"Macon County Health Department Reported Deaths",,,
"Methodology: I visit the daily & weekly releases through MCHD’s Facebook & record deaths from the text of their post.",,,
,,,
,,,
,,,
"This sheet will not include all deaths, due to the nature of the data collection. ",,,
"I think MCHD fails to report specific details of some deaths, but I’m not sure. I could also miss some, as they’re shared in Facebook posts & it’s just an easy mistake to make",,,
,,,
"report_date","sex","age_range","url"
"Date Reported","Sex","Age Range","URL"
06/25/21,"m","80s","https://www.facebook.com/permalink.php?story_fbid=4123376367723675&id=116643335063685"
07/16/21,"m","70s","https://www.facebook.com/permalink.php?story_fbid=4181978121863499&id=116643335063685"
07/23/21,"f","70s","https://www.facebook.com/permalink.php?story_fbid=4202080369853274&id=116643335063685"
08/17/21,"m","70s","https://www.facebook.com/Macon-County-Health-Department-Decatur-IL-116643335063685/photos/a.136673823060636/4275820795812564"
08/17/21,"m","80s","https://www.facebook.com/Macon-County-Health-Department-Decatur-IL-116643335063685/photos/a.136673823060636/4275820795812564"
08/23/21,"f","30s","https://www.facebook.com/Macon-County-Health-Department-Decatur-IL-116643335063685/photos/a.136673823060636/4293673957360581"
08/24/21,"m","80s","https://www.facebook.com/Macon-County-Health-Department-Decatur-IL-116643335063685/photos/a.136673823060636/4296748590386451"
08/25/21,"m","80s","https://www.facebook.com/Macon-County-Health-Department-Decatur-IL-116643335063685/photos/a.136673823060636/4299736396754337"
08/26/21,"m","50s",
08/26/21,"m","70s",
09/20/21,"f","100s",
09/13/21,"f","30s",
09/03/21,"f","40s","https://www.facebook.com/permalink.php?story_fbid=4327093144018662&id=116643335063685"
09/16/21,"f","40s",
09/16/21,"m","40s",
09/16/21,"m","40s",
09/09/21,"m","50s",
09/13/21,"f","50s",
09/14/21,"m","50s",
09/22/21,"f","50s","https://www.facebook.com/116643335063685/photos/a.136673823060636/4386539724740670/?type=3&theater"
09/21/21,"f","60s","https://www.facebook.com/116643335063685/photos/a.136673823060636/4383259218402054/?type=3&theater"
09/23/21,"m","60s","https://www.facebook.com/116643335063685/photos/a.136673823060636/4389961374398505/?type=3&theater"
09/23/21,"m","60s","https://www.facebook.com/116643335063685/photos/a.136673823060636/4389961374398505/?type=3&theater"
09/03/21,"f","70s","https://www.facebook.com/permalink.php?story_fbid=4327093144018662&id=116643335063685"
09/03/21,"f","70s","https://www.facebook.com/permalink.php?story_fbid=4327093144018662&id=116643335063685"
09/14/21,"f","70s",
09/14/21,"m","70s",
09/17/21,"m","70s","https://www.facebook.com/permalink.php?story_fbid=4370339696360673&id=116643335063685"
09/17/21,"f","80s","https://www.facebook.com/permalink.php?story_fbid=4370339696360673&id=116643335063685"
09/17/21,"f","80s","https://www.facebook.com/permalink.php?story_fbid=4370339696360673&id=116643335063685"
09/20/21,"m","80s",
09/23/21,"f","80s","https://www.facebook.com/116643335063685/photos/a.136673823060636/4389961374398505/?type=3&theater"
09/24/21,"m","70s","https://www.facebook.com/permalink.php?story_fbid=4393401894054453&id=116643335063685"
09/30/21,"m","80s","https://www.facebook.com/permalink.php?story_fbid=4412824762112166&id=116643335063685"
09/28/21,"m","50s","https://www.facebook.com/116643335063685/photos/a.136673823060636/4406201869441122/"
09/28/21,"m","70s","https://www.facebook.com/116643335063685/photos/a.136673823060636/4406201869441122/"
10/08/21,"f","70s","https://www.facebook.com/permalink.php?story_fbid=4436666236394685&id=116643335063685"
10/13/21,"m","60s","https://www.facebook.com/116643335063685/photos/a.136673823060636/4452873941440581/"
10/21/21,"m","60s","https://www.facebook.com/116643335063685/photos/a.136673823060636/4477399782321330/"
10/27/21,"m","50s","https://www.facebook.com/116643335063685/photos/a.136673823060636/4496017240459584/"
11/10/21,"f","70s",
