{
    "date": {
        "maxlen": 10,
        "minlen": 10,
        "count": 5,
        "is_string": 5,
        "is_numeric": 0,
        "is_int": 0,
        "is_float": 0,
        "is_bool": 0,
        "is_array": 0,
        "is_date": 5,
        "is_json": 0,
        "sampleValue": "2021-09-20"
    },
    "time": {
        "maxlen": 11,
        "minlen": 11,
        "count": 5,
        "is_string": 5,
        "is_numeric": 0,
        "is_int": 0,
        "is_float": 0,
        "is_bool": 0,
        "is_array": 0,
        "is_date": 0,
        "is_json": 0,
        "sampleValue": "12:00:00 AM"
    },
    "hospitalized": {
        "maxlen": 3,
        "minlen": 3,
        "count": 5,
        "is_string": 5,
        "is_numeric": 5,
        "is_int": 5,
        "is_float": 5,
        "is_bool": 0,
        "is_array": 0,
        "is_date": 0,
        "is_json": 5,
        "sampleValue": "152"
    },
    "novax_hosp": {
        "maxlen": 3,
        "minlen": 3,
        "count": 5,
        "is_string": 5,
        "is_numeric": 5,
        "is_int": 5,
        "is_float": 5,
        "is_bool": 0,
        "is_array": 0,
        "is_date": 0,
        "is_json": 5,
        "sampleValue": "116"
    },
    "vax_hosp": {
        "maxlen": 2,
        "minlen": 2,
        "count": 5,
        "is_string": 5,
        "is_numeric": 5,
        "is_int": 5,
        "is_float": 5,
        "is_bool": 0,
        "is_array": 0,
        "is_date": 0,
        "is_json": 5,
        "sampleValue": "36"
    },
    "icu": {
        "maxlen": 2,
        "minlen": 2,
        "count": 5,
        "is_string": 5,
        "is_numeric": 5,
        "is_int": 5,
        "is_float": 5,
        "is_bool": 0,
        "is_array": 0,
        "is_date": 0,
        "is_json": 5,
        "sampleValue": "29"
    },
    "novax_icu": {
        "maxlen": 2,
        "minlen": 2,
        "count": 5,
        "is_string": 5,
        "is_numeric": 5,
        "is_int": 5,
        "is_float": 5,
        "is_bool": 0,
        "is_array": 0,
        "is_date": 0,
        "is_json": 5,
        "sampleValue": "24"
    },
    "vax_icu": {
        "maxlen": 1,
        "minlen": 1,
        "count": 5,
        "is_string": 5,
        "is_numeric": 5,
        "is_int": 5,
        "is_float": 5,
        "is_bool": 0,
        "is_array": 0,
        "is_date": 0,
        "is_json": 5,
        "sampleValue": "5"
    },
    "ventilated": {
        "maxlen": 2,
        "minlen": 2,
        "count": 5,
        "is_string": 5,
        "is_numeric": 5,
        "is_int": 5,
        "is_float": 5,
        "is_bool": 0,
        "is_array": 0,
        "is_date": 0,
        "is_json": 5,
        "sampleValue": "17"
    },
    "novax_vent": {
        "maxlen": 2,
        "minlen": 2,
        "count": 5,
        "is_string": 5,
        "is_numeric": 5,
        "is_int": 5,
        "is_float": 5,
        "is_bool": 0,
        "is_array": 0,
        "is_date": 0,
        "is_json": 5,
        "sampleValue": "15"
    },
    "vax_vent": {
        "maxlen": 1,
        "minlen": 1,
        "count": 5,
        "is_string": 5,
        "is_numeric": 5,
        "is_int": 5,
        "is_float": 5,
        "is_bool": 0,
        "is_array": 0,
        "is_date": 0,
        "is_json": 5,
        "sampleValue": "2"
    },
    "novax_hosp_percent": {
        "maxlen": 5,
        "minlen": 2,
        "count": 5,
        "is_string": 0,
        "is_numeric": 5,
        "is_int": 1,
        "is_float": 5,
        "is_bool": 0,
        "is_array": 0,
        "is_date": 0,
        "is_json": 0,
        "sampleValue": "76.32"
    },
    "novax_icu_percent": {
        "maxlen": 5,
        "minlen": 5,
        "count": 5,
        "is_string": 0,
        "is_numeric": 5,
        "is_int": 0,
        "is_float": 5,
        "is_bool": 0,
        "is_array": 0,
        "is_date": 0,
        "is_json": 0,
        "sampleValue": "82.76"
    },
    "novax_vent_percent": {
        "maxlen": 5,
        "minlen": 5,
        "count": 5,
        "is_string": 0,
        "is_numeric": 5,
        "is_int": 0,
        "is_float": 5,
        "is_bool": 0,
        "is_array": 0,
        "is_date": 0,
        "is_json": 0,
        "sampleValue": "88.24"
    },
    "age_65_or_younger": {
        "maxlen": 2,
        "minlen": 0,
        "count": 5,
        "is_string": 4,
        "is_numeric": 4,
        "is_int": 4,
        "is_float": 4,
        "is_bool": 0,
        "is_array": 0,
        "is_date": 0,
        "is_json": 4,
        "sampleValue": "81"
    },
    "age_65_or_younger_novax": {
        "maxlen": 2,
        "minlen": 0,
        "count": 5,
        "is_string": 3,
        "is_numeric": 3,
        "is_int": 3,
        "is_float": 3,
        "is_bool": 0,
        "is_array": 0,
        "is_date": 0,
        "is_json": 3,
        "sampleValue": "70"
    },
    "age_65_or_younger_vax": {
        "maxlen": 2,
        "minlen": 0,
        "count": 5,
        "is_string": 3,
        "is_numeric": 3,
        "is_int": 3,
        "is_float": 3,
        "is_bool": 0,
        "is_array": 0,
        "is_date": 0,
        "is_json": 3,
        "sampleValue": "11"
    }
}