{
    "report_date": {
        "maxlen": 8,
        "minlen": 8,
        "count": 16,
        "is_string": 16,
        "is_numeric": 0,
        "is_int": 0,
        "is_float": 0,
        "is_bool": 0,
        "is_array": 0,
        "is_date": 0,
        "is_json": 0,
        "sampleValue": "11\/05\/21"
    },
    "total_variants": {
        "maxlen": 3,
        "minlen": 3,
        "count": 16,
        "is_string": 16,
        "is_numeric": 16,
        "is_int": 16,
        "is_float": 16,
        "is_bool": 0,
        "is_array": 0,
        "is_date": 0,
        "is_json": 16,
        "sampleValue": "484"
    },
    "url": {
        "maxlen": 86,
        "minlen": 84,
        "count": 16,
        "is_string": 16,
        "is_numeric": 0,
        "is_int": 0,
        "is_float": 0,
        "is_bool": 0,
        "is_array": 0,
        "is_date": 0,
        "is_json": 0,
        "sampleValue": "https:\/\/www.facebook.com\/permalink.php?story_fbid=4502828799778428&id=116643335063685 "
    },
    "alpha": {
        "maxlen": 3,
        "minlen": 3,
        "count": 16,
        "is_string": 16,
        "is_numeric": 16,
        "is_int": 16,
        "is_float": 16,
        "is_bool": 0,
        "is_array": 0,
        "is_date": 0,
        "is_json": 16,
        "sampleValue": "143"
    },
    "gamma": {
        "maxlen": 2,
        "minlen": 2,
        "count": 16,
        "is_string": 16,
        "is_numeric": 16,
        "is_int": 16,
        "is_float": 16,
        "is_bool": 0,
        "is_array": 0,
        "is_date": 0,
        "is_json": 16,
        "sampleValue": "87"
    },
    "delta": {
        "maxlen": 3,
        "minlen": 1,
        "count": 16,
        "is_string": 16,
        "is_numeric": 16,
        "is_int": 16,
        "is_float": 16,
        "is_bool": 0,
        "is_array": 0,
        "is_date": 0,
        "is_json": 16,
        "sampleValue": "237"
    },
    "california": {
        "maxlen": 1,
        "minlen": 1,
        "count": 16,
        "is_string": 16,
        "is_numeric": 16,
        "is_int": 16,
        "is_float": 16,
        "is_bool": 0,
        "is_array": 0,
        "is_date": 0,
        "is_json": 16,
        "sampleValue": "7"
    },
    "beta": {
        "maxlen": 1,
        "minlen": 1,
        "count": 16,
        "is_string": 16,
        "is_numeric": 16,
        "is_int": 16,
        "is_float": 16,
        "is_bool": 0,
        "is_array": 0,
        "is_date": 0,
        "is_json": 16,
        "sampleValue": "4"
    },
    "mu": {
        "maxlen": 1,
        "minlen": 1,
        "count": 16,
        "is_string": 16,
        "is_numeric": 16,
        "is_int": 16,
        "is_float": 16,
        "is_bool": 0,
        "is_array": 0,
        "is_date": 0,
        "is_json": 16,
        "sampleValue": "3"
    },
    "b_1_2": {
        "maxlen": 1,
        "minlen": 0,
        "count": 16,
        "is_string": 2,
        "is_numeric": 2,
        "is_int": 2,
        "is_float": 2,
        "is_bool": 0,
        "is_array": 0,
        "is_date": 0,
        "is_json": 2,
        "sampleValue": "2"
    },
    "b_1": {
        "maxlen": 1,
        "minlen": 0,
        "count": 16,
        "is_string": 1,
        "is_numeric": 1,
        "is_int": 1,
        "is_float": 1,
        "is_bool": 0,
        "is_array": 0,
        "is_date": 0,
        "is_json": 1,
        "sampleValue": "1"
    }
}