digraph {

    node [ shape=box ]

    Worker_p0 [ label="Worker" ]
    Object_p0 [ label="Object" ]

    node [ shape=plaintext ]

    Employee_p [ label=<
    <table border="0" cellborder="1" cellspacing="0">
        <tr><td colspan="2">Employee.prototype</td></tr>
        <tr><td>bonus</td><td>100</td></tr>
    </table>
    >]
    Worker_p [ label=<
    <table border="0" cellborder="1" cellspacing="0">
        <tr><td colspan="2">Worker.prototype 'Employee'</td></tr>
        <tr><td>access</td><td>true</td></tr>
    </table>
    >]

    node [ shape=box, fontcolor=blue, color=blue, group="func" ]

    Employee [ label="function Employee" ]
    Worker [ label="function Worker" ]

    { rank=same

    node [ shape="plaintext", fontcolor=black, color=black, group="inst" ]

    jack [ label=<
    <table border="0" cellborder="1" cellspacing="0">
        <tr><td colspan="2">jack</td></tr>
        <tr><td>name</td><td>'Jack'</td></tr>
        <tr><td>dept</td><td>engineering</td></tr>
        <tr><td>projects</td><td>3d printing</td></tr>
    </table>
    > ]

    john [ label=<
        <table border="0" cellborder="1" cellspacing="0">
            <tr><td colspan="2">john</td></tr>
            <tr><td>name</td><td>'John'</td></tr>
            <tr><td>dept</td><td>engineering</td></tr>
            <tr><td>projects</td><td>3d engraving</td></tr>
        </table>
    > ]

    }

    edge [ color=magenta, fontcolor=magenta ]

    Employee -> Employee_p [ xlabel="  prototype  " ]
    Worker -> Worker_p [ xlabel="  prototype  " ]

    edge [ color=blue, fontcolor=blue ]

    Employee_p -> Employee [ xlabel="  constructor  " ]
    Worker_p -> Employee [ xlabel="  constructor  " ]
    Worker_p0 -> Worker [ xlabel="  constructor  " ]

    edge [ color=green, fontcolor=green ]

    Employee_p -> Object_p0 [ xlabel="  __proto__  " ]
    Worker_p -> Employee_p [ xlabel="  __proto__  " ]
    jack -> Worker_p0 [ xlabel="  __proto__  " ]
    john -> Worker_p [ xlabel="  __proto__  " ]
    Worker_p0 -> Object_p0 [ xlabel="  __proto__  " ]

}