code;description
01;VOEDINGSMIDDELEN EN ALCOHOLVRIJE DRANKEN
01.1;Voedingsmiddelen
01.1.1;Brood en granen
01.1.1.1;Rijst
01.1.1.1.10016;Rijstwafels
01.1.1.1.10018;Rijst
01.1.1.2;Bloem en andere granen
01.1.1.2.10015;Bloem of bakmeel
01.1.1.3;Brood
01.1.1.3.10005;Afbakbroodjes (ook poffertjes, pannekoeken e.d.)
01.1.1.3.10007;Brood
01.1.1.4;Andere bakkerijproducten
01.1.1.4.10009;Gebak en koekjes
01.1.1.4.10010;(ontbijt)koek
01.1.1.5;Pizza en quiche
01.1.1.5.10013;Deegwaren met vlees
01.1.1.6;Pastaproducten en couscous
01.1.1.6.10017;Pasta, mie, vermicelli
01.1.1.7;Ontbijtgranen
01.1.1.7.10103;Ontbijtgranen (cornflakes, muesli)
01.1.1.8;Overige graanproducten
01.1.1.8.10001;Bindmiddelen (aardappelmeel)
01.1.1.8.10002;Aardappelpuree
01.1.1.8.10011;Ragoutbakjes
01.1.1.8.10014;Bakproducten (niet apart genoemd)
01.1.2;Vlees
01.1.2.1;Rund- en kalfsvlees
01.1.2.1.10071;Rundergehakt
01.1.2.1.10075;Kalfsvlees
01.1.2.1.10076;Rundvlees (niet apart genoemd)
01.1.2.2;Varkensvlees
01.1.2.2.10073;Varkensgehakt
01.1.2.2.10077;Varkensbraadworst
01.1.2.2.10078;Varkensvlees (niet apart genoemd)
01.1.2.3;Schapen- en geitenvlees
01.1.2.3.0;Schapen- en geitenvlees
01.1.2.4;Pluimveevlees
01.1.2.4.10069;Gevogelte, pluimvee (voor consumptie)
01.1.2.5;Overig vlees
01.1.2.5.10079;Vers vlees (overige diersoorten)
01.1.2.6;Eetbaar slachtafval
01.1.2.6.0;Eetbaar slachtafval
01.1.2.7;Gedroogd, gezouten of gerookt vlees
01.1.2.7.10070;Snijvlees
01.1.2.8;Overige vleesbereidingen
01.1.2.8.10072;Frikandellen, kroketten, loempia's
01.1.2.8.10074;Gehakt gemengd
01.1.2.8.10080;Vlees (niet apart genoemd)
01.1.3;Vis en schaal- en schelpdieren
01.1.3.1;Verse of gekoelde vis
01.1.3.1.10066;Verse vis
01.1.3.2;Diepvriesvis
01.1.3.2.10067;Diepvies of gebakken vis
01.1.3.3;Verse of gekoelde schaal- en schelpdieren
01.1.3.3.10065;Schaal- en weekdieren
01.1.3.4;Diepvries schaal- en schelpdieren
01.1.3.4.0;Diepvries schaal- en schelpdieren
01.1.3.5;Gedroogde, gezouten of gerookte vis en schaal- en schelpdieren
01.1.3.5.0;Gedroogde, gezouten of gerookte vis en schaal- en schelpdieren
01.1.3.6;Overige bereidingen en conserven van vis en schaal-en schelpdieren
01.1.3.6.10068;Vis (niet apart genoemd)
01.1.4;Melk, kaas en eieren
01.1.4.1;Verse volle melk
01.1.4.1.10097;Melk, niet bewerkt (rauwe melk)
01.1.4.2;Verse halfvolle en magere melk
01.1.4.2.10099;Melk (mager, halfvol of vol)
01.1.4.3;Houdbare melk
01.1.4.3.10101;Melkpoeder
01.1.4.4;Yoghurt
01.1.4.4.10098;Melkproduct met fruit
01.1.4.4.10100;Yoghurt
01.1.4.5;Kaas en kwark
01.1.4.5.10095;Kaas
01.1.4.6;Overige zuivelproducten
01.1.4.6.10087;Slagroom surrogaten
01.1.4.6.10089;Chocolademelk
01.1.4.6.10093;Karnemelk, pap of vla
01.1.4.6.10094;Koffiemelk
01.1.4.6.10096;(koffie) room
01.1.4.6.10102;Zuivelproducten (niet apart genoemd)
01.1.4.7;Eieren
01.1.4.7.10092;Eieren
01.1.5;Oliën en vetten
01.1.5.1;Boter
01.1.5.1.10088;Boter
01.1.5.2;Margarine en andere plantaardige vetten
01.1.5.2.10090;Margarine
01.1.5.3;Olijfolie
01.1.5.3.0;Olijfolie
01.1.5.4;Overige eetbare olie
01.1.5.4.10091;Oliën en vetten (niet apart genoemd)
01.1.5.5;Overige eetbare dierlijke vetten
01.1.5.5.0;Overige eetbare dierlijke vetten
01.1.6;Fruit
01.1.6.1;Vers of gekoeld fruit
01.1.6.1.10024;Groentepakket, fruitpakket
01.1.6.1.10026;Appels
01.1.6.1.10030;Bananen
01.1.6.1.10034;Citrusfruit (mandarijnen, citroenen, grapefruits)
01.1.6.1.10044;Vers fruit (niet apart genoemd)
01.1.6.2;Diepvriesfruit
01.1.6.2.0;Diepvriesfruit
01.1.6.3;Gedroogd fruit en noten
01.1.6.3.10008;Borrelnootjes
01.1.6.3.10027;Noten en pitten
01.1.6.3.10036;Gedroogde vruchten
01.1.6.4;Conserven van fruit en producten op basis van fruit
01.1.6.4.10039;Fruitconserven en diepvriesfruit
01.1.7;Groenten
01.1.7.1;Verse of gekoelde groenten behalve aardappelen en andere knollen
01.1.7.1.10031;Verpakte verse groente
01.1.7.1.10033;Champignons
01.1.7.1.10035;Komkommers
01.1.7.1.10037;Koolsoorten vers
01.1.7.1.10038;Paprika's
01.1.7.1.10041;Peulvruchten vers
01.1.7.1.10042;Soepgroenten vers
01.1.7.1.10043;Tomaten
01.1.7.1.10045;Uien (ook knoflook)
01.1.7.1.10046;Verse groente (niet apart genoemd)
01.1.7.2;Diepvriesgroenten behalve aardappelen en andere knollen
01.1.7.2.10028;Diepvries groente
01.1.7.3;Gedroogde groenten, andere bereidingen en conserven van groenten
01.1.7.3.10032;Groenten in blik of glas
01.1.7.3.10040;Peulvruchten gedroogd
01.1.7.4;Aardappelen
01.1.7.4.10000;Aardappelen vers
01.1.7.4.10004;Aardappelproducten (niet apart genoemd)
01.1.7.5;Chips
01.1.7.5.10003;Chips
01.1.7.5.10012;Snacks
01.1.7.6;Overige knolgewassen en producten van knolgewassen
01.1.7.6.0;Overige knolgewassen en producten van knolgewassen
01.1.8;Suiker, jam, honing, chocolade en snoepgoed
01.1.8.1;Suiker
01.1.8.1.10058;Suiker
01.1.8.2;Jam, marmelade en honing
01.1.8.2.10081;Honing
01.1.8.2.10083;Zoet broodbeleg (jam, confiture, halviture)
01.1.8.2.10084;Muisjes, anijshagel
01.1.8.2.10085;Stroop
01.1.8.3;Chocolade
01.1.8.3.10060;Candy bars
01.1.8.3.10062;Chocoladeproducten
01.1.8.3.10082;Broodbeleg van chocolade
01.1.8.4;Snoepgoed
01.1.8.4.10064;Snoepgoed (niet apart genoemd)
01.1.8.5;Consumptie-ijs en roomijs
01.1.8.5.10063;Ijs, ijstaart
01.1.8.6;Kunstmatige zoetstoffen
01.1.8.6.10059;Zoetstof
01.1.8.6.10061;(druiven)suiker (siroop)
01.1.9;Voedingsmiddelen n.e.g.
01.1.9.1;Sauzen, samengestelde kruiderijen
01.1.9.1.10052;Ketchup
01.1.9.1.10053;Azijn, mosterd
01.1.9.1.10054;Fritesaus, slasaus, mayonaise
01.1.9.1.10056;Dipsaus
01.1.9.2;Zout, specerijen en keukenkruiden
01.1.9.2.10104;Zout
01.1.9.2.10105;Anijsblokjes
01.1.9.2.10107;Droge kruiden(mengsels)
01.1.9.2.10110;Specerij (niet apart genoemd)
01.1.9.2.10111;Verse kruiden
01.1.9.3;Babyvoeding
01.1.9.3.10025;Babyvoeding
01.1.9.3.10106;Babyvoeding, dieetvoeding (oplosbaar of in fles)
01.1.9.4;Kant-en-klaarmaaltijden
01.1.9.4.10047;Hoofdgerechten diepvries
01.1.9.4.10048;Hoofdgerechten (niet diepvries)
01.1.9.4.10544;Maaltijdsalades in horeca
01.1.9.4.10808;Salades (niet apart genoemd)
01.1.9.9;Andere voedingsmiddelen n.e.g.
01.1.9.9.10006;Bakpoeder, gist
01.1.9.9.10029;Vleesvervangers
01.1.9.9.10055;Vleessaus, jus
01.1.9.9.10057;Puddingsaus
01.1.9.9.10086;Broodbeleg (niet apart genoemd)
01.1.9.9.10108;Soep, bouillon
01.1.9.9.10109;Opkloppoeder (puddingpoeder), gelatine
01.1.9.9.10112;Voedingsmiddelen (niet apart genoemd)
01.1.9.9.10336;Onderdelen voor bereiding van voedsel (niet apart genoemd)
01.2;Alcoholvrije dranken
01.2.1;Koffie, thee en cacao
01.2.1.1;Koffie
01.2.1.1.10049;Koffie
01.2.1.2;Thee
01.2.1.2.10051;Thee
01.2.1.3;Cacao
01.2.1.3.10050;Cacaopoeder
01.2.2;Mineraalwater, frisdranken, vruchten- en groentesappen
01.2.2.1;Mineraalwater of bronwater
01.2.2.1.10019;Mineraalwater
01.2.2.2;Frisdranken
01.2.2.2.10020;Frisdrank, (bron)water
01.2.2.3;Vruchten- en groentesappen
01.2.2.3.10021;Vruchtensap (niet apart genoemd)
01.2.2.3.10022;Appelsap, sinaasappelsap
01.2.2.3.10023;Vruchtensap geconcentreerd
02;ALCOHOLHOUDENDE DRANKEN, TABAK EN VERDOVENDE MIDDELEN
02.1;Alcoholhoudende dranken
02.1.1;Gedistilleerde dranken
02.1.1.1;Gedistilleerde dranken en likeuren
02.1.1.1.10115;Advocaat
02.1.1.1.10116;Dranken (niet apart genoemd)
02.1.1.1.10801;Likeur
02.1.1.1.10802;Bessenjenever, citroenjenever
02.1.1.1.10803;Jenever (oud, jong), brandewijn, berenburger, vieux
02.1.1.1.10804;Wisk(e)y, cognac
02.1.1.1.10805;Ander gedestilleerd
02.1.1.2;Alcoholhoudende frisdranken
02.1.1.2.0;Alcoholhoudende frisdranken
02.1.2;Wijn
02.1.2.1;Wijn van druiven
02.1.2.1.10123;Wijn
02.1.2.2;Wijn van andere vruchten
02.1.2.2.0;Wijn van andere vruchten
02.1.2.3;Gealcoholiseerde wijn
02.1.2.3.10806;Sherry, port, vermout
02.1.2.4;Dranken op basis van wijn
02.1.2.4.10122;Alcoholvrije wijn
02.1.3;Bier
02.1.3.1;Pils
02.1.3.1.10114;Bier, pils
02.1.3.2;Ander alcoholhoudend bier
02.1.3.2.10800;Speciaal bier (trappist bieren e.d.)
02.1.3.3;Bier met een laag alcohol-volumegehalte en alcoholvrij bier
02.1.3.3.10113;Alcoholvrij bier
02.1.3.4;Dranken op basis van bier
02.1.3.4.0;Dranken op basis van bier
02.2;Tabak
02.2.0;Tabak
02.2.0.1;Sigaretten
02.2.0.1.10121;Sigaretten
02.2.0.2;Sigaren
02.2.0.2.10119;Sigaren
02.2.0.3;Andere tabaksproducten
02.2.0.3.10117;Shag
02.2.0.3.10118;Vloeitjes, filters (sigaretten)
02.2.0.3.10120;Tabak
02.3;Verdovende middelen
02.3.0;Verdovende middelen
02.3.0.0;Verdovende middelen
02.3.0.0.10164;Drugs, verdovende middelen
03;KLEDING EN SCHOENEN
03.1;Kleding en kledingstoffen
03.1.1;Kledingstoffen
03.1.1.0;Kledingstoffen
03.1.1.0.10166;Weefsels (kledingstoffen)
03.1.2;Kleding
03.1.2.1;Herenkleding
03.1.2.1.10137;Trui, vest (heren)
03.1.2.1.10138;Bovenkleding (heren)
03.1.2.1.10139;Onderkleding en nachtkleding (heren)
03.1.2.1.10140;Kousen, sokken (heren)
03.1.2.1.10141;Werkkleding (heren)
03.1.2.1.10142;Sportkleding (heren)
03.1.2.2;Dameskleding
03.1.2.2.10124;Trui, vest (dames)
03.1.2.2.10125;Bovenkleding (dames)
03.1.2.2.10126;Onderkleding en nachtkleding (dames)
03.1.2.2.10127;Kousen, sokken (dames)
03.1.2.2.10128;Werkkleding (dames)
03.1.2.2.10129;Sportkleding (dames)
03.1.2.3;Baby- en kinderkleding
03.1.2.3.10143;Babykleding (niet apart genoemd)
03.1.2.3.10144;Trui, vest (kinderen)
03.1.2.3.10145;Bovenkleding (kinderen)
03.1.2.3.10146;Onderkleding en nachtkleding (kinderen)
03.1.2.3.10147;Kousen, sokken (kinderen)
03.1.2.3.10148;Werkkleding (kinderen)
03.1.2.3.10149;Sportkleding (kinderen)
03.1.2.3.10157;Kleding (niet apart genoemd)
03.1.3;Overige kledingartikelen en toebehoren
03.1.3.1;Andere kledingartikelen
03.1.3.1.10151;Sinterklaaspak, carnavalskleding
03.1.3.1.10152;Lederwaren (riem, ceintuur)
03.1.3.1.10153;Helm voor brommer, motor, scooter
03.1.3.1.10162;Kledingaccessoires (niet apart genoemd)
03.1.3.2;Kledingaccessoires
03.1.3.2.10163;Kledingtoebehoren niet van leer (niet apart genoemd)
03.1.3.2.10167;Naaiartikelen
03.1.3.2.10168;Wol, touw
03.1.3.2.10169;Patronen, patroonpapier
03.1.3.2.10170;Garen en borduurmateriaal, handwerkpakket
03.1.4;Wasserijen en stomerijen, reparatie en verhuur van kleding
03.1.4.1;Wasserijen en stomerijen
03.1.4.1.10173;Wasserij, stomerij
03.1.4.2;Reparatie en huur van kleding
03.1.4.2.10171;Huur kleding
03.1.4.2.10172;Reparatie kleding, kosten kleermaker
03.2;Schoenen
03.2.1;Schoenen
03.2.1.1;Herenschoenen
03.2.1.1.10131;Sportschoenen
03.2.1.1.10134;Herenschoenen
03.2.1.2;Damesschoenen
03.2.1.2.10133;Damesschoenen
03.2.1.3;Kinderschoenen
03.2.1.3.10132;Kinderschoenen
03.2.2;Reparatie en verhuur van schoenen
03.2.2.0;Reparatie en verhuur van schoenen
03.2.2.0.10130;Huur schoeisel
03.2.2.0.10135;Schoenreparatie
03.2.2.0.10136;Schoenmaterialen (niet apart genoemd)
04;HUISVESTING, WATER, ELEKTRICITEIT, GAS EN ANDERE BRANDSTOFFEN
04.1;Werkelijke woninghuur
04.1.1;Werkelijke huur betaald door huurders
04.1.1.0;Werkelijke huur betaald door huurders
04.1.1.0.0;Werkelijke huur betaald door huurders
04.1.2;Andere werkelijke huur
04.1.2.1;Werkelijke huur betaald door huurders voor een tweede woning
04.1.2.1.0;Werkelijke huur betaald door huurders voor een tweede woning
04.1.2.2;Garagehuur en andere huur die door huurders wordt betaald
04.1.2.2.0;Garagehuur en andere huur die door huurders wordt betaald
04.2;Toegerekende huur
04.2.1;Huurwaarde voor bewoners van een eigen woning
04.2.1.0;Huurwaarde voor bewoners van een eigen woning
04.2.1.0.0;Huurwaarde voor bewoners van een eigen woning
04.2.2;Andere huurwaarde
04.2.2.0;Andere huurwaarde
04.2.2.0.0;Andere huurwaarde
04.3;Onderhoud en reparatie van de woning
04.3.1;Materiaal voor onderhoud en reparatie van de woning
04.3.1.0;Materiaal voor onderhoud en reparatie van de woning
04.3.1.0.10179;Kurkplaten
04.3.1.0.10180;Triplex, multiplex
04.3.1.0.10181;Deuren,kozijnen
04.3.1.0.10182;Wandbekleding (behang: papier, textiel, vinyl)
04.3.1.0.10183;Glas (vensterglas, glasplaten)
04.3.1.0.10184;Gipsplaten, tegels
04.3.1.0.10185;Sanitair (niet apart genoemd)
04.3.1.0.10186;Aanrechtbladen
04.3.1.0.10187;Kalk, cement, mortel, zand (niet voor tuin)
04.3.1.0.10188;Lasdraad, soldeertin
04.3.1.0.10189;Slangen kunststof voor gas of water
04.3.1.0.10190;Vloerlijm, tegellijm, kit, muurvuller, houtvuller
04.3.1.0.10191;Kunststof plaatmateriaal
04.3.1.0.10192;Tochtstrips, (plak)plastic, (afdek)zeil
04.3.1.0.10193;Houten panelen, vezelplaten, fineer, hardboard
04.3.1.0.10194;Accessoires en onderdelen sanitair
04.3.1.0.10195;Kunststof buizen, dakgoten, vloertegels
04.3.1.0.10196;Plakband/tape voor vloerbedekking
04.3.1.0.10197;Houten palen, balken, planken
04.3.1.0.10198;Schuurpapier, afplakband
04.3.1.0.10199;Asbestplaat
04.3.1.0.10200;Lijmen (montagekit, secondelijm)
04.3.1.0.10201;Glasvezel, steenwol (-producten)
04.3.1.0.10202;Vloer- en wandtegels
04.3.1.0.10203;Dakbedekking (bituum, dakpannen)
04.3.1.0.10204;Bakstenen, bouwblokken en lateien
04.3.1.0.10205;Metalen draden, strips en profielen
04.3.1.0.10206;Water- en gaskranen
04.3.1.0.10207;Metalen platen, pijpen en buizen
04.3.1.0.10208;Onderdelen cv-installatie
04.3.1.0.10209;Klemmen voor slangen
04.3.1.0.10210;Sanitair badkamer
04.3.1.0.10211;Verf, beits, vernis en afbijtmiddelen
04.3.1.0.10248;Hor, vliegengordijn
04.3.1.0.10282;Metaalproducten (niet apart genoemd)
04.3.2;Diensten voor onderhoud en reparatie van de woning
04.3.2.1;Diensten van loodgieters
04.3.2.1.10175;Loodgieter, verwarmingsmonteur, elektricien
04.3.2.2;Diensten van elektriciens
04.3.2.2.0;Diensten van elektriciens
04.3.2.3;Verwarmingsonderhoud
04.3.2.3.0;Verwarmingsonderhoud
04.3.2.4;Diensten van schilders
04.3.2.4.10176;Stukadoor, timmerman, schilder, behanger
04.3.2.5;Diensten van timmerlieden
04.3.2.5.0;Diensten van timmerlieden
04.3.2.9;Overige diensten voor onderhoud en reparatie van de woning
04.3.2.9.10174;Aannemer, (binnenhuis)architect
04.4;Watervoorziening en diverse diensten in verband met de woning
04.4.1;Watervoorziening
04.4.1.0;Watervoorziening
04.4.1.0.0;Watervoorziening
04.4.2;Ophalen van huisvuil
04.4.2.0;Ophalen van huisvuil
04.4.2.0.0;Ophalen van huisvuil
04.4.3;Riolering
04.4.3.0;Riolering
04.4.3.0.0;Riolering
04.4.4;Overige diensten in verband met de woning n.e.g.
04.4.4.1;Onderhoudskosten in meergezinswoningen
04.4.4.1.10177;Diensten in verband met (onderhoud) woning (niet apart genoemd)
04.4.4.1.10178;Hovenier
04.4.4.2;Bewakingsdiensten
04.4.4.2.0;Bewakingsdiensten
04.4.4.9;Overige diensten in verband met de woning
04.4.4.9.0;Overige diensten in verband met de woning
04.5;Elektriciteit, gas en andere brandstoffen
04.5.1;Elektriciteit
04.5.1.0;Elektriciteit
04.5.1.0.0;Elektriciteit
04.5.2;Gas
04.5.2.1;Aardgas en stadsgas
04.5.2.1.0;Aardgas en stadsgas
04.5.2.2;Vloeibare brandstoffen
04.5.2.2.10216;Flessengas (propaan, butaan), aankoop gasfles
04.5.3;Vloeibare brandstoffen
04.5.3.0;Vloeibare brandstoffen
04.5.3.0.10217;Petroleum
04.5.3.0.10218;Huisbrandolie (olie voor kachel, stookolie)
04.5.4;Vaste brandstoffen
04.5.4.1;Steenkool
04.5.4.1.0;Steenkool
04.5.4.9;Overige vaste brandstoffen
04.5.4.9.10212;Brandhout (kachel, openhaard)
04.5.4.9.10213;Houtskool
04.5.4.9.10215;Vaste brandstof: steenkool, cokes, eierkolen, briketten
04.5.5;Stadsverwarming
04.5.5.0;Stadsverwarming
04.5.5.0.0;Stadsverwarming
05;STOFFERING, HUISHOUDELIJKE APPARATEN EN DAGELIJKS ONDERHOUD VAN DE WONING
05.1;Meubelen en stoffering, vloerbedekking
05.1.1;Meubelen en stoffering
05.1.1.1;Meubelen voor het huis
05.1.1.1.10226;Accessoires meubelen
05.1.1.1.10238;Tafels, bureaus
05.1.1.1.10239;Kasten (niet apart genoemd)
05.1.1.1.10240;Fauteuil, stoelen, krukjes, banken
05.1.1.1.10241;Keukenkast, complete keukeninrichting (inbouwkeuken)
05.1.1.1.10242;Slaapkamerkast, bedden, bedbodems, bedombouw
05.1.1.1.10243;Rekje (boeken, handdoeken, schoenen, keuken)
05.1.1.1.10253;Meubelen (niet apart genoemd)
05.1.1.1.10274;Matrassen
05.1.1.1.10279;Houtproducten (niet apart genoemd)
05.1.1.1.10474;Meubelen voor boot, caravan
05.1.1.2;Tuinmeubelen
05.1.1.2.0;Tuinmeubelen
05.1.1.3;Verlichtingsapparatuur
05.1.1.3.10244;Lampen, spotjes, schemerlampen (woningverlichting)
05.1.1.9;Overige meubelen en stoffering
05.1.1.9.10224;Bed toebehoren (trapje, klemmen, tuigje, zeil)
05.1.1.9.10227;Vrijstaande decoratie (beeldje, vaas)
05.1.1.9.10228;Foto, schilderijlijst
05.1.1.9.10229;Wandversiering (posters, prenten)
05.1.1.9.10230;Spiegels
05.1.1.9.10245;Kunstvoorwerp
05.1.2;Vloerbedekking
05.1.2.1;Tapijten
05.1.2.1.10246;Vloerbedekking, loper
05.1.2.1.10343;Tapijtwol, tapijtgaren
05.1.2.2;Overige vloerbedekking
05.1.2.2.10231;Harde vloerbedekking op rol (vinyl)
05.1.2.2.10232;Ondertapijten (vilt, onderlaag voor parket)
05.1.2.2.10233;Parket (laminaat, kurkparket, vloerdelen)
05.1.2.3;Diensten voor het leggen van vloerbedekking
05.1.2.3.0;Diensten voor het leggen van vloerbedekking
05.1.3;Reparatie van meubelen, stoffering en vloerbedekking
05.1.3.0;Reparatie van meubelen, stoffering en vloerbedekking
05.1.3.0.10329;Stoffeerder
05.1.3.0.10330;Reparatie tapijten
05.2;Huishoudtextiel
05.2.0;Huishoudtextiel
05.2.0.1;Meubelstoffen en gordijnen
05.2.0.1.10234;Jaloezie (luxaflex, lamellen, raamfolie)
05.2.0.1.10249;(rol)gordijnen, vitrage en toebehoren
05.2.0.1.10342;Bekledingsstof meubelen (zoals grand foulard)
05.2.0.2;Beddengoed
05.2.0.2.10273;Vulling voor kussens, dekbedden
05.2.0.2.10275;Beddengoed (lakens, dekbedovertrekken, kussens)
05.2.0.3;Tafel- en toiletlinnen
05.2.0.3.10353;Tafeltextiel, pannenlap, theedoek, handdoek
05.2.0.4;Reparatie van huishoudtextiel
05.2.0.4.0;Reparatie van huishoudtextiel
05.2.0.9;Overig huishoudtextiel
05.2.0.9.10235;Toiletmat, antislipmat badkamer
05.2.0.9.10236;Deurmat
05.2.0.9.10237;(tuin)parasol
05.2.0.9.10247;Lampkatoen
05.2.0.9.10250;Wandbekleding (jute, spanstof wandbedekking)
05.2.0.9.10251;Zonnescherm, zonneluifel
05.2.0.9.10365;Mottenzak (beschermhoes voor kleding, dekenhoes)
05.2.0.9.10370;Tassen niet van leer (boodschappentas, fietstas)
05.3;Huishoudelijke apparaten
05.3.1;Grote huishoudelijke apparaten, al dan niet elektrisch
05.3.1.1;Koel- en vrieskasten
05.3.1.1.10255;Koelkasten, diepvriezers
05.3.1.2;(Af)wasmachines en wasdrogers
05.3.1.2.10225;Dressboy, elektrische broeken-, rokkenpers
05.3.1.2.10256;Witgoed (niet apart genoemd)
05.3.1.2.10257;Wasmachine,  wasdroger
05.3.1.2.10331;Onderdelen reinigingsapparaten (zoals wasmachine)
05.3.1.3;Fornuizen, ovens, magnetrons en dergelijke
05.3.1.3.10254;Gasoven
05.3.1.3.10258;(elektrische) kookapparatuur (ook magnetron)
05.3.1.4;Verwarming, airconditioners
05.3.1.4.10267;Verwarmingsinstallatie, cv, vloerverwarming
05.3.1.4.10268;Apparatuur voor duurzame energie
05.3.1.4.10269;Onderdelen airconditioning installatie
05.3.1.4.10270;Kachels(haarden), boilers/geisers
05.3.1.4.10271;Airconditioner, ventilator, wasemkap
05.3.1.4.10272;Onderdelen kachels/haarden
05.3.1.4.10290;Elektronische materialen/apparaten (adapter, transformator)
05.3.1.5;Schoonmaakapparaten
05.3.1.5.10261;Stofzuigers (ook bijbehorende hulpstukken)
05.3.1.9;Overige grote huishoudelijke apparaten
05.3.1.9.10262;Naaimachine, breimachine (ook toebehoren)
05.3.1.9.10332;Onderdelen naaimachine
05.3.1.9.10334;Onderdelen weefgetouw
05.3.2;Kleine elektrische huishoudelijke apparaten
05.3.2.1;Keukenmachines
05.3.2.1.0;Keukenmachines
05.3.2.2;Koffie- en theezetapparaten en dergelijke
05.3.2.2.0;Koffie- en theezetapparaten en dergelijke
05.3.2.3;Strijkijzers
05.3.2.3.10265;Strijkijzer
05.3.2.4;Broodroosters en grills
05.3.2.4.10259;Elektrische barbecue
05.3.2.9;Overige kleine elektrische huishoudelijke apparaten
05.3.2.9.10263;Elektrische dekens, kussens
05.3.2.9.10264;Elektrische apparaten voor de keuken (niet apart genoemd)
05.3.3;Reparatie van huishoudelijke apparaten
05.3.3.0;Reparatie van huishoudelijke apparaten
05.3.3.0.10335;Onderhoud en reparatie elektrische apparaten
05.3.3.0.10337;Huur gereedschap
05.4;Glas, servies en huishoudelijke artikelen
05.4.0;Glas, servies en huishoudelijke artikelen
05.4.0.1;Glaswerk, kristal en aardewerk of porselein
05.4.0.1.10304;Glasservies
05.4.0.1.10307;Eetservies, theeservies, koffieservies (ook onderdeel van)
05.4.0.2;Messen, bestek en zilverwerk
05.4.0.2.10308;(opdien)bestek, diverse messen, vorken, lepels
05.4.0.3;Niet-elektrische keukenartikelen
05.4.0.3.10260;Filter voor friteuse, frituurmand, antispatdeksel
05.4.0.3.10306;Tafelgarnituur (servetring, onderzetters)
05.4.0.3.10309;Kook-, ovenwekker
05.4.0.3.10310;Snijplank, broodplank, kaasplank
05.4.0.3.10311;Pannen, ketels en bakvormen
05.4.0.3.10312;Appelboor, blikopener, kurkentrekker
05.4.0.3.10313;Vleesmolen, snijmolen, snijder voor groenten
05.4.0.3.10314;Kookgerei (niet apart genoemd)
05.4.0.3.10315;Bakken, manden en kratten (hout, riet, plastic)
05.4.0.3.10316;Bestekbak, filterhouders, fruitpers
05.4.0.3.10317;Emmers, droogrekjes, keukenrolhouders
05.4.0.3.10318;Vaas, bloempot, bloembak voor in huis
05.4.0.3.10319;Voorraadbussen, dozen (voor keuken)
05.4.0.3.10354;Koelbox, koelboxelementen en ijsbakjes
05.4.0.3.10355;Huishoudelijke artikelen (niet apart genoemd)
05.4.0.3.10356;Flessenrek, lepelrek, vlamverdeler
05.4.0.3.10357;Strijkplank, invochtiger, droogmolen
05.4.0.4;Reparatie van glas, servies en huishoudelijke artikelen
05.4.0.4.10333;Slijpen van gereedschap
05.5;Gereedschappen en werktuigen voor huis en tuin
05.5.1;Grote gereedschappen en werktuigen
05.5.1.1;Grote gereedschappen en werktuigen met motor
05.5.1.1.10288;Water aan- en afvoerpomp
05.5.1.1.10289;Elektrisch gereedschap
05.5.1.1.10294;Fonteinpomp, watervalpomp, pomp, compressor
05.5.1.2;Reparatie, lease en huur van grote gereedschappen en werktuigen
05.5.1.2.0;Reparatie, lease en huur van grote gereedschappen en werktuigen
05.5.2;Kleine gereedschappen en toebehoren
05.5.2.1;Kleine gereedschappen zonder motor
05.5.2.1.10277;Huishoudtrap, ladder
05.5.2.1.10280;Handgereedschap (ook gereedschapskisten, behangtafels)
05.5.2.1.10295;Tuinslang, sproeier
05.5.2.1.10296;Klein tuingerei (snoeischaar, hark, handschoenen)
05.5.2.1.10297;Regenton, gieter en plantenspuit
05.5.2.1.10300;Kruiwagen, steekwagen, grasmachine (niet elektrisch)
05.5.2.2;Allerlei toebehoren voor kleine gereedschappen
05.5.2.2.10252;Gaslamp, olielamp
05.5.2.2.10276;Hang- en sluitwerk (ook kettingslot)
05.5.2.2.10278;Openhaard
05.5.2.2.10281;Hulpstukken voor elektrisch gereedschap
05.5.2.2.10283;Schakelaars, stekkers en contactdozen
05.5.2.2.10284;Batterijen, accu's (niet voor auto)
05.5.2.2.10285;Elektrisch snoer, kabel
05.5.2.2.10286;Elektrisch overig: gloei-/ledlamp, tl-buis, ook armatuur
05.5.2.2.10287;Alarm installatie, bewegingsmelder, rookmelder
05.5.2.2.10291;Hout (voor de tuin)
05.5.2.2.10292;Tuindecoratie (beelden, nestkast, windwijzer)
05.5.2.2.10293;Grind en stenen (voor de tuin)
05.5.2.2.10298;Materialen voor vijver
05.5.2.2.10299;Draad, gaas voor tuin, afrastering
05.5.2.2.10301;Tuinhuisje, tuinkas, schutting, tuinscherm
05.5.2.2.10302;Bloemschikmateriaal
05.5.2.2.10303;Tuinmaterialen (niet apart genoemd)
05.5.2.3;Reparatie van kleine gereedschappen zonder motor en allerlei toebehoren
05.5.2.3.0;Reparatie van kleine gereedschappen zonder motor en allerlei toebehoren
05.6;Goederen en diensten voor het dagelijks onderhoud van de woning
05.6.1;Niet-duurzame huishoudproducten
05.6.1.1;Schoonmaak- en onderhoudsproducten
05.6.1.1.10323;Was en olie voor onderhoud meubelen en vloeren
05.6.1.1.10324;Schoenpoetsmiddelen
05.6.1.1.10325;Vaatwasmiddel
05.6.1.1.10327;Wasmiddelen (ook huishoudzeep, soda, stijfsel)
05.6.1.1.10328;Reinigingsmiddelen (allesreiniger, chloor)
05.6.1.1.10360;Schimmelwerende middelen
05.6.1.1.10361;Dierbestrijdingsmiddelen, -artikelen
05.6.1.1.10447;Bestrijdingsmiddel voor bloemen
05.6.1.2;Overige niet-duurzame kleine huishoudproducten
05.6.1.2.10305;Wegwerp servies en bestek
05.6.1.2.10320;Vloerwrijver, sponsstok, raamwisser
05.6.1.2.10321;Vaatdoekje, dweil, spons, zeem
05.6.1.2.10322;Bezems en borstels
05.6.1.2.10326;Wasbenzine, terpentine, spiritus
05.6.1.2.10345;Kleerhanger (ook rokspanners, stropdassenhanger)
05.6.1.2.10347;Zakjes (boterhamzakjes, diepvrieszakjes)
05.6.1.2.10349;Papierlijm (zoals velpon, pritstift)
05.6.1.2.10350;Aanmaakmateriaal voor barbecue en openhaard
05.6.1.2.10351;Huisvuil- en stofzuigerzakken
05.6.1.2.10352;Spijkers
05.6.1.2.10358;Tafelpapier, servetten
05.6.1.2.10359;(koffie)filterzakjes
05.6.1.2.10362;Bouten, moeren, schroeven, pluggen
05.6.1.2.10363;Handwerkgerei (naaigarnituur)
05.6.1.2.10364;Aluminium, plastic folie, hulpstukken vloerwrijver
05.6.1.2.10366;Waslijn, wasknijpers
05.6.1.2.10367;Wasemkapfilters
05.6.1.2.10368;Kaarsen
05.6.1.2.10369;(smeer)olie voor onderhoud
05.6.2;Diensten ten behoeve van het huishouden
05.6.2.1;Huishoudelijke diensten van betaald personeel
05.6.2.1.10339;Hulp in de huishouding, mantelzorg, klusjesman
05.6.2.1.10341;Kinderopvang
05.6.2.2;Reinigingsdiensten
05.6.2.2.0;Reinigingsdiensten
05.6.2.3;Huur van meubelen en stoffering
05.6.2.3.0;Huur van meubelen en stoffering
05.6.2.9;Overige diensten ten behoeve van het huishouden
05.6.2.9.10338;Ongediertebestrijding
05.6.2.9.10340;Glazenwasser, schoorsteenveger
06;GEZONDHEID
06.1;Medische producten, apparaten en toestellen
06.1.1;Farmaceutische producten
06.1.1.0;Farmaceutische producten
06.1.1.0.10374;Geneesmiddel
06.1.1.0.10384;Geneesmiddel op voorschrift
06.1.2;Overige medische producten
06.1.2.1;Zwangerschapstests en mechanische contraceptiva
06.1.2.1.10371;Anticonceptiemiddel
06.1.2.1.10372;Condooms
06.1.2.9;Andere medische producten n.e.g.
06.1.2.9.10376;Medische meet en regelapparatuur (thermometer)
06.1.2.9.10380;Verbandmiddelen, gaas
06.1.2.9.10382;Incontinentieluier, -broekje
06.1.3;Therapeutische apparaten en toestellen
06.1.3.1;Brillenglazen en contactlenzen voor verbetering van gezichtsstoornissen
06.1.3.1.10375;Bril, lenzen
06.1.3.2;Gehoorapparaten
06.1.3.2.10377;Gehoorapparaat
06.1.3.3;Reparatie van therapeutische apparaten en toestellen
06.1.3.3.10378;Reparatie van en accessoires voor bril en gehoorapparaat
06.1.3.9;Overige therapeutische apparaten en toestellen
06.1.3.9.10379;Medische hulpmiddelen (niet apart genoemd)
06.1.3.9.10381;Infrarood lamp
06.2;Extramurale gezondheidszorg
06.2.1;Diensten van artsen
06.2.1.1;Diensten van huisartsen
06.2.1.1.10385;Huisarts
06.2.1.2;Diensten van medische specialisten
06.2.1.2.10386;Medische behandelingen en controles (niet apart genoemd)
06.2.2;Diensten van tandartsen
06.2.2.0;Diensten van tandartsen
06.2.2.0.10383;Tandarts behandeling/controle
06.2.3;Diensten van paramedici
06.2.3.1;Diensten van medischeanalyselaboratoria en doorlichtingscentra
06.2.3.1.0;Diensten van medischeanalyselaboratoria en doorlichtingscentra
06.2.3.2;Warme baden, bewegingstherapie, ambulances en huur van therapeutische toestellen
06.2.3.2.10373;Huur medische artikelen
06.2.3.9;Overige paramedische diensten
06.2.3.9.10387;Alternatieve genezers
06.3;Diensten van ziekenhuizen
06.3.0;Diensten van ziekenhuizen
06.3.0.0;Diensten van ziekenhuizen
06.3.0.0.0;Diensten van ziekenhuizen
07;VERVOER
07.1;Aankoop van voertuigen
07.1.1;Auto's
07.1.1.1;Nieuwe auto's
07.1.1.1.0;Nieuwe auto's
07.1.1.2;Tweedehands auto's
07.1.1.2.0;Tweedehands auto's
07.1.2;Motorfietsen, scooters, bromfietsen en elektrische fietsen
07.1.2.0;Motorfietsen, scooters, bromfietsen en elektrische fietsen
07.1.2.0.10393;Brommer
07.1.2.0.10394;Motor, scooter
07.1.2.0.10615;Elektrische fiets
07.1.3;Fietsen
07.1.3.0;Fietsen
07.1.3.0.10392;Fiets
07.1.4;Door dieren getrokken voertuigen
07.1.4.0;Door dieren getrokken voertuigen
07.1.4.0.0;Door dieren getrokken voertuigen
07.2;Gebruik van privé-voertuigen
07.2.1;Onderdelen en accessoires van privé-voertuigen
07.2.1.1;Banden
07.2.1.1.10395;Fietsband
07.2.1.1.10407;Autobanden
07.2.1.2;Onderdelen van privé-voertuigen
07.2.1.2.10399;Onderdelen motor, (brom)fiets (niet apart genoemd)
07.2.1.2.10408;Autogereedschap
07.2.1.2.10412;Uitlaat auto
07.2.1.2.10413;Onderdelen en toebehoren auto's (niet apart genoemd)
07.2.1.3;Accessoires voor privé-voertuigen
07.2.1.3.10396;Accessoires voor (brom)fiets
07.2.1.3.10398;Tas/koffer voor motor, brommer, scooter
07.2.2;Brandstoffen en smeermiddelen voor privé-voertuigen
07.2.2.1;Diesel
07.2.2.1.10388;Diesel
07.2.2.2;Benzine
07.2.2.2.10390;Benzine
07.2.2.3;Overige brandstoffen voor privé-voertuigen
07.2.2.3.10389;Autogas (lpg)
07.2.2.4;Smeermiddelen
07.2.2.4.10391;Olie voor auto, motor, brommer (vervoermiddel)
07.2.2.4.10411;Reinigings- en onderhoudsmiddelen auto
07.2.3;Onderhoud en reparatie van privé-voertuigen
07.2.3.0;Onderhoud en reparatie van privé-voertuigen
07.2.3.0.10397;Reparatie (brom)fiets, brommer, scooter
07.2.3.0.10409;Onderhoud auto (vervoermiddel)
07.2.3.0.10410;Reiniging auto (vervoermiddel)
07.2.4;Overige diensten in verband met privé-voertuigen
07.2.4.1;Huur van garages, parkeerplaatsen en privé-voertuigen
07.2.4.1.10403;Huur auto
07.2.4.1.10404;Huur transportmiddelen (niet apart genoemd)
07.2.4.2;Tolvoorzieningen en parkeermeters
07.2.4.2.10414;Parkeer- en tolgelden (niet apart genoemd)
07.2.4.2.10415;Veerdiensten
07.2.4.3;Rijlessen, rijexamens, rijbewijzen en technische keuringen
07.2.4.3.10405;Technische keuringen
07.2.4.3.10421;Autorijles, rijexamen
07.3;Vervoersdiensten
07.3.1;Personenvervoer per spoor
07.3.1.1;Personenvervoer per spoor
07.3.1.1.10416;Treinkaartje binnenland
07.3.1.1.10418;Gecombineerd trein-/toegangsbewijs
07.3.1.1.10420;Treinreis buitenland
07.3.1.2;Personenvervoer per tram of metro
07.3.1.2.0;Personenvervoer per tram of metro
07.3.2;Personenvervoer over de weg
07.3.2.1;Personenvervoer per bus
07.3.2.1.0;Personenvervoer per bus
07.3.2.2;Personenvervoer per taxi of huurauto met chauffeur
07.3.2.2.10402;Taxi, ziekenvervoer
07.3.3;Personenvervoer door de lucht
07.3.3.1;Binnenlandse vluchten
07.3.3.1.10485;Rondvlucht, ballonvaart
07.3.3.2;Internationale vluchten
07.3.3.2.0;Internationale vluchten
07.3.4;Personenvervoer over zee of over binnenwateren
07.3.4.1;Personenvervoer over zee
07.3.4.1.0;Personenvervoer over zee
07.3.4.2;Personenvervoer over binnenwateren
07.3.4.2.0;Personenvervoer over binnenwateren
07.3.5;Gecombineerd personenvervoer
07.3.5.0;Gecombineerd personenvervoer
07.3.5.0.10401;Vervoer bus, tram en metro (geen abonnement)
07.3.5.0.10417;Openbaarvervoerkaarten (opladen)
07.3.5.0.10603;Abonnement openbaar vervoer
07.3.6;Overige aankopen van vervoersdiensten
07.3.6.1;Vervoer per kabelspoorweg, kabelbaan en stoeltjeslift
07.3.6.1.0;Vervoer per kabelspoorweg, kabelbaan en stoeltjeslift
07.3.6.2;Verhuizing en opslag
07.3.6.2.10422;Kosten verhuizer, vrachtdienst
07.3.6.9;Overige aankopen van vervoersdiensten n.e.g.
07.3.6.9.0;Overige aankopen van vervoersdiensten n.e.g.
08;COMMUNICATIE
08.1;Post- en pakketdiensten
08.1.0;Post- en pakketdiensten
08.1.0.1;Bezorging van brieven
08.1.0.1.10424;Post
08.1.0.9;Andere postdiensten
08.1.0.9.0;Andere postdiensten
08.2;Telefoonapparatuur
08.2.0;Telefoonapparatuur
08.2.0.1;Apparatuur voor vaste telefonie
08.2.0.1.10429;(huis)telefooninstallatie
08.2.0.2;Apparatuur voor mobiele telefonie
08.2.0.2.10428;Telefoonapparaat
08.2.0.3;Overige telefoon- en faxtoestellen
08.2.0.3.10427;Kantoormachines
08.2.0.3.10430;Telefoonaccessoires
08.2.0.4;Reparatie van telefoon- en faxtoestellen
08.2.0.4.0;Reparatie van telefoon- en faxtoestellen
08.3;Telefoon- en internetdiensten
08.3.0;Telefoon- en internetdiensten
08.3.0.1;Vaste telefoondiensten
08.3.0.1.10426;Gesprekskosten telefoon (-kaarten)
08.3.0.2;Mobiele telefoondiensten
08.3.0.2.0;Mobiele telefoondiensten
08.3.0.3;Verlenen van toegang tot internet
08.3.0.3.0;Verlenen van toegang tot internet
08.3.0.4;Gebundelde telecommunicatiediensten
08.3.0.4.0;Gebundelde telecommunicatiediensten
08.3.0.5;Overige diensten voor de transmissie van informatie
08.3.0.5.0;Overige diensten voor de transmissie van informatie
09;RECREATIE EN CULTUUR
09.1;Audio- en videoapparatuur, foto- en filmapparatuur en gegevensverwerkende apparatuur
09.1.1;Audio- en video-opname- en -weergaveapparatuur
09.1.1.1;Audio-opname- en -weergaveapparatuur
09.1.1.1.10519;Radio's
09.1.1.1.10520;Audioapparatuur
09.1.1.1.10521;Onderdelen audio- en videoapparatuur
09.1.1.2;Televisies en video-apparatuur
09.1.1.2.10514;Tv-antenne, -schotel
09.1.1.2.10522;Televisies
09.1.1.2.10523;Dvd-speler
09.1.1.3;Draagbare beeld- en geluidapparatuur
09.1.1.3.0;Draagbare beeld- en geluidapparatuur
09.1.1.9;Overige apparatuur voor de opname en weergave van audio en video
09.1.1.9.0;Overige apparatuur voor de opname en weergave van audio en video
09.1.2;Foto- en filmapparatuur en optische instrumenten
09.1.2.1;Camera's
09.1.2.1.10524;Camera (foto of film)
09.1.2.2;Toebehoren voor foto- en filmapparatuur
09.1.2.2.10533;Doka-materiaal
09.1.2.2.10536;Fotoaccessoires (niet apart genoemd)
09.1.2.3;Optische instrumenten
09.1.2.3.10528;Loep, verrekijker, microscoop
09.1.3;Gegevensverwerkende apparatuur
09.1.3.1;Personal computers
09.1.3.1.10525;Computerapparatuur
09.1.3.1.10529;Toebehoren voor computer (ook inkt en software)
09.1.3.2;Accessoires voor gegevensverwerkende apparatuur
09.1.3.2.10530;Kantoormachines
09.1.3.3;Software
09.1.3.3.0;Software
09.1.3.4;Rekenmachines en andere gegevensverwerkende apparatuur
09.1.3.4.0;Rekenmachines en andere gegevensverwerkende apparatuur
09.1.4;(On)bespeelde beeld- en geluidsdragers
09.1.4.1;Voorbespeelde dragers van beeld of geluid
09.1.4.1.10515;Cd (bespeeld of leeg)
09.1.4.1.10516;Dvd of blue ray disk (bespeeld of leeg)
09.1.4.1.10517;Opbergdozen cd/dvd/platen
09.1.4.1.10518;Videobanden (bespeeld of leeg)
09.1.4.1.10526;Grammofoonplaten, geluidsbanden
09.1.4.2;Onbespeelde dragers van beeld of geluid
09.1.4.2.0;Onbespeelde dragers van beeld of geluid
09.1.4.9;Overige beeld- en geluidsdragers
09.1.4.9.10532;Filmpjes, foto's en fotopapier
09.1.4.9.10535;Plakmiddelen voor foto's (plakband, fotohoekjes)
09.1.5;Reparatie van audio- en videoapparatuur, foto- en filmapparatuur en gegevensverwerkende apparatuur
09.1.5.0;Reparatie van audio- en videoapparatuur, foto- en filmapparatuur en gegevensverwerkende apparatuur
09.1.5.0.10527;Reparatie audio- en videoapparatuur
09.2;Overige grote duurzame goederen voor recreatie en cultuur
09.2.1;Grote duurzame goederen voor recreatie buitenshuis
09.2.1.1;Kampeerwagens, caravans en aanhangwagens
09.2.1.1.10469;Caravans
09.2.1.2;Vliegtuigen, ultralichte vliegtuigen, zeilvliegers en heteluchtballonnen
09.2.1.2.0;Vliegtuigen, ultralichte vliegtuigen, zeilvliegers en heteluchtballonnen
09.2.1.3;Boten, buitenboordmotoren en uitrusting van boten
09.2.1.3.10472;Plezierboten
09.2.1.3.10473;Buitenboordmotor
09.2.1.4;Paarden, pony's en toebehoren
09.2.1.4.0;Paarden, pony's en toebehoren
09.2.1.5;Grote artikelen voor spelen en sport
09.2.1.5.10476;Surfplank, kiteboard
09.2.2;Muziekinstrumenten en grote duurzame goederen voor recreatie binnenshuis
09.2.2.1;Muziekinstrumenten
09.2.2.1.10512;Muziekinstrument
09.2.2.1.10513;Toebehoren voor muziekinstrumenten
09.2.2.2;Grote duurzame goederen voor recreatie binnenshuis
09.2.2.2.0;Grote duurzame goederen voor recreatie binnenshuis
09.2.3;Onderhoud en reparatie van andere grote duurzame goederen voor recreatie en cultuur
09.2.3.0;Onderhoud en reparatie van andere grote duurzame goederen voor recreatie en cultuur
09.2.3.0.10471;Onderhoud en reparatie caravan
09.2.3.0.10475;Onderdelen/reparatie boot
09.2.3.0.10487;Liggeld, sluisgeld, havengeld
09.2.3.0.10511;Onderhoud en reparatie muziekinstrument
09.3;Overige artikelen en overig materieel voor recreatie, tuinen en huisdieren
09.3.1;Spellen, speelgoed en hobby's
09.3.1.1;Spellen en hobby's
09.3.1.1.10450;Verzamelalbum (postzegel, munten, kaarten)
09.3.1.1.10507;Computer-/videospellen
09.3.1.1.10609;Postzegels, edelstenen, munten (voor verzameling)
09.3.1.2;Speelgoed en feestartikelen
09.3.1.2.10501;Vuurwerk
09.3.1.2.10502;Modelbouw, constructiespeelgoed, speelgoed
09.3.1.2.10505;Fopartikelen
09.3.1.2.10508;Feestartikelen, feestversiering
09.3.1.2.10509;Kerstartikelen, kerstdecoratie
09.3.1.2.10510;Kerst(boom) verlichting
09.3.2;Sport- en kampeerartikelen en artikelen voor recreatie in de open lucht
09.3.2.1;Sportartikelen
09.3.2.1.10503;Sportartikelen
09.3.2.2;Kampeerartikelen en artikelen voor recreatie in de open lucht
09.3.2.2.10468;Campingbedden en -matrassen
09.3.2.2.10470;Kampeerartikelen
09.3.2.3;Reparatie van sport- en kampeerartikelen en artikelen voor recreatie in de open lucht
09.3.2.3.10504;Onderhoud en reparatie sportmateriaal
09.3.3;Tuinen, planten en bloemen
09.3.3.1;Tuinproducten
09.3.3.1.10441;Turf
09.3.3.1.10442;Bloembak, bloempot (gevuld met planten)
09.3.3.1.10443;Keramische sierpotten
09.3.3.1.10448;Potgrond, tuinaarde, zand
09.3.3.1.10449;Kunstmest
09.3.3.2;Planten en bloemen
09.3.3.2.10439;Bloemen
09.3.3.2.10440;Kerstboom
09.3.3.2.10444;Bloembollen
09.3.3.2.10445;Bomen, struiken en planten
09.3.3.2.10446;Zaaizaden, pootgoed
09.3.4;Huisdieren en producten voor huisdieren
09.3.4.1;Aankoop van huisdieren
09.3.4.1.10431;Pluimvee (levend)
09.3.4.1.10435;Aankoop huisdieren
09.3.4.2;Producten voor huisdieren
09.3.4.2.10432;Aquaria en dierverblijven huisdieren
09.3.4.2.10433;Artikelen voor huisdieren (niet apart genoemd)
09.3.4.2.10434;Medicijnen en dierverzorgingsmiddelen
09.3.4.2.10436;Diervoeder
09.3.5;Diensten ten behoeve van huisdieren
09.3.5.0;Diensten ten behoeve van huisdieren
09.3.5.0.10437;Trimsalon, kennel, cursus
09.3.5.0.10438;Dierenarts
09.4;Diensten op het gebied van recreatie en cultuur
09.4.1;Diensten op het gebied van recreatie en sport
09.4.1.1;Diensten op het gebied van recreatie en sport — aanwezigheid
09.4.1.1.10461;Attractie/evenement (pretpark, circus, rommelmarkt)
09.4.1.1.10465;Wedstrijden (voetbal, atletiek)
09.4.1.1.10479;Entree/huur sportfaciliteit
09.4.1.2;Diensten op het gebied van recreatie en cultuur — deelname
09.4.1.2.10459;Opleidingen creatief (handwerken, muziek, toneel)
09.4.1.2.10460;Opleidingen sport
09.4.1.2.10477;Huur sportartikelen
09.4.1.2.10478;Vervoerskosten in verband met sport
09.4.1.2.10480;Huur boot
09.4.1.2.10481;Huur ligstoel
09.4.1.2.10601;Opleidingen/cursussen
09.4.2;Diensten op het gebied van cultuur
09.4.2.1;Bioscopen, theaters en concerten
09.4.2.1.10466;Theater, bioscoop, concert
09.4.2.2;Musea, bibliotheken, dierentuinen
09.4.2.2.10462;Cultureel jeugdpaspoort / museumkaart
09.4.2.2.10467;Entreegelden (niet apart genoemd)
09.4.2.2.10486;Welzijnswerk
09.4.2.2.10488;Kosten excursie
09.4.2.3;Kijk- en luistergelden en televisieabonnementen
09.4.2.3.10807;Downloaden apps, iTunes e.d.
09.4.2.4;Huur van materiaal en toebehoren voor cultuur
09.4.2.4.10484;Huur videobanden, dvd's
09.4.2.5;Diensten op het gebied van fotografie
09.4.2.5.10531;Ontwikkelen, afdrukken, monteren
09.4.2.5.10534;Huur film, filmprojector (visuele middelen)
09.4.2.5.10537;Kosten diensten fotografie en film (niet apart genoemd)
09.4.2.9;Overige culturele diensten
09.4.2.9.10482;Huur muziekinstrumenten, geluidsapparatuur
09.4.3;Kansspelen
09.4.3.0;Kansspelen
09.4.3.0.10464;Casino
09.4.3.0.10612;Loterijen, casino
09.5;Kranten, boeken en schrijfwaren
09.5.1;Boeken
09.5.1.1;Fictieboeken
09.5.1.1.10452;Boeken (geen studieboek)
09.5.1.2;Studieboeken
09.5.1.2.10451;Studieboeken
09.5.1.3;Andere non-fictieboeken
09.5.1.3.0;Andere non-fictieboeken
09.5.1.4;Boekbinddiensten en e-boekdownloads
09.5.1.4.0;Boekbinddiensten en e-boekdownloads
09.5.2;Kranten en tijdschriften
09.5.2.1;Kranten
09.5.2.1.10453;Dagblad (losse verkoop)
09.5.2.2;Tijdschriften
09.5.2.2.10454;Vaktijdschrift (losse verkoop)
09.5.2.2.10455;Tijdschriften (niet apart genoemd)
09.5.3;Divers drukwerk
09.5.3.0;Divers drukwerk
09.5.3.0.10493;Kalenders en (wens)kaarten
09.5.3.0.10496;Drukwerk (niet apart genoemd)
09.5.4;Schrijfwaren en tekenartikelen
09.5.4.1;Producten van papier
09.5.4.1.10346;Pak- en kaftpapier, hobby- en knutselpapier
09.5.4.1.10492;Papier, enveloppen
09.5.4.1.10494;Tekenpapier
09.5.4.9;Andere schrijfwaren en tekenartikelen
09.5.4.9.10348;Textielverf
09.5.4.9.10490;Weefsels (niet apart genoemd: schildersdoek, schilderslinnen)
09.5.4.9.10491;Schildersezel, schilderskist, tekendoos
09.5.4.9.10495;Teken-/schrijfmaterialen
09.5.4.9.10497;Kantoormaterialen (niet apart genoemd)
09.5.4.9.10498;Schrijfwaren (niet apart genoemd)
09.6;Pakketreizen
09.6.0;Pakketreizen
09.6.0.1;Pakketreizen voor binnenlandse vakanties
09.6.0.1.10620;Dagtochten
09.6.0.2;Pakketreizen voor internationale vakanties
09.6.0.2.0;Pakketreizen voor internationale vakanties
10;ONDERWIJS
10.1;Kleuter- en primair onderwijs
10.1.0;Kleuter- en primair onderwijs
10.1.0.1;Kleuteronderwijs [niveau 0 van ISCED-97]
10.1.0.1.0;Kleuteronderwijs [niveau 0 van ISCED-97]
10.1.0.2;Primair onderwijs [niveau 1 van ISCED-97]
10.1.0.2.10593;Schoolreis/-kamp
10.2;Secundair onderwijs
10.2.0;Secundair onderwijs
10.2.0.0;Secundair onderwijs
10.2.0.0.10594;Kosten voor bijlessen
10.3;Postsecundair niet-tertiair onderwijs
10.3.0;Postsecundair niet-tertiair onderwijs
10.3.0.0;Postsecundair niet-tertiair onderwijs [niveau 4 van ISCED-97]
10.3.0.0.0;Postsecundair niet-tertiair onderwijs [niveau 4 van ISCED-97]
10.4;Tertiair onderwijs
10.4.0;Tertiair onderwijs
10.4.0.0;Tertiair onderwijs
10.4.0.0.0;Tertiair onderwijs
10.5;Onderwijs dat niet naar niveau kan worden ingedeeld
10.5.0;Onderwijs dat niet naar niveau kan worden ingedeeld
10.5.0.0;Onderwijs dat niet naar niveau kan worden ingedeeld
10.5.0.0.10592;Opleidingen (niet apart genoemd)
11;RESTAURANTS EN HOTELS
11.1;Cateringdiensten
11.1.1;Restaurants, cafés en dergelijke
11.1.1.1;Restaurants, cafés en dancings
11.1.1.1.10463;Disco/dansgelegenheid, feestavond
11.1.1.1.10539;Catering aan huis
11.1.1.1.10540;Fooien en tipgeld
11.1.1.1.10541;Koffie/thee in horeca
11.1.1.1.10542;Drank in horeca
11.1.1.1.10543;Maaltijd (of gebak) in horeca
11.1.1.2;Fastfood en afhaalmaaltijden
11.1.1.2.10545;Snoep in horeca
11.1.1.2.10546;(consumptie)ijs in horeca
11.1.2;Kantines
11.1.2.0;Kantines
11.1.2.0.0;Kantines
11.2;Accommodatie
11.2.0;Accommodatie
11.2.0.1;Hotels, motels, herbergen en dergelijke
11.2.0.1.10583;Huur ruimte (feestzaal, oefenlokaal)
11.2.0.1.10911;Korte vakantie binnenland (1 overnachting)
11.2.0.1.10912;Korte vakantie buitenland (1 overnachting)
11.2.0.2;Bungalowparken, kampeerterreinen, jeugdherbergen en dergelijke
11.2.0.2.0;Bungalowparken, kampeerterreinen, jeugdherbergen en dergelijke
11.2.0.3;Diensten op het gebied van accommodatie van andere instellingen
11.2.0.3.0;Diensten op het gebied van accommodatie van andere instellingen
12;DIVERSE GOEDEREN EN DIENSTEN
12.1;Persoonlijke verzorging
12.1.1;Kapsalons en schoonheidsinstituten
12.1.1.1;Heren- en kinderkappers
12.1.1.1.10547;Kapper voor kind (jonger dan 18)
12.1.1.1.10548;Kapper voor man
12.1.1.2;Dameskappers
12.1.1.2.10549;Kapper voor vrouw
12.1.1.2.10809;Kapper (niet appart genoemd)
12.1.1.3;Schoonheidsbehandelingen
12.1.1.3.10554;Behandeling schoonheidssalon, pedicure
12.1.1.3.10555;Sauna, massage
12.1.2;Elektrische apparaten voor lichaamsverzorging
12.1.2.1;Elektrische apparaten voor lichaamsverzorging
12.1.2.1.10550;Elektrische apparaten voor lichaamsverzorging
12.1.2.2;Reparatie van elektrische apparaten voor lichaamsverzorging
12.1.2.2.0;Reparatie van elektrische apparaten voor lichaamsverzorging
12.1.3;Overige apparaten, artikelen en producten voor lichaamsverzorging
12.1.3.1;Niet-elektrische apparaten
12.1.3.1.10551;Weegschaal
12.1.3.1.10558;Kammen, krullers en spelden
12.1.3.1.10559;Scheerartikelen voor nat scheren (kwast, kom, mesjes)
12.1.3.1.10566;Epileertang, pincet
12.1.3.1.10577;Hand(gereedschap) (niet elektrisch)
12.1.3.1.10581;Spons/borstel voor lichaamsverzorging
12.1.3.2;Artikelen voor persoonlijke hygiëne en wellness, esoterische en schoonheidsproducten
12.1.3.2.10556;Zeep
12.1.3.2.10557;Shampoo
12.1.3.2.10560;Scheerzeep, scheerschuim
12.1.3.2.10561;Lak, versteviger, crème
12.1.3.2.10562;Parfum, deodorant
12.1.3.2.10563;Ontharingscrème
12.1.3.2.10564;Doucheschuim, badolie
12.1.3.2.10565;Reinigingsmiddelen tanden, gebit
12.1.3.2.10567;Huidverzorgingsmiddelen (niet apart genoemd)
12.1.3.2.10575;Seks middelen
12.1.3.2.10576;Luchtverfrisser (toiletspray, geurolie e.d.)
12.1.3.2.10578;Hygiënische verzorgingsproducten (maandverband, tampons)
12.1.3.2.10580;Poeder en crème voor huidverzorging
12.1.3.2.10582;Zakdoekjes, luiers, toiletpapier
12.2;Prostitutie
12.2.0;Prostitutie
12.2.0.0;Prostitutie
12.2.0.0.10590;Erotisch vermaak
12.3;Artikelen voor persoonlijk gebruik n.e.g.
12.3.1;Sieraden, klokken en horloges
12.3.1.1;Sieraden
12.3.1.1.10154;Sieraden
12.3.1.2;Klokken en horloges
12.3.1.2.10155;Horloges, klokken, wekkers
12.3.1.3;Reparatie van sieraden, klokken en horloges
12.3.1.3.10160;Reparatie sieraden en horloges
12.3.2;Overige artikelen voor persoonlijk gebruik
12.3.2.1;Reisartikelen
12.3.2.1.10158;Boekentas, aktetas (niet van leer)
12.3.2.1.10344;Tas van leer
12.3.2.1.10506;Opbergtassen (sport)
12.3.2.2;Artikelen voor baby's
12.3.2.2.10610;Kinderwagens, boodschappenwagen
12.3.2.3;Reparatie van andere artikelen voor persoonlijk gebruik
12.3.2.3.10161;Reparatie tassen/koffers, paraplu's
12.3.2.9;Overige artikelen voor persoonlijk gebruik n.e.g.
12.3.2.9.10150;Sleutelring, hanger
12.3.2.9.10156;Zonnebril (glazen)
12.3.2.9.10159;Paraplu, wandelstok
12.3.2.9.10165;Rookartikelen (niet apart genoemd)
12.3.2.9.10579;Haarstukje, pruik
12.3.2.9.10586;Grafsteen, bewerkte natuursteen
12.3.2.9.10606;Thermometer, barometer en hygrometer
12.4;Sociale bescherming
12.4.0;Sociale bescherming
12.4.0.1;Kinderopvang
12.4.0.1.0;Kinderopvang
12.4.0.2;Bejaardentehuizen en tehuizen voor personen met een handicap
12.4.0.2.0;Bejaardentehuizen en tehuizen voor personen met een handicap
12.4.0.3;Thuiszorg
12.4.0.3.0;Thuiszorg
12.4.0.4;Adviesverlening
12.4.0.4.0;Adviesverlening
12.5;Verzekeringen
12.5.1;Levensverzekeringen
12.5.1.0;Levensverzekeringen
12.5.1.0.0;Levensverzekeringen
12.5.2;Verzekeringen in verband met de woning
12.5.2.0;Verzekeringen in verband met de woning
12.5.2.0.0;Verzekeringen in verband met de woning
12.5.3;Verzekeringen in verband met gezondheid
12.5.3.1;Volksverzekeringen in verband met gezondheid
12.5.3.1.0;Volksverzekeringen in verband met gezondheid
12.5.3.2;Particuliere verzekeringen in verband met gezondheid
12.5.3.2.0;Particuliere verzekeringen in verband met gezondheid
12.5.4;Verzekeringen in verband met vervoer
12.5.4.1;Motorvoertuigenverzekeringen
12.5.4.1.0;Motorvoertuigenverzekeringen
12.5.4.2;Reisverzekeringen
12.5.4.2.10569;Reisverzekering, bagageverzekering
12.5.5;Overige verzekeringen
12.5.5.0;Overige verzekeringen
12.5.5.0.0;Overige verzekeringen
12.6;Financiële diensten n.e.g.
12.6.1;Indirect gemeten diensten van financiële intermediairs
12.6.1.0;Indirect gemeten diensten van financiële intermediairs
12.6.1.0.0;Indirect gemeten diensten van financiële intermediairs
12.6.2;Overige financiële diensten n.e.g.
12.6.2.1;Vergoedingen voor banken en postkantoren
12.6.2.1.10553;Provisie banken
12.6.2.1.10599;Kosten betalingsverkeer
12.6.2.2;Honoraria en kosten van de diensten van makelaars en beleggingsadviseurs
12.6.2.2.10552;Accountant, boekhouder, belastingadviseur e.d.
12.7;Overige diensten n.e.g.
12.7.0;Overige diensten n.e.g.
12.7.0.1;Legestarieven
12.7.0.1.10489;Vergunningen met betrekking tot recreatie (vissen, jacht)
12.7.0.1.10572;Kosten visum (consulaat)
12.7.0.1.10573;Identiteitsbewijzen, vergunningen, leges
12.7.0.1.10607;Boetes
12.7.0.2;Juridische diensten en accountancy
12.7.0.2.10585;Notaris, rechtskundige diensten
12.7.0.3;Begrafenisdiensten
12.7.0.3.10587;Begrafeniskosten, uitvaart
12.7.0.4;Overige honoraria en diensten
12.7.0.4.10584;Fotokopie, drukwerk (niet apart genoemd)
12.7.0.4.10588;Huur opslagruimte, huur pakhuis
12.7.0.4.10589;Diensten sociale instellingen
12.7.0.4.10591;Milieuheffing (op goederen)
12.8;Handmatig toegevoegd
12.8.0;Overige
12.8.0.0;Overige
12.8.0.0.0;Overige