<svg fill="currentColor" xmlns="http://www.w3.org/2000/svg" width="32" height="32" viewBox="0 0 260 260">
<g>
	<path  d="M58.361,0.46c1.476,0.767,3.06,1.379,4.406,2.328
		c3.511,2.476,5.039,6.033,5.09,10.263c0.031,2.617,0.005,5.234,0.005,8.215c1.144,0,2.126,0,3.108,0c30.72,0,61.441,0,92.162,0.001
		c0.846,0,1.701-0.06,2.537,0.036c2.02,0.231,3.269,1.369,3.442,3.42c0.187,2.194-0.988,3.549-3.05,4.03
		c-0.969,0.226-2.019,0.127-3.033,0.127c-43.668,0.005-87.338-0.006-131.007,0.012c-11.09,0.005-19.859,6.97-22.106,17.576
		c-0.399,1.882-0.447,3.865-0.449,5.802c-0.028,24.796-0.035,49.593-0.012,74.389c0.013,14.241,9.283,23.499,23.532,23.501
		c64.996,0.012,129.992,0.01,194.987,0.001c11.908-0.002,20.781-6.777,23.084-17.692c0.397-1.884,0.443-3.866,0.446-5.803
		c0.027-24.796,0.038-49.593,0.01-74.39c-0.016-14.276-9.234-23.387-23.578-23.391c-14.979-0.003-29.959,0-44.938-0.001
		c-0.762,0-1.527,0.039-2.284-0.023c-2.326-0.191-3.931-1.817-3.885-3.886c0.046-2.097,1.656-3.652,4.032-3.688
		c3.961-0.061,7.923-0.016,12.307-0.016c-0.46-8.669-0.88-17.312,9.44-20.81c6.941,0,13.883,0,20.824,0
		c7.915,3.205,9.887,6.153,9.89,14.783c0,1.354,0.091,2.715-0.022,4.059c-0.141,1.669,0.453,2.262,2.173,2.603
		c11.687,2.315,20.922,11.495,23.004,23.235c0.745,4.202,0.633,8.584,0.639,12.884c0.03,23.853,0.05,47.705-0.094,71.556
		c-0.044,7.325-3.07,13.596-8.068,18.911c-4.749,5.048-10.662,7.905-17.475,9.031c0,20.472,0,40.82,0,61.227
		c0.742,0.045,1.327,0.093,1.913,0.111c11.013,0.356,20.418,7.349,23.831,17.756c0.494,1.509,0.861,3.061,1.287,4.592
		c0,6.434,0,12.867,0,19.301c-86.683,0-173.365,0-260.048,0c0-6.434,0-12.867,0-19.301c0.17-0.556,0.384-1.103,0.503-1.669
		c1.227-5.828,4.067-10.715,8.603-14.571c5.116-4.35,11.125-6.251,18.086-6.154c0-0.952,0-1.777,0-2.603
		c0-3.215-0.002-6.43,0.001-9.646c0.001-0.677-0.021-1.356,0.041-2.029c0.204-2.249,1.661-3.765,3.642-3.832
		c2.06-0.071,3.807,1.502,3.868,3.854c0.121,4.65-0.002,9.307,0.121,13.957c0.022,0.825,0.538,1.919,1.187,2.4
		c3.555,2.636,7.223,5.118,11.061,7.799c2.481-3.143,5.97-6.203,10.433-7.826c1.868-0.68,2.294-1.667,2.287-3.532
		c-0.071-18.867-0.043-37.735-0.043-56.604c0-0.904,0-1.81,0-2.772c-8.479,0-16.631,0-24.857,0
		c-0.047,0.858-0.116,1.525-0.117,2.193c-0.009,9.476,0.021,18.952-0.029,28.428c-0.015,2.889-1.424,4.415-3.781,4.423
		c-2.372,0.009-3.729-1.505-3.794-4.397c-0.063-2.791-0.019-5.584-0.019-8.376c-0.001-7.522,0-15.045,0-22.61
		c-0.898-0.227-1.623-0.425-2.354-0.593c-13.71-3.148-23.23-14.199-23.357-28.19c-0.24-26.395-0.214-52.795,0.019-79.19
		c0.11-12.438,8.501-23.073,20.347-26.942c1.733-0.566,4.247-0.6,5.016-1.781c0.901-1.383,0.321-3.752,0.325-5.693
		c0.016-8.611,2.011-11.607,9.892-14.79C44.479,0.46,51.42,0.46,58.361,0.46z M88.735,229.337
		c5.46-6.749,12.303-10.469,20.897-10.471c8.589-0.001,15.417,3.746,20.88,10.471c5.477-6.861,12.364-10.494,20.959-10.468
		c8.571,0.026,15.386,3.807,20.791,10.488c5.371-6.938,12.328-10.234,20.642-10.63c0-20.404,0-40.58,0-60.8
		c-41.712,0-83.229,0-124.808,0c0,20.379,0,40.613,0,60.855C76.663,219.143,83.434,222.62,88.735,229.337z M252.875,252.763
		c0-3.027,0.064-5.89-0.012-8.749c-0.231-8.604-6.424-15.673-15.088-17.299c-8.029-1.507-16.301,3.007-19.613,10.707
		c-0.334,0.774-0.558,1.614-0.991,2.327c-1.536,2.53-4.938,2.513-6.49-0.02c-0.35-0.569-0.559-1.228-0.816-1.851
		c-3.031-7.314-9.652-11.77-17.54-11.354c-7.846,0.413-13.269,4.475-16.224,11.788c-1.439,3.564-4.753,4.481-6.816,1.869
		c-0.51-0.645-0.798-1.48-1.118-2.257c-3.018-7.315-9.637-11.796-17.51-11.404c-7.854,0.392-13.278,4.45-16.258,11.746
		c-1.381,3.38-4.284,4.463-6.435,2.298c-0.734-0.738-1.144-1.845-1.563-2.842c-3.535-8.406-12.324-12.934-21.173-10.702
		c-6.282,1.585-10.483,5.613-12.731,11.666c-0.657,1.768-1.813,2.912-3.714,2.928c-1.909,0.016-3.112-1.123-3.743-2.889
		c-0.113-0.318-0.222-0.64-0.351-0.952c-2.84-6.871-9.286-11.253-16.612-11.299c-7.503-0.047-13.989,4.259-16.903,11.224
		c-0.163,0.39-0.195,0.919-0.478,1.159c-1.153,0.977-2.364,2.564-3.583,2.59c-1.205,0.025-2.527-1.469-3.629-2.479
		c-0.507-0.464-0.586-1.378-0.905-2.067c-3.263-7.043-10.753-11.24-18.446-10.348c-7.699,0.894-14.226,6.638-15.542,14.27
		c-0.666,3.857-0.483,7.862-0.691,11.94C89.717,252.763,171.114,252.763,252.875,252.763z M201.094,157.905
		c-0.217,0.392-0.292,0.465-0.292,0.537c-0.03,20.048-0.064,40.095-0.037,60.142c0.001,0.592,0.521,1.532,1.02,1.72
		c4.874,1.828,8.83,4.874,11.714,8.539c3.374-2.519,6.455-5.136,9.859-7.224c1.656-1.016,2.396-1.823,2.389-3.814
		c-0.08-19.033-0.047-38.066-0.054-57.101c0-0.897-0.083-1.795-0.133-2.799C217.239,157.905,209.15,157.905,201.094,157.905z
		 M225.658,21.15c0-3.064,0.104-5.852-0.029-8.628c-0.135-2.763-1.8-4.374-4.56-4.414c-5.24-0.077-10.482-0.063-15.723-0.002
		c-2.41,0.028-4.197,1.299-4.412,3.707c-0.275,3.07-0.067,6.183-0.067,9.337C209.168,21.15,217.254,21.15,225.658,21.15z
		 M60.193,21.149c0-3.121,0.137-5.99-0.041-8.839c-0.157-2.502-1.836-4.136-4.279-4.182c-5.409-0.104-10.822-0.104-16.23-0.003
		c-2.269,0.042-3.999,1.314-4.179,3.643c-0.238,3.073-0.059,6.178-0.059,9.381C43.71,21.149,51.797,21.149,60.193,21.149z"/>
	<path  d="M111.002,101.116c0-5.779,0.031-10.829-0.007-15.878
		c-0.049-6.263-0.186-12.524-0.219-18.787c-0.011-2.071,0.922-3.625,3.098-4.039c1.885-0.358,3.356,0.386,4.144,2.145
		c0.296,0.662,0.333,1.478,0.342,2.225c0.166,14.641,0.304,29.282,0.466,43.922c0.026,2.406-0.65,4.399-3.119,5.23
		c-2.563,0.864-4.17-0.608-5.5-2.534c-7.305-10.58-14.605-21.163-21.909-31.743c-0.567-0.822-1.151-1.631-2.288-2.375
		c0,0.858,0,1.717,0,2.576c0,9.648,0.004,19.296-0.005,28.945c0,0.929,0.015,1.873-0.138,2.783
		c-0.323,1.933-1.626,3.008-3.493,3.083c-1.998,0.079-3.366-0.996-3.812-3.013c-0.145-0.653-0.161-1.343-0.162-2.017
		c-0.009-14.726-0.007-29.452-0.007-44.179c0-0.169,0.004-0.339,0.002-0.508c-0.028-2.034,0.589-3.748,2.697-4.387
		c2.076-0.63,3.54,0.356,4.711,2.069c4.393,6.423,8.831,12.815,13.255,19.217C102.901,89.41,106.748,94.966,111.002,101.116z"/>
	<path  d="M205.099,84.835c7.907,0,15.43,0.002,22.952-0.005
		c0.499,0,0.999-0.08,1.849-0.152c0-0.934,0-1.834,0-2.734c0.006-5.246-0.037-10.492,0.039-15.737
		c0.034-2.364,1.417-3.756,3.512-3.862c2.201-0.111,3.742,1.272,4.021,3.674c0.087,0.752,0.046,1.521,0.046,2.282
		c0.002,14.13,0.002,28.26,0,42.39c0,0.761,0.042,1.53-0.046,2.282c-0.27,2.31-1.976,3.866-4.023,3.735
		c-1.984-0.127-3.484-1.672-3.512-3.928c-0.069-5.753-0.031-11.507-0.035-17.26c-0.001-0.913-0.001-1.826-0.001-2.897
		c-8.334,0-16.403,0-24.801,0c0,1.212,0.001,2.366,0,3.519c-0.002,5.5,0.05,11-0.031,16.499c-0.037,2.487-1.781,4.152-3.942,4.07
		c-2.086-0.078-3.618-1.689-3.623-4.085c-0.032-15.399-0.033-30.798-0.003-46.197c0.005-2.59,1.536-4.126,3.819-4.092
		c2.241,0.033,3.728,1.594,3.76,4.21c0.063,5.076,0.02,10.153,0.021,15.229C205.099,82.688,205.099,83.602,205.099,84.835z"/>
	<path  d="M170.309,62.315c5.622,0.012,10.585,1.974,15.07,5.231
		c2.091,1.518,2.501,3.7,1.213,5.52c-1.283,1.813-3.433,2.132-5.595,0.656c-3.817-2.606-7.892-4.212-12.609-3.691
		c-3.706,0.41-6.281,2.298-7.086,5.216c-0.72,2.609,0.283,4.975,2.797,6.048c4.116,1.758,8.323,3.305,12.426,5.091
		c2.077,0.905,4.163,1.931,5.985,3.259c8.618,6.285,8.446,17.312-0.275,23.495c-7.335,5.201-18.357,4.673-26.631-1.326
		c-1.227-0.889-2.377-1.912-3.433-2.999c-1.713-1.763-1.771-3.853-0.296-5.43c1.553-1.659,3.78-1.734,5.62,0.104
		c3.126,3.121,6.859,4.869,11.177,5.473c3.397,0.475,6.594-0.061,9.378-2.178c4.319-3.283,4.275-8.116-0.204-11.161
		c-1.655-1.125-3.574-1.895-5.435-2.681c-3.5-1.48-7.03-2.893-10.575-4.264c-4.996-1.932-7.802-5.623-8.294-10.851
		c-0.492-5.227,1.737-9.379,5.979-12.41C162.734,63.122,166.403,62.28,170.309,62.315z"/>
	<path  d="M31.225,85.374c4.241,0,8.373-0.16,12.48,0.087
		c1.421,0.086,3.235,0.825,4.075,1.892c1.844,2.343-0.099,5.523-3.307,5.6c-4.31,0.103-8.624,0.025-13.254,0.025
		c-0.055,1.024-0.142,1.913-0.144,2.802c-0.014,5.417,0.013,10.833-0.017,16.25c-0.016,2.949-1.495,4.715-3.808,4.682
		c-2.311-0.034-3.783-1.801-3.788-4.768c-0.023-14.812-0.025-29.623-0.001-44.435c0.006-3.605,1.326-4.918,4.929-4.946
		c5.501-0.042,11.002-0.031,16.504-0.004c3.236,0.016,4.949,1.356,4.98,3.791c0.032,2.498-1.604,3.791-4.867,3.817
		c-4.398,0.037-8.797,0.056-13.196,0.096c-0.145,0.001-0.288,0.145-0.585,0.305C31.225,75.351,31.225,80.209,31.225,85.374z"/>
	<path  d="M138.595,89.525c0,7.44,0.012,14.879-0.005,22.319
		c-0.007,3.099-1.509,4.931-3.909,4.867c-2.317-0.062-3.695-1.81-3.698-4.799c-0.011-14.964-0.012-29.928,0.001-44.892
		c0.002-3.039,1.343-4.669,3.755-4.685c2.418-0.016,3.84,1.636,3.849,4.617C138.611,74.477,138.595,82.001,138.595,89.525z"/>
	<path  d="M58.169,89.498c0-7.183-0.005-14.367,0.007-21.55
		c0.001-0.927-0.032-1.881,0.167-2.774c0.395-1.772,1.596-2.738,3.418-2.823c1.812-0.084,3.166,0.721,3.691,2.46
		c0.31,1.025,0.322,2.166,0.323,3.254c0.019,14.282,0.013,28.564,0.011,42.846c0,0.676,0.031,1.358-0.043,2.027
		c-0.258,2.318-1.935,3.967-3.972,3.748c-2.238-0.241-3.5-1.577-3.568-3.865c-0.06-2.026-0.032-4.056-0.033-6.084
		C58.167,100.991,58.169,95.244,58.169,89.498z"/>
</g>
</svg>
