<svg fill="currentColor" xmlns="http://www.w3.org/2000/svg" width="32" height="32" viewBox="0 0 14 14">
<g>
	<g>
		<path d="M4.969,10.03c-0.02-0.006-0.04-0.009-0.06-0.011C5.208,9.705,5.393,9.28,5.393,8.813V7.374    c0-0.013-0.001-0.026-0.003-0.039c0.001-0.026,0.003-0.052,0.003-0.079v-0.91c0-0.151-0.123-0.273-0.273-0.273H3.285    c-0.772,0-1.401,0.628-1.401,1.401v1.339c0,0.468,0.185,0.893,0.484,1.207c-0.021,0.002-0.041,0.005-0.061,0.011    C1.016,10.146,0,11.236,0,12.559v1.168C0,13.877,0.123,14,0.273,14h6.73c0.151,0,0.273-0.123,0.273-0.273v-1.168    C7.277,11.236,6.261,10.146,4.969,10.03z M2.431,7.82V7.474c0-0.471,0.383-0.854,0.854-0.854h1.561v0.637    c0,0.321-0.261,0.582-0.582,0.582H2.431V7.82z M2.431,8.385h1.833c0.213,0,0.412-0.059,0.582-0.162v0.59    c0,0.666-0.542,1.207-1.207,1.207c-0.666,0-1.208-0.541-1.208-1.207V8.385z M4.233,10.566l-0.595,0.596l-0.595-0.596H4.233z     M6.73,13.453L6.73,13.453H0.547v-0.547h1.135c0.151,0,0.273-0.123,0.273-0.273s-0.123-0.273-0.273-0.273H0.557    c0.092-0.922,0.815-1.66,1.73-1.776l1.159,1.159c0.051,0.051,0.121,0.08,0.193,0.08c0.072,0,0.142-0.029,0.193-0.08l1.158-1.159    c0.98,0.124,1.74,0.962,1.74,1.976V13.453z"></path>
	</g>
</g>
<g>
	<g>
		<path d="M11.691,3.957c-0.02-0.005-0.039-0.009-0.06-0.01c0.3-0.315,0.483-0.74,0.483-1.208V1.301    c0-0.013-0.001-0.026-0.002-0.039c0.001-0.026,0.002-0.052,0.002-0.079v-0.91C12.115,0.123,11.993,0,11.842,0h-1.834    c-0.771,0-1.4,0.628-1.4,1.4v1.339c0,0.468,0.185,0.893,0.484,1.208c-0.021,0.001-0.041,0.004-0.061,0.01    C7.738,4.074,6.723,5.163,6.723,6.485v1.168c0,0.151,0.123,0.273,0.273,0.273h2.201c0.15,0,0.273-0.122,0.273-0.273    S9.348,7.38,9.197,7.38H7.27V6.485c0-1.013,0.759-1.851,1.74-1.976l1.158,1.159c0.054,0.054,0.123,0.08,0.193,0.08    s0.141-0.026,0.193-0.08l1.158-1.159c0.98,0.125,1.74,0.963,1.74,1.976V7.38h-2.014c-0.152,0-0.273,0.122-0.273,0.274    c0,0.15,0.121,0.273,0.273,0.273h2.287c0.15,0,0.273-0.123,0.273-0.273V6.485C14,5.163,12.984,4.074,11.691,3.957z M10.361,5.088    L9.767,4.493h1.19L10.361,5.088z M11.568,2.739c0,0.666-0.541,1.207-1.207,1.207S9.154,3.405,9.154,2.739V2.312h1.833    c0.212,0,0.411-0.06,0.581-0.162V2.739z M11.568,1.184c0,0.32-0.26,0.582-0.581,0.582H9.154V1.748V1.4    c0-0.471,0.383-0.854,0.854-0.854h1.561V1.184z"></path>
	</g>
</g>
<g>
	<g>
		<path d="M10.555,7.46c-0.051-0.051-0.121-0.08-0.193-0.08s-0.143,0.029-0.193,0.08    c-0.051,0.052-0.08,0.122-0.08,0.193c0,0.072,0.029,0.143,0.08,0.193c0.051,0.052,0.121,0.08,0.193,0.08s0.143-0.028,0.193-0.08    c0.051-0.051,0.08-0.121,0.08-0.193C10.635,7.582,10.605,7.512,10.555,7.46z"></path>
	</g>
</g>
<g>
	<g>
		<path d="M7.312,3.826L6.168,2.683V1.367C6.168,0.613,5.555,0,4.801,0H1.367C0.613,0,0,0.613,0,1.367v2.406    c0,0.754,0.613,1.367,1.367,1.367h3.434c0.565,0,1.058-0.339,1.265-0.848h1.052c0.11,0,0.21-0.066,0.252-0.169    C7.414,4.022,7.39,3.904,7.312,3.826z M5.867,3.746c-0.127,0-0.238,0.088-0.267,0.212C5.514,4.333,5.186,4.594,4.801,4.594H1.367    c-0.452,0-0.82-0.368-0.82-0.82V1.367c0-0.452,0.368-0.82,0.82-0.82h3.434c0.452,0,0.82,0.368,0.82,0.82v1.429    c0,0.072,0.029,0.142,0.08,0.193l0.757,0.757H5.867z"></path>
	</g>
</g>
<g>
	<g>
		<path d="M12.633,8.859H9.199c-0.565,0-1.059,0.34-1.266,0.848H6.881c-0.11,0-0.21,0.066-0.252,0.169    s-0.019,0.22,0.059,0.298l1.144,1.144v1.315C7.832,13.387,8.445,14,9.199,14h3.434C13.387,14,14,13.387,14,12.633v-2.406    C14,9.473,13.387,8.859,12.633,8.859z M13.453,12.633c0,0.452-0.368,0.82-0.82,0.82H9.199c-0.453,0-0.82-0.368-0.82-0.82v-1.429    c0-0.072-0.029-0.142-0.08-0.193l-0.758-0.757h0.592c0.128,0,0.238-0.088,0.268-0.212c0.086-0.374,0.414-0.636,0.799-0.636h3.434    c0.452,0,0.82,0.368,0.82,0.82V12.633z"></path>
	</g>
</g>
<g>
	<g>
		<path d="M12.145,10.702c-0.106-0.106-0.279-0.106-0.387,0l-0.727,0.728l-0.338-0.339    c-0.107-0.106-0.279-0.106-0.387,0s-0.107,0.28,0,0.387l0.531,0.532c0.053,0.053,0.123,0.08,0.193,0.08s0.141-0.027,0.193-0.08    l0.92-0.921C12.252,10.982,12.252,10.809,12.145,10.702z"></path>
	</g>
</g>
<g>
	<g>
		<path d="M4.327,1.812c-0.032-0.469-0.41-0.847-0.879-0.879c-0.266-0.019-0.52,0.071-0.713,0.252    C2.543,1.364,2.434,1.617,2.434,1.879c0,0.151,0.122,0.273,0.273,0.273c0.151,0,0.273-0.123,0.273-0.273    c0-0.113,0.045-0.217,0.127-0.293C3.19,1.509,3.297,1.471,3.411,1.479C3.608,1.492,3.768,1.652,3.782,1.85    c0.014,0.2-0.118,0.377-0.312,0.42C3.257,2.318,3.108,2.503,3.108,2.72v0.146c0,0.151,0.123,0.273,0.273,0.273    c0.151,0,0.273-0.123,0.273-0.273v-0.08C4.079,2.66,4.358,2.261,4.327,1.812z"></path>
	</g>
</g>
<g>
	<g>
		<path d="M3.575,3.719c-0.051-0.051-0.121-0.08-0.193-0.08c-0.072,0-0.142,0.029-0.193,0.08    C3.137,3.77,3.108,3.841,3.108,3.913s0.029,0.143,0.081,0.193c0.051,0.051,0.121,0.08,0.193,0.08c0.072,0,0.143-0.029,0.193-0.08    c0.051-0.051,0.08-0.122,0.08-0.193S3.626,3.77,3.575,3.719z"></path>
	</g>
</g>
<g>
	<g>
		<path d="M2.969,12.439c-0.051-0.051-0.122-0.08-0.193-0.08s-0.143,0.029-0.193,0.08s-0.08,0.121-0.08,0.193    s0.029,0.143,0.08,0.193s0.122,0.08,0.193,0.08s0.143-0.029,0.193-0.08s0.08-0.121,0.08-0.193S3.02,12.49,2.969,12.439z"></path>
	</g>
</g>
</svg>
