<?xml version="1.0" encoding="iso-8859-1"?>
<!-- Generator: Adobe Illustrator 16.0.3, SVG Export Plug-In . SVG Version: 6.00 Build 0)  -->
<!DOCTYPE svg PUBLIC "-//W3C//DTD SVG 1.1//EN" "http://www.w3.org/Graphics/SVG/1.1/DTD/svg11.dtd">
<svg version="1.1" xmlns="http://www.w3.org/2000/svg" xmlns:xlink="http://www.w3.org/1999/xlink" x="0px" y="0px" width="64px"
	 height="64px" viewBox="0 0 64 64" style="enable-background:new 0 0 64 64;" xml:space="preserve">
<g id="Ebene_1">
	<rect style="fill:#88B04B;" width="64" height="64"/>
</g>
<g id="Ebene_2">
	<g>
		<path style="fill:#FFFFFF;" d="M52.947,12.863c0,0.233,0,0.431,0,0.628c0,7.486,0,14.974,0,22.459
			c0,1.073-0.235,1.307-1.313,1.307c-13.085,0-26.167,0-39.252,0c-1.082,0-1.315-0.231-1.316-1.302c0-7.486,0-14.974,0-22.46
			c0-0.198,0-0.396,0-0.632C25.022,12.863,38.949,12.863,52.947,12.863z M29.612,27.658c1.162,0,2.143,0.008,3.123-0.002
			c0.681-0.008,1.007-0.33,1.013-1.004c0.011-1.071,0.01-2.144,0-3.215c-0.005-0.703-0.328-1.008-1.053-1.013
			c-0.853-0.005-1.708,0.001-2.562-0.002c-0.128-0.001-0.255-0.03-0.507-0.063c0.789-0.778,1.494-1.457,2.182-2.155
			c0.478-0.484,0.48-0.941,0.011-1.421c-0.751-0.766-1.509-1.524-2.274-2.274c-0.5-0.489-0.951-0.476-1.462,0.029
			c-0.607,0.6-1.204,1.212-1.81,1.814c-0.09,0.089-0.205,0.154-0.374,0.28c0-1.101,0.009-2.099-0.004-3.097
			c-0.008-0.617-0.334-0.952-0.94-0.959c-1.109-0.015-2.218-0.014-3.326-0.001c-0.638,0.007-0.956,0.34-0.962,0.993
			c-0.01,0.871-0.001,1.744-0.005,2.617c0,0.13-0.029,0.258-0.059,0.5c-0.731-0.738-1.377-1.399-2.031-2.054
			c-0.635-0.634-1.035-0.636-1.658-0.017c-0.695,0.69-1.39,1.384-2.082,2.08c-0.579,0.584-0.584,1.004-0.016,1.581
			c0.561,0.57,1.131,1.131,1.693,1.698c0.116,0.116,0.216,0.246,0.396,0.452c-1.134,0-2.133-0.009-3.13,0.003
			c-0.617,0.007-0.951,0.333-0.958,0.941c-0.014,1.109-0.013,2.216-0.001,3.325c0.008,0.635,0.343,0.955,0.995,0.962
			c0.872,0.011,1.744,0.001,2.616,0.005c0.129,0,0.259,0.03,0.47,0.056c-0.746,0.749-1.428,1.426-2.102,2.11
			c-0.527,0.536-0.534,0.979-0.019,1.501c0.727,0.739,1.459,1.472,2.196,2.199c0.55,0.54,0.982,0.535,1.543-0.019
			c0.595-0.586,1.181-1.181,1.776-1.769c0.091-0.09,0.206-0.158,0.374-0.285c0,1.079-0.006,2.059,0.001,3.038
			c0.007,0.684,0.325,1.01,1,1.015c1.072,0.011,2.144,0.009,3.216,0c0.701-0.005,1.012-0.329,1.017-1.051
			c0.006-0.855,0-1.708,0.004-2.563c0-0.127,0.029-0.255,0.062-0.513c0.739,0.753,1.382,1.418,2.035,2.073
			c0.634,0.635,1.031,0.635,1.657,0.014c0.659-0.654,1.312-1.312,1.966-1.967c0.738-0.737,0.74-1.084,0.013-1.813
			C30.998,29.049,30.363,28.412,29.612,27.658z M38.979,19.375c-0.613-0.413-0.993-0.911-0.877-1.713
			c0.07-0.498,0.013-1.015,0.012-1.523c-0.003-1.111-0.604-1.473-1.583-0.952c-3.338,1.775-3.746,6.356-0.763,8.733
			c0.425,0.337,0.613,0.705,0.608,1.248c-0.018,2.524-0.003,5.05-0.01,7.576c-0.002,0.662,0.163,1.256,0.573,1.776
			c0.685,0.857,1.836,1.207,2.84,0.865c1.07-0.367,1.812-1.369,1.819-2.532c0.015-2.397,0.031-4.797-0.009-7.195
			c-0.014-0.82,0.194-1.393,0.855-1.961c2.831-2.433,2.166-7.061-1.185-8.606c-0.787-0.364-1.385,0.001-1.4,0.864
			c-0.01,0.545-0.055,1.095,0.012,1.634C39.969,18.385,39.685,18.955,38.979,19.375z M50.33,30.327
			c0.75-0.29,0.87-0.459,0.871-1.217c0.002-0.727,0.007-1.454-0.001-2.18c-0.008-0.683-0.326-1.002-0.999-1.015
			c-0.521-0.009-1.044-0.002-1.585-0.002c0-2.058,0-4.063,0-6.108c0.284,0,0.534,0.011,0.785-0.003
			c0.663-0.032,1.038-0.498,0.885-1.139c-0.268-1.129-0.552-2.254-0.844-3.378c-0.116-0.457-0.421-0.709-0.904-0.712
			c-0.545-0.004-1.09-0.001-1.635-0.001c-0.483,0-0.8,0.24-0.918,0.697c-0.297,1.142-0.591,2.283-0.858,3.431
			c-0.141,0.607,0.241,1.067,0.878,1.101c0.265,0.016,0.529,0.002,0.796,0.002c0,2.074,0,4.078,0,6.11
			c-0.528,0-1.018-0.004-1.506,0.001c-0.755,0.008-1.064,0.311-1.071,1.051c-0.007,0.691,0.022,1.382-0.009,2.071
			c-0.028,0.663,0.16,1.143,0.88,1.274c0,0.854-0.006,1.671,0,2.488c0.014,1.54,1.138,2.705,2.606,2.709
			c1.472,0.006,2.611-1.157,2.628-2.69C50.336,32.001,50.33,31.184,50.33,30.327z"/>
		<path style="fill:#FFFFFF;" d="M54.692,16.32c0.349,0,0.638-0.022,0.922,0.005c0.478,0.045,0.749,0.329,0.814,0.804
			c0.016,0.108,0.008,0.218,0.008,0.327c0,7.597,0,15.193,0,22.789c0,0.144,0,0.286,0,0.465c-16.288,0-32.542,0-48.861,0
			c0-0.215,0-0.427,0-0.64c0-7.432,0.017-14.865-0.017-22.297c-0.005-1.429,0.574-1.583,1.761-1.402c0,0.203,0,0.417,0,0.63
			c0,6.343,0,12.685,0,19.029c0,1.921,1.042,2.971,2.954,2.971c13.157,0,26.316,0,39.473,0c1.892,0,2.945-1.047,2.945-2.927
			c0.001-6.342,0.001-12.685,0.001-19.027C54.692,16.831,54.692,16.614,54.692,16.32z"/>
		<path style="fill:#FFFFFF;" d="M56.436,42.526c0,0.878,0.013,1.712-0.004,2.545c-0.013,0.551-0.344,0.87-0.885,0.907
			c-0.163,0.009-0.327,0.003-0.49,0.003c-15.372,0-30.745,0-46.116,0c-1.151,0-1.367-0.213-1.365-1.361
			c0-0.654,0.004-1.31,0.008-1.961c0-0.035,0.02-0.068,0.041-0.133C23.866,42.526,40.119,42.526,56.436,42.526z M31.985,45.105
			c0.309,0,0.619,0.018,0.925-0.005c0.485-0.035,0.825-0.39,0.837-0.843c0.012-0.475-0.337-0.864-0.848-0.885
			c-0.599-0.023-1.2-0.023-1.799,0.003c-0.488,0.021-0.823,0.383-0.834,0.838c-0.012,0.476,0.335,0.852,0.848,0.889
			C31.401,45.123,31.693,45.105,31.985,45.105z"/>
		<path style="fill:#FFFFFF;" d="M52.947,11.062c-13.986,0-27.899,0-41.871,0c0-0.917-0.027-1.819,0.012-2.72
			c0.018-0.423,0.329-0.676,0.753-0.74c0.178-0.027,0.362-0.011,0.544-0.011c13.082,0,26.165,0,39.248,0
			c1.08,0,1.313,0.231,1.314,1.301C52.947,9.598,52.947,10.304,52.947,11.062z M37.731,8.463c-4.106,0-8.214-0.001-12.323,0
			c-0.182,0-0.37-0.019-0.542,0.022c-0.439,0.103-0.703,0.39-0.703,0.848c0,0.46,0.264,0.745,0.7,0.85
			c0.174,0.042,0.362,0.023,0.543,0.023c8.18,0,16.359,0,24.539,0c0.164,0,0.332,0.016,0.49-0.013
			c0.468-0.088,0.754-0.376,0.755-0.858c0-0.482-0.283-0.774-0.753-0.859c-0.177-0.033-0.362-0.014-0.544-0.014
			C45.839,8.463,41.786,8.463,37.731,8.463z M14.116,10.207c0.127,0,0.254,0.005,0.382,0c0.557-0.029,0.923-0.376,0.924-0.87
			c0.001-0.496-0.364-0.845-0.92-0.871c-0.2-0.011-0.4-0.005-0.6-0.003c-0.688,0.006-1.085,0.325-1.087,0.87
			c-0.003,0.544,0.398,0.866,1.083,0.874C13.971,10.208,14.043,10.207,14.116,10.207z M17.62,8.463
			c-0.127,0-0.254-0.005-0.381,0.001c-0.562,0.026-0.927,0.365-0.934,0.859c-0.007,0.495,0.358,0.852,0.911,0.881
			c0.218,0.011,0.437,0.006,0.654,0.002c0.645-0.01,1.037-0.336,1.043-0.862c0.006-0.528-0.385-0.867-1.021-0.881
			C17.802,8.46,17.711,8.463,17.62,8.463z M21.152,8.472c0-0.002,0-0.004,0-0.007c-0.164,0-0.328-0.009-0.49,0.003
			c-0.519,0.037-0.867,0.392-0.867,0.869c0,0.475,0.351,0.836,0.869,0.866c0.326,0.018,0.66,0.034,0.979-0.013
			c0.472-0.067,0.755-0.373,0.754-0.855c-0.001-0.481-0.285-0.771-0.755-0.857C21.483,8.447,21.315,8.472,21.152,8.472z"/>
		<path style="fill:#FFFFFF;" d="M21.538,56.414c0-0.881-0.015-1.733,0.006-2.583c0.013-0.519,0.347-0.828,0.866-0.864
			c0.146-0.014,0.291-0.005,0.437-0.005c6.102,0,12.205,0,18.308,0c1.101,0,1.322,0.226,1.322,1.35c0,0.689,0,1.377,0,2.103
			C35.503,56.414,28.557,56.414,21.538,56.414z"/>
		<path style="fill:#FFFFFF;" d="M27.668,51.18c0-1.158,0-2.277,0-3.452c1.452,0,2.881,0,4.311,0c1.434,0,2.869,0,4.346,0
			c0,1.148,0,2.28,0,3.452C33.464,51.18,30.589,51.18,27.668,51.18z"/>
		<path style="fill:#FFFFFF;" d="M16.534,19.574c0.445-0.443,0.841-0.834,1.275-1.265c0.578,0.588,1.195,1.2,1.793,1.83
			c0.393,0.413,0.804,0.471,1.324,0.234c1.482-0.669,1.507-0.282,1.482-2.306c-0.006-0.561-0.001-1.121-0.001-1.717
			c0.587,0,1.137,0,1.745,0c0,0.881,0.014,1.747-0.005,2.613c-0.012,0.565,0.26,0.836,0.746,1.123
			c1.155,0.679,1.987,0.386,2.742-0.616c0.325-0.432,0.747-0.79,1.162-1.221c0.392,0.458,0.754,0.878,1.187,1.382
			c-0.514,0.498-1.127,1.082-1.729,1.677c-0.563,0.556-0.578,0.739-0.279,1.441c0.62,1.454,0.342,1.436,2.238,1.42
			c0.576-0.005,1.154-0.001,1.761-0.001c0,0.583,0,1.122,0,1.746c-0.814,0-1.642,0-2.468,0c-0.868,0.001-0.916,0.158-1.336,0.905
			c-0.603,1.067-0.299,1.784,0.575,2.467c0.469,0.367,0.869,0.823,1.33,1.266c-0.448,0.417-0.856,0.795-1.353,1.259
			c-0.546-0.574-1.123-1.196-1.715-1.803c-0.542-0.553-0.74-0.569-1.445-0.265c-1.432,0.614-1.426,0.333-1.41,2.188
			c0.005,0.595,0.001,1.189,0.001,1.81c-0.59,0-1.128,0-1.745,0c0-0.846,0.001-1.691,0-2.539c-0.001-0.78-0.188-0.873-0.864-1.258
			c-1.073-0.612-1.818-0.322-2.514,0.572c-0.366,0.469-0.814,0.873-1.245,1.326c-0.43-0.468-0.806-0.878-1.24-1.349
			c0.549-0.533,1.151-1.105,1.742-1.689c0.579-0.573,0.599-0.768,0.287-1.492c-0.609-1.416-0.327-1.416-2.197-1.397
			c-0.579,0.005-1.159,0-1.781,0c0-0.573,0-1.125,0-1.746c0.841,0,1.689,0.001,2.536,0c0.755-0.001,0.864-0.192,1.23-0.826
			c0.641-1.109,0.325-1.886-0.603-2.604C17.304,20.388,16.921,19.946,16.534,19.574z M26.77,25.03
			c-0.004-1.927-1.584-3.492-3.513-3.479c-1.927,0.013-3.479,1.592-3.465,3.527c0.013,1.897,1.583,3.453,3.485,3.452
			C25.208,28.53,26.773,26.96,26.77,25.03z"/>
		<path style="fill:#FFFFFF;" d="M36.325,17.589c0.024,0.121,0.05,0.172,0.041,0.218c-0.368,1.855,1.178,2.57,2.176,3.591
			c0.313,0.32,0.764,0.181,1.084-0.13c0.574-0.555,1.152-1.111,1.688-1.703c0.163-0.183,0.247-0.48,0.276-0.735
			c0.047-0.387,0.012-0.781,0.012-1.219c1.072,0.963,1.364,3.401-0.387,4.881c-0.342,0.291-0.737,0.586-0.933,0.968
			c-0.238,0.466-0.397,1.025-0.406,1.547c-0.039,2.49-0.019,4.98-0.02,7.471c0,0.181,0.019,0.372-0.028,0.541
			c-0.119,0.445-0.398,0.739-0.887,0.739c-0.447-0.003-0.804-0.364-0.821-0.857c-0.021-0.689-0.008-1.381-0.008-2.071
			c0-1.873-0.025-3.745,0.01-5.617c0.022-1.129-0.389-1.979-1.279-2.677C35.273,21.309,35.046,19.148,36.325,17.589z"/>
		<path style="fill:#FFFFFF;" d="M46.842,30.296c0.604,0,1.141,0,1.73,0c0,0.917,0.025,1.815-0.01,2.713
			c-0.02,0.461-0.462,0.783-0.908,0.753c-0.449-0.032-0.797-0.373-0.807-0.866C46.827,32.047,46.842,31.199,46.842,30.296z"/>
		<path style="fill:#FFFFFF;" d="M45.988,28.531c0-0.319,0-0.566,0-0.873c0.596,0,1.172,0,1.746,0c0.558,0,1.116,0,1.698,0
			c0,0.3,0,0.548,0,0.873c-0.568,0-1.144,0-1.715,0C47.157,28.531,46.597,28.531,45.988,28.531z"/>
		<path style="fill:#FFFFFF;" d="M48.326,18.036c-0.438,0-0.812,0-1.23,0c0.127-0.505,0.233-0.98,0.37-1.448
			c0.032-0.105,0.169-0.181,0.258-0.269c0.076,0.079,0.198,0.145,0.226,0.238C48.086,17.036,48.199,17.523,48.326,18.036z"/>
		<path style="fill:#FFFFFF;" d="M25.023,25.033c0.004,0.948-0.774,1.74-1.722,1.751c-0.946,0.011-1.746-0.765-1.763-1.71
			c-0.018-0.975,0.774-1.78,1.748-1.777C24.233,23.3,25.019,24.084,25.023,25.033z"/>
	</g>
</g>
</svg>
