<?xml version="1.0" encoding="utf-8"?>
<!-- Generator: Adobe Illustrator 16.0.3, SVG Export Plug-In . SVG Version: 6.00 Build 0)  -->
<!DOCTYPE svg PUBLIC "-//W3C//DTD SVG 1.1//EN" "http://www.w3.org/Graphics/SVG/1.1/DTD/svg11.dtd">
<svg version="1.1" id="Ebene_1" xmlns="http://www.w3.org/2000/svg" xmlns:xlink="http://www.w3.org/1999/xlink" x="0px" y="0px"
	 width="16px" height="16px" viewBox="0 0 16 16" enable-background="new 0 0 16 16" xml:space="preserve">
<g>
	<path fill="#393939" d="M8.156,0.395V0.374c0.062,0,0.124,0,0.186,0C8.28,0.436,8.218,0.395,8.156,0.395L8.156,0.395z"/>
	<path fill="#393939" d="M8.156,15.627L8.156,15.627c0-0.02,0-0.02,0-0.02c0.062,0,0.124-0.041,0.186,0.02
		C8.28,15.627,8.218,15.627,8.156,15.627z"/>
	<path fill="#7A7B7B" d="M8.547,0.373c0,0,0,0,0.021,0c0,0.021,0,0.021-0.021,0.021S8.485,0.415,8.465,0.373
		C8.485,0.373,8.525,0.373,8.547,0.373z"/>
	<path fill="#7A7B7B" d="M8.568,15.607c0,0,0,0.02-0.021,0.02s-0.062,0-0.082,0c0.02-0.041,0.061-0.02,0.082-0.02
		C8.547,15.607,8.547,15.607,8.568,15.607z"/>
	<path fill="#ACACAC" d="M8.609,0.395c-0.021,0,0-0.021,0-0.021c0.02,0,0.041,0,0.062,0C8.671,0.416,8.629,0.395,8.609,0.395
		L8.609,0.395z"/>
	<path fill="#969596" d="M8.546,0.395V0.374c0.022,0,0.042,0,0.063,0v0.021C8.588,0.395,8.568,0.395,8.546,0.395z"/>
	<path fill="#ACACAC" d="M8.607,15.627L8.607,15.627c-0.021-0.02,0-0.02,0-0.02c0.021,0,0.063-0.021,0.063,0.02
		C8.65,15.627,8.629,15.627,8.607,15.627z"/>
	<path fill="#969596" d="M8.546,15.627v-0.02c0.022,0,0.042,0,0.063,0v0.02C8.588,15.627,8.568,15.627,8.546,15.627z"/>
	<path fill="#E8A33D" d="M8.676,15.627c-0.021-0.02-0.042-0.02-0.062-0.02c-0.022,0-0.042,0-0.063,0s-0.061,0-0.082,0.02
		c-0.042,0-0.083,0-0.124,0c-0.062-0.041-0.124,0-0.186-0.02c-0.041,0-0.082,0-0.144,0c-0.041,0.02-0.102-0.021-0.144,0.02
		c-0.062,0-0.123,0-0.185,0c-0.041-0.041-0.102,0-0.144-0.02c-0.062,0-0.103,0-0.144,0c-0.062,0.02-0.103-0.021-0.165,0.02
		c-0.041,0-0.083,0-0.144,0c-0.021-0.02-0.062-0.02-0.083-0.02s-0.041,0-0.062,0s-0.041,0-0.062,0.02c-0.02,0-0.062,0-0.082,0
		c-0.185-0.061-0.349-0.041-0.535-0.061c-0.863-0.063-1.706-0.166-2.549-0.392c-0.617-0.165-1.213-0.35-1.727-0.72
		c-0.411-0.268-0.637-0.637-0.617-1.15c0.021-0.822,0-1.646,0-2.468c0-0.041-0.02-0.082,0.021-0.144
		c0.041,0.041,0.082,0.062,0.143,0.084c0.679,0.431,1.419,0.656,2.2,0.822c0.782,0.184,1.604,0.267,2.405,0.308
		c1.788,0.102,3.578,0.081,5.341-0.248c0.927-0.164,1.812-0.431,2.634-0.925c0.02-0.021,0.042-0.041,0.063-0.021
		c0,0.945,0,1.892,0,2.837c0,0.021,0,0.063-0.021,0.104c-0.061,0.369-0.309,0.596-0.596,0.802c-0.433,0.308-0.924,0.493-1.418,0.637
		c-0.945,0.267-1.912,0.411-2.898,0.474c-0.145,0.02-0.288,0-0.432,0.061C8.773,15.627,8.711,15.627,8.676,15.627z"/>
	<path fill="#E8A33D" d="M6.876,0.377c0.021,0.021,0.041,0.021,0.062,0.021s0.041,0,0.062,0s0.062,0,0.083-0.021
		c0.041,0,0.082,0,0.123,0c0.062,0.042,0.124,0,0.186,0.021c0.041,0,0.082,0,0.144,0C7.577,0.377,7.638,0.419,7.68,0.377
		c0.062,0,0.123,0,0.185,0c0.041,0.042,0.102,0,0.144,0.021c0.062,0,0.103,0,0.144,0c0.062-0.021,0.124,0.021,0.186-0.021
		c0.041,0,0.082,0,0.124,0c0.02,0.021,0.061,0.021,0.082,0.021s0.042,0,0.063,0s0.041,0,0.063-0.021c0.041,0,0.104,0,0.145,0
		c0.021,0.042,0.041,0.021,0.084,0.021c0.901,0.06,1.787,0.164,2.672,0.369c0.697,0.164,1.395,0.369,1.994,0.779
		c0.287,0.206,0.533,0.452,0.617,0.823c0.02,0.103,0,0.185-0.104,0.269c-0.454,0.391-0.964,0.614-1.521,0.801
		c-1.193,0.39-2.427,0.514-3.66,0.576c-0.925,0.041-1.83,0.021-2.754-0.041C5.114,3.913,4.086,3.79,3.079,3.482
		C2.503,3.295,1.948,3.048,1.455,2.639C1.372,2.555,1.352,2.473,1.372,2.37c0.062-0.247,0.185-0.453,0.371-0.617
		c0.37-0.351,0.822-0.556,1.295-0.72c1.048-0.37,2.138-0.516,3.227-0.598c0.185-0.021,0.35,0,0.535-0.063
		C6.82,0.373,6.861,0.373,6.876,0.377z"/>
	<path fill="#393939" d="M7.396,0.373L7.396,0.373c0,0.021,0,0.021,0,0.021c-0.062,0-0.145,0.041-0.186-0.021
		C7.272,0.373,7.334,0.373,7.396,0.373z"/>
	<path fill="#272727" d="M8.012,0.395L8.012,0.395c-0.021,0,0-0.021,0-0.021c0.041,0,0.103,0,0.144,0v0.021
		C8.115,0.395,8.075,0.395,8.012,0.395z"/>
	<path fill="#151515" d="M7.869,0.374c0.041,0,0.102,0,0.144,0v0.021C7.971,0.395,7.91,0.415,7.869,0.374z"/>
	<path fill="#151515" d="M7.52,0.395c0,0,0-0.021,0.02-0.021c0.041,0,0.102,0,0.144,0C7.643,0.416,7.582,0.395,7.54,0.395
		C7.54,0.395,7.54,0.395,7.52,0.395z"/>
	<path fill="#272727" d="M7.396,0.395V0.374c0.041,0,0.082,0,0.144,0v0.021C7.478,0.395,7.437,0.395,7.396,0.395z"/>
	<path fill="#272727" d="M8.012,15.627L8.012,15.627c-0.021-0.02,0-0.02,0-0.02c0.062,0,0.103,0,0.144,0v0.02
		C8.115,15.627,8.054,15.627,8.012,15.627z"/>
	<path fill="#151515" d="M7.869,15.627c0.041-0.041,0.102-0.02,0.144-0.02v0.02C7.971,15.627,7.91,15.627,7.869,15.627z"/>
	<path fill="#151515" d="M7.54,15.627c0,0,0,0-0.02,0c0-0.02,0-0.02,0.02-0.02c0.041,0,0.102-0.021,0.144,0.02
		C7.642,15.627,7.581,15.627,7.54,15.627z"/>
	<path fill="#272727" d="M7.396,15.627c-0.021,0-0.021,0-0.021,0c0-0.02,0-0.02,0.021-0.02c0.041,0,0.082,0,0.144,0v0.02
		C7.478,15.627,7.437,15.627,7.396,15.627z"/>
	<path fill="#393939" d="M7.231,15.627c0.041-0.061,0.103-0.02,0.165-0.02v0.02C7.334,15.627,7.293,15.627,7.231,15.627z"/>
	<path fill="#7A7B7B" d="M6.984,0.395c0,0,0-0.021,0.021-0.021s0.062,0,0.083,0C7.067,0.416,7.026,0.395,7.005,0.395H6.984z"/>
	<path fill="#7A7B7B" d="M7.005,15.627H6.984c0-0.02,0-0.02,0.021-0.02s0.062-0.021,0.083,0.02
		C7.067,15.627,7.026,15.627,7.005,15.627z"/>
	<path fill="#969596" d="M6.943,0.395c0,0,0,0-0.021,0c0,0,0-0.021,0.021-0.021s0.041,0,0.062,0v0.021
		C6.984,0.395,6.964,0.395,6.943,0.395z"/>
	<path fill="#ACACAC" d="M6.881,0.374c0.021,0,0.041,0,0.062,0v0.021C6.923,0.395,6.882,0.415,6.881,0.374z"/>
	<path fill="#969596" d="M6.943,15.627c0,0,0,0-0.021,0c0-0.02,0-0.02,0.021-0.02s0.041,0,0.062,0v0.02
		C6.984,15.627,6.964,15.627,6.943,15.627z"/>
	<path fill="#ACACAC" d="M6.881,15.627c0-0.041,0.041-0.02,0.062-0.02v0.02C6.923,15.627,6.902,15.627,6.881,15.627z"/>
	<path fill="#E8A33D" d="M14.182,6.129c0,0.063-0.043,0.105-0.084,0.145c-0.451,0.412-0.986,0.658-1.563,0.844
		c-1.192,0.369-2.426,0.493-3.659,0.555C7.869,7.713,6.861,7.693,5.854,7.61C4.908,7.549,4.004,7.425,3.1,7.139
		C2.503,6.953,1.948,6.707,1.456,6.297C1.394,6.234,1.373,6.173,1.373,6.068c0-0.844,0-1.707,0-2.549
		c0-0.041-0.02-0.104,0.021-0.145C1.456,3.416,1.538,3.457,1.6,3.498c0.453,0.268,0.925,0.453,1.419,0.598
		c1.254,0.369,2.529,0.493,3.803,0.533c1.336,0.041,2.655,0,3.968-0.164c1.004-0.145,1.972-0.369,2.897-0.822
		c0.164-0.082,0.307-0.164,0.494-0.268C14.182,4.3,14.182,5.205,14.182,6.129z"/>
	<path fill="#E8A33D" d="M1.455,7.075c0.719,0.452,1.501,0.699,2.323,0.884C4.559,8.103,5.32,8.206,6.121,8.247
		C7.869,8.35,9.616,8.33,11.363,8.022c0.701-0.103,1.378-0.288,2.016-0.577c0.288-0.103,0.535-0.266,0.803-0.41
		c0,0.02,0,0.042,0,0.063c0,0.882,0,1.787,0,2.672c0,0.082-0.021,0.123-0.084,0.164c-0.451,0.41-0.986,0.657-1.563,0.844
		c-1.253,0.39-2.529,0.513-3.824,0.554c-0.945,0.042-1.87,0.021-2.816-0.041c-0.987-0.082-1.953-0.228-2.877-0.513
		c-0.576-0.186-1.111-0.432-1.563-0.823C1.393,9.893,1.372,9.831,1.372,9.729c0-0.842,0-1.707,0-2.549c0-0.043,0-0.082,0-0.145
		C1.414,7.055,1.434,7.055,1.455,7.075z"/>
</g>
</svg>
