<?xml version="1.0" encoding="iso-8859-1"?>
<!-- Generator: Adobe Illustrator 16.0.3, SVG Export Plug-In . SVG Version: 6.00 Build 0)  -->
<!DOCTYPE svg PUBLIC "-//W3C//DTD SVG 1.1//EN" "http://www.w3.org/Graphics/SVG/1.1/DTD/svg11.dtd">
<svg version="1.1" id="Ebene_1" xmlns="http://www.w3.org/2000/svg" xmlns:xlink="http://www.w3.org/1999/xlink" x="0px" y="0px"
	 width="512px" height="512px" viewBox="0 0 512 512" style="enable-background:new 0 0 512 512;" xml:space="preserve">
    <g fill="currentColor">
<path style="fill:none;stroke:currentColor;stroke-width:22.6814;stroke-miterlimit:10;" d="M489.168,96.973
	c0,106.77,0,213.528,0,320.291c-0.931,4.362-0.723,8.919-2.731,13.111c-7.324,15.313-19.905,22.372-36.341,23.51
	c-1.802,0.133-3.618,0.058-5.419,0.058c-125.059,0-250.12,0-375.17,0.016c-9.823,0-19.211-1.565-27.415-7.494
	c-9.55-6.896-15.638-15.733-15.727-27.952c0-0.481-0.25-0.851-0.446-1.248c0-106.763,0-213.521,0-320.291
	c0.923-4.371,0.702-8.916,2.721-13.12c7.335-15.302,19.902-22.371,36.344-23.512c1.805-0.129,3.614-0.052,5.419-0.052
	c125.058,0,250.102,0,375.159-0.008c9.85,0,19.226,1.565,27.422,7.491c9.554,6.896,15.638,15.741,15.726,27.96
	C488.71,96.208,488.961,96.578,489.168,96.973z"/>
<path style="fill:currentColor;" d="M141.969,309.792c0-21.522,0.096-43.053-0.082-64.607c-0.033-4.108,0.758-5.15,4.925-3.762
	c28.924,9.55,57.885,19.005,86.931,28.233c3.551,1.137,4.659,2.584,4.644,6.217c-0.11,43.318-0.118,86.629,0,129.932
	c0.015,4.192-0.774,4.983-4.932,3.624c-28.927-9.524-57.929-18.886-86.976-28.063c-3.927-1.233-4.636-3.234-4.603-6.919
	C142.054,352.88,141.969,331.359,141.969,309.792z"/>
<path style="fill:currentColor;" d="M262.729,410.905c0-33.46,0-65.857,0-98.278c0-12.026,0.126-24.084-0.066-36.119
	c-0.08-3.699,0.672-5.626,4.689-6.896c29.061-9.185,58.003-18.661,86.938-28.227c4.318-1.44,4.88-0.088,4.864,3.865
	c-0.124,43.314-0.089,86.632-0.044,129.941c0,2.658-0.045,4.651-3.315,5.679C325.037,390.713,294.346,400.687,262.729,410.905z"/>
<path style="fill:currentColor;" d="M169.029,223.407c27.381-8.859,53.041-17.166,78.705-25.494c2.082-0.668,4.105-0.499,6.129,0.167
	c24.809,8.018,49.631,16.036,74.423,24.095c0.835,0.269,1.587,0.871,2.791,1.543c-26.106,8.454-51.793,16.75-77.451,25.099
	c-2.066,0.679-4.031,0.724-6.098,0.056C221.864,240.515,196.178,232.193,169.029,223.407z"/>
<line style="fill:none;stroke:currentColor;stroke-width:23;stroke-miterlimit:10;" x1="26" y1="153.5" x2="488" y2="153.5"/>
<path style="fill:currentColor;" d="M79.223,95.323c6.992-0.066,12.777,6.018,12.862,13.504c0.074,7.516-5.575,13.703-12.582,13.763
	c-7.077,0.081-12.717-5.877-12.769-13.482C66.679,101.502,72.212,95.389,79.223,95.323z"/>
<path style="fill:currentColor;" d="M113.244,95.323c6.992-0.066,12.778,6.018,12.862,13.504c0.074,7.516-5.574,13.703-12.582,13.763
	c-7.077,0.081-12.717-5.877-12.77-13.482C100.7,101.502,106.234,95.389,113.244,95.323z"/>
<path style="fill:currentColor;" d="M147.747,95.323c6.992-0.066,12.777,6.018,12.862,13.504c0.074,7.516-5.574,13.703-12.582,13.763
	c-7.076,0.081-12.717-5.877-12.769-13.482C135.203,101.502,140.736,95.389,147.747,95.323z"/>
    </g>
</svg>
