<?xml version="1.0" encoding="utf-8"?>
<!-- Generator: Adobe Illustrator 16.0.3, SVG Export Plug-In . SVG Version: 6.00 Build 0)  -->
<!DOCTYPE svg PUBLIC "-//W3C//DTD SVG 1.1//EN" "http://www.w3.org/Graphics/SVG/1.1/DTD/svg11.dtd">
<svg version="1.1" id="Ebene_1" xmlns="http://www.w3.org/2000/svg" xmlns:xlink="http://www.w3.org/1999/xlink" x="0px" y="0px"
	 width="16px" height="16px" viewBox="0 0 16 16" enable-background="new 0 0 16 16" xml:space="preserve">
<g>
	<path fill-rule="evenodd" clip-rule="evenodd" fill="#9095A9" d="M9.416,3.852c0.426,0.009,0.724,0.307,0.726,0.73
		c0.003,1.006-0.002,2.012,0.003,3.019c0,0.114-0.031,0.144-0.143,0.144c-0.765-0.004-1.527,0-2.291,0.001
		c-0.076,0.057-0.166,0.038-0.25,0.04C7.3,7.776,7.135,7.825,6.98,7.746C6.621,7.745,6.262,7.738,5.903,7.745
		C5.786,7.746,5.762,7.708,5.762,7.599c0.005-1.005,0.001-2.011,0.003-3.017c0-0.422,0.3-0.72,0.725-0.729
		c0.15,0.154,0.195,0.363,0.281,0.549c0.243,0.528,0.471,1.062,0.714,1.59c0.113,0.228,0.275,0.424,0.407,0.637
		c0.042,0.068,0.078,0.07,0.121,0.001C8.146,6.416,8.307,6.218,8.42,5.991c0.287-0.619,0.557-1.246,0.836-1.868
		C9.299,4.027,9.328,3.922,9.416,3.852z"/>
	<path fill-rule="evenodd" clip-rule="evenodd" fill="#9095A9" d="M4.066,5.311c0.426,0.011,0.724,0.307,0.726,0.733
		c0.001,1.007-0.001,2.015,0.002,3.021c0,0.104-0.023,0.139-0.134,0.139c-1.372-0.004-2.743-0.004-4.115,0
		c-0.109,0-0.133-0.035-0.132-0.139c0.003-1.008,0-2.014,0.002-3.021c0.001-0.425,0.299-0.722,0.725-0.732
		c0.15,0.154,0.196,0.363,0.281,0.55c0.243,0.528,0.47,1.063,0.714,1.59C2.248,7.677,2.41,7.873,2.543,8.088
		c0.041,0.066,0.078,0.068,0.121,0C2.797,7.874,2.957,7.677,3.07,7.451c0.287-0.619,0.557-1.246,0.836-1.868
		C3.949,5.486,3.978,5.381,4.066,5.311z"/>
	<path fill-rule="evenodd" clip-rule="evenodd" fill="#9095A9" d="M14.766,5.311c0.428,0.011,0.726,0.307,0.726,0.733
		c0.003,1.007,0,2.015,0.003,3.021c0,0.104-0.023,0.139-0.133,0.139c-1.373-0.004-2.743-0.004-4.116,0
		c-0.108,0-0.132-0.035-0.132-0.139c0.002-1.008,0-2.014,0.002-3.021c0-0.425,0.298-0.722,0.726-0.732
		c0.15,0.154,0.194,0.363,0.28,0.55c0.243,0.528,0.472,1.063,0.715,1.59c0.111,0.227,0.275,0.422,0.406,0.637
		c0.042,0.066,0.078,0.068,0.122,0c0.133-0.214,0.293-0.411,0.407-0.637c0.287-0.619,0.557-1.246,0.833-1.868
		C14.649,5.486,14.678,5.381,14.766,5.311z"/>
	<path fill-rule="evenodd" clip-rule="evenodd" fill="#FEC147" d="M12.452,10.179c0.977-0.002,1.953-0.003,2.931-0.007
		c0.085,0,0.111,0.026,0.111,0.111c-0.006,1.139-0.006,2.278-0.008,3.417c-0.058,0.056-0.13,0.048-0.199,0.048
		c-0.877,0.002-1.752,0.002-2.627,0c-0.221-0.001-0.252-0.037-0.257-0.258c-0.003-0.188-0.003-0.375,0-0.563
		c0-0.108-0.049-0.152-0.155-0.152c-0.265,0.001-0.526,0.003-0.79,0c-0.076-0.002-0.153,0.011-0.215-0.048
		c0.283-0.283,0.565-0.569,0.846-0.853c0.042-0.107,0.129-0.181,0.208-0.256c0.081-0.074,0.114-0.161,0.111-0.27
		c-0.003-0.324-0.003-0.646,0-0.969C12.408,10.311,12.397,10.237,12.452,10.179z"/>
	<path fill-rule="evenodd" clip-rule="evenodd" fill="#FED9A9" d="M6.98,7.746c0.162,0,0.325,0,0.487,0
		c0.064,0.072,0.047,0.162,0.047,0.246c0.002,0.71,0,1.418,0,2.127c0,0.056-0.002,0.11,0.011,0.167
		c0.007,0.038,0.025,0.065,0.069,0.064c0.047-0.002,0.056-0.036,0.063-0.072c0.006-0.041,0.005-0.082,0.005-0.122
		c0-0.178-0.001-0.354,0.001-0.53C7.665,9.562,7.657,9.492,7.713,9.44c0.162,0.003,0.324,0.005,0.485,0.008
		C8.251,9.507,8.241,9.58,8.242,9.649c0.003,0.198-0.003,0.396,0.003,0.593c0.002,0.049,0,0.11,0.072,0.11
		c0.075,0,0.071-0.062,0.073-0.11c0.006-0.197,0.002-0.395,0.003-0.593C8.396,9.58,8.385,9.507,8.438,9.448c0.163,0,0.326,0,0.49,0
		C8.979,9.507,8.971,9.58,8.972,9.649c0.003,0.198-0.003,0.396,0.005,0.593c0,0.049-0.002,0.11,0.071,0.11s0.07-0.062,0.073-0.11
		c0.004-0.197,0-0.395,0.003-0.593C9.125,9.58,9.113,9.507,9.168,9.448c0.162,0,0.325,0,0.489,0c0.05,0.055,0.045,0.121,0.045,0.186
		c0.002,0.152,0.007,0.305-0.003,0.454c-0.011,0.16,0.008,0.291,0.197,0.326c0,0.533,0,1.067,0.005,1.602
		c0,0.073-0.031,0.121-0.078,0.17c-0.14,0.14-0.275,0.28-0.412,0.42c-0.059,0.053-0.131,0.048-0.203,0.048
		c-0.676,0.002-1.353,0.003-2.03,0c-0.211,0-0.246-0.034-0.246-0.25c-0.002-0.839-0.001-1.678,0-2.517
		c0-0.069-0.003-0.143,0.048-0.2C6.98,9.039,6.98,8.393,6.98,7.746z"/>
	<path fill-rule="evenodd" clip-rule="evenodd" fill="#FE7045" d="M3.815,11.844c0.158,0.213,0.365,0.377,0.545,0.569
		c0.1,0.105,0.205,0.209,0.307,0.314c-0.058,0.056-0.131,0.046-0.201,0.048c-0.253,0.001-0.506-0.002-0.759,0.001
		c-0.187,0.002-0.199,0.014-0.203,0.195c-0.002,0.188,0.004,0.375-0.002,0.563c-0.006,0.169-0.043,0.211-0.208,0.211
		c-0.906,0.005-1.812,0.005-2.717,0.002c-0.056,0-0.112-0.002-0.155-0.047c-0.002-1.145-0.003-2.289-0.007-3.433
		c0-0.072,0.023-0.096,0.095-0.096c0.982,0.004,1.964,0.005,2.947,0.007c0.054,0.059,0.042,0.132,0.042,0.202
		c0.001,0.302,0.004,0.604-0.001,0.906c-0.002,0.131,0.032,0.236,0.132,0.323C3.705,11.676,3.779,11.745,3.815,11.844z"/>
	<path fill-rule="evenodd" clip-rule="evenodd" fill="#FEB580" d="M6.98,9.687c0,0.914,0.004,1.829-0.002,2.742
		c0,0.137,0.031,0.181,0.174,0.18c0.752-0.007,1.506-0.003,2.259-0.003c0,0.162,0,0.322,0,0.483c-0.056,0.06-0.131,0.05-0.2,0.052
		c-0.757,0.001-1.515,0.001-2.273,0c-0.069-0.002-0.143,0.008-0.198-0.052c0.072-0.369-0.077-0.615-0.417-0.76
		C6.063,12.22,5.987,12.028,6,11.745c0.026-0.555,0.007-1.114,0.008-1.671c0-0.228,0.162-0.387,0.395-0.387
		C6.596,9.687,6.789,9.687,6.98,9.687z"/>
	<path fill-rule="evenodd" clip-rule="evenodd" fill="#F1F5FB" d="M7.459,6.001C7.257,5.556,7.054,5.112,6.853,4.666
		C6.725,4.382,6.602,4.096,6.477,3.812c0.328,0,0.656,0,0.984-0.001c0.106-0.012,0.139,0.088,0.204,0.137
		c0.104,0.079,0.166,0.25,0.296,0.243c0.118-0.006,0.184-0.163,0.282-0.243C8.307,3.896,8.34,3.798,8.445,3.81
		c0.328,0.001,0.656,0.001,0.985,0.001c-0.327,0.73-0.636,1.469-0.983,2.19c-0.092-0.02-0.088-0.104-0.106-0.168
		c-0.127-0.437-0.25-0.874-0.384-1.341C7.874,4.738,7.818,4.963,7.752,5.185C7.687,5.411,7.624,5.637,7.558,5.862
		C7.542,5.918,7.539,5.989,7.459,6.001z"/>
	<path fill-rule="evenodd" clip-rule="evenodd" fill="#F1F5FB" d="M4.028,5.285c-0.327,0.73-0.636,1.469-0.983,2.189
		c-0.092-0.02-0.088-0.103-0.107-0.167C2.811,6.87,2.689,6.433,2.554,5.966C2.471,6.211,2.415,6.437,2.35,6.658
		C2.284,6.884,2.222,7.111,2.156,7.335C2.14,7.392,2.138,7.462,2.057,7.474C1.855,7.03,1.651,6.585,1.451,6.139
		C1.323,5.855,1.2,5.57,1.074,5.285c0.329,0,0.657,0,0.985-0.001C2.165,5.272,2.197,5.371,2.262,5.42
		C2.366,5.5,2.428,5.669,2.559,5.663C2.676,5.657,2.743,5.5,2.841,5.42c0.063-0.051,0.097-0.148,0.203-0.137
		C3.372,5.284,3.7,5.285,4.028,5.285z"/>
	<path fill-rule="evenodd" clip-rule="evenodd" fill="#F1F5FB" d="M14.832,5.285c-0.326,0.73-0.635,1.469-0.983,2.189
		c-0.091-0.02-0.086-0.103-0.104-0.167c-0.128-0.437-0.251-0.875-0.387-1.34c-0.081,0.245-0.139,0.47-0.204,0.691
		c-0.065,0.226-0.126,0.453-0.193,0.677c-0.016,0.056-0.019,0.127-0.098,0.139c-0.203-0.444-0.407-0.889-0.606-1.335
		c-0.128-0.284-0.251-0.569-0.377-0.854c0.327,0,0.657,0,0.983-0.001c0.107-0.012,0.139,0.087,0.204,0.137
		c0.105,0.079,0.165,0.249,0.296,0.243C13.48,5.657,13.546,5.5,13.645,5.42c0.063-0.051,0.097-0.148,0.204-0.137
		C14.176,5.284,14.506,5.285,14.832,5.285z"/>
	<path fill-rule="evenodd" clip-rule="evenodd" fill="#FED9A9" d="M2.12,4.582C1.921,4.375,1.843,4.088,1.652,3.877
		C1.622,3.844,1.631,3.8,1.631,3.76c0-0.313-0.004-0.627,0.001-0.94c0.007-0.415,0.358-0.817,0.76-0.882
		c0.211,0.018,0.372,0.129,0.5,0.286c0.161,0.199,0.247,0.426,0.242,0.688c-0.005,0.263-0.002,0.527,0,0.79
		c0.001,0.105-0.022,0.197-0.091,0.281C2.946,4.1,2.885,4.241,2.806,4.371C2.649,4.631,2.407,4.705,2.12,4.582z"/>
	<path fill-rule="evenodd" clip-rule="evenodd" fill="#FED9A9" d="M12.817,4.582c-0.196-0.207-0.274-0.493-0.466-0.705
		C12.32,3.844,12.331,3.8,12.331,3.76c0-0.313-0.006-0.627,0.002-0.94c0.006-0.415,0.357-0.817,0.76-0.882
		c0.209,0.018,0.37,0.129,0.497,0.286c0.163,0.199,0.248,0.426,0.243,0.688c-0.005,0.263-0.003,0.527,0,0.79
		c0,0.105-0.022,0.197-0.091,0.281c-0.096,0.118-0.158,0.26-0.234,0.39C13.349,4.631,13.107,4.705,12.817,4.582z"/>
	<path fill-rule="evenodd" clip-rule="evenodd" fill="#FED9A9" d="M7.469,3.123C7.271,2.916,7.193,2.629,7.001,2.418
		c-0.03-0.033-0.021-0.077-0.021-0.117C6.98,1.987,6.976,1.674,6.982,1.36c0.007-0.415,0.356-0.815,0.761-0.882
		c0.212,0.013,0.37,0.134,0.496,0.287c0.157,0.187,0.242,0.408,0.243,0.657c0,0.278-0.001,0.557,0,0.835
		c0.001,0.094-0.021,0.177-0.083,0.253C8.302,2.632,8.237,2.778,8.156,2.913C7.998,3.172,7.757,3.246,7.469,3.123z"/>
	<path fill-rule="evenodd" clip-rule="evenodd" fill="#FEB580" d="M7.469,3.123c0.106,0,0.213-0.01,0.319,0.001
		c0.143,0.015,0.224-0.055,0.294-0.167C8.19,2.781,8.267,2.586,8.409,2.432c0.016-0.017,0.029-0.045,0.027-0.068
		C8.431,1.995,8.474,1.625,8.42,1.258c-0.057-0.371-0.278-0.618-0.628-0.75C7.775,0.501,7.758,0.489,7.743,0.479
		c0.447-0.138,1.011,0.157,1.151,0.68c0.05,0.189,0.016,0.382,0.034,0.573c0.032,0.397,0,0.775-0.278,1.088
		C8.433,3.063,8.415,3.352,8.439,3.654C8.444,3.72,8.44,3.786,8.44,3.851C8.306,3.984,8.166,4.115,8.032,4.252
		c-0.059,0.061-0.099,0.061-0.159,0C7.741,4.115,7.603,3.984,7.465,3.851C7.467,3.608,7.468,3.365,7.469,3.123z"/>
	<path fill-rule="evenodd" clip-rule="evenodd" fill="#FEB580" d="M2.12,4.582c0.106,0,0.214-0.01,0.318,0.001
		c0.144,0.015,0.225-0.054,0.294-0.167c0.109-0.174,0.185-0.371,0.329-0.524c0.04-0.042,0.028-0.095,0.028-0.145
		c0-0.268,0-0.537,0-0.805c0-0.491-0.203-0.79-0.661-0.977C2.415,1.958,2.404,1.946,2.392,1.937c0.463-0.139,1.013,0.168,1.152,0.68
		C3.596,2.807,3.561,3,3.578,3.19C3.612,3.587,3.579,3.965,3.3,4.278C3.083,4.522,3.066,4.812,3.089,5.113
		C3.094,5.178,3.091,5.244,3.092,5.31C2.955,5.443,2.816,5.574,2.683,5.711c-0.06,0.062-0.1,0.062-0.159,0
		C2.392,5.574,2.252,5.443,2.116,5.31C2.117,5.067,2.118,4.824,2.12,4.582z"/>
	<path fill-rule="evenodd" clip-rule="evenodd" fill="#FEB580" d="M12.817,4.582c0.109,0,0.215-0.01,0.321,0.001
		c0.143,0.015,0.224-0.054,0.293-0.167c0.108-0.174,0.184-0.371,0.329-0.524C13.8,3.849,13.79,3.796,13.79,3.746
		c0-0.268,0-0.537,0-0.805c0-0.491-0.203-0.79-0.661-0.977c-0.014-0.006-0.025-0.018-0.036-0.027
		c0.464-0.139,1.012,0.168,1.149,0.68C14.294,2.807,14.26,3,14.275,3.19c0.037,0.397,0.003,0.775-0.276,1.088
		c-0.217,0.244-0.233,0.534-0.209,0.835c0.005,0.065,0,0.131,0.002,0.197c-0.138,0.133-0.277,0.264-0.409,0.401
		c-0.061,0.062-0.099,0.062-0.158,0c-0.132-0.138-0.272-0.268-0.41-0.401C12.817,5.067,12.817,4.824,12.817,4.582z"/>
	<path fill-rule="evenodd" clip-rule="evenodd" fill="#FE432E" d="M0.42,13.7c0.957,0,1.913-0.004,2.87,0.003
		c0.135,0,0.174-0.038,0.167-0.172c-0.011-0.221,0.002-0.445-0.005-0.667c-0.003-0.104,0.028-0.143,0.137-0.14
		c0.359,0.007,0.718,0.003,1.078,0.003c0.117,0.11,0.234,0.221,0.351,0.332c-0.032,0.053-0.077,0.03-0.113,0.03
		c-0.323,0.003-0.647,0.006-0.972-0.001c-0.096-0.001-0.119,0.028-0.116,0.12c0.006,0.248-0.001,0.496,0.004,0.744
		c0.001,0.082-0.018,0.113-0.107,0.113c-1.063-0.004-2.125-0.004-3.188-0.001c-0.083,0-0.121-0.018-0.112-0.107
		C0.421,13.872,0.418,13.787,0.42,13.7z"/>
	<path fill-rule="evenodd" clip-rule="evenodd" fill="#FB9842" d="M11.243,12.728c0.353,0,0.707,0.005,1.062-0.004
		c0.124-0.002,0.153,0.041,0.15,0.156c-0.008,0.224,0.003,0.446-0.005,0.668c-0.006,0.121,0.034,0.155,0.152,0.153
		c0.961-0.004,1.923-0.001,2.884-0.001c0.021,0.363,0.021,0.363-0.335,0.363c-0.971,0-1.939-0.002-2.911,0.003
		c-0.13,0.001-0.16-0.034-0.156-0.16c0.012-0.226-0.003-0.454,0.005-0.681c0.003-0.105-0.024-0.14-0.134-0.137
		c-0.35,0.007-0.702,0.003-1.082,0.003C11.002,12.95,11.11,12.829,11.243,12.728z"/>
	<path fill-rule="evenodd" clip-rule="evenodd" fill="#80DAFE" d="M9.409,14.791c0,0.208,0,0.416,0.005,0.623
		c0.002,0.088-0.033,0.111-0.116,0.111c-0.815-0.003-1.631-0.003-2.446,0c-0.083,0-0.118-0.023-0.116-0.111
		c0.006-0.207,0.004-0.416,0.005-0.623c0.059-0.054,0.132-0.046,0.202-0.046c0.754-0.001,1.509-0.001,2.263,0
		C9.276,14.745,9.35,14.737,9.409,14.791z"/>
	<path fill-rule="evenodd" clip-rule="evenodd" fill="#19CEFB" d="M9.409,14.791c-0.89,0-1.779,0-2.668,0
		c-0.001-0.242-0.003-0.484-0.004-0.728c0.057-0.055,0.131-0.047,0.201-0.049c0.758-0.001,1.517-0.001,2.274,0
		c0.071,0.002,0.145-0.006,0.202,0.049C9.412,14.307,9.409,14.549,9.409,14.791z"/>
	<path fill-rule="evenodd" clip-rule="evenodd" fill="#B4EEFE" d="M6.74,13.089c0.89,0,1.78,0,2.671,0
		c0.131,0.001,0.26,0.004,0.391,0.003c0.071-0.002,0.1,0.027,0.096,0.097c-0.001,0.13-0.001,0.262-0.001,0.392
		c-0.061,0.052-0.133,0.047-0.202,0.047c-1.079,0-2.159,0-3.238,0c-0.07,0-0.144,0.005-0.202-0.047
		c0.007-0.159-0.072-0.362,0.033-0.461C6.384,13.027,6.585,13.102,6.74,13.089z"/>
	<path fill-rule="evenodd" clip-rule="evenodd" fill="#7FDAFE" d="M6.254,13.58c1.214,0,2.427,0,3.642,0
		c-0.008,0.157,0.072,0.367-0.034,0.457c-0.091,0.077-0.295,0.022-0.448,0.026c-0.894,0-1.785,0-2.677,0
		c-0.129,0-0.259-0.002-0.39,0.002c-0.07,0.001-0.099-0.025-0.096-0.096C6.254,13.84,6.253,13.711,6.254,13.58z"/>
	<path fill-rule="evenodd" clip-rule="evenodd" fill="#FEB57F" d="M7.713,9.44c-0.001,0.277-0.005,0.556-0.001,0.834
		c0.001,0.096-0.014,0.146-0.13,0.146c-0.115-0.001-0.115-0.063-0.115-0.146c0.001-0.843,0-1.686,0-2.529c0.082,0,0.163,0,0.245,0
		C7.711,8.312,7.713,8.876,7.713,9.44z"/>
	<path fill-rule="evenodd" clip-rule="evenodd" fill="#FB9842" d="M12.452,10.179c0,0.388-0.005,0.776,0.003,1.164
		c0.003,0.134-0.031,0.231-0.135,0.315c-0.08,0.066-0.152,0.145-0.231,0.217c0-0.524,0-1.05-0.005-1.574
		c0-0.097,0.022-0.141,0.126-0.129C12.289,10.181,12.37,10.177,12.452,10.179z"/>
	<path fill-rule="evenodd" clip-rule="evenodd" fill="#FE432E" d="M3.815,11.844c-0.105-0.101-0.21-0.203-0.317-0.302
		c-0.052-0.049-0.044-0.11-0.044-0.17c0-0.397,0.001-0.796,0.001-1.193c0.364-0.019,0.365-0.019,0.364,0.348
		C3.819,10.965,3.817,11.405,3.815,11.844z"/>
	<path fill-rule="evenodd" clip-rule="evenodd" fill="#FEB57F" d="M8.438,9.448c0,0.282-0.003,0.566,0.004,0.85
		c0.001,0.093-0.035,0.122-0.125,0.122c-0.091,0-0.124-0.029-0.122-0.122C8.2,10.015,8.198,9.73,8.198,9.448
		C8.278,9.448,8.357,9.448,8.438,9.448z"/>
	<path fill-rule="evenodd" clip-rule="evenodd" fill="#FEB57F" d="M9.896,10.414c-0.037,0.002-0.073-0.001-0.107,0.003
		c-0.108,0.015-0.137-0.034-0.137-0.138c0.008-0.277,0.005-0.554,0.005-0.831c0.016-0.002,0.031-0.005,0.045-0.005
		c0.195-0.002,0.195-0.002,0.195,0.19C9.897,9.894,9.896,10.153,9.896,10.414z"/>
	<path fill-rule="evenodd" clip-rule="evenodd" fill="#FEB57F" d="M9.168,9.448c0,0.282-0.002,0.566,0.004,0.85
		c0.001,0.093-0.033,0.122-0.124,0.122c-0.092,0-0.126-0.029-0.124-0.122c0.006-0.283,0.005-0.567,0.005-0.85
		C9.008,9.448,9.087,9.448,9.168,9.448z"/>
	<path fill-rule="evenodd" clip-rule="evenodd" fill="#80DAFE" d="M7.464,6.02c0.13-0.332,0.203-0.683,0.307-1.023
		c0.056-0.186,0.108-0.374,0.166-0.57c0.061,0.038,0.062,0.091,0.074,0.136c0.13,0.45,0.256,0.899,0.386,1.349
		c0.01,0.038,0.03,0.072,0.046,0.109c-0.125,0.247-0.3,0.461-0.445,0.694c-0.032,0.05-0.056,0.05-0.086,0
		C7.763,6.482,7.589,6.268,7.464,6.02z"/>
	<path fill-rule="evenodd" clip-rule="evenodd" fill="#80DAFE" d="M2.114,7.479c0.131-0.333,0.204-0.683,0.307-1.023
		C2.478,6.271,2.53,6.083,2.587,5.885c0.061,0.038,0.062,0.092,0.074,0.136C2.79,6.471,2.917,6.921,3.046,7.37
		c0.01,0.038,0.031,0.073,0.047,0.109C2.969,7.727,2.794,7.941,2.646,8.175c-0.031,0.05-0.055,0.048-0.085,0
		C2.414,7.941,2.239,7.727,2.114,7.479z"/>
	<path fill-rule="evenodd" clip-rule="evenodd" fill="#80DAFE" d="M12.814,7.479c0.13-0.333,0.202-0.683,0.308-1.023
		c0.056-0.186,0.107-0.373,0.164-0.571c0.063,0.038,0.063,0.092,0.076,0.136c0.127,0.449,0.253,0.899,0.383,1.349
		c0.011,0.038,0.031,0.073,0.047,0.109c-0.124,0.247-0.298,0.462-0.445,0.695c-0.032,0.05-0.056,0.048-0.086,0
		C13.114,7.941,12.939,7.727,12.814,7.479z"/>
	<path fill-rule="evenodd" clip-rule="evenodd" fill="#F1F5FB" d="M13.543,12.848c-0.069,0-0.127-0.029-0.176-0.076
		c-0.135-0.135-0.268-0.275-0.409-0.405c-0.096-0.09-0.019-0.146,0.038-0.175c0.107-0.053,0.118-0.271,0.303-0.179
		c0.006,0.004,0.008,0.008,0.014,0.011c0.077,0.069,0.138,0.202,0.23,0.202c0.104,0,0.166-0.133,0.244-0.209
		c0.163-0.157,0.325-0.317,0.48-0.481c0.061-0.064,0.1-0.059,0.161,0c0.274,0.259,0.278,0.256,0.011,0.522
		c-0.226,0.225-0.451,0.45-0.674,0.675C13.703,12.795,13.639,12.849,13.543,12.848z"/>
	<path fill-rule="evenodd" clip-rule="evenodd" fill="#F1F5FB" d="M2.113,12.362c-0.283,0-0.566-0.004-0.85,0.001
		c-0.09,0.002-0.12-0.019-0.122-0.116c-0.004-0.372-0.008-0.372,0.365-0.372c0.485,0,0.972,0.003,1.457-0.001
		c0.096-0.002,0.128,0.021,0.13,0.124c0,0.364,0.004,0.364-0.358,0.364C2.528,12.362,2.32,12.362,2.113,12.362z"/>
	<path fill-rule="evenodd" clip-rule="evenodd" fill="#F1F5FB" d="M2.129,12.848c0.278,0,0.556,0.004,0.834-0.002
		c0.096-0.002,0.128,0.022,0.13,0.125c0,0.363,0.004,0.363-0.358,0.363c-0.486,0-0.971-0.001-1.457,0.003
		c-0.103,0-0.137-0.022-0.136-0.133c0.002-0.356-0.001-0.356,0.351-0.356C1.705,12.848,1.917,12.848,2.129,12.848z"/>
	<path fill-rule="evenodd" clip-rule="evenodd" fill="#F1F5FB" d="M2.548,11.423c-0.133,0-0.267,0.011-0.398-0.003
		c-0.188-0.02-0.076-0.17-0.081-0.251c-0.004-0.073-0.099-0.227,0.081-0.234c0.265-0.012,0.53-0.001,0.795-0.005
		c0.07,0,0.096,0.019,0.1,0.094c0.024,0.399,0.026,0.399-0.375,0.399C2.629,11.423,2.588,11.423,2.548,11.423z"/>
	<path fill-rule="evenodd" clip-rule="evenodd" fill="#F1F5FB" d="M1.631,11.143c0,0.247,0,0.247-0.29,0.247
		c-0.197,0-0.197,0-0.197-0.294c0-0.193,0-0.193,0.313-0.193C1.631,10.902,1.631,10.902,1.631,11.143z"/>
</g>
</svg>
