<?xml version="1.0" encoding="utf-8"?>
<!-- Generator: Adobe Illustrator 16.0.3, SVG Export Plug-In . SVG Version: 6.00 Build 0)  -->
<!DOCTYPE svg PUBLIC "-//W3C//DTD SVG 1.1//EN" "http://www.w3.org/Graphics/SVG/1.1/DTD/svg11.dtd">
<svg version="1.1" id="Ebene_1" xmlns="http://www.w3.org/2000/svg" xmlns:xlink="http://www.w3.org/1999/xlink" x="0px" y="0px"
	 width="595.281px" height="841.891px" viewBox="0 0 595.281 841.891" enable-background="new 0 0 595.281 841.891"
	 xml:space="preserve">
<g>
	<g>
		<g>
			<path fill="#FFFFFF" d="M67.052,341.118h20.266c-0.427-7.86-0.621-15.765-0.577-23.719c0.077-13.495,0.011-26.989,0.011-41.35
				c2.832,0,5.396,0.054,7.957-0.008c24.409-0.576,48.662-2.286,72.194-9.561c37.097-11.468,58.291-36.026,62.021-75.045
				c0.078-0.809,0.238-1.609,0.447-2.99c1.642,0,3.243,0,4.845,0c42.166,0,84.333,0.052,126.498-0.085
				c4.081-0.012,5.55,0.837,5.933,5.295c3.158,36.75,25.814,62.583,63.766,73.497c21.705,6.241,43.954,8.13,66.377,8.831
				c3.61,0.111,7.224,0.015,10.797,0.015c0.507,1.11,0.746,1.398,0.76,1.693c0.896,21.345,0.805,42.508-0.63,63.426h20.063
				c1.033-23.605,0.592-47.291,0.811-70.939c0.102-11.147-2.822-13.524-13.95-14.184c-21.49-1.275-43.02-2.486-64.394-4.937
				c-14.608-1.674-28.511-6.68-40.502-15.723c-17.429-13.144-23.158-31.719-23.53-52.471c-0.11-6.192-1.446-11.239-6.923-14.619
				c-54.362,0-108.722,0-163.083,0c-5.199,2.993-7.45,7.354-7.09,13.458c0.23,3.903-0.368,7.888-0.872,11.8
				c-2.929,22.762-14.027,39.846-35.413,49.169c-7.335,3.198-15.101,5.68-22.903,7.484c-22.107,5.112-44.696,5.578-67.256,5.904
				c-13.972,0.203-16.103,2.194-16.104,15.962c-0.001,15.481,0.05,30.96-0.01,46.44C66.536,326.033,66.692,333.585,67.052,341.118z"
				/>
			<path fill="#FFFFFF" d="M455.453,510.549c-37.171,61.425-88.539,108.513-154.611,140.789c-1.73,0.844-4.584,0.869-6.305,0.028
				c-66.458-32.492-118.068-79.501-154.812-140.817H116.09c33.671,60.77,82.907,110.06,147.799,147.725
				c9.898,5.746,20.258,10.696,30.403,16.019c1.976,0,3.952,0,5.93,0c0.251-0.209,0.471-0.484,0.757-0.616
				c76.98-35.209,136.309-89.687,177.918-163.128L455.453,510.549L455.453,510.549z"/>
		</g>
	</g>
	<path fill="#FFFFFF" d="M47.897,427.798l-14.252-3.587c-4.851-1.196-8.322-3.339-10.415-6.429c-2.093-3.09-3.14-7.325-3.14-12.707
		c0-3.987,0.414-7.191,1.246-9.618c0.83-2.425,2.258-4.252,4.286-5.482c2.026-1.229,4.286-2.043,6.777-2.442
		c2.491-0.398,5.831-0.598,10.016-0.598c8.106,0.134,14.916,0.798,20.432,1.994l-0.598,6.378
		c-6.445-0.332-12.924-0.498-19.435-0.498c-2.925,0-5.083,0.066-6.478,0.199c-1.396,0.134-2.758,0.532-4.086,1.196
		c-1.33,0.665-2.21,1.711-2.642,3.14c-0.433,1.43-0.647,3.406-0.647,5.93c0,3.655,0.647,6.247,1.943,7.774
		c1.295,1.529,3.538,2.691,6.728,3.488l13.953,3.489c5.116,1.262,8.704,3.422,10.764,6.478c2.059,3.057,3.09,7.343,3.09,12.857
		c0,7.574-1.711,12.592-5.133,15.049c-3.423,2.459-9.386,3.688-17.89,3.688c-7.243,0-14.352-0.632-21.328-1.894l0.598-6.479
		c11.163,0.399,18.171,0.565,21.029,0.498c5.447,0,9.12-0.697,11.014-2.092c1.894-1.396,2.84-4.386,2.84-8.97
		c0-3.788-0.648-6.43-1.944-7.924C53.328,429.741,51.086,428.597,47.897,427.798z"/>
	<path fill="#FFFFFF" d="M85.271,408.364l0.499,7.674c6.843-5.913,13.455-8.87,19.833-8.87c6.777,0,10.863,2.857,12.258,8.571
		c6.578-5.714,13.089-8.571,19.535-8.571c4.186,0,7.391,1.13,9.618,3.389c2.225,2.259,3.338,5.581,3.338,9.967v36.378h-8.372
		v-33.985c-0.067-2.991-0.682-5.167-1.843-6.529c-1.164-1.361-3.075-2.043-5.731-2.043c-2.327,0-4.569,0.533-6.727,1.594
		c-2.16,1.064-5.232,3.058-9.219,5.981v34.982h-8.172v-33.985c0-3.057-0.615-5.249-1.844-6.579c-1.23-1.329-3.14-1.994-5.731-1.994
		c-2.326,0-4.569,0.533-6.728,1.594c-2.16,1.064-5.232,3.024-9.219,5.881v35.082h-8.471v-48.538H85.271z"/>
	<path fill="#FFFFFF" d="M165.899,415.64l-0.797-6.279c8.903-1.46,16.71-2.192,23.422-2.192c5.646,0,9.833,1.18,12.558,3.538
		c2.724,2.359,4.086,6.363,4.086,12.01v34.186h-6.677l-0.997-7.974c-2.326,2.327-5.232,4.385-8.721,6.179
		c-3.488,1.795-7.26,2.691-11.312,2.691c-4.452,0-7.99-1.179-10.614-3.538c-2.625-2.357-3.937-5.696-3.937-10.016v-5.283
		c0-3.787,1.179-6.728,3.539-8.82c2.357-2.093,5.664-3.14,9.917-3.14h20.231v-4.285c0-3.055-0.697-5.215-2.093-6.479
		c-1.396-1.261-3.986-1.894-7.774-1.894C181.945,414.344,175.001,414.777,165.899,415.64z M171.58,440.157v3.09
		c0,2.525,0.598,4.37,1.794,5.531c1.196,1.163,3.122,1.744,5.78,1.744c2.524,0.067,5.398-0.531,8.621-1.794
		c3.222-1.262,6.162-3.09,8.82-5.481v-9.768h-18.737c-2.26,0.066-3.871,0.665-4.833,1.794
		C172.061,436.405,171.58,438.032,171.58,440.157z"/>
	<path fill="#FFFFFF" d="M250.714,407.168l-0.997,7.973h-2.791c-2.458,0-5,0.483-7.624,1.445c-2.625,0.964-6.129,2.542-10.515,4.734
		v35.581h-8.472v-48.538h6.578l0.897,7.674c7.507-5.913,14.417-8.87,20.73-8.87H250.714z"/>
	<path fill="#FFFFFF" d="M272.44,415.042v28.504c0,2.326,0.499,3.986,1.495,4.983c0.997,0.996,2.691,1.495,5.083,1.495h7.375
		l0.997,6.478c-3.057,0.863-6.712,1.296-10.963,1.296c-4.054,0-7.143-1.13-9.269-3.389c-2.127-2.258-3.189-5.514-3.189-9.768v-29.6
		h-8.771v-6.179l8.771-0.399v-14.451h8.472v14.352h15.448v6.678H272.44z"/>
	<path fill="#FFFFFF" d="M351.376,388.132l-19.437,65.28c-0.663,2.327-2.192,3.489-4.585,3.489h-11.76
		c-1.063,0-2.011-0.315-2.84-0.948c-0.832-0.63-1.38-1.477-1.646-2.541l-19.534-65.28h12.857l14.052,51.626
		c0.199,0.798,0.5,2.077,0.897,3.838c0.398,1.761,0.699,3.04,0.898,3.837h2.491c0.398-2.126,1.029-4.685,1.893-7.675l13.854-51.626
		H351.376z"/>
	<path fill="#FFFFFF" d="M385.958,437.566h-19.934c0.465,4.254,1.661,7.094,3.589,8.522c1.927,1.43,5.082,2.142,9.469,2.142
		c4.983,0,10.829-0.398,17.541-1.195l1.097,7.774c-4.586,2.191-11.297,3.288-20.132,3.288c-8.838,0-15.119-1.959-18.839-5.881
		c-3.721-3.919-5.58-10.529-5.58-19.832c0-9.502,1.825-16.162,5.48-19.983c3.653-3.82,9.7-5.73,18.14-5.73
		c7.773,0,13.421,1.412,16.942,4.235c3.521,2.825,5.283,7.061,5.283,12.707C399.015,432.916,394.661,437.566,385.958,437.566z
		 M365.826,429.094h16.744c2.923,0,4.385-1.894,4.385-5.681c0-2.656-0.699-4.517-2.094-5.581c-1.396-1.063-3.922-1.595-7.574-1.595
		c-4.253,0-7.191,0.882-8.82,2.641C366.838,420.64,365.958,424.046,365.826,429.094z"/>
	<path fill="#FFFFFF" d="M443.066,406.67l-1.296,11.361h-3.488c-3.456,0-8.838,1.463-16.146,4.385v34.485h-12.16v-48.836h9.469
		l1.097,7.176c6.976-5.713,13.687-8.571,20.132-8.571H443.066z"/>
	<path fill="#FFFFFF" d="M480.938,437.566h-19.934c0.466,4.254,1.661,7.094,3.589,8.522c1.927,1.43,5.082,2.142,9.469,2.142
		c4.983,0,10.83-0.398,17.541-1.195l1.097,7.774c-4.585,2.191-11.297,3.288-20.132,3.288c-8.838,0-15.119-1.959-18.839-5.881
		c-3.721-3.919-5.58-10.529-5.58-19.832c0-9.502,1.825-16.162,5.48-19.983c3.653-3.82,9.7-5.73,18.14-5.73
		c7.773,0,13.421,1.412,16.942,4.235c3.521,2.825,5.284,7.061,5.284,12.707C493.996,432.916,489.642,437.566,480.938,437.566z
		 M460.807,429.094h16.745c2.922,0,4.384-1.894,4.384-5.681c0-2.656-0.698-4.517-2.094-5.581c-1.396-1.063-3.921-1.595-7.574-1.595
		c-4.252,0-7.191,0.882-8.82,2.641C461.818,420.64,460.938,424.046,460.807,429.094z"/>
	<path fill="#FFFFFF" d="M508.545,386.836h5.583c2.325,0,3.486,1.163,3.486,3.488v5.482c0,2.327-1.161,3.488-3.486,3.488h-5.583
		c-2.327,0-3.488-1.162-3.488-3.488v-5.482C505.057,387.999,506.218,386.836,508.545,386.836z M517.415,456.902h-12.058v-48.836
		h12.058V456.902z"/>
	<path fill="#FFFFFF" d="M541.533,408.065l0.799,7.176c7.574-5.713,14.616-8.571,21.129-8.571c4.319,0,7.639,1.163,9.967,3.488
		c2.324,2.327,3.488,5.681,3.488,10.066v36.677h-12.159v-32.989c0-2.725-0.366-4.568-1.097-5.532
		c-0.731-0.962-2.094-1.445-4.086-1.445c-2.261,0-4.57,0.466-6.928,1.396c-2.359,0.931-5.398,2.459-9.119,4.585v33.985h-12.159
		v-48.836H541.533z"/>
</g>
</svg>
