<?xml version="1.0" encoding="utf-8"?>
<!-- Generator: Adobe Illustrator 16.0.3, SVG Export Plug-In . SVG Version: 6.00 Build 0)  -->
<!DOCTYPE svg PUBLIC "-//W3C//DTD SVG 1.1//EN" "http://www.w3.org/Graphics/SVG/1.1/DTD/svg11.dtd">
<svg version="1.1" id="Ebene_1" xmlns="http://www.w3.org/2000/svg" xmlns:xlink="http://www.w3.org/1999/xlink" x="0px" y="0px"
	 width="512px" height="512px" viewBox="0 0 512 512" enable-background="new 0 0 512 512" xml:space="preserve">
<g id="Hintergrund">
	<g id="Ebene_2">
		<rect y="0" fill="#3B7EB0" width="512" height="512"/>
	</g>
</g>
<g>
	<path fill-rule="evenodd" clip-rule="evenodd" fill="#FFFFFF" d="M361.049,414.465c-80.533,0-160.42,0-240.58,0
		c0-105.592,0-211.073,0-316.752c80.02,0,159.997,0,240.455,0c0,7.624,0,15.247,0,23.162c13.979,0,27.479,0,41.266,0
		c0,69.448,0,138.594,0,208.155c-13.614,0-27.19,0-41.141,0C361.049,357.677,361.049,385.913,361.049,414.465z M342.161,343.219
		c0-75.833,0-151.373,0-226.942c-67.873,0-135.504,0-203.176,0c0,75.745,0,151.287,0,226.942
		C206.763,343.219,274.313,343.219,342.161,343.219z M342.227,395.801c0-11.438,0-22.509,0-33.684c-67.884,0-135.59,0-203.309,0
		c0,11.326,0,22.406,0,33.684C206.701,395.801,274.324,395.801,342.227,395.801z M383.648,247.201c0-14.998,0-29.664,0-44.326
		c-7.593,0-14.916,0-22.393,0c0,14.834,0,29.494,0,44.326C368.82,247.201,376.138,247.201,383.648,247.201z M383.651,184.051
		c0-14.98,0-29.627,0-44.271c-7.594,0-14.918,0-22.415,0c0,14.862,0,29.519,0,44.271
		C368.798,184.051,376.132,184.051,383.651,184.051z M361.243,266.094c0,14.945,0,29.515,0,44.093c7.648,0,15.061,0,22.464,0
		c0-14.82,0-29.393,0-44.093C376.163,266.094,368.827,266.094,361.243,266.094z"/>
	<path fill-rule="evenodd" clip-rule="evenodd" fill="#FFFFFF" d="M308.665,309.695c-45.508,0-90.609,0-135.693,0
		c-0.159-0.195-0.418-0.366-0.417-0.534c0.143-12.753-0.706-25.62,0.688-38.237c2.554-23.118,15.123-40.089,35.302-51.488
		c0.839-0.474,1.683-0.942,2.829-1.583c-9.231-10.005-13.313-21.571-11.468-34.912c1.449-10.473,6.477-19.1,14.576-25.831
		c15.947-13.253,38.821-12.386,54.286,1.813c13.757,12.632,19.813,38.34,1.495,58.728c4.408,3.001,9.087,5.684,13.187,9.067
		c15.97,13.184,24.584,30.184,25.162,50.96C308.906,288.221,308.665,298.777,308.665,309.695z M289.872,291.144
		c2.767-24.136-5.888-43.981-24.326-54.326c-18.526-10.394-37.061-9.488-54.288,2.922c-17.512,12.616-22.036,30.788-19.953,51.404
		C224.178,291.144,256.928,291.144,289.872,291.144z M240.738,211.318c12.449-0.057,22.355-10.062,22.332-22.556
		c-0.024-12.578-10.162-22.562-22.797-22.451c-12.338,0.108-22.292,10.304-22.209,22.752
		C218.146,201.44,228.268,211.374,240.738,211.318z"/>
</g>
</svg>
