<?xml version="1.0" encoding="utf-8"?>
<!-- Generator: Adobe Illustrator 16.0.3, SVG Export Plug-In . SVG Version: 6.00 Build 0)  -->
<!DOCTYPE svg PUBLIC "-//W3C//DTD SVG 1.1//EN" "http://www.w3.org/Graphics/SVG/1.1/DTD/svg11.dtd">
<svg version="1.1" id="Ebene_1" xmlns="http://www.w3.org/2000/svg" xmlns:xlink="http://www.w3.org/1999/xlink" x="0px" y="0px"
	 width="16px" height="16px" viewBox="0 0 16 16" enable-background="new 0 0 16 16" xml:space="preserve">
<g>
	<path fill-rule="evenodd" clip-rule="evenodd" fill="#0181FB" d="M12.557,11.225c0.142-0.074,0.304-0.07,0.453-0.117
		c0.147-0.07,0.294-0.066,0.441,0c0.162,0.041,0.331,0.057,0.486,0.119c0.763,0.305,1.231,0.848,1.377,1.664
		c0.002,0.014,0.015,0.029,0.023,0.045c0,0.195,0,0.395,0,0.59c-0.036,0.127-0.068,0.254-0.113,0.379
		c-0.126,0.357-0.322,0.666-0.621,0.904c-0.047-0.039-0.051-0.096-0.06-0.15c-0.049-0.369-0.22-0.664-0.517-0.889
		c-0.047-0.037-0.103-0.068-0.119-0.133c-0.013-0.066,0.017-0.127,0.019-0.193c0.021-0.107,0.095-0.191,0.126-0.295
		c0.107-0.367-0.015-0.729-0.326-0.955c-0.038-0.025-0.079-0.049-0.111-0.084c-0.23-0.359-0.546-0.615-0.933-0.791
		C12.636,11.299,12.57,11.295,12.557,11.225z"/>
	<path fill-rule="evenodd" clip-rule="evenodd" fill="#22A5FD" d="M1.683,14.818c-0.357-0.299-0.585-0.676-0.694-1.129
		c-0.012-0.047-0.003-0.104-0.054-0.137c0-0.215,0-0.43,0-0.646c0.057-0.072,0.051-0.166,0.076-0.246
		c0.213-0.709,0.665-1.188,1.362-1.438c0.228,0.039,0.416,0.158,0.594,0.297c0.156,0.119,0.294,0.258,0.412,0.416
		c0.031,0.043,0.082,0.088,0.017,0.146c-0.112,0.023-0.213-0.045-0.324-0.037c-0.068,0.006-0.138-0.004-0.204,0.02
		c-0.633,0.156-0.876,0.824-0.498,1.355c0.042,0.057,0.119,0.102,0.094,0.191c-0.054,0.066-0.132,0.102-0.2,0.152
		c-0.32,0.23-0.494,0.545-0.535,0.936C1.725,14.742,1.739,14.795,1.683,14.818z"/>
	<path fill-rule="evenodd" clip-rule="evenodd" fill="#7FD161" d="M6.024,7.759C5.234,7.17,4.75,6.387,4.594,5.415
		C4.4,4.213,4.741,3.164,5.571,2.281C6.06,1.76,6.661,1.42,7.358,1.257C7.431,1.24,7.504,1.224,7.576,1.208
		c0.645,0.077,1.199,0.356,1.694,0.759c0.762,0.619,1.204,1.427,1.338,2.396c0.111,0.82-0.051,1.593-0.456,2.314
		c-0.018,0.03-0.034,0.056-0.064,0.073c-0.034,0.013-0.064,0-0.092-0.019C9.807,6.594,9.58,6.539,9.362,6.467
		C9.281,6.439,9.198,6.428,9.119,6.4C8.941,6.336,8.818,6.147,8.824,5.956c0.07-0.089,0.173-0.141,0.261-0.211
		c0.269-0.217,0.457-0.492,0.585-0.81c0.065-0.16,0.063-0.329,0.062-0.498c-0.002-0.112,0-0.224-0.002-0.337
		c0.013-0.599-0.18-1.105-0.679-1.464c-0.333-0.24-0.711-0.324-1.118-0.24C7.237,2.531,6.787,3.11,6.708,3.774
		C6.695,3.875,6.663,3.977,6.712,4.077c-0.118,0.61,0.06,1.125,0.505,1.554c0.122,0.116,0.265,0.206,0.391,0.318
		c0,0.145-0.077,0.257-0.16,0.367C7.339,6.427,7.186,6.432,7.049,6.478C6.897,6.525,6.746,6.571,6.601,6.639
		C6.236,6.808,6.082,7.104,6.063,7.491C6.059,7.581,6.093,7.678,6.024,7.759z"/>
	<path fill-rule="evenodd" clip-rule="evenodd" fill="#4FC022" d="M10.075,6.748c0.213-0.392,0.389-0.796,0.467-1.24
		c0.129-0.721,0.05-1.419-0.23-2.096c-0.173-0.416-0.418-0.783-0.726-1.107C9.053,1.741,8.394,1.397,7.638,1.233
		c-0.021-0.004-0.04-0.017-0.062-0.026c1.086-0.186,2.07,0.061,2.924,0.749c1.003,0.809,1.466,1.881,1.368,3.164
		c-0.084,1.097-0.587,1.986-1.475,2.647c-0.054-0.041-0.045-0.101-0.043-0.153c0.004-0.293-0.045-0.566-0.252-0.79
		C10.079,6.806,10.068,6.778,10.075,6.748z"/>
	<path fill-rule="evenodd" clip-rule="evenodd" fill="#CCBDB8" d="M13.451,11.107c-0.147,0-0.294,0-0.441,0
		c-0.002-0.322-0.005-0.645,0-0.969c0-0.096-0.025-0.129-0.126-0.129c-1.445,0.004-2.888,0.004-4.33,0
		c-0.107,0-0.137,0.039-0.135,0.141c0.004,0.32,0.002,0.637,0,0.955c-0.141,0.068-0.281,0.068-0.423,0.002
		c0-0.324-0.004-0.646,0-0.969c0.003-0.098-0.025-0.129-0.126-0.129c-1.492,0.004-2.986,0.004-4.479,0
		c-0.102,0-0.127,0.033-0.126,0.129c0.004,0.322,0,0.646-0.001,0.969c-0.147,0.064-0.295,0.066-0.442,0
		c-0.001-0.375-0.002-0.748-0.001-1.125c0-0.254,0.144-0.396,0.401-0.396c1.53,0,3.062,0,4.59,0c0.182,0,0.182,0,0.182-0.182
		c0-0.303,0-0.607,0-0.91c0.144-0.076,0.286-0.076,0.427,0c0,0.313,0.007,0.627-0.004,0.941C8.413,9.563,8.455,9.59,8.577,9.588
		c1.48-0.002,2.962-0.002,4.443-0.002c0.303,0,0.433,0.133,0.433,0.438C13.453,10.385,13.451,10.748,13.451,11.107z"/>
	<path fill-rule="evenodd" clip-rule="evenodd" fill="#22A5FD" d="M8.421,8.494c-0.141,0-0.283,0-0.427,0
		c-0.666-0.059-1.285-0.254-1.84-0.63C6.109,7.832,6.067,7.795,6.024,7.759c0.014-0.151-0.003-0.305,0.022-0.458
		c0.051-0.305,0.212-0.523,0.48-0.667c0.161-0.087,0.334-0.143,0.511-0.189c0.209,0.059,0.378,0.2,0.565,0.299
		C7.74,6.816,7.87,6.897,8.001,6.98c0.137,0.087,0.267,0.09,0.405,0.004c0.111-0.066,0.227-0.13,0.337-0.199
		c0.063-0.036,0.122-0.07,0.194-0.075C9.362,6.754,9.665,7.025,9.749,7.46C9.791,7.678,9.811,7.903,9.8,8.127
		C9.366,8.348,8.901,8.447,8.421,8.494z"/>
	<path fill-rule="evenodd" clip-rule="evenodd" fill="#0181FB" d="M2.822,11.107c0.147,0,0.294,0,0.442,0
		c0.153,0.041,0.313,0.057,0.462,0.113c0.761,0.287,1.244,0.826,1.388,1.625c0.14,0.781-0.106,1.449-0.713,1.973
		c-0.043-0.027-0.038-0.072-0.042-0.111c-0.033-0.371-0.204-0.664-0.482-0.902c-0.052-0.045-0.117-0.078-0.15-0.145
		c-0.032-0.084-0.001-0.162,0.016-0.24c0.042-0.129,0.121-0.242,0.14-0.381c0.048-0.355-0.07-0.641-0.362-0.852
		c-0.043-0.031-0.102-0.051-0.113-0.115c-0.085-0.227-0.278-0.357-0.443-0.512c-0.171-0.158-0.391-0.232-0.593-0.338
		C2.512,11.148,2.675,11.156,2.822,11.107z"/>
	<path fill-rule="evenodd" clip-rule="evenodd" fill="#0182FB" d="M9.8,8.127c-0.049-0.15-0.049-0.305-0.06-0.461
		C9.723,7.399,9.654,7.153,9.443,6.968C9.292,6.831,9.112,6.767,8.914,6.742c-0.002-0.013,0-0.026,0.007-0.039
		C9.06,6.591,9.211,6.5,9.379,6.44c0.25,0.062,0.489,0.147,0.696,0.308c0.25,0.237,0.326,0.533,0.313,0.864
		c-0.002,0.052,0.002,0.104,0.005,0.156C10.214,7.917,10.016,8.037,9.8,8.127z"/>
	<path fill-rule="evenodd" clip-rule="evenodd" fill="#0181FB" d="M7.996,11.107c0.142-0.002,0.282-0.002,0.423-0.002
		c0.232,0.051,0.465,0.094,0.683,0.199c1.437,0.693,1.609,2.566,0.472,3.512c-0.034-0.025-0.034-0.063-0.038-0.1
		c-0.047-0.414-0.245-0.738-0.576-0.986c-0.034-0.025-0.07-0.049-0.081-0.094c0-0.066,0.011-0.131,0.017-0.193
		c0.073-0.17,0.162-0.33,0.167-0.527c0.006-0.311-0.128-0.537-0.36-0.719c-0.034-0.027-0.073-0.045-0.101-0.078
		c-0.248-0.371-0.572-0.648-0.986-0.82c-0.032-0.014-0.072-0.027-0.066-0.076C7.687,11.146,7.85,11.156,7.996,11.107z"/>
	<path fill-rule="evenodd" clip-rule="evenodd" fill="#22A5FD" d="M12.557,11.225c0.259,0.113,0.509,0.24,0.72,0.43
		c0.139,0.123,0.265,0.26,0.348,0.432c-0.051,0.033-0.101,0.006-0.147-0.01c-0.134-0.039-0.267-0.039-0.403-0.016
		c-0.31,0.072-0.537,0.248-0.638,0.551c-0.099,0.295-0.062,0.582,0.147,0.83c0.036,0.041,0.083,0.078,0.096,0.135
		c0,0.045-0.034,0.064-0.066,0.084c-0.416,0.236-0.645,0.598-0.7,1.072c-0.004,0.031-0.006,0.063-0.038,0.084
		c-1.197-0.965-0.895-2.951,0.538-3.537C12.459,11.26,12.508,11.242,12.557,11.225z"/>
	<path fill-rule="evenodd" clip-rule="evenodd" fill="#22A5FD" d="M7.548,11.223c0.167,0.09,0.344,0.164,0.5,0.273
		c0.23,0.162,0.418,0.359,0.567,0.596c-0.051,0.037-0.101,0.004-0.147-0.01c-0.141-0.041-0.283-0.049-0.427-0.025
		c-0.676,0.189-0.896,0.871-0.456,1.416c0.027,0.031,0.058,0.063,0.06,0.107c-0.011,0.064-0.068,0.082-0.115,0.111
		c-0.356,0.227-0.563,0.547-0.627,0.965c-0.009,0.055-0.013,0.111-0.058,0.154c-0.43-0.354-0.667-0.816-0.727-1.363
		C6.008,12.447,6.601,11.541,7.548,11.223z"/>
	<path fill-rule="evenodd" clip-rule="evenodd" fill="#7FD161" d="M11.874,14.816c0.023-0.564,0.299-0.969,0.792-1.229
		c0.07-0.023,0.111,0.031,0.162,0.061c0.07,0.037,0.146,0.059,0.222,0.08c0.139,0.025,0.28,0.006,0.419,0.004
		c0.104,0.021,0.166,0.102,0.226,0.178c0.282,0.348,0.43,0.752,0.468,1.195C13.449,15.484,12.468,15.361,11.874,14.816z"/>
	<path fill-rule="evenodd" clip-rule="evenodd" fill="#FC4755" d="M6.844,14.811c0.038-0.557,0.303-0.965,0.795-1.225
		c0.139,0.018,0.244,0.125,0.38,0.145c0.147,0.025,0.293,0,0.44,0c0.123,0.064,0.207,0.172,0.285,0.279
		c0.235,0.326,0.351,0.699,0.401,1.092C8.402,15.482,7.422,15.359,6.844,14.811z"/>
	<path fill-rule="evenodd" clip-rule="evenodd" fill="#FCB340" d="M1.683,14.818c0.024-0.559,0.281-0.969,0.784-1.221
		c0.085-0.031,0.138,0.041,0.204,0.066c0.056,0.021,0.114,0.043,0.17,0.063c0.147,0.031,0.294,0.002,0.442,0.004
		c0.198,0.121,0.327,0.303,0.436,0.502c0.149,0.271,0.217,0.564,0.255,0.869C3.227,15.479,2.314,15.365,1.683,14.818z"/>
	<path fill-rule="evenodd" clip-rule="evenodd" fill="#E31E2B" d="M9.146,15.102C9.123,15.096,9.1,15.09,9.096,15.061
		c-0.049-0.51-0.256-0.947-0.621-1.311c0.077-0.1,0.194-0.135,0.305-0.182c0.05,0.008,0.09,0.029,0.115,0.076
		c0.425,0.275,0.66,0.662,0.679,1.172C9.45,14.939,9.305,15.031,9.146,15.102z"/>
	<path fill-rule="evenodd" clip-rule="evenodd" fill="#4FC022" d="M14.162,15.105c-0.054-0.049-0.052-0.115-0.063-0.18
		c-0.076-0.459-0.254-0.861-0.616-1.172c0.094-0.094,0.207-0.15,0.331-0.189c0.049,0.012,0.092,0.033,0.115,0.084
		c0.42,0.271,0.638,0.662,0.674,1.16C14.476,14.939,14.326,15.033,14.162,15.105z"/>
	<path fill-rule="evenodd" clip-rule="evenodd" fill="#FD9800" d="M3.974,15.102c-0.029-0.006-0.052-0.018-0.055-0.053
		c-0.035-0.514-0.25-0.943-0.621-1.297c0.094-0.098,0.204-0.164,0.342-0.178c0.051,0.01,0.079,0.047,0.108,0.084
		c0.412,0.277,0.642,0.658,0.653,1.16C4.277,14.939,4.133,15.031,3.974,15.102z"/>
	<path fill-rule="evenodd" clip-rule="evenodd" fill="#FDD0A2" d="M13.812,13.586c-0.108,0.055-0.217,0.113-0.328,0.168
		c-0.151,0.035-0.303,0.047-0.455,0c0.016-0.053,0.064-0.063,0.107-0.08c0.328-0.158,0.497-0.43,0.501-0.783
		c0.005-0.342-0.175-0.592-0.47-0.762c-0.042-0.023-0.115-0.021-0.11-0.102c0.196-0.055,0.384-0.01,0.567,0.059
		c0.436,0.229,0.693,0.779,0.333,1.348C13.93,13.504,13.894,13.566,13.812,13.586z"/>
	<path fill-rule="evenodd" clip-rule="evenodd" fill="#24A4F9" d="M13.812,13.586c0.05-0.051,0.097-0.104,0.146-0.152
		c0.018,0.076-0.027,0.141-0.027,0.215C13.889,13.627,13.851,13.607,13.812,13.586z"/>
	<path fill-rule="evenodd" clip-rule="evenodd" fill="#FEE4C0" d="M2.819,13.752c-0.132-0.018-0.231-0.109-0.352-0.154
		c-0.151-0.178-0.282-0.367-0.313-0.611c-0.053-0.432,0.268-0.877,0.695-0.949c0.283,0.014,0.583,0.332,0.647,0.652
		c0.083,0.418-0.088,0.799-0.455,1.014C2.973,13.744,2.901,13.77,2.819,13.752z"/>
	<path fill-rule="evenodd" clip-rule="evenodd" fill="#FDD0A2" d="M2.819,13.752c0.448-0.123,0.665-0.471,0.666-0.873
		c0.001-0.322-0.152-0.588-0.449-0.75c-0.061-0.033-0.125-0.061-0.187-0.092c0.192-0.074,0.375-0.018,0.559,0.035
		c0.295,0.162,0.485,0.398,0.521,0.742c0.023,0.219-0.046,0.412-0.155,0.596c-0.032,0.078-0.063,0.156-0.149,0.188
		c-0.119,0.029-0.212,0.115-0.327,0.154C3.138,13.787,2.979,13.805,2.819,13.752z"/>
	<path fill-rule="evenodd" clip-rule="evenodd" fill="#FEE4C0" d="M7.596,5.962C7.124,5.672,6.78,5.285,6.665,4.728
		c-0.038-0.19-0.01-0.382-0.017-0.573C6.646,4.114,6.673,4.1,6.701,4.081C6.716,4.047,6.75,4.041,6.782,4.033
		c0.164-0.035,0.303-0.121,0.416-0.244c0.134-0.146,0.29-0.196,0.48-0.137c0.036,0.012,0.074,0.015,0.108,0.029
		c0.284,0.111,0.565,0.098,0.85,0.001C8.714,3.657,8.79,3.633,8.871,3.648c0.068,0.013,0.084,0.065,0.09,0.125
		C8.982,4.08,9.013,4.386,8.959,4.695c-0.036,0.217-0.124,0.412-0.245,0.59C8.528,5.558,8.295,5.788,8.003,5.95
		C7.918,5.998,7.83,6.044,7.728,6.042C7.672,6.035,7.627,6.011,7.596,5.962z"/>
	<path fill-rule="evenodd" clip-rule="evenodd" fill="#6D80A9" d="M8.863,3.676c-0.139,0.001-0.265,0.056-0.396,0.09
		C8.293,3.813,8.12,3.816,7.945,3.763c-0.09-0.026-0.182-0.045-0.269-0.074c-0.18-0.056-0.327-0.02-0.455,0.124
		C7.085,3.969,6.915,4.071,6.701,4.081C6.613,4.052,6.646,3.979,6.65,3.927c0.062-0.755,0.467-1.386,1.263-1.565
		c0.322,0.082,0.544,0.303,0.736,0.555C8.779,3.088,8.86,3.29,8.91,3.502C8.921,3.548,8.934,3.594,8.914,3.64
		C8.903,3.661,8.882,3.667,8.863,3.676z"/>
	<path fill-rule="evenodd" clip-rule="evenodd" fill="#FDD0A2" d="M8.863,3.676C8.874,3.667,8.887,3.659,8.897,3.65
		C8.989,3.599,9.06,3.651,9.123,3.706c0.073,0.063,0.146,0.128,0.223,0.191C9.433,3.97,9.531,4.018,9.644,4.035
		c0.048,0.007,0.095,0.013,0.122,0.057c0.009,0.377,0.038,0.753-0.171,1.102C9.403,5.511,9.162,5.775,8.837,5.959
		C8.82,5.992,8.797,6.02,8.761,6.037C8.442,6.194,8.118,6.244,7.783,6.089C7.751,6.075,7.711,6.065,7.715,6.015
		C7.913,5.992,8.071,5.88,8.219,5.761C8.547,5.494,8.816,5.18,8.905,4.753c0.052-0.25,0.075-0.506,0.026-0.762
		c-0.014-0.068-0.007-0.14-0.007-0.209C8.925,3.734,8.929,3.686,8.863,3.676z"/>
	<path fill-rule="evenodd" clip-rule="evenodd" fill="#49679A" d="M9.766,4.092C9.521,4.077,9.326,3.963,9.164,3.783
		c-0.07-0.08-0.162-0.121-0.267-0.132C8.822,3.107,8.534,2.71,8.059,2.444c-0.05-0.027-0.097-0.056-0.146-0.083
		c0.76-0.165,1.552,0.32,1.77,1.083C9.742,3.657,9.785,3.87,9.766,4.092z"/>
	<path fill-rule="evenodd" clip-rule="evenodd" fill="#FDD0A2" d="M8.923,6.718C8.918,6.727,8.916,6.733,8.914,6.742
		C8.737,6.814,8.579,6.925,8.417,7.023C8.276,7.104,8.15,7.111,8.009,7.025C7.687,6.829,7.363,6.638,7.038,6.445
		c0.132-0.046,0.28-0.054,0.395-0.15C7.493,6.274,7.54,6.311,7.593,6.33c0.284,0.105,0.574,0.173,0.878,0.094
		C8.525,6.41,8.579,6.416,8.611,6.462C8.69,6.578,8.812,6.639,8.923,6.718z"/>
	<path fill-rule="evenodd" clip-rule="evenodd" fill="#FEBB85" d="M8.923,6.718C8.786,6.708,8.69,6.629,8.615,6.521
		C8.588,6.48,8.566,6.432,8.496,6.452C8.118,6.56,7.771,6.458,7.433,6.294c0.068-0.104,0.12-0.214,0.163-0.332
		C7.634,5.98,7.674,5.998,7.715,6.015c0.386,0.213,0.758,0.143,1.122-0.055c0.05,0.229,0.156,0.403,0.41,0.443
		c0.047,0.006,0.09,0.025,0.132,0.038C9.238,6.55,9.078,6.63,8.923,6.718z"/>
	<path fill-rule="evenodd" clip-rule="evenodd" fill="#26A5F8" d="M3.625,13.598c0.031-0.076,0.101-0.123,0.149-0.188
		c-0.003,0.084-0.042,0.162-0.026,0.248C3.708,13.639,3.667,13.619,3.625,13.598z"/>
	<path fill-rule="evenodd" clip-rule="evenodd" fill="#FDD0A2" d="M8.784,13.586c-0.104,0.055-0.207,0.109-0.31,0.164
		c-0.16,0.039-0.32,0.055-0.482,0.002c0.104-0.102,0.245-0.145,0.356-0.242c0.399-0.352,0.353-1.09-0.207-1.377
		c-0.045-0.023-0.115-0.023-0.117-0.1c0.205-0.066,0.398-0.01,0.591,0.059c0.34,0.209,0.517,0.502,0.479,0.912
		c-0.016,0.162-0.088,0.301-0.169,0.438C8.889,13.5,8.876,13.582,8.784,13.586z"/>
	<path fill-rule="evenodd" clip-rule="evenodd" fill="#31A2F3" d="M8.784,13.586c0.047-0.049,0.094-0.096,0.141-0.145
		c0,0.07,0.007,0.141-0.03,0.203C8.858,13.625,8.82,13.605,8.784,13.586z"/>
	<path fill-rule="evenodd" clip-rule="evenodd" fill="#FEE4C0" d="M13.057,12.027c0.177,0.098,0.354,0.197,0.472,0.379
		c0.313,0.484,0.108,1.117-0.436,1.318c-0.023,0.008-0.043,0.02-0.064,0.029c-0.141-0.014-0.247-0.098-0.362-0.166
		c-0.243-0.227-0.353-0.5-0.31-0.83C12.399,12.408,12.686,12.111,13.057,12.027z"/>
	<path fill-rule="evenodd" clip-rule="evenodd" fill="#FEE4C0" d="M8.024,12.033c0.202,0.1,0.391,0.213,0.506,0.42
		c0.29,0.52,0.025,1.137-0.538,1.299c-0.133-0.02-0.241-0.096-0.353-0.166c-0.369-0.396-0.422-0.836-0.145-1.215
		C7.625,12.191,7.8,12.072,8.024,12.033z"/>
</g>
</svg>
