<?xml version="1.0" encoding="utf-8"?>
<!-- Generator: Adobe Illustrator 16.0.3, SVG Export Plug-In . SVG Version: 6.00 Build 0)  -->
<!DOCTYPE svg PUBLIC "-//W3C//DTD SVG 1.1//EN" "http://www.w3.org/Graphics/SVG/1.1/DTD/svg11.dtd">
<svg version="1.1" id="Ebene_1" xmlns="http://www.w3.org/2000/svg" xmlns:xlink="http://www.w3.org/1999/xlink" x="0px" y="0px"
	 width="512px" height="512px" viewBox="0 0 512 512" enable-background="new 0 0 512 512" xml:space="preserve">
<g id="Hintergrund">
	<g id="Ebene_2">
		<rect y="0" fill="#458043" width="512" height="512"/>
	</g>
</g>
<g>
	<path fill="#FFFFFF" d="M256.533,390.272c-21.04,0-42.079,0.007-63.118-0.002c-9.422-0.005-14.149-4.659-14.157-14.017
		c-0.021-26.396-0.1-52.791,0.019-79.183c0.159-35.025,26.791-61.721,61.765-61.902c12.869-0.066,25.792-0.389,38.603,0.577
		c29.057,2.19,53.632,27.687,54.296,56.742c0.65,28.547,0.269,57.119,0.191,85.68c-0.019,7.292-5.334,12.075-12.953,12.092
		C299.631,390.299,278.081,390.272,256.533,390.272z"/>
	<path fill="#FFFFFF" d="M349.359,390.239c0.441-7.611,1.174-14.915,1.234-22.224c0.169-20.27-0.037-40.542,0.092-60.812
		c0.084-12.922-0.198-25.753-5.238-38.509c3.212-0.308,6.056-0.787,8.903-0.812c11.091-0.092,22.183-0.117,33.274-0.021
		c24.369,0.213,44.059,19.448,44.42,43.864c0.323,21.924,0.132,43.856,0.066,65.782c-0.022,7.363-4.921,12.675-11.945,12.709
		c-23.586,0.114-47.171,0.04-70.757,0.026C349.069,390.243,348.728,390.066,349.359,390.239z"/>
	<path fill="#FFFFFF" d="M168.047,268.646c-5.57,13.676-5.331,27.583-5.271,41.493c0.087,20.143-0.089,40.287,0.087,60.43
		c0.056,6.421,0.878,12.836,1.371,19.55c-0.222,0.017-1.295,0.145-2.368,0.146c-22.184,0.012-44.367,0.016-66.55,0.004
		c-9.205-0.004-13.985-4.68-13.999-13.785c-0.032-21.035-0.088-42.072,0.013-63.108c0.124-26.121,19.698-45.475,45.898-45.528
		c10.454-0.021,20.909-0.06,31.362,0.032C161.602,267.905,164.61,268.356,168.047,268.646z"/>
	<path fill="#FFFFFF" d="M309.694,175.827c-0.126,29.342-23.94,53.022-53.191,52.889c-29.265-0.131-52.859-23.987-52.749-53.331
		c0.111-29.336,23.888-52.969,53.188-52.864C286.202,122.626,309.818,146.491,309.694,175.827z"/>
	<path fill="#FFFFFF" d="M187.259,214.92c0.131,24.571-19.991,44.661-44.751,44.685c-24.696,0.022-44.86-19.98-44.938-44.577
		c-0.078-24.677,20.021-45.087,44.435-45.124C167.229,169.865,187.124,189.656,187.259,214.92z"/>
	<path fill="#FFFFFF" d="M370.854,259.603c-24.897-0.064-44.827-20.214-44.669-45.16c0.156-24.687,20.24-44.583,44.959-44.543
		c24.751,0.042,44.856,20.363,44.735,45.214C415.758,239.727,395.578,259.667,370.854,259.603z"/>
</g>
</svg>
