<?xml version="1.0" encoding="utf-8"?>
<!-- Generator: Adobe Illustrator 16.0.3, SVG Export Plug-In . SVG Version: 6.00 Build 0)  -->
<!DOCTYPE svg PUBLIC "-//W3C//DTD SVG 1.1//EN" "http://www.w3.org/Graphics/SVG/1.1/DTD/svg11.dtd">
<svg version="1.1" id="Ebene_1" xmlns="http://www.w3.org/2000/svg" xmlns:xlink="http://www.w3.org/1999/xlink" x="0px" y="0px"
	 width="16px" height="16px" viewBox="0 0 16 16" enable-background="new 0 0 16 16" xml:space="preserve">
<g>
	<path fill-rule="evenodd" clip-rule="evenodd" fill="#539398" d="M15.307,15.316c-0.314-0.002-0.629-0.004-0.943-0.006
		c-0.051-0.055-0.041-0.123-0.041-0.189c-0.002-0.299,0-0.598,0-0.896c-0.002-0.063,0-0.125-0.014-0.186
		c-0.023-0.092-0.076-0.154-0.178-0.156c-0.098-0.004-0.156,0.055-0.189,0.143c-0.02,0.061-0.018,0.123-0.018,0.184
		c-0.002,0.305,0,0.609-0.002,0.912c0,0.066,0.01,0.135-0.041,0.189c-0.457,0-0.912,0-1.369,0c-0.053-0.053-0.049-0.121-0.049-0.188
		c0-0.967,0-1.934,0-2.902c0-0.066-0.002-0.133,0.047-0.189c0.15-0.047,0.301-0.002,0.449,0.008
		c0.508,0.031,1.008,0.109,1.488,0.285c0.215,0.078,0.41,0.193,0.578,0.354c0.145,0.139,0.215,0.316,0.281,0.498
		C15.307,13.889,15.307,14.604,15.307,15.316z"/>
	<path fill-rule="evenodd" clip-rule="evenodd" fill="#73CAB0" d="M1.637,15.311c-0.314,0.002-0.629,0.004-0.943,0.006
		c0-0.723,0-1.447,0-2.17c0.234-0.637,0.782-0.828,1.369-0.969c0.491-0.117,0.993-0.141,1.495-0.168
		c0.055-0.002,0.114-0.014,0.167,0.02c-0.021,0.029-0.053,0.041-0.085,0.047c-0.076,0.014-0.1,0.063-0.101,0.131
		c0,0.053-0.001,0.105-0.001,0.158c0,0.904,0,1.811,0,2.717c0,0.078,0.016,0.162-0.044,0.23c-0.458,0-0.915-0.002-1.372-0.002
		c-0.051-0.055-0.041-0.123-0.041-0.189c-0.002-0.303,0-0.605-0.001-0.91c0-0.076-0.003-0.152-0.042-0.221
		c-0.041-0.07-0.098-0.115-0.185-0.105s-0.134,0.063-0.156,0.145c-0.017,0.059-0.016,0.121-0.016,0.184c0,0.303,0,0.605-0.001,0.91
		C1.678,15.188,1.688,15.256,1.637,15.311z"/>
	<path fill-rule="evenodd" clip-rule="evenodd" fill="#F0CABB" d="M8.258,0.704c0.176,0.06,0.361,0.09,0.527,0.187
		c0.357,0.208,0.543,0.527,0.607,0.915C9.5,2.447,9.371,3.04,8.969,3.56C8.732,3.863,8.418,4.029,8.035,4.065
		C8.023,4.066,8.012,4.052,8,4.044C7.952,3.989,7.955,3.921,7.955,3.855c-0.001-0.987-0.001-1.975,0-2.962
		c0-0.066-0.003-0.134,0.045-0.189C8.086,0.704,8.172,0.704,8.258,0.704z"/>
	<path fill-rule="evenodd" clip-rule="evenodd" fill="#F5DBCC" d="M8,0.704c0,1.114,0,2.227,0,3.341
		C7.481,4.051,7.141,3.76,6.888,3.351c-0.245-0.397-0.345-0.842-0.31-1.305C6.625,1.432,6.87,0.938,7.599,0.746
		c0.03-0.008,0.068-0.008,0.087-0.042C7.791,0.704,7.896,0.704,8,0.704z"/>
	<path fill-rule="evenodd" clip-rule="evenodd" fill="#3AA9FE" d="M8.004,4.366c0.764,0.006,1.514,0.094,2.232,0.365
		c0.4,0.152,0.738,0.391,0.881,0.828c0.031,0.1,0.051,0.201,0.051,0.307c-0.002,0.703-0.002,1.405,0,2.108
		c0,0.079,0,0.133-0.107,0.133c-1.006-0.004-2.014-0.004-3.02-0.004C8.027,8.104,8.014,8.1,8,8.098
		c-0.048-0.057-0.045-0.124-0.045-0.19c-0.001-1.119-0.001-2.237,0-3.356C7.955,4.486,7.949,4.417,8.004,4.366z"/>
	<path fill-rule="evenodd" clip-rule="evenodd" fill="#76E1F7" d="M8.004,4.366C8.002,5.453,8.002,6.54,8,7.627
		c0,0.156,0,0.313,0,0.47C7.477,8.098,6.955,8.1,6.433,8.1C6.374,8.043,6.388,7.967,6.388,7.898c-0.002-0.376,0-0.751-0.001-1.127
		c-0.001-0.198-0.082-0.31-0.218-0.307C6.039,6.468,5.962,6.577,5.961,6.77c-0.002,0.375,0,0.751-0.002,1.126
		c0,0.07,0.014,0.145-0.044,0.204c-0.318,0-0.636-0.004-0.955,0.002c-0.1,0.002-0.129-0.029-0.129-0.129
		c0.004-0.703-0.006-1.406,0.005-2.108c0.008-0.517,0.324-0.833,0.755-1.05c0.495-0.249,1.035-0.33,1.576-0.399
		C7.445,4.38,7.724,4.359,8.004,4.366z"/>
	<path fill-rule="evenodd" clip-rule="evenodd" fill="#539398" d="M3.492,15.313c0-1.049,0.002-2.096-0.005-3.145
		c-0.001-0.213,0.154-0.102,0.237-0.139c0.571,0.016,1.13,0.104,1.672,0.289c0.139,0.047,0.269,0.115,0.392,0.197
		c0.326,0.215,0.493,0.514,0.492,0.906c-0.002,0.59-0.002,1.178,0.001,1.766c0.001,0.098-0.021,0.135-0.125,0.131
		c-0.28-0.008-0.56-0.006-0.84-0.006c-0.051-0.057-0.042-0.125-0.042-0.189c-0.001-0.318,0-0.637-0.001-0.955
		c-0.001-0.191-0.063-0.283-0.184-0.283c-0.122,0-0.184,0.092-0.185,0.283c-0.002,0.318,0,0.637-0.001,0.955
		c0,0.064,0.009,0.133-0.042,0.189C4.405,15.313,3.948,15.313,3.492,15.313z"/>
	<path fill-rule="evenodd" clip-rule="evenodd" fill="#73CAB0" d="M12.51,12.031c0,1.094,0.002,2.188,0.002,3.279
		c-0.457,0-0.916,0.002-1.373,0.002c-0.051-0.055-0.041-0.125-0.041-0.189c-0.002-0.318,0-0.637-0.002-0.955
		c-0.002-0.191-0.063-0.283-0.184-0.283c-0.123,0-0.184,0.092-0.186,0.283c-0.002,0.318,0,0.637,0,0.955
		c-0.002,0.064,0.008,0.135-0.043,0.189c-0.275,0-0.551-0.002-0.826,0.006c-0.105,0.004-0.125-0.039-0.123-0.133
		c0.004-0.584,0.012-1.17-0.002-1.754c-0.012-0.453,0.205-0.756,0.578-0.969c0.387-0.223,0.816-0.299,1.248-0.369
		C11.873,12.041,12.189,12.018,12.51,12.031z"/>
	<path fill-rule="evenodd" clip-rule="evenodd" fill="#F0CABB" d="M12.508,8.807c0.162-0.045,0.316,0.006,0.467,0.051
		c0.473,0.146,0.725,0.494,0.781,0.965c0.061,0.49-0.012,0.967-0.305,1.383c-0.229,0.324-0.518,0.551-0.941,0.541
		c-0.051-0.055-0.047-0.123-0.047-0.188c0-0.854,0-1.709,0-2.563C12.463,8.93,12.461,8.863,12.508,8.807z"/>
	<path fill-rule="evenodd" clip-rule="evenodd" fill="#F5DBCC" d="M3.492,11.746c-0.367-0.006-0.66-0.166-0.87-0.457
		c-0.429-0.592-0.534-1.238-0.223-1.912C2.564,9.02,2.891,8.846,3.277,8.814c0.117-0.008,0.239-0.08,0.359-0.008
		C3.544,8.873,3.535,8.967,3.536,9.07c0.002,0.816,0.001,1.631,0,2.445C3.536,11.594,3.55,11.678,3.492,11.746z"/>
	<path fill-rule="evenodd" clip-rule="evenodd" fill="#F0CABB" d="M3.492,11.746c0-0.934,0.002-1.867-0.004-2.801
		c0-0.119,0.045-0.148,0.148-0.139C4.209,8.822,4.658,9.26,4.722,9.83c0.059,0.523-0.038,1.002-0.346,1.426
		C4.161,11.553,3.877,11.746,3.492,11.746z"/>
	<path fill-rule="evenodd" clip-rule="evenodd" fill="#F5DBCC" d="M12.508,8.807c0.002,0.98,0.002,1.959,0.002,2.939
		c-0.428-0.012-0.721-0.242-0.949-0.582c-0.205-0.305-0.293-0.652-0.299-1.008C11.254,9.705,11.352,9.277,11.766,9
		C11.99,8.852,12.24,8.791,12.508,8.807z"/>
	<path fill-rule="evenodd" clip-rule="evenodd" fill="#45D7F5" d="M5.915,8.1c0-0.47,0.002-0.94,0.001-1.41
		c0-0.138,0.068-0.227,0.191-0.269C6.226,6.381,6.315,6.444,6.394,6.53c0.044,0.049,0.038,0.105,0.038,0.161
		C6.432,7.161,6.433,7.63,6.433,8.1C6.26,8.125,6.088,8.127,5.915,8.1z"/>
	<path fill-rule="evenodd" clip-rule="evenodd" fill="#498388" d="M13.881,15.311c0-0.398-0.002-0.795,0-1.193
		c0-0.164,0.086-0.273,0.217-0.285c0.172-0.014,0.266,0.082,0.266,0.285c0.002,0.398,0.002,0.797,0,1.193
		C14.203,15.311,14.041,15.311,13.881,15.311z"/>
	<path fill-rule="evenodd" clip-rule="evenodd" fill="#4EBC9B" d="M1.637,15.311c0-0.398-0.002-0.797,0-1.197
		c0.001-0.199,0.1-0.299,0.271-0.281c0.118,0.012,0.209,0.135,0.212,0.295c0.003,0.199,0.001,0.4,0.001,0.6
		c0,0.195-0.001,0.389-0.001,0.584C1.959,15.311,1.798,15.311,1.637,15.311z"/>
	<path fill-rule="evenodd" clip-rule="evenodd" fill="#498287" d="M4.861,15.313c0-0.404-0.001-0.807,0-1.209
		c0-0.18,0.085-0.275,0.235-0.271c0.143,0.004,0.221,0.098,0.221,0.271c0,0.402,0,0.805,0,1.209
		C5.165,15.313,5.013,15.313,4.861,15.313z"/>
	<path fill-rule="evenodd" clip-rule="evenodd" fill="#4EBC9B" d="M10.684,15.313c0-0.408-0.002-0.816,0-1.223
		c0-0.166,0.09-0.262,0.234-0.258c0.139,0.004,0.221,0.096,0.221,0.258c0.002,0.406,0,0.814,0,1.223
		C10.986,15.313,10.836,15.313,10.684,15.313z"/>
	<path fill-rule="evenodd" clip-rule="evenodd" fill="#0793FE" d="M10.084,7.329c0,0.214-0.004,0.428,0.002,0.642
		c0.002,0.09-0.021,0.124-0.119,0.125C9.568,8.104,9.568,8.107,9.568,7.709c0-0.338,0-0.675,0-1.013
		C9.57,6.536,9.676,6.416,9.82,6.412c0.148-0.004,0.262,0.117,0.264,0.289C10.086,6.91,10.084,7.119,10.084,7.329z"/>
</g>
</svg>
