<?xml version="1.0" encoding="utf-8"?>
<!-- Generator: Adobe Illustrator 16.0.3, SVG Export Plug-In . SVG Version: 6.00 Build 0)  -->
<!DOCTYPE svg PUBLIC "-//W3C//DTD SVG 1.1//EN" "http://www.w3.org/Graphics/SVG/1.1/DTD/svg11.dtd">
<svg version="1.1" id="Ebene_1" xmlns="http://www.w3.org/2000/svg" xmlns:xlink="http://www.w3.org/1999/xlink" x="0px" y="0px"
	 width="16px" height="16px" viewBox="0 0 16 16" enable-background="new 0 0 16 16" xml:space="preserve">
<g>
	<path fill-rule="evenodd" clip-rule="evenodd" fill="#6B958A" d="M2.267,0.318c3.876,0,7.752,0,11.629,0
		c0.069,0.051,0.072,0.126,0.074,0.201c0.002,0.104,0.002,0.208,0.001,0.313c0.001,4.774,0,9.549,0.001,14.324
		c-0.002,0.124,0.001,0.249-0.004,0.374c-0.005,0.103-0.048,0.16-0.158,0.15c-0.029-0.003-0.059-0.001-0.089-0.001
		c-3.762,0-7.521,0-11.283,0c-0.233,0-0.244-0.009-0.246-0.242c-0.003-0.289-0.001-0.58,0-0.869c0-0.07,0.003-0.14,0.029-0.206
		c0.022-0.094,0.1-0.086,0.168-0.088c0.174-0.007,0.349-0.002,0.524-0.003c0.08,0,0.16-0.003,0.238-0.024
		c0.22-0.061,0.364-0.252,0.348-0.463c-0.017-0.221-0.189-0.392-0.426-0.407c-0.225-0.016-0.45,0-0.674-0.008
		c-0.066-0.002-0.146,0.017-0.176-0.075c-0.025-0.072-0.031-0.146-0.031-0.22c0-0.473,0-0.944,0-1.416
		c0-0.07,0.004-0.139,0.029-0.205c0.022-0.093,0.101-0.084,0.168-0.087c0.174-0.005,0.349-0.001,0.523-0.002
		c0.095-0.001,0.189-0.011,0.279-0.041c0.189-0.064,0.31-0.235,0.307-0.432c-0.003-0.194-0.122-0.351-0.314-0.409
		c-0.11-0.034-0.224-0.049-0.339-0.048c-0.155,0-0.309,0.003-0.463-0.003c-0.062-0.003-0.135,0.009-0.16-0.076
		C2.2,10.289,2.193,10.22,2.193,10.149c-0.001-0.472-0.001-0.942,0-1.414c0-0.064,0.006-0.129,0.029-0.19
		C2.241,8.461,2.312,8.462,2.375,8.46c0.165-0.007,0.33-0.003,0.493-0.003c0.105-0.001,0.209-0.011,0.31-0.041
		C3.373,8.357,3.498,8.194,3.5,7.995c0.001-0.197-0.12-0.363-0.314-0.425C3.07,7.533,2.951,7.526,2.831,7.526
		C2.682,7.527,2.532,7.53,2.383,7.524c-0.062-0.003-0.135,0.008-0.16-0.077C2.2,7.381,2.193,7.313,2.193,7.242
		c-0.001-0.472-0.001-0.943,0-1.415c0-0.065,0.006-0.129,0.029-0.19c0.019-0.085,0.09-0.083,0.153-0.086
		c0.159-0.006,0.319-0.002,0.479-0.003c0.121,0,0.239-0.016,0.353-0.055C3.387,5.433,3.499,5.273,3.5,5.084
		c0-0.186-0.112-0.352-0.285-0.417c-0.1-0.037-0.204-0.048-0.309-0.048c-0.174,0-0.349,0.003-0.522-0.002
		c-0.062-0.002-0.135,0.008-0.16-0.076C2.2,4.473,2.193,4.404,2.193,4.334c-0.001-0.477-0.001-0.954,0-1.43
		c0-0.07,0.005-0.139,0.03-0.205c0.024-0.093,0.102-0.083,0.169-0.085c0.185-0.006,0.37-0.001,0.554-0.003
		c0.065,0,0.13,0,0.194-0.012c0.191-0.038,0.332-0.186,0.357-0.376c0.024-0.183-0.08-0.369-0.253-0.452
		C3.147,1.724,3.043,1.712,2.938,1.712C2.752,1.71,2.568,1.715,2.383,1.709c-0.062-0.002-0.135,0.008-0.16-0.077
		C2.18,1.507,2.193,1.376,2.193,1.249C2.192,1.005,2.19,0.762,2.194,0.52C2.195,0.444,2.198,0.369,2.267,0.318z"/>
	<path fill-rule="evenodd" clip-rule="evenodd" fill="#F8CC74" d="M13.908,0.853c0.311-0.001,0.619,0,0.929-0.003
		c0.095-0.001,0.141,0.03,0.133,0.129c-0.004,0.05,0,0.1,0,0.15c0,3.007,0,6.013-0.002,9.019c0,0.145,0.013,0.228,0.19,0.26
		c0.341,0.061,0.588,0.368,0.595,0.716c0.011,0.469,0.011,0.939,0,1.408c-0.008,0.366-0.275,0.673-0.635,0.73
		c-0.126,0.021-0.151,0.072-0.149,0.185c0.003,0.505-0.003,1.01,0.004,1.514c0.002,0.142-0.047,0.18-0.181,0.176
		c-0.295-0.009-0.59-0.005-0.884-0.006c-0.003-0.064-0.009-0.128-0.009-0.193c-0.001-4.63-0.001-9.26,0-13.89
		C13.899,0.982,13.905,0.917,13.908,0.853z"/>
	<path fill-rule="evenodd" clip-rule="evenodd" fill="#F8B559" d="M8.506,5.326c0.039,0.048,0.1,0.041,0.151,0.051
		c0.731,0.15,1.264,0.77,1.279,1.514c0.011,0.499,0,0.998,0.006,1.498c0.001,0.106-0.039,0.137-0.14,0.137
		c-0.969-0.002-1.938-0.002-2.907,0c-0.107,0-0.135-0.04-0.134-0.142C6.766,7.944,6.78,7.504,6.76,7.066
		C6.72,6.171,7.353,5.456,8.169,5.353C8.24,5.235,8.402,5.222,8.506,5.326z"/>
	<path fill-rule="evenodd" clip-rule="evenodd" fill="#F8B559" d="M8.506,5.326C8.394,5.335,8.281,5.344,8.169,5.353
		C8.119,5.297,8.044,5.298,7.98,5.275C7.5,5.099,7.206,4.565,7.319,4.068c0.118-0.521,0.605-0.887,1.108-0.834
		c0.568,0.06,0.973,0.49,0.979,1.042C9.41,4.809,9.024,5.259,8.506,5.326z"/>
	<path fill-rule="evenodd" clip-rule="evenodd" fill="#C3DDEC" d="M8.368,11.168c0.918,0,1.837,0,2.756,0
		c0.055,0,0.11-0.002,0.164,0.005c0.137,0.021,0.232,0.126,0.235,0.252c0.004,0.126-0.086,0.234-0.222,0.26
		c-0.063,0.013-0.129,0.014-0.194,0.014c-1.838,0.001-3.675,0.001-5.513,0c-0.069,0-0.141-0.002-0.208-0.018
		c-0.137-0.027-0.206-0.124-0.204-0.257c0.002-0.128,0.078-0.216,0.205-0.244c0.057-0.014,0.119-0.012,0.179-0.012
		C6.5,11.168,7.434,11.168,8.368,11.168z"/>
	<path fill-rule="evenodd" clip-rule="evenodd" fill="#C3DDEC" d="M7.823,12.756c-0.753,0-1.507,0-2.261,0
		c-0.25,0-0.378-0.089-0.382-0.261c-0.004-0.177,0.129-0.272,0.387-0.272c1.502-0.001,3.005-0.001,4.507,0
		c0.262,0,0.391,0.091,0.389,0.269c-0.002,0.179-0.129,0.265-0.394,0.265C9.322,12.756,8.573,12.756,7.823,12.756z"/>
	<path fill-rule="evenodd" clip-rule="evenodd" fill="#CBCBCB" d="M2.267,8.531C2.018,8.528,1.768,8.532,1.52,8.524
		c-0.341-0.013-0.562-0.214-0.572-0.51C0.938,7.748,1.11,7.53,1.371,7.478C1.559,7.44,1.749,7.462,1.938,7.457
		c0.109-0.003,0.219-0.003,0.329-0.005C2.52,7.455,2.774,7.451,3.028,7.461c0.427,0.018,0.678,0.394,0.507,0.754
		C3.431,8.435,3.244,8.519,3.013,8.523C2.764,8.527,2.515,8.528,2.267,8.531z"/>
	<path fill-rule="evenodd" clip-rule="evenodd" fill="#CBCBCB" d="M2.266,5.624c-0.244-0.002-0.488,0-0.731-0.01
		c-0.323-0.013-0.518-0.16-0.576-0.422C0.886,4.862,1.125,4.566,1.49,4.551c0.258-0.01,0.518-0.005,0.777-0.007
		c0.258,0.002,0.518-0.002,0.776,0.007C3.432,4.567,3.677,4.902,3.557,5.25C3.489,5.445,3.35,5.562,3.146,5.597
		C2.963,5.629,2.778,5.609,2.594,5.614C2.485,5.617,2.375,5.621,2.266,5.624z"/>
	<path fill-rule="evenodd" clip-rule="evenodd" fill="#CBCBCB" d="M2.267,11.438c-0.254-0.002-0.508,0.003-0.762-0.005
		c-0.336-0.011-0.562-0.234-0.557-0.538c0.004-0.262,0.176-0.465,0.438-0.509c0.292-0.048,0.587-0.003,0.88-0.027
		c0.234,0.003,0.468,0.007,0.702,0.011c0.151,0.002,0.299,0.02,0.421,0.122c0.168,0.142,0.232,0.322,0.18,0.534
		c-0.054,0.22-0.199,0.353-0.422,0.394c-0.172,0.031-0.348,0.01-0.522,0.015C2.506,11.437,2.386,11.437,2.267,11.438z"/>
	<path fill-rule="evenodd" clip-rule="evenodd" fill="#CBCBCB" d="M2.27,2.687C2.006,2.688,1.742,2.695,1.478,2.691
		c-0.311-0.006-0.525-0.217-0.53-0.512C0.942,1.891,1.157,1.657,1.459,1.643c0.269-0.012,0.539-0.005,0.808-0.006
		c0.265,0.001,0.529-0.003,0.794,0.005c0.25,0.008,0.434,0.154,0.502,0.379C3.628,2.232,3.55,2.464,3.372,2.593
		C3.293,2.651,3.206,2.69,3.109,2.69C2.829,2.691,2.549,2.688,2.27,2.687z"/>
	<path fill-rule="evenodd" clip-rule="evenodd" fill="#CBCBCB" d="M2.267,14.347c-0.269-0.001-0.539,0.004-0.808-0.006
		c-0.267-0.012-0.472-0.202-0.508-0.446c-0.034-0.243,0.096-0.478,0.323-0.565c0.054-0.021,0.116-0.034,0.174-0.034
		c0.274-0.003,0.548,0,0.821,0.001c0.265-0.002,0.529-0.011,0.794-0.005c0.302,0.007,0.515,0.223,0.522,0.509
		c0.007,0.29-0.207,0.521-0.509,0.541c-0.145,0.009-0.29,0.003-0.435,0.004C2.517,14.346,2.392,14.347,2.267,14.347z"/>
	<path fill-rule="evenodd" clip-rule="evenodd" fill="#C3DDEC" d="M9.536,10.635c-0.555,0-1.108,0.001-1.664-0.001
		c-0.189-0.001-0.293-0.087-0.305-0.238c-0.011-0.143,0.074-0.253,0.216-0.276c0.054-0.008,0.11-0.008,0.165-0.008
		c1.063,0,2.127,0,3.189,0c0.256,0,0.381,0.084,0.386,0.255c0.006,0.176-0.126,0.269-0.386,0.269
		C10.604,10.635,10.069,10.635,9.536,10.635z"/>
	<path fill-rule="evenodd" clip-rule="evenodd" fill="#C3DDEC" d="M6.625,10.631c-0.264,0.004-0.389-0.084-0.384-0.265
		c0.004-0.173,0.125-0.255,0.383-0.255c0.055,0,0.11-0.001,0.165,0.006c0.141,0.018,0.242,0.132,0.238,0.263
		c-0.004,0.127-0.102,0.233-0.236,0.249C6.736,10.635,6.68,10.631,6.625,10.631z"/>
	<path fill-rule="evenodd" clip-rule="evenodd" fill="#EA9750" d="M8.083,6.942c0-0.159-0.004-0.319,0.001-0.479
		c0.007-0.197,0.111-0.315,0.271-0.313C8.513,6.152,8.616,6.27,8.619,6.469c0.005,0.309,0.005,0.618-0.001,0.927
		C8.615,7.595,8.512,7.715,8.356,7.718c-0.16,0.003-0.266-0.12-0.272-0.327C8.08,7.242,8.083,7.092,8.083,6.942z"/>
</g>
</svg>
