{
  "_meta": {
    "sources": [
      "loopback/common/models",
      "loopback/server/models",
      "../common/models",
      "./models"
    ],
    "mixins": [
      "loopback/common/mixins",
      "loopback/server/mixins",
      "../common/mixins",
      "./mixins"
    ]
  },
  "Project": {
    "dataSource": "postgresql",
    "public": true
  },
  "Category": {
    "dataSource": "postgresql",
    "public": true
  },
  "Subcategory": {
    "dataSource": "postgresql",
    "public": true
  },
  "Container": {
    "dataSource": "images",
    "public": true
  },
  "User": {
    "dataSource": "postgresql",
    "public": false
  },
  "AccessToken": {
    "dataSource": "postgresql",
    "public": false
  },
  "ACL": {
    "dataSource": "postgresql",
    "public": false
  },
  "RoleMapping": {
    "dataSource": "postgresql",
    "public": false
  },
  "Role": {
    "dataSource": "postgresql",
    "public": false
  },
  "Admin": {
    "dataSource": "postgresql",
    "public": true,
    "options": {
      "realmRequired": false
    }
  },
  "Responsible": {
    "dataSource": "postgresql",
    "public": true
  },
  "Type": {
    "dataSource": "postgresql",
    "public": true
  }
}
