<?xml version="1.0" encoding="UTF-8" standalone="no"?>
<svg
   xmlns:dc="http://purl.org/dc/elements/1.1/"
   xmlns:cc="http://creativecommons.org/ns#"
   xmlns:rdf="http://www.w3.org/1999/02/22-rdf-syntax-ns#"
   xmlns:svg="http://www.w3.org/2000/svg"
   xmlns="http://www.w3.org/2000/svg"
   xmlns:sodipodi="http://sodipodi.sourceforge.net/DTD/sodipodi-0.dtd"
   xmlns:inkscape="http://www.inkscape.org/namespaces/inkscape"
   xml:space="preserve"
   width="75.566971mm"
   height="20.42918mm"
   version="1.1"
   style="clip-rule:evenodd;fill-rule:evenodd;image-rendering:optimizeQuality;shape-rendering:geometricPrecision;text-rendering:geometricPrecision"
   viewBox="0 0 7557.0003 2042.8215"
   id="svg31"
   sodipodi:docname="T1 Full Logo.svg"
   inkscape:version="1.0.2 (394de47547, 2021-03-26)"><metadata
   id="metadata35"><rdf:RDF><cc:Work
       rdf:about=""><dc:format>image/svg+xml</dc:format><dc:type
         rdf:resource="http://purl.org/dc/dcmitype/StillImage" /><dc:title></dc:title></cc:Work></rdf:RDF></metadata><sodipodi:namedview
   pagecolor="#ffffff"
   bordercolor="#666666"
   borderopacity="1"
   objecttolerance="10"
   gridtolerance="10"
   guidetolerance="10"
   inkscape:pageopacity="0"
   inkscape:pageshadow="2"
   inkscape:window-width="1926"
   inkscape:window-height="961"
   id="namedview33"
   showgrid="false"
   fit-margin-top="0"
   fit-margin-left="0"
   fit-margin-right="0"
   fit-margin-bottom="0"
   inkscape:zoom="3.9375077"
   inkscape:cx="142.80372"
   inkscape:cy="38.606322"
   inkscape:window-x="1007"
   inkscape:window-y="132"
   inkscape:window-maximized="0"
   inkscape:current-layer="svg31" />
 <defs
   id="defs4">
  <style
   type="text/css"
   id="style2">
   <![CDATA[
    .fil0 {fill:none}
    .fil2 {fill:black}
    .fil1 {fill:#5C73A9}
   ]]>
  </style>
 </defs>
 <g
   id="Layer_x0020_1"
   transform="translate(-455,-2365.296)">
  <metadata
   id="CorelCorpID_0Corel-Layer" />
  
  <g
   id="_344933136">
   <path
   class="fil1"
   d="m 1854,4068 v 36 141 c -115,51 -243,80 -378,80 -518,0 -938,-420 -938,-938 0,-56 5,-111 15,-164 h 129 c -11,53 -16,108 -16,164 0,447 363,810 810,810 61,0 119,-6 176,-19 10,-2 21,-5 31,-7 v -33 -1033 h -75 v -64 c 22,-5 42,-13 58,-24 20,-13 36,-32 47,-55 h 141 v 1000 z m 121,-42 c 190,-148 312,-380 312,-639 0,-448 -363,-811 -811,-811 -278,0 -524,141 -670,355 l -21,31 h 38 701 v 141 h -186 v 708 H 1167 V 3103 H 854 750 717 582 c 121,-380 475,-654 894,-654 518,0 938,420 938,938 0,335 -175,628 -439,794 z m 27,236 c 297,-178 496,-504 496,-875 0,-565 -457,-1022 -1022,-1022 -564,0 -1021,457 -1021,1022 0,564 457,1021 1021,1021 161,0 314,-37 450,-104 36,-17 45,-23 76,-42 z M 806,2931 c -7,10 -14,21 -21,31 z"
   id="path9" />
   <path
   class="fil2"
   d="m 6527,3531 v -586 h 93 l 413,345 c 14,12 27,23 37,33 11,10 21,20 30,31 -2,-33 -4,-56 -5,-70 0,-13 -1,-24 -1,-31 v -308 h 123 v 586 h -93 l -431,-362 c -10,-9 -19,-18 -27,-25 -8,-8 -15,-15 -22,-23 2,18 4,35 5,51 0,17 1,31 1,42 v 317 z"
   id="path11" />
   <path
   class="fil2"
   d="m 4840,3046 h -307 v 164 h 307 c 23,0 39,-4 48,-11 9,-7 13,-19 13,-36 v -71 c 0,-17 -4,-29 -13,-36 -9,-7 -25,-10 -48,-10 z m -441,485 v -586 h 501 c 47,0 81,9 102,27 21,17 31,46 31,86 v 138 c 0,40 -10,68 -31,86 -21,18 -55,28 -102,28 h -77 l 272,221 h -196 l -237,-221 h -129 v 221 z m 1229,-448 c 0,-53 10,-89 30,-109 20,-20 58,-29 115,-29 h 432 c 57,0 96,9 116,29 20,20 30,56 30,109 v 310 c 0,53 -10,90 -30,109 -20,20 -59,29 -116,29 h -432 c -57,0 -95,-9 -115,-29 -20,-19 -30,-56 -30,-109 z m 136,338 h 450 v -372 h -450 z"
   id="path13" />
   <polygon
   class="fil1"
   points="7844,3275 7573,3275 7573,3175 7844,3175 "
   id="polygon15" />
   <polygon
   class="fil1"
   points="4094,3275 3817,3275 3817,3175 4094,3175 "
   id="polygon17" />
   <polygon
   class="fil2"
   points="4257,3421 4257,3531 3651,3531 3651,2945 4251,2945 4251,3045 3787,3045 3787,3110 3787,3175 3787,3275 3787,3343 3787,3421 "
   id="polygon19" />
   <polygon
   class="fil2"
   points="3461,2945 3461,3531 3325,3531 3325,2945 "
   id="polygon21" />
   <polygon
   class="fil2"
   points="2861,3531 2861,3049 2591,3049 2591,2945 3268,2945 3268,3049 2997,3049 2997,3531 "
   id="polygon23" />
   <path
   class="fil1"
   d="m 7817,3673 v 36 h 80 v 159 h 36 v -159 h 79 v -36 z m -128,0 v 80 h -128 v -80 h -36 v 195 h 36 v -80 h 128 v 80 h 35 v -195 z m -265,38 c 0,-21 -17,-38 -38,-38 h -119 c -21,0 -38,17 -38,38 v 119 c 0,21 17,38 38,38 h 119 c 21,0 38,-17 38,-38 v -72 h -80 v 36 h 44 v 36 c 0,1 -1,2 -2,2 h -119 c -2,0 -2,-1 -2,-2 v -119 c 0,-1 0,-2 2,-2 h 119 c 1,0 2,1 2,2 v 15 h 36 z m -326,157 h 36 v -195 h -36 z m -258,-103 c -1,0 -2,0 -2,-1 v -53 c 0,-1 1,-2 2,-2 h 119 c 1,0 2,1 2,2 v 53 c 0,1 -1,1 -2,1 z m 157,-54 c 0,-20 -17,-37 -38,-37 h -156 v 194 h 35 v -67 h 1 63 l 56,67 h 39 v -9 l -48,-58 h 10 c 21,0 38,-17 38,-37 z m -377,-38 h -179 v 195 h 179 v -36 h -143 v -44 h 115 v -35 h -115 v -44 h 143 z m -317,143 -120,-143 h -39 v 195 h 36 v -143 l 120,143 h 39 v -195 h -36 z m -418,16 c -1,0 -2,-1 -2,-2 v -119 c 0,-1 1,-2 2,-2 h 120 c 1,0 1,1 1,2 v 119 c 0,1 0,2 -1,2 z m 0,-159 c -21,0 -37,17 -37,38 v 119 c 0,21 16,38 37,38 h 120 c 20,0 37,-17 37,-38 v -119 c 0,-21 -17,-38 -37,-38 z m -175,157 c 0,1 -1,2 -2,2 h -119 c -1,0 -2,-1 -2,-2 v -119 c 0,-1 1,-2 2,-2 h 119 c 1,0 2,1 2,2 z m -159,-157 v 195 h 157 c 21,0 38,-17 38,-38 v -119 c 0,-21 -17,-38 -38,-38 z m -185,38 c 0,-21 -17,-38 -38,-38 h -119 c -21,0 -38,17 -38,38 v 119 c 0,21 17,38 38,38 h 119 c 21,0 38,-17 38,-38 v -72 h -80 v 36 h 44 v 36 c 0,1 -1,2 -2,2 h -119 c -1,0 -2,-1 -2,-2 v -119 c 0,-1 1,-2 2,-2 h 119 c 1,0 2,1 2,2 v 15 h 36 z m -333,105 -119,-143 h -39 v 195 h 35 v -143 l 120,143 h 39 v -195 h -36 z m -289,52 h 35 v -195 h -35 z m -258,-103 c -1,0 -2,0 -2,-1 v -53 c 0,-1 1,-2 2,-2 h 119 c 1,0 2,1 2,2 v 53 c 0,1 -1,1 -2,1 z m 157,-54 c 0,-20 -17,-37 -38,-37 h -157 v 194 h 36 v -67 h 1 63 l 56,67 h 39 v -9 l -49,-58 h 11 c 21,0 38,-17 38,-37 z m -294,-38 h -179 v 195 h 179 v -36 h -143 v -44 h 115 v -35 h -115 v -44 h 143 z m -279,0 h -179 v 195 h 179 v -36 h -143 v -44 h 115 v -35 h -115 v -44 h 143 z m -317,143 -120,-143 h -39 v 195 h 36 v -143 l 120,143 h 39 v -195 h -36 z m -290,52 h 36 v -195 h -36 z m -102,-157 c 0,-21 -17,-38 -38,-38 h -119 c -21,0 -38,17 -38,38 v 119 c 0,21 17,38 38,38 h 119 c 21,0 38,-17 38,-38 v -72 h -80 v 36 h 44 v 36 c 0,1 -1,2 -2,2 h -119 c -1,0 -2,-1 -2,-2 v -119 c 0,-1 1,-2 2,-2 h 119 c 1,0 2,1 2,2 v 15 h 36 z m -333,105 -119,-143 h -39 v 195 h 35 v -143 l 120,143 h 39 v -195 h -36 z m -258,-143 h -179 v 195 h 179 v -36 h -143 v -44 h 115 v -35 h -115 v -44 h 143 z"
   id="path25" />
   <polygon
   class="fil2"
   points="8012,3421 8012,3531 7406,3531 7406,2945 8006,2945 8006,3045 7542,3045 7542,3110 7542,3175 7542,3275 7542,3343 7542,3421 "
   id="polygon27" />
  </g>
 </g>
</svg>
