ply
format ascii 1.0
element vertex 1776
property double x
property double y
property double z
end_header
0.025808966071131 -0.143508426637121 0.053486462090121
0.022849330654465 -0.139012117148322 0.047762650397744
0.024192592373215 -0.132742019655396 0.042349678730768
0.025403204352382 -0.126488289491679 0.038362898078057
0.025196905524256 -0.124062599090359 0.035077169683211
0.024653936774256 -0.115583886368607 0.027836304354638
0.023205816657069 -0.110235503476208 0.022869270010829
0.020241583258632 -0.100920767706799 0.012377950397363
0.023345098883632 -0.093134519154093 0.007059980771016
0.021218145758632 -0.087095519984814 0.000448760079573
0.023947882086756 -0.081723843803897 -0.002827354706434
0.024938360602381 -0.077848873016106 -0.004811073202588
0.024259649664881 -0.070344081164363 -0.012170350399066
0.022393438727381 -0.066679783293090 -0.017279944563815
0.023584519456548 -0.060035041454671 -0.022333750072548
0.023069708258632 -0.049323507867248 -0.032479699719717
0.022410528571132 -0.044435357425170 -0.036832090927261
0.022456427008632 -0.037738164337088 -0.043299012017099
0.022666062425298 -0.034035028844380 -0.046481322998792
0.022407598883631 -0.024868473548707 -0.054922681127744
0.024938523362798 -0.021024658213314 -0.056851731582512
0.022490606696132 -0.012130516745479 -0.066324874312486
0.017161993414881 -0.145357961630874 0.051585003823893
0.017014451097173 -0.139826697356385 0.045469057740135
0.015143845628423 -0.127662861597757 0.034752716225055
0.016882696539882 -0.125488906927807 0.031732633081096
0.016100958258631 -0.119699616062728 0.026461396792924
0.013409063727381 -0.109046346347010 0.020054064624102
0.016581329352381 -0.106595217674366 0.017172031741404
0.015138881435715 -0.101743802793348 0.013104785338786
0.017348516852381 -0.090527146729492 0.001699289086011
0.015381394456548 -0.083574345420148 -0.003179123853594
0.014836309821132 -0.077227141231802 -0.011273333354892
0.015086472581548 -0.072008279311680 -0.013720658696838
0.014293341071132 -0.066319826399173 -0.017031954707227
0.017074102789882 -0.060407885225723 -0.024160825635925
0.015912074795089 -0.054080777861445 -0.028308016448402
0.015893194586756 -0.051820127424931 -0.033719324676855
0.014932663987798 -0.043161808530837 -0.039822290949752
0.017682623297693 -0.033629380887971 -0.049364188543871
0.013022344977382 -0.031363571652245 -0.053217520909329
0.015957647711756 -0.024316262216436 -0.058435982495612
0.014856654873215 -0.009889792733179 -0.067540624903809
0.016397833258632 -0.005477293818542 -0.075214180999635
0.016234844977381 -0.001107747427262 -0.077807955878650
0.009423142503423 -0.146546923683553 0.051170335179423
0.007461228440923 -0.141888662184273 0.045522160379966
0.008712774664881 -0.132100419856825 0.042643142175053
0.009963446051600 -0.128926981012567 0.037481961496150
0.007463385016444 -0.122784850619261 0.030587853221174
0.007066656500819 -0.117540385155481 0.024998795384174
0.007962774664881 -0.112527608368128 0.021707917725868
0.008843703794345 -0.105188167097629 0.017561217870911
0.009666143805506 -0.099822280719623 0.011930668391755
0.006722540289882 -0.093178403291810 0.007137484902336
0.009429292522024 -0.088898376660537 0.002138267296593
0.008960577399256 -0.084991413519436 -0.002835646112849
0.008337611904464 -0.077408123809641 -0.008764136674421
0.006724737555507 -0.072163568619992 -0.013292439750773
0.010369582700596 -0.066930841680458 -0.018314768124245
0.008187546800298 -0.060891294362162 -0.024769705393920
0.009422491461756 -0.055265120704622 -0.029753739943395
0.009933477789881 -0.050166801918667 -0.037140058698642
0.009358445237798 -0.045020765438845 -0.041136228098619
0.009996710211756 -0.039310935957055 -0.043715828271297
0.007747582142560 -0.033416594977905 -0.048210497431286
0.010823451748215 -0.028391713355465 -0.054415448523028
0.008068048102382 -0.022115424722243 -0.057786682086025
0.008535249553274 -0.017029640657994 -0.062777881320778
0.008503594977381 -0.012446811921647 -0.067604511683136
0.008938787848475 -0.005566755726884 -0.074312781655056
0.002181315401488 -0.147150913466126 0.049680628885489
0.002637457282069 -0.142307231815778 0.046183865299498
0.000546270758631 -0.132959029975521 0.042313108940005
0.001373297125819 -0.130728991912482 0.034249762201109
0.000239792894048 -0.122794009480525 0.030622133682376
0.001412068535074 -0.117437704737080 0.025898536737775
0.001339646409673 -0.113426086193447 0.020657456007158
0.002562058519048 -0.105068159381581 0.017309066211503
0.002192938239100 -0.099849350551858 0.011038653271568
0.001851446539881 -0.092250213155504 0.005688739348877
0.001674298102381 -0.090049731408741 0.002493599949307
0.001373907477381 -0.081660832749576 -0.003841745009438
0.000661798102381 -0.080247683222768 -0.008866369345966
0.000756719977381 -0.072253753750183 -0.014433796264914
0.002286749274256 -0.069055163135523 -0.019251832330804
0.001725836188318 -0.062537525467971 -0.024346889824530
0.001532947655953 -0.057454887481004 -0.029011783973534
-0.000743280022619 -0.050919575763280 -0.037806802579641
0.000921270758632 -0.046443897963276 -0.041743810386693
0.001043219000819 -0.039298805079386 -0.043556045728730
0.002416306565922 -0.034231935313050 -0.048531984093024
0.001687058519049 -0.026691266678129 -0.053353202965748
0.003919561774256 -0.021408052928930 -0.057912638437162
0.000563946539881 -0.017000825595806 -0.063362496473891
0.001537603766444 -0.014046543953497 -0.067821261226673
0.000368373623214 -0.004991601427408 -0.074994627689815
0.000553176450596 -0.001458949484431 -0.077934074214893
-0.006118096917150 -0.146368803668683 0.049345086488812
-0.006926190178869 -0.140736296613797 0.044504623495380
-0.008156365960118 -0.133300291291456 0.043137781037737
-0.005924725335119 -0.128855928218554 0.035901205599304
-0.006776808668452 -0.124499460325952 0.028796389526913
-0.004873651116369 -0.117251911462833 0.028268543402533
-0.005510809319494 -0.112810959306179 0.021291172603809
-0.005215692131994 -0.105773312810523 0.014940829932913
-0.008484490960119 -0.101096520415891 0.012131919739306
-0.005046502678869 -0.095111530987344 0.005859777365424
-0.005891880283035 -0.088578805142157 0.001545900286412
-0.006338657626785 -0.085202055513795 -0.003519645566354
-0.005979526767410 -0.079023198040170 -0.009103395024829
-0.007799350986160 -0.072869169480678 -0.012329127539521
-0.007429510491369 -0.068910448201399 -0.016190161834425
-0.005200636793452 -0.061484423224346 -0.022904688241076
-0.005651862921924 -0.056624049879015 -0.029188173162120
-0.004155145256993 -0.051994253169978 -0.036737111048229
-0.003713657626785 -0.042322450361282 -0.039777921196953
-0.005841326897618 -0.039959483962962 -0.044875627097062
-0.007769158928869 -0.032564478743117 -0.048634410802254
-0.005175687946726 -0.028439524622774 -0.053411732947687
-0.006585809319493 -0.021929687854965 -0.060429574696136
-0.005603082268712 -0.016932386960248 -0.064258389990448
-0.006250311272619 -0.012064809401086 -0.067463971935618
-0.005896980109424 -0.006610858777898 -0.073256099765535
-0.003959295647619 -0.002506634063280 -0.078302454195708
-0.013893833408036 -0.146378064100317 0.051670559855978
-0.013954510491369 -0.140519342400716 0.045192750964728
-0.014149204501786 -0.133911087333443 0.040836515181129
-0.012540350335118 -0.130184555214933 0.035774585238804
-0.014266880283036 -0.122680301515508 0.030079747941611
-0.014522674553869 -0.116611189540608 0.027154073653516
-0.012346516629762 -0.111971989831627 0.022232085012063
-0.012963913393154 -0.104917761868044 0.018720419484209
-0.012867791741369 -0.100288665972523 0.013251018005466
-0.014781121819494 -0.092975173902823 0.005364842427096
-0.013721185296056 -0.090286105008505 0.002591455102166
-0.012780877678869 -0.085217323577507 -0.003801310168436
-0.013588983147619 -0.077610574914231 -0.008220727053405
-0.014322521094047 -0.071747756449023 -0.013424577477253
-0.010501336663244 -0.065302868862194 -0.017618456989904
-0.014267856845536 -0.056661509795317 -0.026424552022379
-0.012275262444494 -0.051658870316156 -0.035684162204908
-0.013494989006993 -0.044864975658658 -0.039858159312349
-0.013318475335119 -0.037755618499691 -0.043228640668545
-0.013538079827306 -0.033531978305850 -0.050141533156478
-0.012997186272618 -0.027196863378162 -0.052276371016643
-0.011465610751786 -0.022922836765910 -0.057631286677442
-0.013736834710118 -0.014766367010580 -0.063487893903926
-0.012699962500297 -0.011052401872030 -0.068579626345959
-0.012596063225744 -0.005373663311592 -0.074202863890870
-0.014649468987462 -0.002415570145961 -0.077158266972188
-0.022446771233556 -0.144630261534425 0.051828608520049
-0.020762811272620 -0.139665819377290 0.046463806492157
-0.017576287835119 -0.133963711372393 0.039990697121676
-0.021651727288244 -0.127985457273245 0.035741996038416
-0.021802362053868 -0.118759529182460 0.026854311214495
-0.022682977288244 -0.111076934565869 0.021703625757221
-0.022333856194494 -0.105773185700608 0.016784621006697
-0.022154901116369 -0.100573250800440 0.011971425805321
-0.020317661533035 -0.096532995095388 0.007494643954785
-0.020453240960119 -0.087753607587525 -0.000329552364914
-0.019822747796056 -0.082451322152291 -0.005426046114704
-0.021232049553869 -0.079623029924269 -0.007371091769378
-0.023179803460118 -0.069162622328816 -0.015772904482963
-0.022987583408036 -0.060048346311183 -0.023489086596799
-0.021728631585118 -0.054693161823353 -0.028545003621094
-0.022389438876785 -0.049404008517599 -0.033925420055771
-0.021987978683334 -0.042272058721468 -0.039178032586696
-0.017601678460119 -0.039522754685423 -0.045016110261139
-0.020995477288244 -0.035077596133575 -0.047501475707027
-0.019871942131995 -0.022109935739837 -0.059745880994533
-0.020583612053868 -0.011498275272915 -0.068951947155102
-0.021210402418452 -0.006910355470806 -0.072774270496591
-0.022129754631993 -0.001195035824355 -0.076563373249396
-0.026166619866369 -0.144931097834847 0.054109100197271
-0.027380242913243 -0.140076022483181 0.049115398319076
-0.024932244866368 -0.130803155673022 0.040641058038865
-0.025547479241369 -0.128281877182071 0.038192310437812
-0.026438348381995 -0.123903225243028 0.034680243656154
-0.027218703199702 -0.116248638122121 0.028115380838486
-0.026015496819493 -0.111649557453624 0.024082157082257
-0.025428338616370 -0.101333769476893 0.014429519042701
-0.027918328850744 -0.092898494499401 0.008382038091421
-0.026128045647618 -0.081389154974390 -0.003097802996330
-0.027241815178870 -0.075105331601115 -0.008056479393965
-0.027794061272618 -0.068591314326995 -0.013573142803302
-0.025685662835118 -0.058911768846418 -0.023607672150902
-0.027455194085119 -0.051719229678773 -0.028970594503309
-0.026169549553870 -0.050092313128462 -0.031245071863842
-0.027311883538244 -0.036730897708234 -0.042557596855180
-0.026111281324702 -0.015782629885162 -0.062174957377787
-0.027098748772619 -0.008452196215204 -0.068160186673743
0.037109014899256 -0.140530986109770 0.060017534174796
0.036847052008631 -0.135435979977948 0.055736164324111
0.036017950446132 -0.129839186484008 0.045501480437278
0.036588751227381 -0.120376209006824 0.040876322821655
0.037554571539881 -0.116577482997112 0.038210281245806
0.036070294196131 -0.110868129507392 0.030969667201251
0.035887091071131 -0.096401599164569 0.015048011155143
0.036483770758631 -0.088671326355013 0.009490551022606
0.036148321539881 -0.082824284187560 0.003258677083451
0.036166754157069 -0.079740749071843 0.003474324622476
0.036180385341964 -0.072447345371673 -0.004506112223455
0.035914923102381 -0.062313018631595 -0.015600815675761
0.035612188727381 -0.057326065319065 -0.020515186928953
0.035917201748215 -0.049528925656262 -0.024596217544633
0.035912725836755 -0.039220897644347 -0.034987928500969
0.036391973883630 -0.027440248378271 -0.042745864229913
0.036576055914881 -0.021985855442407 -0.048495095698380
0.036265997321131 -0.019294347328912 -0.053636467692924
0.036081427008631 -0.010959609368630 -0.059234995176300
0.036502488206549 -0.007129303400367 -0.061988131761601
0.030409674078944 -0.141900490572244 0.057022865988813
0.032975144456547 -0.137168711302653 0.051289355568909
0.029865704352381 -0.129297078607211 0.044605645972845
0.030226772060715 -0.122430014127876 0.042992906506827
0.029994024664881 -0.118720039844529 0.034564512189262
0.031487677008630 -0.112266285586139 0.031258172346824
0.028443731696131 -0.107928329013471 0.027379100110836
0.029198980719569 -0.100145398807996 0.022695589492217
0.030095953375819 -0.095811719626667 0.016855009471887
0.030145880133632 -0.091797151479619 0.010600183303278
0.032023931891444 -0.085743706872676 0.004197288401003
0.030238653571131 -0.078858738411396 0.001449011273952
0.029000209560715 -0.072320791709627 -0.005423661215491
0.029650518805506 -0.067720456543565 -0.006512389657788
0.028434942633632 -0.064064261354514 -0.012105303933427
0.030358212722917 -0.057297313004161 -0.019393201650278
0.031110933147024 -0.050283795762516 -0.022989486158811
0.032183803310715 -0.045589901289982 -0.031464845463721
0.030978887946131 -0.038740642309710 -0.035589516342713
0.029544708258631 -0.034058445550973 -0.038194595967519
0.031030645758631 -0.030212160455095 -0.045388495478729
0.031507208258631 -0.023639115716659 -0.049925500217141
0.031118536383631 -0.018721530705136 -0.053497476265308
0.032800665289881 -0.011426896647296 -0.062772659664510
0.030208705654465 -0.007490950528228 -0.063695989119131
0.024788946539881 -0.140474748154347 0.057337869092105
0.022619512946131 -0.137208584673295 0.053099059377491
0.025490769456548 -0.129234950951671 0.045543650757490
0.020367071539881 -0.119624021374508 0.042793893813477
0.024617852789881 -0.117772688962678 0.037272251737477
0.023203057868006 -0.112570287302218 0.032040744896425
0.026040411383631 -0.107194245003386 0.027453555878725
0.023993048102381 -0.102394699914951 0.021187176898816
0.024866257737798 -0.095793754994254 0.017335782477840
0.024040481138096 -0.091136753622319 0.011703808434262
0.024819342047694 -0.083700070091560 0.004895514461397
0.023890671800298 -0.078899140179914 0.000520200495496
0.023170098883631 -0.073415109715496 -0.003911604784509
0.025595587164881 -0.066521641155077 -0.008514353526444
0.021961553961756 -0.065472140531858 -0.011904072550039
0.023354376227381 -0.057363205301500 -0.018767806410115
0.024590622972173 -0.052520459722051 -0.023830125846778
0.024016729743006 -0.038427393431465 -0.036039693993033
0.025558477789880 -0.033094725166240 -0.038635609241983
0.023869024664881 -0.029460401968569 -0.045209119277412
0.022213751227381 -0.022481590885731 -0.050412440382018
0.025235784918787 -0.018381806715042 -0.053697599765133
0.024035137946132 -0.011168268243674 -0.059396790204712
0.023637774664881 -0.006042767894213 -0.064208443098734
0.025833705654464 -0.001034405597283 -0.069624317557171
0.019409063727381 -0.140816500214922 0.054500784019237
0.017516160081548 -0.137519009205237 0.050627879713311
0.015835821539881 -0.131405933847543 0.044350684046635
0.015054083258631 -0.126370443886397 0.040861006385891
0.017074753831548 -0.118635397490947 0.035993086551397
0.016877471930506 -0.113091675807128 0.029644596379416
0.017373907477381 -0.109922004627227 0.025693584697701
0.016080206305506 -0.103298981501137 0.019158519154968
0.017558152269048 -0.096975292438719 0.014145361990470
0.018352423102381 -0.093960380683625 0.011763839354985
0.017208868414882 -0.086384865913122 0.004510837462526
0.019233770758631 -0.078635069303153 -0.001572232951334
0.017849981696131 -0.077324810171394 -0.003441669305480
0.017542783035417 -0.069810399447251 -0.010312189620481
0.014757452399256 -0.064450253035650 -0.016393506004137
0.017185430914881 -0.058528214668242 -0.020626195558228
0.016659796149257 -0.054580979831124 -0.024398846971475
0.016285626227381 -0.037432019211271 -0.040002741983813
0.017917608649256 -0.030124589186020 -0.045851544816742
0.015382891852381 -0.024566281950858 -0.051975086129472
0.017639369716964 -0.019894286249927 -0.055167734588631
0.015915899664880 -0.013496707916607 -0.061777804727305
0.016543585211757 -0.008880023560615 -0.065628992201757
0.017520391852381 -0.002265202390689 -0.071073228307085
0.008795489508631 -0.121994960188119 0.042335571521171
0.007909552008631 -0.117448677865050 0.035664083170174
0.009827227789882 -0.115139250085144 0.029958649985528
0.002545945237797 -0.123539322134970 0.043085102563044
0.001604376227382 -0.118587726147121 0.036962495891439
-0.000840447991368 -0.116756361837259 0.031976791427369
-0.003074334710118 -0.125261557734947 0.047214488140936
-0.006129673251785 -0.121347095842630 0.043390357704236
-0.006921600335119 -0.119363144190567 0.035721287041055
-0.009554803460119 -0.116097663227643 0.032067651903945
-0.017268670647618 -0.134894514035324 0.047160503112331
-0.017000115960119 -0.130768454166571 0.043337985696269
-0.014361444085118 -0.121812317652367 0.041665373763242
-0.012799554436681 -0.118776221059204 0.036285892606841
-0.015016066480953 -0.114693789412143 0.029725216052370
-0.016911248772618 -0.107900384742180 0.022731139451388
-0.016796014397620 -0.084264328307364 0.001398104555815
-0.016511102288244 -0.074120518723909 -0.007825268693410
-0.016484979241369 -0.058756896968107 -0.021675208236809
-0.016332147210119 -0.023935183927195 -0.053071055305560
-0.016420526116369 -0.017931515107397 -0.058453252487563
-0.016657342522618 -0.017216492996116 -0.058998914858153
-0.020579705803870 -0.139535234484483 0.052832659191655
-0.017435662835118 -0.135568474819300 0.047841524866878
-0.022538446038244 -0.122564910317723 0.041519489802548
-0.019948032626785 -0.118564243998673 0.034811389163069
-0.020585890699702 -0.114302311921772 0.031131827228679
-0.021242954501785 -0.107755456866575 0.024648302703174
-0.021740106194494 -0.102740748956016 0.020388062720407
-0.021692987053869 -0.098478364036228 0.016485991688265
-0.021540155022618 -0.093435286579236 0.011825991875987
-0.021445916741368 -0.086156616433864 0.005337776323881
-0.020483319085119 -0.079645470161309 -0.001065504917029
-0.020891717522619 -0.074321105568175 -0.005673153337954
-0.020408685296056 -0.068783835439152 -0.010884113595691
-0.020258660881994 -0.063361912992250 -0.015865980105033
-0.020728143303869 -0.058113699255351 -0.021024533303106
-0.022183546949701 -0.053294855635816 -0.025097487742700
-0.021080763746577 -0.035077045833675 -0.040808375250964
-0.021848016350744 -0.029784990193641 -0.045264950885836
-0.020552036533035 -0.026551389130541 -0.048822422843182
-0.020599139397619 -0.020414427035806 -0.054317240572272
-0.020008294671056 -0.014217556331035 -0.060206417282167
-0.023773065178869 -0.007341605032276 -0.064396794055571
-0.021066766350743 -0.001637232359151 -0.071026589901363
-0.029334588616369 -0.142069600134665 0.056909336784978
-0.030128208408035 -0.133634014547993 0.051360870457510
-0.030012648512202 -0.123923944989849 0.039922805143881
-0.028810771342063 -0.118659944141831 0.038166512804281
-0.029574822991368 -0.111475443423682 0.032514707953900
-0.028055194085119 -0.105887436096197 0.027203862967392
-0.027983165625297 -0.103376586896187 0.022863198249303
-0.028939975986161 -0.093796381208834 0.015767670030297
-0.029233351637202 -0.088784044618560 0.012664207639656
-0.029164748121577 -0.085323776666231 0.008378697496840
-0.028957391350744 -0.077913543141511 0.002811322458995
-0.030079054762202 -0.075972922332241 -0.005302331506615
-0.028229526767410 -0.067830170532776 -0.008075689262665
-0.029856072991369 -0.062535990284582 -0.013972692985473
-0.028812615960119 -0.056733324864441 -0.019651626569967
-0.029578680413244 -0.051809215316290 -0.023665388535667
-0.030126092522619 -0.049207795238236 -0.029377558948519
-0.030500441480952 -0.038796742594574 -0.035624335717434
-0.027666009514807 -0.035254197154897 -0.036610718510838
-0.030260980217932 -0.027100883745712 -0.042047517813204
-0.027700311272619 -0.020480980318149 -0.049979457786445
-0.029323276767410 -0.018309911920055 -0.054209346545596
-0.027278533928868 -0.011831641785692 -0.058046819901745
-0.029996209710119 -0.006957736273536 -0.061499008067550
-0.028663104241369 -0.000264526415446 -0.068832887788103
-0.035517287184077 -0.139413636200897 0.057474731854499
-0.037103143303869 -0.135234243795389 0.053418218441117
-0.036167433668452 -0.128361699530378 0.046995599617213
-0.036996209710118 -0.122349939720189 0.041770765782226
-0.036721551506994 -0.118873507459839 0.037910941697699
-0.036945428460119 -0.110696876129107 0.033229217155027
-0.037226678460118 -0.106343083264611 0.028238362033626
-0.032582635491369 -0.104054067191310 0.021892279677273
-0.035039178460118 -0.095792132966036 0.016652129020738
-0.037447707105952 -0.083823465057611 0.008198393542083
-0.036173944085119 -0.076229993305000 0.000021070906726
-0.035435662835119 -0.073175512686723 -0.003441255332523
-0.037921339918453 -0.066525020384674 -0.006944698083639
-0.036775018303868 -0.061286915315560 -0.012841952987486
-0.035714959710119 -0.054390202086952 -0.017288877550801
-0.035585076897619 -0.051340511975144 -0.022575436417051
-0.035759881585119 -0.045657324109529 -0.027826156187446
-0.035218703199702 -0.037759296745096 -0.033953787468638
-0.036612176506993 -0.034031866809919 -0.037395290511418
-0.037056024163244 -0.027808263346046 -0.042912682461757
-0.037057000725744 -0.021364185673862 -0.049192963053478
-0.036118280022620 -0.018349162629994 -0.052159114959052
-0.034745395908036 -0.011944343908046 -0.059354896640459
-0.034287713616368 -0.004877254121743 -0.065968637255560
-0.038637322991369 -0.000641031012260 -0.066892932562399
-0.041097772210118 -0.138306532788199 0.059457857317059
-0.040014276116369 -0.132235819404735 0.054039932209956
-0.041110467522619 -0.119780077633782 0.042794980024719
-0.040117791741369 -0.026709319847205 -0.042055949910469
-0.043652459710119 -0.016904023725203 -0.051997278172513
-0.042326898186682 -0.009113438136567 -0.057831515405680
-0.044755975335119 -0.006183759101816 -0.062836256079255
-0.043586785881993 -0.000868285274696 -0.067730563342356
0.044729701748215 -0.127823116896268 0.058068956852657
0.043824102789881 -0.124229509340636 0.054265384473612
0.045268764248215 -0.116729163655794 0.049586313617445
0.044792120368006 -0.110405585007115 0.042026658864760
0.044887579352381 -0.104500123560552 0.038749011761993
0.043700567633631 -0.094269562774362 0.027754619521750
0.043117071539881 -0.092640948868523 0.025449919370883
0.043911016852381 -0.082301770667986 0.017276505900876
0.045007208258631 -0.077726891828667 0.014837243864827
0.043513800055506 -0.073381288642951 0.008673868486740
0.044497442633632 -0.061566479992292 -0.000527470904251
0.044074591071130 -0.056091217099370 -0.006024025463136
0.044272833258632 -0.043430728076519 -0.015583227619628
0.045027227789881 -0.041244586356307 -0.017967077110602
0.044038946539880 -0.028573719466306 -0.030931690218556
0.044544805914881 -0.017417460616304 -0.042041712729415
0.044329962164881 -0.016527714940820 -0.047072807323077
0.047078009039881 -0.007679979965440 -0.051797602679379
0.046144903571131 -0.001997085150452 -0.057875377553764
0.040055757365774 -0.135481030678400 0.062432436948236
0.038554001878423 -0.130632067045449 0.057607202910249
0.040052862555507 -0.126648625247957 0.051523468223028
0.039359910081548 -0.117565154498822 0.045733357656043
0.038263121887104 -0.106511778557705 0.037038785008942
0.036086309821130 -0.103391022248397 0.034533397346233
0.038758835862798 -0.094678781770587 0.027203082374480
0.038533168545089 -0.090834157715884 0.022098559320972
0.038658331305506 -0.084548927228089 0.016631185561486
0.038790313727381 -0.079773301224433 0.011592628387087
0.037817022711756 -0.072666895949208 0.009083811529596
0.038466762295090 -0.067236368049363 0.003594735509648
0.037187579352381 -0.062489288509552 -0.002600384461899
0.039425469977381 -0.057591714954972 -0.009260792124717
0.038491949469569 -0.049874816388452 -0.012411769255463
0.038950689703943 -0.046296179615520 -0.018447109050292
0.039529180914881 -0.042246361195904 -0.024607569975943
0.038737188727381 -0.035398133405992 -0.029458246153197
0.039442836513839 -0.030030131463722 -0.032937534865469
0.038386765550298 -0.022748941443912 -0.038470295985441
0.037860154222173 -0.019724784696543 -0.041621140427989
0.039090094000819 -0.010356888636389 -0.047957230576185
0.036300339769048 -0.009039723222118 -0.052884023644789
0.038200567633631 -0.001316144302147 -0.058818888607949
0.033931524664882 -0.136651967494463 0.062060919635763
0.033546270758632 -0.131563935997049 0.057078200172407
0.030334600836756 -0.118653245166132 0.046133467416097
0.031379115810715 -0.112619786759277 0.042819800848279
0.031230902106288 -0.109296516441391 0.037044340880601
0.033003302008631 -0.102876167840702 0.030681852126752
0.031419805914881 -0.097648011187660 0.024442496534587
0.035061895758631 -0.092070028110822 0.023142470126693
0.032862774664881 -0.085781122709814 0.015179468716447
0.032779913336756 -0.080792683380842 0.010587194369746
0.034780645758631 -0.075275326992147 0.007697750728855
0.032435821539881 -0.070805481508782 0.001239487603859
0.033032110602382 -0.065399500361355 -0.003029482964466
0.032041021735194 -0.059697598119551 -0.009115336947868
0.032100307216965 -0.053997730413545 -0.014174295192776
0.032731695563319 -0.048884672073898 -0.018198881123070
0.033370210490774 -0.025811041544785 -0.038305580053878
0.031725469977382 -0.020724583626103 -0.044523782579829
0.034328985602381 -0.015102749890886 -0.046935808288475
0.033612188727381 -0.008830967135746 -0.053336901699780
0.031378139248214 -0.003027288311481 -0.060822197767169
0.024250697841964 -0.115492412637734 0.048025884283565
0.023553106696131 -0.114433995323849 0.042016956385282
0.027052618414882 -0.110671998666037 0.036231934703900
0.017065802008631 -0.119383426107679 0.049098115842391
0.017847540289881 -0.116893835455323 0.041644748912976
0.011001470953944 -0.122324958431770 0.053696917688972
0.008750697841965 -0.120412754765564 0.047279691799422
0.000690802008631 -0.122736281289428 0.051751296463697
-0.000538201897619 -0.121259197533948 0.047154602935528
-0.004799554436681 -0.123950779566627 0.050287142676964
-0.006038983147619 -0.121108457839221 0.047832458879040
-0.013950392652827 -0.122985736626541 0.052108298082729
-0.012788568108556 -0.119812301598819 0.045946265089941
-0.019608514397619 -0.121952992935732 0.050640185429716
-0.022768996168452 -0.118910112886699 0.048900504454271
-0.023571893303868 -0.116104484824985 0.044039969072452
-0.027641066480952 -0.118034962922829 0.046531898086450
-0.027442708036012 -0.114598903193098 0.041926899687033
-0.029757277418453 -0.110146996573461 0.035200857168391
-0.032362420647618 -0.031732386410262 -0.036057545310914
-0.036202752678868 -0.138655042180972 0.061276756729691
-0.034744500725744 -0.130790675276383 0.055422361276887
-0.038309197991368 -0.116198032522346 0.046182653486345
-0.035091215290476 -0.112028862093456 0.043328024524861
-0.036119419345535 -0.108120703567756 0.036158089434852
-0.036093459059077 -0.102091925386652 0.031040817988246
-0.036344761142411 -0.096593308164883 0.026343466168164
-0.036040317783035 -0.092161565787536 0.021997543903638
-0.035232375074702 -0.087034626841169 0.016511228364863
-0.034709425855952 -0.082292707331623 0.011913242617518
-0.036911346428868 -0.075634732254006 0.008051812766070
-0.038594679762202 -0.068805480342174 0.003885559753059
-0.034530096428869 -0.063808865288706 -0.005105051173182
-0.036385565178869 -0.058081633330887 -0.008133685688970
-0.036445428460118 -0.052245942257969 -0.013527769247274
-0.037671319573400 -0.046501155235195 -0.018287091197373
-0.036105747470535 -0.034515022257093 -0.031261838751546
-0.036325408928868 -0.030222358178032 -0.033321074480772
-0.036163364658035 -0.025828682116139 -0.037618520220991
-0.037241408277827 -0.017871976468644 -0.043511808115812
-0.035225701897619 -0.013767637837315 -0.049462124612062
-0.035458245842931 -0.008113899278976 -0.054191823752268
-0.036801629631994 -0.002755422770574 -0.057596800203147
-0.043225091546056 -0.135894850615128 0.062313442434364
-0.044454357031548 -0.129104927484057 0.056731226266179
-0.043710858147619 -0.123042803523441 0.052006778585901
-0.044550897210119 -0.117265341062186 0.045820660168671
-0.042898797600744 -0.115615392585154 0.041239926506982
-0.041900701897619 -0.107509803686538 0.038115891819948
-0.043413006585119 -0.102319999479791 0.035211935277235
-0.041368117262202 -0.095802065128910 0.026042508700306
-0.044980828850744 -0.088899498646888 0.021805009159938
-0.043406121819494 -0.084600563845373 0.017963142239950
-0.041916294345536 -0.079294996326565 0.011851506468145
-0.042332798251785 -0.073033815230082 0.009661799831880
-0.042039910881995 -0.063589381521035 -0.004896900328045
-0.043206903069493 -0.057064709504549 -0.009384493967427
-0.043010369866369 -0.051050398141594 -0.012894072969258
-0.042535434970535 -0.044923051351308 -0.021104513753067
-0.042603631585119 -0.042530396737938 -0.023230548170191
-0.043569234883730 -0.032926855354902 -0.028450521192433
-0.041040573549404 -0.030074351106502 -0.032751761215481
-0.044847609449702 -0.022722358316203 -0.036130098605368
-0.043712518303869 -0.018389001580805 -0.043953383017227
-0.042273797600744 -0.012673765123751 -0.048823373677821
-0.045327630608556 -0.006933277240518 -0.053192749957579
-0.041966180413244 -0.002300082806589 -0.061951973783311
-0.048282342522618 -0.115343667895807 0.048543782413099
-0.047667596428869 -0.112104731785482 0.044670062092390
0.050261114508632 -0.129963508669409 0.069919743389727
0.050518438727381 -0.123312578521186 0.065181241077016
0.050351690680506 -0.116725568378614 0.059085608308848
0.050738165289881 -0.103255759095657 0.046127897555997
0.050436895758632 -0.076096701094223 0.023342979850458
0.050650762946131 -0.073543001771167 0.021499424636015
0.050467169196131 -0.055048873651914 0.004444538793459
0.050363653571131 -0.051369752164395 0.000918856960079
0.050473028571131 -0.017534389656365 -0.029332917704334
0.046790132365774 -0.130970860246692 0.069473042733676
0.044798223883631 -0.125577170194652 0.063959229707061
0.046752162685715 -0.120418514645382 0.057171161427341
0.047350836188319 -0.112351137277104 0.051929898277515
0.046530157477381 -0.110042045593815 0.050837205742232
0.046206243903163 -0.103108475504621 0.043280901356194
0.045762481696131 -0.095109038270544 0.037807128006229
0.046263230394048 -0.088154088898397 0.033198253009842
0.043071824144048 -0.086330384037649 0.029164290307389
0.046216262388096 -0.079391430357452 0.022672869643882
0.043726934821131 -0.074069498103210 0.019285945293246
0.045649395758631 -0.069415792521084 0.012382716243563
0.043792038987798 -0.062344732489059 0.008828232289249
0.045532720953943 -0.056716169529019 0.001810918919792
0.046503139248214 -0.052982506780207 -0.001512257217476
0.045892340094568 -0.046034331319639 -0.009111083547951
0.046849818935715 -0.040854264257117 -0.014295304736096
0.046160284430507 -0.029800898291414 -0.024338055173869
0.044468634039882 -0.024909155938243 -0.027062697685941
0.046159674078944 -0.019817424639749 -0.030821877022597
0.045939581305507 -0.013132376426726 -0.037244820528537
0.045283575446132 -0.008278982943230 -0.042305335824699
0.045522751878423 -0.001348334726896 -0.046329033788817
0.042552618414881 -0.131029261183177 0.067003008725299
0.041716192633632 -0.124162264490423 0.060993577261364
0.040254034430506 -0.122475159721555 0.057225064175857
0.037867559821131 -0.110706969840270 0.051997111822469
0.039808575446131 -0.109498257163477 0.046682608049837
0.039454840094569 -0.102943096801137 0.042486924108852
0.040558966071131 -0.099990488534852 0.037441700040938
0.040361212164881 -0.092474839644687 0.030368857361282
0.041182501227381 -0.088747415566118 0.028272352384794
0.040883184821131 -0.080414488660109 0.020351366595079
0.041710658779465 -0.069965171869528 0.012183257825054
0.039509161383631 -0.065521651603665 0.004873503591668
0.041003790289881 -0.052295254910151 -0.004773784253610
0.040420375576339 -0.047450035321598 -0.010034079014539
0.041314581305506 -0.043238930779948 -0.012495828847841
0.042322393805505 -0.029070026689008 -0.024815399022249
0.040832281500818 -0.027004421784095 -0.027805432635991
0.041877325446131 -0.021970588878017 -0.030764798775649
0.041063360602382 -0.015849724856707 -0.037561665066613
0.041954962164880 -0.009339806035116 -0.042006536073772
0.041538946539881 -0.004731956730760 -0.046849745552745
0.030302374274257 -0.116188377803073 0.059221032762083
0.031511260993006 -0.112711795445079 0.052174533053351
0.032999395758631 -0.111481332675572 0.048415829076197
0.024504644782069 -0.119546331617507 0.057859786891439
0.025685593675298 -0.115292837415802 0.054273846305716
0.015882696539881 -0.119241140647396 0.058211445177214
0.006231085211756 -0.122828180311414 0.060781901267325
0.011223191331548 -0.120530506574057 0.056909471891943
0.001410040289882 -0.123674018456246 0.063554978154286
-0.001059686272618 -0.121974492536811 0.056544592611457
-0.004826125074703 -0.124353236221393 0.061251181246689
-0.007461834710119 -0.121533925362067 0.058336013101411
-0.013804193108557 -0.120370916143607 0.059044141195710
-0.020452508538245 -0.121456934945525 0.062258121139400
-0.018286737053869 -0.120845373011214 0.059171584245024
-0.030020623772619 -0.117742144557803 0.058006085752845
-0.029920119215327 -0.114696021416251 0.053271567073395
-0.036843703199702 -0.113424047480127 0.053120558452943
-0.037241082756993 -0.108299161666300 0.048049730172053
-0.039446405022619 -0.105924531765644 0.044600753513988
-0.046867059319493 -0.130505806368077 0.068441790925387
-0.046077264397618 -0.124162659167093 0.064727505990982
-0.043231398512202 -0.118882750726478 0.055320729104857
-0.044226841220535 -0.112562532370097 0.052779308978950
-0.045430128980953 -0.105495113998493 0.047540005239814
-0.043240757236160 -0.102002724711846 0.043885077659563
-0.043688592522619 -0.097705844286199 0.036928220766052
-0.044557175111905 -0.091064279573080 0.032475960671401
-0.044281365960119 -0.085695012498605 0.027024744591427
-0.043942417392411 -0.081382766297030 0.022741674645882
-0.044187453199702 -0.076046857512888 0.018273478938436
-0.044375970452306 -0.070768972450729 0.013985420814096
-0.045812908928869 -0.062837499315286 0.009096840346925
-0.044124464918452 -0.058049983027199 0.002085651874844
-0.045231479892410 -0.051873856363907 -0.001655291377206
-0.043989312737463 -0.047603879004487 -0.008220756980765
-0.043515252678868 -0.043059532927044 -0.012344262705959
-0.046923455803868 -0.025864527904546 -0.022149244931340
-0.044728729241369 -0.024570837335113 -0.027139142993955
-0.044516131585119 -0.018424095286170 -0.032946221159424
-0.044273309319494 -0.014118881988431 -0.037276871941829
-0.044861322014807 -0.007918808480220 -0.041936882159526
-0.044463250725744 -0.001769928696793 -0.048136063237216
-0.050051263421056 -0.131538494289152 0.070114896586831
-0.049949171949702 -0.127450874876592 0.063292476651504
-0.051050408928869 -0.120266150946341 0.059406229587534
-0.052036981194493 -0.112506134268639 0.053597575527271
-0.049654656975743 -0.108717404059931 0.044913337295157
-0.051271722405431 -0.101512646309815 0.044039022866855
-0.050272088616370 -0.095851651813050 0.037013701633664
-0.051407505283036 -0.090566079135483 0.034407927099397
-0.049628045647619 -0.081961984560228 0.022900963338794
-0.050399530022619 -0.074007848784843 0.017086793739793
-0.051076776116369 -0.068722494085771 0.013998124919582
-0.049890008538243 -0.064061614557174 0.007327107799599
-0.050950408928869 -0.051086467144812 -0.002343342613244
-0.048750970452306 -0.045684477232449 -0.007746615411822
-0.050291619866369 -0.041704333964168 -0.009480170813498
-0.049984295647619 -0.037500827313238 -0.016079531504875
-0.049569818108556 -0.029386025601186 -0.023550375626758
-0.049375408928869 -0.025645783892991 -0.028208938864670
-0.050491652418452 -0.013209251845093 -0.037342483032369
-0.050339471428869 -0.007234180960186 -0.043105371551192
0.053164556891444 -0.124523132763788 0.074440416585539
0.053227423102381 -0.122141400791644 0.070425253015534
0.052695684821132 -0.117697189919771 0.065272748736888
0.053685919196131 -0.106602987541248 0.055946090513822
0.052830816657070 -0.098938899441348 0.048066112740875
0.052967169196130 -0.090622580803654 0.042404986915620
0.053078009039881 -0.084811330757992 0.037571649532341
0.053260951748214 -0.081227754672463 0.034982387388617
0.052337774664881 -0.069773094374309 0.022211381102326
0.050970587164880 -0.063782144375626 0.013386810762216
0.053295456956548 -0.056082339547342 0.012333428282183
0.051873419196132 -0.053831769163298 0.006580967755700
0.053081182868006 -0.046714877328050 0.003251813745593
0.054405889899257 -0.037576589391219 -0.001291734860995
0.052877227789881 -0.034762756646659 -0.007576021465374
0.051067755133631 -0.030148901399642 -0.016668024267013
0.051960007737798 -0.024534444528435 -0.017908812817221
0.052025274664882 -0.019745069265571 -0.023753125514440
0.053401495368007 -0.014082101637976 -0.025306116058561
0.051931199144048 -0.010135850942203 -0.032484027026736
0.052820440680507 -0.003104455154098 -0.036605507758379
0.047540899664882 -0.125728662746455 0.072720988375982
0.048814662685714 -0.117616067455718 0.069455871200636
0.046928432216965 -0.115969436667204 0.063383908709033
0.045963208692659 -0.100968561959236 0.053157111526577
0.046202799776489 -0.098624768102682 0.048664661091538
0.045439825446132 -0.094561189579821 0.040970415388267
0.047648240159672 -0.085501637505487 0.037732344918454
0.046730059821131 -0.081345490475661 0.031955155898601
0.048018113206548 -0.075734145510586 0.029784233604099
0.048211798102382 -0.068277248685391 0.023628228210608
0.047315411383631 -0.064021643022541 0.017595493518726
0.047811000576339 -0.057237541394461 0.012645260374190
0.047350632737798 -0.052741501635909 0.007521591069694
0.046336553961756 -0.047594021196286 0.000554734301192
0.048274969489100 -0.041065466698622 -0.002053154469895
0.045642950446130 -0.038718772899074 -0.008933675242310
0.048654506435714 -0.023648650414480 -0.018793134476031
0.047371832282069 -0.018841965442464 -0.022972328331618
0.047718145758630 -0.013245873592793 -0.027281695740226
0.047610174567225 -0.008827031499653 -0.031414088628725
0.045996466071131 -0.005409271025265 -0.038208230931957
0.035398809821131 -0.111890831410478 0.065553728495191
0.039162969977381 -0.108212462006291 0.058988150513976
0.037628790289882 -0.106874070337435 0.052164964625291
0.033171026618006 -0.114023774369887 0.062095011245965
0.032146368414881 -0.111283742121911 0.058982896006823
0.022910528571131 -0.116485204218291 0.068521917706214
0.025173630784673 -0.114967368439346 0.063610810601066
0.017058966071132 -0.120431752015011 0.073647147491368
0.016804449469568 -0.119535238043745 0.067145086438746
0.019765997321131 -0.117566639664052 0.063070944277495
0.006325079352382 -0.122370131563848 0.072080327982864
0.009414801032069 -0.119268597601541 0.069308312966441
0.000869635016444 -0.120951434621501 0.069578247944284
-0.002940545647620 -0.122522220127485 0.073152678537973
-0.003857863355952 -0.120913483003242 0.066383824411529
-0.012028436272619 -0.121559261224095 0.072798459510633
-0.014254091964583 -0.120209583805861 0.069065405014434
-0.021799310296057 -0.118229179840014 0.068972149061882
-0.023156756585119 -0.116918848041899 0.063905248455835
-0.027805535881994 -0.117411720966931 0.067881130244998
-0.029837762444494 -0.115454298529708 0.063220464894516
-0.034291619866369 -0.114042135272056 0.066624818874151
-0.035793572991369 -0.110122820590654 0.059409330320098
-0.042541340848512 -0.106106549196216 0.058288290249344
-0.042453607171057 -0.104263349849334 0.053595344861739
-0.046209295647619 -0.099477485155293 0.049231113956553
-0.047410760491368 -0.050064695724967 0.000537389255707
-0.052223846428869 -0.127396698335551 0.072859355559825
-0.052534295647619 -0.120395615936684 0.067518040609760
-0.050505242913244 -0.113742186372903 0.064756365918845
-0.053113592522619 -0.109854826024337 0.056959116439273
-0.050201409905432 -0.104622574740179 0.053210614837447
-0.050761004631994 -0.097450555314512 0.048870781183996
-0.049702069085119 -0.091647892334475 0.042969440962826
-0.049986322014807 -0.086633945714773 0.039160663284366
-0.050263885491369 -0.080498412706251 0.031814186911397
-0.051282635491369 -0.075773663579479 0.027561410181088
-0.050769891350744 -0.069235892499409 0.023348365499638
-0.049942010491369 -0.064827195123365 0.019490332240651
-0.049169549553869 -0.060019513114932 0.013227178488505
-0.051261916090328 -0.051994008706678 0.006994964282070
-0.048429315178870 -0.050686482410339 0.003187505672238
-0.050675115960119 -0.042030254048536 -0.002735643042469
-0.052148832477976 -0.036108336012969 -0.009138532505039
-0.053845819085119 -0.030979076897610 -0.013564865138266
-0.052270721428869 -0.023353024384564 -0.018527321605367
-0.051543328850744 -0.019023950136793 -0.022846942285461
-0.049476190178868 -0.015270343768966 -0.026285740846801
-0.050077589918452 -0.008796969636604 -0.032452484961765
-0.049191115309077 -0.003202009461501 -0.037755778297834
-0.056275994866369 -0.125264897678801 0.076323335191080
-0.056240513095535 -0.119730602120023 0.070243800064477
-0.056013201897619 -0.108980448726984 0.059954905454516
-0.055809523512202 -0.105315926295195 0.054779642208853
-0.056131951897618 -0.098536484908788 0.049814868538994
-0.056608514397620 -0.090624993900451 0.046651494863918
-0.056214471428870 -0.085779358829175 0.041163136035716
-0.055525994866369 -0.074949027875005 0.029462973279670
-0.056583856194494 -0.061702434499577 0.020566381550192
-0.056608514397620 -0.048227255784494 0.008533357777088
-0.055430780022619 -0.042819063762325 0.000256858485084
-0.055043572991369 -0.031610073475767 -0.010834491459067
-0.056677362053869 -0.022477016511835 -0.014419518223524
-0.055894647210119 -0.016803994853597 -0.021838911664139
-0.055829705803868 -0.013105205809435 -0.025339466701025
-0.055734979241369 -0.006646245100636 -0.031497407898733
-0.055929315178868 -0.001332013817308 -0.035712261835472
0.057629766852382 -0.115998732774928 0.077232928436759
0.054843145758631 -0.121741750322391 0.079722034749834
0.053181524664881 -0.116375116788759 0.073575115614121
0.055578009039881 -0.109723160514757 0.069565940172843
0.051413458258631 -0.105151768331020 0.066313801539947
0.053641973883631 -0.096798162765040 0.059572743148237
0.053702215582850 -0.092353558004203 0.054381611722474
0.053494594326340 -0.085648952445730 0.050453730512261
0.051889602231845 -0.080701326877123 0.043367108654563
0.053182989508631 -0.077305693374700 0.038880983493046
0.052101739508631 -0.070206577457046 0.033703129216683
0.053027797451340 -0.063593417584585 0.028720690916829
0.052081182868006 -0.056197681581856 0.024549962113171
0.055366217047694 -0.053121665926448 0.020444766848520
0.053773728440923 -0.047193281820197 0.013630608378402
0.053744024664881 -0.041978003146627 0.007948770863420
0.051835193749703 -0.035759148327027 0.003674409450786
0.054143368972917 -0.031228501640857 -0.002042540843804
0.053985235602381 -0.018048668604418 -0.013091859663447
0.051558477789881 -0.014575630132845 -0.014886834929537
0.054455613206548 -0.007879939445389 -0.022055230762184
0.054281134039881 -0.003377951264005 -0.025612749989033
0.050019903571130 -0.110175724566707 0.066053097505387
0.043903855394048 -0.101136653334724 0.063364628301616
0.045803920498215 -0.097258008471663 0.061688799070253
0.048899786383631 -0.093059787389195 0.053197010433654
0.049781622321132 -0.068598191904304 0.027909915978835
0.049717657477381 -0.033394078445072 -0.003942375189673
0.049582403571132 -0.009994820351175 -0.025386253649128
0.050048223883631 -0.003318602253168 -0.030036833408349
0.049685919196132 -0.000507098263878 -0.033642405266253
0.039509649664881 -0.107823576359699 0.067469768528443
0.040505417894049 -0.104818119990289 0.064147102162383
0.030721441657069 -0.110336899483800 0.069680157157104
0.023675665289882 -0.115343923993388 0.075013355776325
0.015533575446132 -0.118894326058340 0.077393665739439
0.016555181891443 -0.116928623274456 0.073913587505776
0.007828985602381 -0.118975553437906 0.078034212249920
0.010374884039881 -0.116510182702342 0.077511386604986
0.000668747972173 -0.119274346054432 0.077980637850761
-0.000892449944494 -0.119120420461447 0.073696984023764
-0.003397821038244 -0.119088079283832 0.078025326703181
-0.006682000725744 -0.118907688429704 0.073501979477706
-0.014884602567262 -0.116501087827810 0.075857402025699
-0.021081658928869 -0.116997725163916 0.078766863357390
-0.019204339592931 -0.115822011795510 0.074280981413810
-0.028510858147619 -0.111656183432324 0.074062411770800
-0.030613397210119 -0.112107842035764 0.068932878897979
-0.035163690178869 -0.110058296572677 0.069095603251075
-0.042169793694493 -0.107469804390500 0.067286554313759
-0.043851678460118 -0.102604119453363 0.064896739960949
-0.047163934319493 -0.098614599065693 0.060709013940841
-0.052997064202306 -0.122079544932661 0.078184302476977
-0.053523797600743 -0.115346022852998 0.075072139215096
-0.053224725335120 -0.109630481963375 0.068922257335398
-0.050132562249182 -0.101679456143780 0.065212079227846
-0.050413690178869 -0.098176021252023 0.057689046186418
-0.052312860100744 -0.092247378807146 0.053685892428722
-0.053767303460119 -0.086234201473298 0.049994665970165
-0.052792108147619 -0.081990285012981 0.042613698522147
-0.053682244866368 -0.073735333791079 0.038322705011180
-0.053184279371577 -0.070637999898600 0.033935735375620
-0.053215643303869 -0.064025656735953 0.027893875443961
-0.052924554436681 -0.059065346156030 0.022644123228438
-0.053130405673660 -0.048355202897701 0.013572791228007
-0.053016787277083 -0.042239725699681 0.007787734724284
-0.053206536858557 -0.037360191431734 0.003975491673377
-0.053391880283035 -0.032130148752993 -0.000095276923073
-0.054582147210119 -0.018125142357992 -0.012664981585011
-0.053242140699702 -0.015558435762583 -0.015416219763987
-0.052867547600744 -0.010308829051430 -0.021606942007322
-0.053070623772619 -0.002930869585575 -0.027533502112228
-0.058481235751785 -0.122091127126368 0.079696442521620
-0.059077752678869 -0.113692461245251 0.074950145479328
-0.058103631585118 -0.109858275446549 0.067723543600477
-0.058195916741369 -0.104643437563756 0.063413626331648
-0.058799188225744 -0.099084976222929 0.059064837614830
-0.058294061272618 -0.093016758407440 0.052962030569119
-0.058864373772618 -0.085884527511966 0.050465987966343
-0.057626092522619 -0.081197254284042 0.041517623680218
-0.058125604241370 -0.073788478353870 0.036585314775563
-0.057639520256994 -0.070465072262149 0.031883400490139
-0.058484246819494 -0.064871435680803 0.029920290611644
-0.058553338616368 -0.058859637591862 0.024852146896634
-0.057971551506994 -0.053129248831176 0.017468371670139
-0.058151971428870 -0.048214125719299 0.013707824803187
-0.058765740960119 -0.039804020521774 0.008510978732229
-0.057547357171056 -0.034678129814888 0.003926047058674
-0.058237542717931 -0.031298201395899 -0.000766727601241
-0.058234735100744 -0.026691756782803 -0.005160892035826
-0.057190057366369 -0.019046009768658 -0.012600783250216
-0.058083612053868 -0.012710352821889 -0.018488845529751
-0.057409946689286 -0.011647569585399 -0.021828664301868
-0.058847772210119 -0.004983586027614 -0.022509020544688
0.058636602789881 -0.114559285430792 0.083724037115230
0.058262579352381 -0.110756984049535 0.078395478715562
0.058786667894047 -0.104468546138003 0.074667816428351
0.058507975557738 -0.099038352851204 0.069119556432691
0.058807012946132 -0.083958132305529 0.060392725625240
0.058143927008632 -0.079881402509121 0.052046586461439
0.057908087164882 -0.077896698295192 0.048972723758075
0.058051153571131 -0.071171650116990 0.043675839414270
0.057979864508632 -0.065824731302489 0.038461079332164
0.058851934821132 -0.053480577106546 0.033189047944171
0.058775567633631 -0.046718646034906 0.026535703062294
0.058530157477382 -0.043718552933440 0.022085128184019
0.058297247321131 -0.039707293812565 0.016890200979018
0.058304815680506 -0.031351210993913 0.009559114012675
0.058055792243005 -0.026051901448846 0.003044378663845
0.058302781175298 -0.013941347153247 -0.006100446050486
0.058151739508631 -0.009681641668152 -0.011081715470366
0.058849981696132 -0.002789431355241 -0.012400567265100
0.054019049078944 -0.115723916517815 0.084114423410493
0.053903041591964 -0.100717335336314 0.073832910260844
0.053142950446131 -0.098903801608188 0.067776286366195
0.053715704352382 -0.090569352521262 0.063313802122506
0.053356709126687 -0.087669689890105 0.059506872075084
0.053687506110194 -0.082640167169401 0.056384084909214
0.053424871832850 -0.077369545551765 0.050027581719838
0.053670294196131 -0.070307799591257 0.045100320607916
0.053315964769048 -0.065009241371738 0.038387481868880
0.054508306891444 -0.062201966390224 0.035869976226615
0.053585089118006 -0.054623010036544 0.030325069051753
0.053553350836757 -0.048240342966707 0.024509649099802
0.055059942633631 -0.045232991451282 0.017160641318378
0.053502650966964 -0.037695554976441 0.014598952856101
0.054567266852381 -0.033574129258445 0.007383662569544
0.054504376227382 -0.027803632285652 0.003860163411711
0.057361212164882 -0.022685227972197 -0.003564050407751
0.055634649664881 -0.013366635053683 -0.007371731984843
0.053394206026489 -0.009300344339538 -0.011451140088340
0.053747198493006 -0.002765442556118 -0.015184277940452
0.045459600836756 -0.098102516963515 0.069242138480362
0.048798223883632 -0.092300387979407 0.062679986613385
0.038691900641444 -0.104557717584729 0.076036927147508
0.040875046800298 -0.101021150602161 0.070282024103913
0.029269903571131 -0.108792419808144 0.080223747996587
0.032804897060714 -0.106727968072477 0.075109968040977
0.022759975185715 -0.113163402401527 0.083177214598601
0.025401413987798 -0.109944780489839 0.079000475479934
0.015220424404465 -0.113220808158045 0.084357639963748
0.016934942633631 -0.113208142307430 0.080476313797102
0.009445684821131 -0.114477906387240 0.084186139552227
0.000767869065923 -0.115693603522473 0.084020265928044
-0.006203179924962 -0.116423241093790 0.084076135145276
-0.014697800111905 -0.115602647232942 0.083661886562080
-0.019327264397618 -0.115983523452396 0.082020031627299
-0.021990350335119 -0.112776441563452 0.079085116321623
-0.025398553460119 -0.113915574503788 0.081088053887543
-0.029810955803869 -0.110261410710470 0.078740378142337
-0.034049757887203 -0.110779024235822 0.077294121282416
-0.037724725335119 -0.104996370848134 0.075979743727780
-0.043308872470535 -0.103531697275765 0.071383456389784
-0.044866229241369 -0.100007734514186 0.069853563242375
-0.047317498772619 -0.097327429462035 0.065444214308094
-0.050449822991368 -0.097308548266296 0.068397948284510
-0.051067661533036 -0.094747750524807 0.064297575503966
-0.054344744866369 -0.088610682340478 0.061055463324784
-0.054805291741368 -0.071838330309959 0.041051266413926
-0.054785028069493 -0.052909397633072 0.023894040602536
-0.054880975335119 -0.041119351871178 0.013784421309798
-0.054710076897618 -0.031010757789398 0.003906049486781
-0.054795770256994 -0.003610160868343 -0.020348451868441
-0.059754859263690 -0.114594530206528 0.084414045348817
-0.059120721428869 -0.111043140578444 0.079721934436482
-0.060172967522619 -0.104001148880356 0.075033428206113
-0.059228387444494 -0.100075676428387 0.068965338533217
-0.059562371819494 -0.092499001716115 0.061968481300196
-0.057807432666849 -0.086289474552509 0.060124481922463
-0.058892531324702 -0.080496226795144 0.053952089056742
-0.057199497470536 -0.076723702417334 0.049764173762111
-0.057041968638690 -0.070701556577693 0.044745850319018
-0.055467819643154 -0.066210874395519 0.039423288090560
-0.056702264397619 -0.059651188600647 0.033679111040615
-0.056187371819494 -0.052400425397893 0.031256333911486
-0.060341424553869 -0.048759510931666 0.024395700233185
-0.056643475335119 -0.042510067533600 0.019296460604460
-0.059111322014806 -0.038725069902192 0.015317392910822
-0.058681198549405 -0.031486353398340 0.009095658455197
-0.058532220452306 -0.025356058780378 0.004444023909881
-0.060861444085118 -0.021096770984620 0.003156036309930
-0.059586053460119 -0.014410703939447 -0.005993669692946
-0.058475946038244 -0.010104540673065 -0.010774235402807
-0.058024530022619 -0.003296254063385 -0.016084210563358
0.059423061123215 -0.111984070377492 0.091369760551643
0.059706427008631 -0.105546344088674 0.087059980453080
0.059720782477382 -0.097949097513806 0.081236369695983
0.059783575446131 -0.093606437367360 0.073998440972622
0.060317657477381 -0.086191118578051 0.069387812774915
0.059082891852382 -0.083303737214990 0.063140295620459
0.059347052008631 -0.077241061444181 0.060759133049135
0.059454962164881 -0.068985173635741 0.054255194443460
0.059154180914881 -0.065143231272033 0.046718074089527
0.059405157477381 -0.057836231837445 0.043325557783520
0.059299688727381 -0.055626064922604 0.039773831349310
0.059525762946131 -0.049614465702131 0.038362847856342
0.059527471930506 -0.044310961617678 0.033636583479385
0.059476934821131 -0.035238731003640 0.024577105726975
0.059452520758632 -0.032316882047371 0.021356055601498
0.058302862555507 -0.027278799970953 0.012241253655891
0.059214361578943 -0.022169455698386 0.008900734206449
0.059230841071131 -0.015909544676824 0.004090999284869
0.058913458258631 -0.007584715181049 0.001169469734825
0.059076706956548 -0.002268798460924 -0.010644569904168
0.054758770758631 -0.110933717989567 0.089387775452299
0.054762091071131 -0.104850381742314 0.085342252315836
0.054624639899256 -0.101531886071254 0.082011145575424
0.054561895758632 -0.092160453086637 0.071563639320682
0.051167120368006 -0.088818685344231 0.071849354957921
0.054039044196131 -0.081622221577137 0.065016236254079
0.054732305914881 -0.075332725119932 0.059152944889417
0.054552130133632 -0.072944258468886 0.054156264811116
0.054858607998214 -0.063865695061207 0.050172124477778
0.054732916266444 -0.059786274110844 0.045045783836081
0.054796270758631 -0.055498257567453 0.041888222142292
0.054674688727381 -0.048803782582355 0.034316640969315
0.054603155524256 -0.043972021672360 0.029143195452008
0.054740728766444 -0.037002520703241 0.024184390832185
0.054601837164881 -0.034000637231328 0.019997885051621
0.055039556891443 -0.026119708896715 0.014483947005109
0.055039923102380 -0.022153404898314 0.011218774861720
0.056045538336756 -0.007711650576109 -0.001090323296788
0.054925665289881 -0.002736748365543 -0.003386508313842
0.045177618414882 -0.096921584664976 0.077780344566989
0.044394317633631 -0.093672462507571 0.075243920073210
0.048558966071131 -0.087608720251599 0.073562033258064
0.037213262946131 -0.103663581759089 0.081796346056405
0.036269415289880 -0.102034231895889 0.078343876311236
0.042102423102382 -0.095604153111644 0.077729686278423
0.030410365810715 -0.105833453264482 0.085079773104036
0.033817144782068 -0.102525013705284 0.081215379769829
0.023043666591965 -0.110599910791415 0.086786822959819
0.023548874925298 -0.105418657605211 0.087764651782047
0.016134649664881 -0.109198479827984 0.089671758190788
0.008585612276488 -0.110310680567994 0.090568748524484
0.001194708258631 -0.111691480531938 0.091518526478094
-0.007017694085119 -0.111759474252391 0.089939616391747
-0.013632788951190 -0.110188536741978 0.089907856158873
-0.021980421949702 -0.110203262916031 0.089745868849335
-0.024091912835119 -0.105830829863938 0.088564204077799
-0.025569451897618 -0.107983872849007 0.090339736646217
-0.030923944085118 -0.103133186866379 0.086339058650316
-0.035244439690588 -0.103874929291145 0.084546651670836
-0.037536981194495 -0.099792970628834 0.082951805306306
-0.044738592522619 -0.098538708894180 0.079539054957538
-0.045836883538244 -0.094779080964126 0.075708660180229
-0.049545526116369 -0.093988938723506 0.073732258468472
-0.051165503794940 -0.089090199452422 0.069840095407594
-0.054125115960119 -0.083541702923411 0.067527091866870
-0.059536004631994 -0.110007413350779 0.090848173241938
-0.060061802158035 -0.103377906071512 0.085198897833818
-0.060192824293452 -0.099126622133788 0.079368118761988
-0.060646722405431 -0.093400801196067 0.075956210228092
-0.057746697991369 -0.088218205792274 0.069674049636432
-0.057728082268713 -0.082697951171612 0.064118296611710
-0.056995721428869 -0.076487285362610 0.060954128306188
-0.059179803460119 -0.071700243769208 0.055552964086019
-0.058180657952306 -0.064715986769963 0.051338691505219
-0.058555352776525 -0.060246768179834 0.044751993804879
-0.058678045647618 -0.055330482345208 0.039856045830115
-0.059990838616368 -0.047411303110813 0.033717998197759
-0.060653143303869 -0.042807090785000 0.030707564259133
-0.056899041741369 -0.038391396785608 0.025765475013256
-0.058709030580655 -0.033416025417293 0.019144783820777
-0.057469734015674 -0.026545361032018 0.014018611016136
-0.060425734449702 -0.020403071728306 0.009944265211635
-0.061641717522619 -0.015675070499305 0.007654508900475
-0.060316815178869 -0.009772520805568 -0.001070995290137
-0.058195916741368 -0.005557895967021 -0.006951099169854
-0.062621209710119 -0.106197244458637 0.089684573612678
-0.062482049553869 -0.101746353621999 0.086861326802886
0.059984649664881 -0.105789394732692 0.096155869580175
0.059697247321131 -0.099650749122099 0.091520640206307
0.059998663336756 -0.093551113416748 0.087320201683452
0.060525274664882 -0.083628009631628 0.075005782788833
0.060092657477381 -0.077526097725149 0.070522744409493
0.059439825446131 -0.073236111021387 0.069709483606379
0.059408087164882 -0.062638594901325 0.060848435888465
0.059578497321132 -0.060886040421598 0.054424900477475
0.059596075446131 -0.056310717600486 0.050030833722926
0.059535040289881 -0.049886527966246 0.045902862932183
0.059502813727381 -0.034261328539016 0.033629757352725
0.059523931891444 -0.026658002683008 0.025240995151395
0.059597540289881 -0.022661159004674 0.018428859162248
0.059372735602382 -0.015782775057935 0.015093746017106
0.059033209235194 -0.002630670749021 0.004455987940454
0.059564337164882 -0.001296496539259 0.002178743237684
0.054936732998214 -0.104764456737150 0.095854382712598
0.054988653571132 -0.102863164672904 0.091913400094868
0.055004034430506 -0.091177149984286 0.079623486048304
0.053622686774256 -0.083883443044282 0.075487065833500
0.054211798102381 -0.075574073754065 0.070550160352626
0.054860235602381 -0.071247281215036 0.067405197751219
0.054849615485194 -0.066871488446307 0.063457715169906
0.054890753180506 -0.058786314919399 0.054845002717920
0.054935308844568 -0.055836117147946 0.051367925539490
0.054974737555506 -0.047862790805567 0.043544427320485
0.054992071539881 -0.039364858622723 0.034556723176458
0.054904831956548 -0.033638725235140 0.031807812652795
0.054999273688319 -0.028745622946904 0.022706824258691
0.054920538336756 -0.022251670152048 0.019908906060056
0.055336147060714 -0.017370071468816 0.016647474328329
0.055137579352382 -0.003663012824437 0.003406326889449
0.054862310797694 -0.000283065260411 0.002168091064058
0.043227789313319 -0.093219135970323 0.085006431339067
0.045182431472917 -0.088021681099612 0.082394042424262
0.047949102789882 -0.087500898860529 0.075342634866370
0.036100958258631 -0.097331874135621 0.089717224684506
0.038550567633631 -0.095042824806488 0.087241445421386
0.042228887946131 -0.090616387068519 0.083571997491270
0.031367594698363 -0.099360696458234 0.090719187656386
0.035026251227381 -0.096717452468316 0.086922470034577
0.020678106696131 -0.103406907166436 0.094463748661272
0.025415574144048 -0.100836845062364 0.092464083531207
0.015677339397024 -0.104779339967607 0.095606912661150
0.008565883388839 -0.106856758296875 0.096924353580888
0.001917852789881 -0.108010750530444 0.095281501549728
-0.005762811272619 -0.107453680702350 0.098122202525538
-0.014084161370275 -0.104528192246844 0.096612750687662
-0.019512811272619 -0.102403972904877 0.095020839921901
-0.027497023512202 -0.102825743292628 0.094628429458991
-0.027190301506994 -0.101416365442357 0.091307342734638
-0.033558465569494 -0.099891157254991 0.091498389649286
-0.040317010491369 -0.096793437861005 0.088965957450362
-0.042603045647619 -0.094551122089561 0.084525374518379
-0.045232537835119 -0.090636185863633 0.081947776111476
-0.049490594475744 -0.086807887961577 0.081295354819904
-0.052277947991368 -0.081985239584779 0.075211733982749
-0.053999139397619 -0.079728687926259 0.072835299337276
-0.059386346428869 -0.104369249337376 0.095711835889896
-0.057081170647618 -0.101021511742571 0.092660582329549
-0.062013299553869 -0.096231112389512 0.085498915766230
-0.061101190178869 -0.089958273617871 0.079738355793889
-0.056958530673661 -0.083808575767561 0.074484894557130
-0.056973958036011 -0.077721523510420 0.070389655196409
-0.059041061830655 -0.072555061914790 0.065870579218650
-0.059752655022619 -0.063725392413400 0.061081755934396
-0.059421502678869 -0.060808920432804 0.055413950300968
-0.058228265374181 -0.054260118441852 0.049299416708754
-0.057137567131994 -0.051761369732970 0.044376325697230
-0.058868572991369 -0.042177082726466 0.040069020421137
-0.059438348381994 -0.038132884509956 0.032473978475813
-0.058976580803869 -0.034099263216945 0.029514296606582
-0.058241815178869 -0.027487264399626 0.025033312778962
-0.058953729241369 -0.021085578619302 0.019101644536636
-0.059883335361160 -0.015204796515015 0.015090092944894
-0.061075555413243 -0.003881658913403 0.005182097250116
-0.062633905022618 -0.101426961198702 0.092800632515630
-0.062566888421057 -0.083187600118317 0.076518163815951
-0.062658319085119 -0.080872793112087 0.069824977690787
0.058926251227381 -0.099221025493871 0.100308587334748
0.059142462164881 -0.093358917700293 0.095411766432859
0.058935675055506 -0.091222845950450 0.091892315786937
0.059651007086756 -0.083705448308379 0.085919651234218
0.059744512946131 -0.075532097777168 0.079260559631138
0.059384649664881 -0.074003573400177 0.076874860758548
0.058665899664881 -0.065683306445466 0.071230829358541
0.058831915289881 -0.061403974625950 0.066306809658272
0.058745977789881 -0.055207063368121 0.061066257458555
0.058262823493006 -0.049069346321775 0.059234183570268
0.059097784430507 -0.046724671409893 0.050469824998374
0.059215216071131 -0.042716278323451 0.045714292878088
0.058962286383630 -0.035119848683340 0.040981272971171
0.058994512946131 -0.030460164476248 0.037072031562197
0.058410365810714 -0.013849690150154 0.026518619646700
0.058895880133631 -0.011551584787335 0.020364515894844
0.058683721930506 -0.005043357032587 0.016446999735358
0.055166713466965 -0.101021417665568 0.103797504656973
0.053993048102382 -0.093796365703018 0.096494109968974
0.054161505133632 -0.084211932626426 0.086375839341527
0.052523112276488 -0.077986188387636 0.079704315277600
0.054053204352381 -0.071801568965141 0.076196457915511
0.053946856696131 -0.065975974175385 0.071803970780924
0.054501104743007 -0.064702864871381 0.066285077732066
0.053930303961756 -0.053204929168434 0.060503398310974
0.053807338466965 -0.048352953423716 0.056917055401049
0.054300299078944 -0.045746784885247 0.050812653222624
0.054346563727381 -0.040631714430875 0.046040205608089
0.054300469977381 -0.033929160519002 0.040125145497371
0.053877813727381 -0.027959736583260 0.038262981050540
0.054107794196131 -0.023004714671617 0.032067943852320
0.054277227789881 -0.015839750959001 0.026051016215461
0.055515264899256 -0.011351551728078 0.021394298122411
0.045286784151488 -0.083199548312605 0.086233090903070
0.048939825446131 -0.077532887800163 0.082116716863518
0.038765802008632 -0.088820322778813 0.091381468685623
0.042102423102382 -0.087303214210296 0.086307384739450
0.030567755133631 -0.093952298254731 0.096006600334434
0.032672247321131 -0.089989125379753 0.094872274373122
0.022793585211756 -0.098976553937529 0.099595409754552
0.025159389248214 -0.094486026019656 0.097310451367170
0.015848598232590 -0.098814262230938 0.099433411987227
0.008456915289881 -0.100901364009848 0.101742052302478
0.002870880133631 -0.102624142480249 0.101375583769067
-0.005623101799962 -0.100409167634081 0.102084405277600
-0.013925164788244 -0.099655798519667 0.100408298827432
-0.020721307366369 -0.100187500549498 0.098622312117781
-0.027147576897618 -0.100336719935903 0.097237581791313
-0.029088555901525 -0.094931894246302 0.096869841874515
-0.036198358147618 -0.096364419303324 0.093770429080226
-0.035179071038244 -0.090492729692039 0.094150966198489
-0.043034783928869 -0.089396466576346 0.091970404219740
-0.045877069085119 -0.084294617849196 0.086094036388457
-0.050034295647619 -0.083356222112498 0.086499058998309
-0.051881951897619 -0.079459543834265 0.081712713853324
-0.053969842522619 -0.071683870601854 0.077706866017329
-0.058677036533036 -0.099487023614686 0.100922476663155
-0.058174920647619 -0.095014583279375 0.096319502015661
-0.060776580803869 -0.088614504777849 0.093127442644302
-0.056468133538244 -0.084672428172541 0.085655705909921
-0.058240740960119 -0.076556174912437 0.081936311125347
-0.060556878655432 -0.073473385541640 0.075693138234127
-0.056923455803869 -0.067475999717452 0.070758905999645
-0.057392449944494 -0.061819541731084 0.067176841101441
-0.059623406975744 -0.054775121224435 0.061407147651001
-0.057336663811681 -0.049824942692828 0.056376772203466
-0.057530633538244 -0.044722822037422 0.050447193221400
-0.057604538393154 -0.038940272142364 0.045812808707511
-0.056808831780431 -0.033769929463003 0.041697424141730
-0.056188267001786 -0.027749961012355 0.036627743116749
-0.057508626004762 -0.021396294355657 0.030954328070419
-0.058179742424962 -0.015601165680046 0.025875907100365
-0.057844415276525 -0.011054065576363 0.021094663749069
-0.060504266350745 -0.004103730210710 0.018037489838963
0.058009893805507 -0.097014254170517 0.104000425311126
0.058429571539881 -0.086896175872321 0.097718454827376
0.058239727789881 -0.079530736759053 0.089783359481044
0.058675177008631 -0.075719629130159 0.086310493461254
0.058307745368005 -0.068891950179212 0.081432981999452
0.057782110602381 -0.064549123759407 0.075956842444853
0.057710821539880 -0.023491137713650 0.039405388280826
0.057902716071130 -0.017040820651595 0.032489879341061
0.057603887946132 -0.014552463848621 0.031947096126204
0.053598321539882 -0.094905528473337 0.107439616787111
0.056974330654464 -0.089680333803368 0.103530437145585
0.051705775966964 -0.083380707643205 0.098240989512469
0.055475632737798 -0.078878126627123 0.092338792937803
0.053457810472172 -0.073798385384515 0.088826140161953
0.053086038553770 -0.067249432746434 0.081396383977568
0.053814906826340 -0.062417248313653 0.077474765374691
0.054129034430506 -0.057293331546807 0.072373185379730
0.052182257086756 -0.052225741579923 0.068356905368691
0.053538336188318 -0.046475883867780 0.062626417430237
0.052629962164881 -0.038710868650566 0.058510584673108
0.052185675055506 -0.033306820814313 0.051290356823801
0.053817950446131 -0.027866746388172 0.047811159191637
0.051949395758631 -0.021749276509791 0.042022943618608
0.053207110602381 -0.017135093018390 0.036720182880132
0.054507391364100 -0.010909410989427 0.030888052193885
0.053940259473909 -0.005808942634346 0.026652589708026
0.045029278571131 -0.079169465727515 0.090258293822579
0.045928664731846 -0.073366423289921 0.087748458662358
0.048799932868005 -0.066998902169169 0.084580025973240
0.038277018526488 -0.083129904250444 0.095482246213546
0.040189825446131 -0.077473114915852 0.093860419488483
0.029398077399256 -0.090331858279543 0.099983175493734
0.032934779873214 -0.083643562053335 0.098141220999506
0.025354010016444 -0.089347499066753 0.101455326797376
0.015298834235194 -0.091561549629717 0.103846673365624
0.011139044196132 -0.093881612352250 0.104978809362532
0.000762928124703 -0.095318168704363 0.105420118280146
-0.004926792392411 -0.092705192537127 0.106390922797565
-0.013541619866368 -0.095803001470742 0.103656709488302
-0.016700799553868 -0.091118445429454 0.104446424855295
-0.020835321038244 -0.093260719284920 0.105380504509162
-0.021404046624181 -0.091344331039915 0.103406720876426
-0.028276483147619 -0.089159453081714 0.103056123226251
-0.031140740960118 -0.084461188651749 0.100729266556694
-0.034666375725744 -0.087764617490213 0.100622224275701
-0.036675958245275 -0.085489920276401 0.097456130127814
-0.044976629631994 -0.078377279441738 0.091875492814720
-0.046779412835119 -0.074065739195371 0.089630125272798
-0.054433953850744 -0.094454222815247 0.109475745807097
-0.054013625074702 -0.090579822017234 0.104309307322426
-0.052692132561681 -0.078651088148168 0.092077826503927
-0.049305780022618 -0.072523870774337 0.088211415807319
-0.052762462500298 -0.067544987706781 0.081528384844897
-0.053759718824702 -0.060811756779568 0.078453322687054
-0.054006138095535 -0.055259260433025 0.072551074863082
-0.054358026116369 -0.050528145767508 0.067066148992179
-0.053979770908035 -0.046010471014596 0.064407802362070
-0.053896600335118 -0.038684256078720 0.058136943609270
-0.053946160881994 -0.031953619452506 0.051703395086218
-0.053962192783035 -0.027584925147317 0.047835717468619
-0.053547723381995 -0.022875105184655 0.045162244205539
-0.054205682366370 -0.017119580088333 0.037397010051496
-0.054666131585118 -0.013038295907868 0.031897112855588
-0.054339796949702 -0.007847070564814 0.028625396559792
-0.058071405022619 -0.094407138989760 0.107220890870752
-0.059833856194494 -0.089151561819490 0.102835206455526
-0.057241977939286 -0.082320467210782 0.097032548696459
-0.058851068108556 -0.079825744486827 0.091530875328031
-0.058802606194494 -0.073748539519213 0.087145423308925
-0.058891880283035 -0.068171686180608 0.082624048744818
-0.056781854241368 -0.064140863368468 0.075482537982946
-0.058772088616368 -0.055540712590343 0.073205376038009
-0.056283319085119 -0.050997225399187 0.065934403560013
-0.060255975335118 -0.049035949371360 0.060156430918205
-0.059970330803869 -0.041723561521581 0.055166693496880
-0.055215203850743 -0.034729726683680 0.048934727075127
-0.057418670647619 -0.028664696095100 0.046313436813269
-0.058772576897619 -0.024963309908995 0.042415387003528
-0.058800408928869 -0.018755605304625 0.039894518312074
-0.057732830803868 -0.012483982210664 0.030449808355123
-0.058993280022619 -0.006448722116116 0.023701989935157
0.053347121763095 -0.090722086368985 0.114070109529719
0.054755255133631 -0.077608270339481 0.101017049385601
0.054980108649256 -0.074819495954230 0.097115505815307
0.052426397711756 -0.067071455415246 0.091270199709413
0.052250302566667 -0.062021050274149 0.085972045114645
0.055183315029465 -0.057620039305945 0.080420418871117
0.055086309821132 -0.051800866305771 0.075483868051521
0.053280401618007 -0.046588229824781 0.068614549906264
0.050802130133632 -0.038297256614591 0.061149489641748
0.053059291591964 -0.030235136202385 0.057216318503722
0.050690557868007 -0.025289418607170 0.049797099129233
0.052796173102381 -0.018864145378172 0.046771158256891
0.052412481696131 -0.011971674028407 0.042640382638642
0.052667434263095 -0.007567555087032 0.035890038535939
0.052670294196131 -0.001754308873048 0.032270261419432
0.049497930914881 -0.088948975885628 0.110659920669511
0.048169805914882 -0.078938981797760 0.105054040350864
0.048723679612798 -0.073220645365302 0.098550062908311
0.045921148688319 -0.068383033632025 0.092765281658639
0.047595281989100 -0.061993630779273 0.087943748155142
0.048955613206548 -0.055732489809741 0.082191297668434
0.049985723883630 -0.052527199171858 0.076469033118107
0.047535528571130 -0.043484882211764 0.074755675714657
0.049272100836756 -0.038592180384546 0.065975625561828
0.048055792243006 -0.032758552304703 0.063837934556346
0.048919643154464 -0.028832589223310 0.058076144506453
0.049975469977382 -0.022683787176951 0.049660033724461
0.048121466071131 -0.017038261517827 0.049572297175887
0.048625128180506 -0.011018192879254 0.042787174638216
0.048649949144048 -0.005931006824298 0.038195135233673
0.038017869065923 -0.074142393537750 0.098511608058397
0.041675502529465 -0.068166480453347 0.094275996099738
0.031082598883631 -0.080276205802746 0.100838709977758
0.034775030524256 -0.075521090058701 0.099564974344658
0.022248581956548 -0.084408536793835 0.108271557474766
0.024262457282069 -0.080977366641043 0.104784705156296
0.016204473883630 -0.083987753137142 0.108296185310688
0.008646368414881 -0.088649900125960 0.110890646193057
0.006979864508632 -0.086801806299663 0.108915226944290
0.000940174218453 -0.090254819470783 0.111243064936801
0.001517787685715 -0.085213941118695 0.109448024555455
-0.007727236495833 -0.087055212015651 0.108304018287838
-0.016442010491369 -0.088006969542805 0.109597949530751
-0.014205275465327 -0.084399453725077 0.109294381754263
-0.020571025248313 -0.084268794217782 0.107113576870598
-0.024248651116369 -0.079683236466247 0.106353880095917
-0.028317987053869 -0.085083463347779 0.105173818237050
-0.028817498772619 -0.080908609635264 0.104452421615794
-0.036164080803869 -0.079268948461463 0.100908621992175
-0.037921893303869 -0.072486781845433 0.099297820283915
-0.041395623772618 -0.077510335445564 0.099563476140918
-0.044435052483557 -0.073275957015890 0.096188905144365
-0.045594744866368 -0.067055720773829 0.092343586697356
-0.046695672600744 -0.062211365242358 0.091016887224445
-0.052034783928868 -0.090565836890429 0.113330982201055
-0.049731561272618 -0.081152855493476 0.108584136590778
-0.051196567783035 -0.079586827731607 0.103307081921021
-0.053065057366369 -0.077017033020289 0.095620252227212
-0.051689778348512 -0.061411893031088 0.087440647004004
-0.052256463616369 -0.058225528821430 0.081201566594326
-0.051529901116369 -0.050762111568029 0.076534387613690
-0.051426955152827 -0.045664672056873 0.072113545574177
-0.051022283928869 -0.039324319620371 0.067435522585980
-0.051390740960119 -0.032762443988680 0.060611025721961
-0.051140903720535 -0.030114402100304 0.058979031615036
-0.050744093824702 -0.023986996211576 0.054581225711909
-0.051833026116369 -0.018029658179282 0.046137944339546
-0.051615155022619 -0.011103749921263 0.040472330838168
-0.051515985100744 -0.005276772992799 0.036069301777399
-0.051097121168452 -0.002246329594973 0.033806764588763
-0.057880731194495 -0.084760164760167 0.103929088357910
-0.057286370842932 -0.079230458639093 0.102736896587992
-0.056373223870275 -0.073379446633216 0.098575191514694
-0.056977264397619 -0.068964912269961 0.093699040266785
-0.056689813225744 -0.056140910489574 0.080923692448839
-0.056137322991369 -0.050429724202529 0.077501064235743
-0.055175897210119 -0.043620494731216 0.074201524895928
-0.055453240960119 -0.037988426329882 0.068365394183063
-0.056732781975745 -0.035990389126080 0.062889490469628
-0.057289422600743 -0.028647570116760 0.054451303157764
-0.057948358147619 -0.023482115336861 0.047620435172099
-0.057031365960119 -0.016206029195537 0.044097262491843
-0.056350604241368 -0.012309864554570 0.042707289173825
-0.056757684319494 -0.007092992191399 0.034232792913031
-0.056406854241369 -0.000766101453022 0.031687971127800
0.051851934821131 -0.087351584613011 0.117741110013440
0.051457566331548 -0.081658670818582 0.112673151648773
0.051096075446131 -0.073989388975741 0.108693240543266
0.051859910081548 -0.070515791669550 0.102917476587071
0.051097052008631 -0.063100853150663 0.098617872634147
0.051792364508631 -0.058199049706494 0.090575101691798
0.050489141852382 -0.049552037626866 0.085670191501629
0.050716192633632 -0.048693771027969 0.082795986143031
0.051411505133631 -0.040292276267455 0.075174187867240
0.051581182868005 -0.030519707916730 0.065225822348761
0.051605841071131 -0.024411772882190 0.059673007515164
0.051103155524256 -0.013686250679755 0.051135826448894
0.050971075446130 -0.007592283881348 0.046801463085903
0.052013230394048 -0.003163051833024 0.040345672233717
0.044785528571132 -0.085787648179784 0.118638306485379
0.046347637946131 -0.079830374520334 0.114523195111964
0.046841192633631 -0.071241893709908 0.108068289235258
0.049422979743007 -0.065123714077319 0.102431987946339
0.046429473883631 -0.064179702331852 0.097964355880742
0.045635463466965 -0.056903309176617 0.092113004520931
0.046475958258631 -0.051078145034271 0.083922980566411
0.045612351487798 -0.046634262981416 0.083470974436283
0.045848944098475 -0.040721391426526 0.077077787321646
0.046523626715662 -0.035855718539595 0.074101868887990
0.047742315680506 -0.030245456035838 0.067532410122316
0.045375302566667 -0.024484184154896 0.062130517651485
0.044891485602381 -0.018251167861502 0.057521071809577
0.045470343024256 -0.011984774473413 0.053473740723570
0.045535430914882 -0.008192468887619 0.047185839875824
0.047409161383632 -0.000588383030407 0.042968262932089
0.042241583258632 -0.082485465786977 0.120189549431275
0.037126837164882 -0.069678350614111 0.102647638162839
0.039411602789881 -0.061743029602220 0.096631527909840
0.040295294196130 -0.057202867321479 0.096859602048969
0.042534552008631 -0.047063865947806 0.087773914817848
0.042326544196132 -0.029359524996397 0.072187946944963
0.042137091071132 -0.005687150206569 0.051198448355737
0.029139044196132 -0.071573029713178 0.108392669492569
0.030646042894048 -0.069479311111620 0.103575310848650
0.020669805914882 -0.076989218262314 0.111095040960621
0.023303717047693 -0.074610561344889 0.107844826006508
0.025275274664881 -0.069898988175451 0.106832025334605
0.020018438727381 -0.077457898810693 0.111231270868212
0.017630841071131 -0.074028579739771 0.110044219031866
0.009036602789881 -0.080156144409620 0.112156107031600
0.012146368414881 -0.074684151313214 0.110976986860052
0.002189825446131 -0.078767016056074 0.112953111540575
-0.006383199727480 -0.080510229609091 0.111569883887827
-0.004239373772619 -0.074127696232780 0.112585959220461
-0.012875604241368 -0.079155058417698 0.111422816308970
-0.015415643303868 -0.075236538635470 0.110575118801502
-0.021006463616369 -0.080523484335254 0.110077064742687
-0.022314080803869 -0.074412736612334 0.108339821340401
-0.028185383817261 -0.074252727703865 0.107683662194056
-0.031457309970535 -0.070303924922771 0.104464337294665
-0.032638787835120 -0.069808094732526 0.107465671890674
-0.036315165873313 -0.068411440597239 0.102490964950020
-0.046338494866368 -0.086090273229412 0.120011222981918
-0.045860467522618 -0.078442247191524 0.114039880159446
-0.044317661533036 -0.067740230810235 0.103475687618940
-0.043994842522618 -0.061745518346746 0.097384758852490
-0.045155023186681 -0.056917541580582 0.092385114839559
-0.045643182366369 -0.052902459073114 0.091418081528632
-0.045921014397618 -0.044673534026776 0.083493524555943
-0.046246697991369 -0.039010050151556 0.077829654969793
-0.045790155022619 -0.032550532746642 0.072800243465309
-0.046008221428868 -0.029319199632768 0.069437594626306
-0.045663690178869 -0.024202054242666 0.065558737427181
-0.045869500725744 -0.009950143614428 0.052325429607773
-0.045368280022619 -0.005180910208394 0.048852366332492
-0.052314080803869 -0.086127000501364 0.116148134303803
-0.051926385491369 -0.080091488062295 0.112778565572938
-0.051318800855952 -0.074135626371850 0.107280079020354
-0.050432733147619 -0.068753377286786 0.101843680535050
-0.051042498772619 -0.064007419694253 0.098267343040460
-0.050172088616369 -0.057685785178559 0.092591016572941
-0.051354608147619 -0.051388382056024 0.084097018594024
-0.050360565178868 -0.047005694867490 0.081159348540562
-0.050194696038243 -0.039550512774452 0.076033756204629
-0.047488885491368 -0.033459675862287 0.070462681707217
-0.051239739983556 -0.031161049667393 0.066135901008902
-0.051236810296056 -0.025118528013728 0.062194824705195
-0.050498000074702 -0.018426608602465 0.058234732599993
-0.050122308342931 -0.009797155908685 0.052163679711397
-0.050276157626785 -0.010487690405088 0.047665193674003
-0.050438299553869 -0.001833179005233 0.042378550051349
0.045090411383631 -0.083013308849824 0.124008523462498
0.047620001227382 -0.074114230648014 0.113858230231981
0.045865769456548 -0.068151172336363 0.111860515816541
0.045636765550298 -0.063921656072806 0.108566287510598
0.044902716071132 -0.058499240308942 0.105752008530876
0.045425787360194 -0.053852782302428 0.096715443012484
0.045567999274256 -0.047427178599654 0.092728602586843
0.046299200446131 -0.044203784562206 0.088818100905008
0.044727260341965 -0.036591493628825 0.084344600545910
0.043550421149255 -0.029242709950311 0.079635729134722
0.045288702399256 -0.025500839433873 0.073577173381253
0.045572271735193 -0.019451181491937 0.067576164855963
0.043658087164881 -0.015161242367187 0.066796175313758
0.045168096930506 -0.001921087166334 0.052574563219594
0.042183966071131 -0.081804771246600 0.125903288126798
0.038381231696131 -0.075276941139203 0.119361742609569
0.038755938727381 -0.068008611115399 0.113984700589475
0.041086798102381 -0.063003337569347 0.104462541924032
0.039088751227381 -0.058776994781906 0.102760332561248
0.037813623523054 -0.052241602660234 0.098803703723741
0.038113025780952 -0.046213827206122 0.093404063155269
0.041462774664881 -0.041086303396963 0.088729208383748
0.041834356696131 -0.038519270492413 0.081262972067845
0.039188500111310 -0.030742052088575 0.079382298014593
0.038769354254725 -0.024952992302560 0.073488732003142
0.037915606696131 -0.019741149075297 0.069878067944810
0.037955548102381 -0.012248384757205 0.063110666632637
0.040635626227380 -0.010771961199709 0.058101731805590
0.038935723883631 -0.002093921294540 0.052608534296006
0.030774298102382 -0.064126238544619 0.105897537836569
0.031788458258631 -0.056616723721043 0.104362332207800
0.032340460211756 -0.051044286112611 0.101724763893631
0.034565313727381 -0.041550958110470 0.093633918299062
0.034973516852381 -0.010826048774336 0.065545422387384
0.023909552008631 -0.070082921945545 0.110877663876316
0.023362595628423 -0.064257392034682 0.109098273798212
0.013227911383631 -0.068173820654236 0.111555269578984
0.008649298102381 -0.073335871747851 0.115093385605485
0.009774786383631 -0.069131028514175 0.114552919064535
0.001419134528162 -0.069232322186179 0.114312080681840
0.000078009039881 -0.063759375732620 0.113476716366444
-0.004986444085119 -0.074637688920737 0.115528072171512
-0.007091843080655 -0.068709590449261 0.113387823115391
-0.012294061272619 -0.074374600928605 0.115448101300365
-0.013257972849323 -0.070474542442572 0.112752636182820
-0.014495037835119 -0.063749306424236 0.111881702037685
-0.020916619866369 -0.069219326605340 0.112995830016570
-0.019774448642410 -0.064261832700802 0.110305901444227
-0.029049920647619 -0.069569015571317 0.110523123581854
-0.028838773884226 -0.065416048485462 0.107799328111093
-0.032003533928869 -0.058845529041230 0.106015776485034
-0.039252882887202 -0.079626609033027 0.126192072180410
-0.035989536533036 -0.062896231832354 0.108225984177624
-0.035836402232440 -0.057540817471579 0.103049605109018
-0.038342645256994 -0.050081113166361 0.098389126734018
-0.037614373772618 -0.044431632276785 0.095205546770280
-0.039434442131994 -0.034835261873656 0.084382849469700
-0.038350213616369 -0.029467928939705 0.080861223430377
-0.038707798251785 -0.024565855739419 0.076018352430355
-0.038814080803869 -0.017158460276495 0.069230036205219
-0.037309197991369 -0.012025652855593 0.066407409789635
-0.039436639397619 -0.006966395420177 0.059265585473950
-0.037104608147618 -0.002845051835726 0.058342135107417
-0.043968133538245 -0.079448509130774 0.124218636597067
-0.042566888421056 -0.069973503602762 0.113976097896408
-0.045840936272619 -0.062285593684202 0.106123428279081
-0.042010858147619 -0.058376622694347 0.102091430648660
-0.042216851799963 -0.052708000792966 0.097891531371466
-0.043118035881994 -0.048499051379154 0.093836618197677
-0.042909661858556 -0.040770864573952 0.088317705915757
-0.045226678460119 -0.034635416092975 0.083276920334513
-0.043519647210119 -0.034103509917266 0.078021981938380
-0.042457391350743 -0.025612781964839 0.073452118880543
-0.043445591220536 -0.021199185594791 0.069555864633748
-0.040864048251785 -0.014795074636820 0.064430377725000
-0.042592987053869 -0.008221512538835 0.057884187962292
-0.042797200223511 -0.002322446598655 0.053033563013254
-0.048094842522619 -0.079815471981377 0.121475781022326
-0.048963739006993 -0.077139964746342 0.118709041263992
-0.048388950595535 -0.064738191780217 0.108392806237396
-0.050198846428869 -0.059968085677013 0.102005947786699
-0.048280714918452 -0.051772367006357 0.096520528718605
-0.047942987053869 -0.037108869552180 0.083234013447770
-0.049192824293451 -0.032462973009477 0.076928245388893
-0.047608514397619 -0.013594017406626 0.062593145838311
-0.048778436272620 -0.011077809809788 0.058429021049961
-0.048680780022619 -0.002812315258459 0.051154946193851
0.038206671149257 -0.075287909832505 0.128000813931029
0.036090216071131 -0.070194002668571 0.126736244026885
0.039467657477381 -0.065490562057582 0.117904834780487
0.038080450446130 -0.058742753232805 0.114067867805493
0.038411505133632 -0.052498815793157 0.108859476037688
0.039234049776489 -0.048608701060300 0.102030419735243
0.037528326422694 -0.041156141347201 0.097888685417421
0.040274298102381 -0.038040061057716 0.091985066257731
0.039202357998215 -0.026185884137593 0.082501992463967
0.039090216071131 -0.020248372268521 0.077413007295670
0.039143194586756 -0.009120320778684 0.067318326054085
0.038264532477382 -0.004262678809691 0.063931896458011
0.030627569586756 -0.074910050654756 0.129850729823292
0.030345343024256 -0.071572838815250 0.124842704565437
0.032361016852381 -0.064057998091971 0.119265775994997
0.033142252901489 -0.057175622330895 0.113853357926529
0.033418829352380 -0.053092716792973 0.113712223882104
0.029210394293787 -0.047170265962709 0.103070089087270
0.032618861904464 -0.043448580123924 0.097368329673054
0.031004034430506 -0.036697118031136 0.092769999476763
0.031651332607589 -0.030660660761839 0.088075557821014
0.033500697841964 -0.024844527225323 0.083603384981751
0.031174091939187 -0.018700396794467 0.078177119985493
0.032921514899257 -0.014714227801540 0.073142839630509
0.029068243414882 -0.007367902780304 0.068236765923827
0.032247605394048 -0.004040012231164 0.063519521457168
0.023769903571131 -0.074671955307860 0.132839954189221
0.024728236904464 -0.066615845362298 0.124899877592082
0.024418096930506 -0.061820301990354 0.120805849628028
0.020426641852380 -0.057897800403758 0.112235152768186
0.022439337164881 -0.052867762612888 0.108858365013991
0.024983548812609 -0.046455036913750 0.104754198231318
0.026411830654465 -0.040119168349904 0.099859294349941
0.025013555914880 -0.035823603404224 0.097020431510513
0.023664434821131 -0.028860195539860 0.091683247418244
0.024155889899257 -0.023732807197505 0.086737305773084
0.025899298102381 -0.017467218507850 0.079851241739320
0.023278692633631 -0.011448440451831 0.076264894316385
0.025293536383631 -0.006569559047667 0.070444218493362
0.025685430914882 -0.002405812748284 0.066416909090080
0.014314141852381 -0.058712211175222 0.113567848503741
0.016065557868006 -0.052849606283324 0.109984701360060
0.017196173102381 -0.045368845893204 0.107141363101864
0.009014044196131 -0.063961323264641 0.115705401086981
0.008563421637537 -0.058824440076507 0.113916030916059
0.009047442633631 -0.054019516547829 0.111593137343019
0.001553106696132 -0.063459560738650 0.117210942306603
0.002183721930506 -0.058150550260161 0.114484766628536
-0.008910760491369 -0.062924475315850 0.116039645531676
-0.004012648512202 -0.060410100923961 0.114262604013092
-0.007650506585118 -0.052914605225357 0.111975536166918
-0.014249790439285 -0.063698802165949 0.115334126873869
-0.014140113169940 -0.057505956907021 0.112402738522164
-0.014624139397618 -0.049925457727298 0.109955194130727
-0.024722283928868 -0.059035188569421 0.119549141451590
-0.021443963616369 -0.059174997852585 0.111447893316963
-0.020139666741369 -0.053671660015007 0.110479594647775
-0.021873976637202 -0.046053368824545 0.106371393702591
-0.024784295647618 -0.040960385117954 0.103219459385887
-0.024753045647619 -0.006501212787045 0.072219653946295
-0.031882440178868 -0.073140031602539 0.126869730187134
-0.026385369866369 -0.065286766287018 0.124086092779550
-0.029510369866369 -0.063435997657085 0.120042782294450
-0.028391961663244 -0.057046633583100 0.111853829463460
-0.028104364006993 -0.051889812707943 0.110363532928412
-0.028669638332278 -0.046581742695247 0.104922681537024
-0.028697869866369 -0.040128876385465 0.099716015295615
-0.028312615960118 -0.035027885646798 0.095427771264665
-0.028520819085119 -0.028619128262569 0.089506109522524
-0.028292352288244 -0.021736695606314 0.083496235063276
-0.030039056389806 -0.018956217584195 0.079564315426801
-0.028012445061681 -0.013470168735611 0.076239178230077
-0.027607537835120 -0.009455732335176 0.072950354939327
-0.028299432366369 -0.000125331093501 0.063979484412591
-0.036137729892410 -0.074541093798544 0.130221092781829
-0.035620558668452 -0.070077339883029 0.123106268605769
-0.037051263421056 -0.063277549061778 0.118885306693871
-0.037804803460120 -0.060095290082806 0.113155341154429
-0.036837843824702 -0.052601548127457 0.109249620112141
-0.036046781696726 -0.047791246881434 0.103043218589387
-0.034252882887202 -0.041491552098925 0.098517052519344
-0.034995640048661 -0.036517362525706 0.092203244637726
-0.037909132887202 -0.031274702648514 0.088389426433700
-0.035815057366369 -0.024757355217474 0.082087628945345
-0.035928478125297 -0.019853396588856 0.078275173273749
-0.037568800855952 -0.015085119040496 0.074132481427633
-0.033084344475744 -0.009887696890504 0.068828552832800
-0.035628338616369 -0.002087003372602 0.065094658783129
-0.042169451897619 -0.074998166933541 0.126652119830295
-0.042488397210119 -0.071983233004959 0.122972161535374
-0.043974725335118 -0.065357607021200 0.115798741022521
-0.042429152418451 -0.060325130599215 0.112764591814833
-0.043295526116368 -0.054631233430861 0.107528855098733
-0.043430291741369 -0.050604667806017 0.103244475601542
-0.041432733147619 -0.038645039955292 0.093719801770070
-0.042437615960119 -0.027162662438496 0.082160395046875
-0.042197056064285 -0.021499698325279 0.077360003272338
-0.041918572991369 -0.009442791650401 0.066847686616284
-0.041816522210119 -0.004175491339773 0.062232388545564
0.029882086188319 -0.071904751318595 0.133221655358783
0.029191973883631 -0.065018228676344 0.127676998604562
0.032308477789882 -0.060598702907914 0.122214383323418
0.030700567633631 -0.055733363802092 0.118976852682011
0.027852911383632 -0.050302891211515 0.116462560320321
0.027964727789881 -0.041553079277221 0.107081121728626
0.030194219977381 -0.037975191967112 0.102120016747321
0.031281134039881 -0.034272936372563 0.097909640774128
0.030815802008631 -0.016552933860145 0.082347634350802
0.029897589118005 -0.009886321180160 0.077067215135249
0.030729132086757 -0.004908578463916 0.071929169951777
0.024203009039881 -0.068817453100030 0.134169869295847
0.025308111578944 -0.064619921429025 0.128749882398900
0.023496628831548 -0.059425399943146 0.126628771917360
0.021020880133631 -0.053933978957422 0.119350174706493
0.023457891852381 -0.048953176607955 0.113994785814416
0.025202032477382 -0.043054906454190 0.110798725700627
0.022579718024256 -0.037685774107126 0.103696574634561
0.021969488532069 -0.031359461543043 0.098368596789942
0.022281134039881 -0.027830265691433 0.093892255477357
0.022496140550298 -0.020137513229373 0.089078308745911
0.023199730580060 -0.016326489117888 0.084560158078318
0.024425665289881 -0.008432507108223 0.079567481997877
0.017761969000818 -0.070600780585846 0.135337742268009
0.016260870368005 -0.066181358276750 0.132828172178104
0.017593634039881 -0.055759368525437 0.126034694662191
0.016591518154465 -0.053966155135774 0.121387952680586
0.016965582282068 -0.048178533112042 0.114578913709237
0.016279376227381 -0.042083048626808 0.108826629130833
0.016737677008631 -0.036204477210340 0.106434970994161
0.019318975836756 -0.032689076540620 0.097684573382308
0.016987481696131 -0.026508424204746 0.093211658596386
0.015820684821131 -0.019843692147505 0.091006801896312
0.016724842187203 -0.013992066455908 0.083936482579224
0.016806199144048 -0.010316621075516 0.078761831268550
0.017298223883631 -0.006033468903957 0.074645055916754
0.008815118414881 -0.070810065288637 0.136613685866716
0.008364141852382 -0.064610250298029 0.130438808065884
0.008871954352382 -0.057453708278271 0.123966130159588
0.009658819586757 -0.051762994980128 0.118620925669284
0.007502325446131 -0.047856194776911 0.112743353715384
0.008396298660417 -0.042301578454404 0.109451549199940
0.007351283779465 -0.035610328992394 0.104619247792524
0.009977667243006 -0.030996216082958 0.099828845798233
0.008818080654465 -0.024057635776486 0.093825943503764
0.010484259039882 -0.022413860590212 0.092012402831300
0.007542974860194 -0.014248650101427 0.085280967162076
0.008505255133631 -0.008698277687280 0.080122686591040
0.008188151338988 -0.002951436085837 0.075000879602001
0.003122442633631 -0.068482518373344 0.134875944368204
-0.000037225335120 -0.064440312702478 0.131455050897740
0.000597052008631 -0.058459022320196 0.125945838460067
0.001501654059412 -0.047940981054000 0.113692786805918
0.001790330003423 -0.041806040721265 0.110219791981584
-0.000411004631994 -0.034650472286558 0.104589473137543
0.001275860602381 -0.029477272312199 0.099853417515099
-0.000190789788244 -0.019290000174268 0.090786386577214
0.001738165289881 -0.013528307456823 0.085475621121544
0.002150925706548 -0.008750083293192 0.081152116382625
-0.005902459710119 -0.072008966643864 0.138055271498413
-0.004975701897618 -0.066344727030014 0.132971095504408
-0.004529168694494 -0.056625587129656 0.124267774899485
-0.003843865960119 -0.052286798120790 0.120422464797060
-0.007136102288244 -0.049198840922643 0.114585121266980
-0.004911574293452 -0.042888531987183 0.109429250086390
-0.007401971428869 -0.036886138308407 0.106076035379057
-0.006193475335119 -0.030378316329345 0.100448809654433
-0.007172723381994 -0.024529288429565 0.095025000601239
-0.004983107496577 -0.018100099813119 0.089506800482561
-0.006427484124181 -0.013007914492811 0.084731192960503
-0.006290155022619 -0.004075732008733 0.076714676141685
-0.011852227776525 -0.070604591514399 0.135944198310227
-0.015477166741369 -0.066246103079549 0.130538996748458
-0.009968865960120 -0.057326953408187 0.124093040931940
-0.015290643303868 -0.053874316025789 0.119485396105994
-0.016558709710119 -0.045912084530359 0.111831459736924
-0.013126519768713 -0.042146889407456 0.109319731118990
-0.014217401116369 -0.036303890730359 0.103965384888715
-0.013170595870833 -0.031464479255789 0.099977683955226
-0.015042840569493 -0.024595004674656 0.093143392207227
-0.014887811272619 -0.018646288779934 0.087886973187641
-0.013936541741369 -0.015530657324295 0.085291172739991
-0.011402785230952 -0.007554853694143 0.078905685203815
-0.014439080803869 -0.002681762117098 0.073594859477423
-0.021378045647618 -0.069769556023441 0.135757400503925
-0.021758335361161 -0.064481974825800 0.129431955728052
-0.020602166741369 -0.058262446397368 0.126212632721248
-0.020732456454910 -0.052438443522402 0.120652110437087
-0.020025994866369 -0.047607494114260 0.113160947978857
-0.021410094653300 -0.042112061509247 0.108969434889393
-0.021361077874181 -0.038833733087700 0.104062697058930
-0.020235589592931 -0.031483999949231 0.098796549382676
-0.021793695061681 -0.025624133818122 0.094434790693672
-0.022700897210119 -0.021426468610120 0.088165272618882
-0.020655877678869 -0.014841747118011 0.083891941898224
-0.020332879631993 -0.007999985189445 0.079282243236119
-0.022701287835118 -0.003161445644967 0.072596917338577
-0.030089715569494 -0.070945830357139 0.133585926665339
-0.030589959710120 -0.066516821539777 0.129221826683669
-0.026839227288243 -0.056798782469890 0.123215806080987
-0.027766717522619 -0.053937518639962 0.120024522764740
-0.029223260491369 -0.047701202204664 0.114254657177520
-0.026276971428870 -0.044405563859412 0.109797618068379
-0.029310418694494 -0.035580724666014 0.102268358793541
-0.027236444085119 -0.031749255878387 0.100175029541843
-0.029876790067262 -0.027155464538637 0.093905857415358
-0.027799432366369 -0.021965677003771 0.090936874294668
-0.029190252678869 -0.014964079303178 0.083551734427326
-0.032099237053868 -0.004086363801416 0.071844068212909
-0.033602492262202 -0.072155575753739 0.132659588487037
-0.034059686272620 -0.069691580053580 0.129273011497966
-0.034786248772619 -0.050782949623379 0.112635788204019
-0.034587518303869 -0.045288770957960 0.108272342452659
-0.032748162835119 -0.032314547709105 0.096718795733518
-0.032671990960119 -0.024433042788758 0.088731475310675
-0.032657830803868 -0.011787265912377 0.078037630284868
0.012746466071131 -0.069174038415478 0.140041326537064
0.014842331956548 -0.055447137993404 0.127090754379863
0.013654180914881 -0.050479931856953 0.123311430459637
0.017489630133631 -0.043215838811596 0.115911044868620
0.013487188727381 -0.037576962759745 0.111066508815415
0.013687628180506 -0.021996930221770 0.096978583137601
0.013199835211756 -0.006708859902232 0.083378219492756
0.008923419196131 -0.066972762809443 0.139219988165373
0.009410333258631 -0.059523383926217 0.132911853126342
0.008894903571131 -0.058139129848073 0.130876490027212
0.007609259039880 -0.046627932579082 0.121875763271081
0.011696661383632 -0.043995654085319 0.118689948031297
0.010653692633631 -0.037030562705964 0.111431078893797
0.009402960211755 -0.035145219718598 0.110029947107783
0.007689337164881 -0.015362766972225 0.092597997334362
0.009029669196131 -0.010602789985201 0.087917904964588
0.006369675706548 -0.004772901889923 0.083302779432739
0.001876565897520 -0.060006881157712 0.134193511606878
0.002526739508630 -0.054586200443461 0.128745998830309
0.000904669196132 -0.048586045783591 0.123982901392786
0.004828009039880 -0.043264876276545 0.119449018820075
0.000496221930506 -0.038347774226722 0.113813817400506
0.002024298102381 -0.033154309102918 0.109278029486898
-0.000816522210118 -0.019676705921302 0.097342927453228
0.002097052008631 -0.015882356606821 0.093796501156422
0.003838262946131 -0.008948539310021 0.087407611535021
0.003794805914881 -0.005480784682558 0.084284232840018
-0.008815057366368 -0.065427868951748 0.138481555908580
-0.005567824293452 -0.060740491399130 0.134704259592120
-0.005422845452306 -0.054759402463326 0.129026500220309
-0.005730584710120 -0.048933187457106 0.123834704522286
-0.008801873772618 -0.043664565622022 0.119525777531300
-0.006044340290476 -0.039010617561168 0.113952491180047
-0.004236932366369 -0.034254906901523 0.110345568464710
-0.006136671949702 -0.020789051762797 0.097979773035818
-0.005705438225744 -0.015803696189191 0.093581245493812
-0.007073358147619 -0.009078048153172 0.087387830622273
-0.007819940178868 -0.000799710082542 0.079801832919029
-0.016065382887202 -0.067980414954078 0.139163940285018
-0.013452508538244 -0.061643505994361 0.133424308069622
-0.014735630283035 -0.054017097260986 0.126509016968862
-0.013583367913243 -0.049821778072112 0.123303537850927
-0.011592889397618 -0.043366211295757 0.118704533135317
-0.013937209059077 -0.038719451075468 0.113107314177477
-0.017292108147619 -0.034366492084524 0.107586604030035
-0.012093865960119 -0.026424299830236 0.102052884070372
-0.017287713616369 -0.022725153649547 0.097110424452686
-0.014896112053868 -0.016642153964673 0.092446085691843
-0.016488397210118 -0.010697290001150 0.086576433258684
-0.013133416741370 -0.005197095920452 0.082688881399283
-0.018944451897619 -0.046787566796362 0.119439243289710
