ply
format ascii 1.0
element vertex 1757
property double x
property double y
property double z
end_header
0.144735166474257 -0.002475020997860 -0.056277692997936
0.137124179713940 -0.003978719705623 -0.057522695744516
0.129263789705822 -0.001045613148983 -0.057349803491914
0.143148411478200 -0.010975772670724 -0.058928332341197
0.135074346632849 -0.009520174160555 -0.059772227808320
0.118810758893154 -0.008192398217599 -0.059596826756480
0.115583470924483 -0.005777533712769 -0.060386526310924
0.107751974514138 -0.005016805661258 -0.060430026575410
0.095257049137136 -0.005276042337179 -0.058063173497202
0.092197982657926 -0.001433142199089 -0.058564816105845
0.085711320240987 -0.001613571963352 -0.058341139042858
0.142233093968375 -0.018684168661956 -0.060032062097869
0.134748350238869 -0.019195710798779 -0.061112488631886
0.125968779389343 -0.016173280112486 -0.056702403589569
0.120512617316782 -0.013812808510103 -0.058414463246349
0.111023672409070 -0.014474380141001 -0.059427896702770
0.103455814275563 -0.013373540450412 -0.060072143757823
0.097817282534677 -0.011338292596499 -0.059163540089610
0.089918308689200 -0.008868901457616 -0.057334093841965
0.082472569156966 -0.006549299216831 -0.057927928746226
0.073910168453618 -0.007847403940276 -0.057044336522105
0.068037812059413 -0.003919538984454 -0.057895582402232
0.061834472298122 -0.003163515781769 -0.058977651799205
0.052295028516908 -0.001901172546121 -0.058309167641219
0.045185991888786 -0.002131569666130 -0.058165060246471
0.140282856217500 -0.025679945136382 -0.061543277671135
0.134546619506450 -0.024073858484008 -0.060900823796275
0.124784792761601 -0.024264265705702 -0.057522188389780
0.118028979402680 -0.022077222105314 -0.062022236073496
0.109643592430368 -0.021564975823762 -0.059408549829804
0.102868295035021 -0.019022043500579 -0.059334799016001
0.096490653669844 -0.017827292717051 -0.060545384292287
0.088439870565678 -0.014979531812136 -0.057441178207082
0.080448943503666 -0.013766389366423 -0.058608938420298
0.071332566190316 -0.012301211090224 -0.057499883854869
0.067597265847703 -0.011738832636766 -0.058401925480845
0.057266564988530 -0.009990204097436 -0.057496735458060
0.052800115851097 -0.009827832548155 -0.060285177433970
0.043338380271713 -0.007848994820069 -0.059073599064829
0.038143582664760 -0.005255680987118 -0.060513822758677
0.029939921717263 -0.004195773389817 -0.059939037526133
0.023136285348824 -0.003039113415100 -0.060004780836244
0.012156914877761 -0.003176002457503 -0.062167776310925
0.006635731767346 -0.000380609595322 -0.062098730290416
0.137873460776341 -0.033662694003636 -0.061269300663951
0.130433802151567 -0.033006778638742 -0.061097582829478
0.123876936565669 -0.032956813332065 -0.057137685978893
0.116323792788978 -0.029179038572736 -0.059541650212291
0.108319578250955 -0.028455677942687 -0.061906511509898
0.103061966104209 -0.025469431251032 -0.057449220860485
0.095121742662535 -0.024539663479011 -0.059662840855601
0.085882258105917 -0.022400916857476 -0.059672960484508
0.079992381252825 -0.024562185892171 -0.058631002629283
0.072184606634508 -0.019503780505289 -0.059287373173716
0.064427120125677 -0.018822660029456 -0.058121961796763
0.058554378613374 -0.018110029341611 -0.059626909459117
0.050456418971527 -0.016133078369447 -0.059641981328013
0.043498967134298 -0.016604631836505 -0.057921318893118
0.038151849752137 -0.015163937960926 -0.058141724980357
0.028767542580987 -0.011024743290136 -0.058162609939260
0.021013269929126 -0.009942388730589 -0.059579924680607
0.012976598433466 -0.006817755280037 -0.062091940129283
0.004017681983743 -0.004585579115648 -0.057880003178600
-0.001465179434115 -0.005664322947140 -0.060087203801158
-0.009698034975281 -0.005992306654726 -0.057932300134979
-0.015333840341737 -0.002226995184730 -0.058722409315248
-0.024959360055900 -0.001750107554801 -0.059581751072886
0.137889385877732 -0.041593933877920 -0.059547333602591
0.129356114224189 -0.039958426429492 -0.060441033757213
0.121642720249347 -0.038622645265001 -0.059256562118215
0.115918441184692 -0.035843641881528 -0.060524772465709
0.106374649714418 -0.035705618395677 -0.059735535506887
0.099981138000153 -0.034694675421584 -0.057848706639292
0.093794162243281 -0.031245218048580 -0.058402226514956
0.086227517826481 -0.030369611175575 -0.056291702746122
0.079282858933581 -0.028890227848272 -0.057258790410045
0.068403547004979 -0.028677012587482 -0.058225679600718
0.064830260336020 -0.026885539769274 -0.058487369740489
0.057123843193920 -0.024393908759044 -0.059846443379404
0.048521546960687 -0.023506742841228 -0.058040801823619
0.040690085791328 -0.022696877164377 -0.057985025064063
0.033985773866028 -0.017467260748134 -0.056789213383676
0.021173367319100 -0.018759025305132 -0.057551219507538
0.011839015532512 -0.014870675660109 -0.061085031712536
0.003909939737750 -0.014537106841196 -0.059640913212779
-0.003449346782141 -0.012893281958154 -0.057388580525402
-0.011107402938712 -0.011593906677060 -0.059699693882945
-0.017020363994885 -0.009866255309262 -0.057047168299043
-0.023351047974757 -0.007045423112524 -0.058166764144584
-0.033582647070058 -0.007325951380625 -0.057061327946667
-0.039428913229937 -0.005105871001106 -0.058360094818526
-0.047238061641811 -0.003446600021603 -0.058739156926157
-0.051734265879661 -0.004645883751291 -0.058956098759654
-0.069013545579835 -0.000151184448532 -0.058580710354114
0.135050600623467 -0.049749764166117 -0.058260372365002
0.128239937137355 -0.046678088281721 -0.058925337040903
0.120457397369621 -0.041881093749995 -0.059920339787485
0.112516665659853 -0.044456866039098 -0.059077507222179
0.099930065951946 -0.042106821569087 -0.059508993351940
0.090778430117670 -0.041184315526648 -0.058196039402966
0.083752608448543 -0.039430831925323 -0.058302671635630
0.076838695452629 -0.037873108108076 -0.058400137150769
0.071314327028394 -0.034901009671857 -0.059023575668020
0.059754071768313 -0.032739767515651 -0.058963529789927
0.052667728392880 -0.030687360923389 -0.059203041279796
0.049054860792133 -0.031405628487408 -0.058755994999888
0.035536755969328 -0.030702622915795 -0.058000379765512
0.023867249387520 -0.028185427869922 -0.057635979537650
0.016891585347084 -0.025514265874336 -0.057809940268792
0.009376562386354 -0.024693188138168 -0.058269234542532
0.000809501043641 -0.022579768421387 -0.057400480473521
-0.004170022484010 -0.017117046683242 -0.059899374211315
-0.009703121881703 -0.019476732060994 -0.058771969044687
-0.026971289494948 -0.014896333449487 -0.059194277012828
-0.040886299479735 -0.012854078231206 -0.058935130640351
-0.046861046025996 -0.012304697164976 -0.058705752893769
-0.053692789625304 -0.011883142260512 -0.057697309697154
-0.063943686931113 -0.009356802531120 -0.058154577458385
-0.070326533380432 -0.007516168350011 -0.058571567466057
-0.077758705226340 -0.006125354516395 -0.058214059686057
-0.085049325996151 -0.003756194209851 -0.058810312898109
0.136040789497483 -0.053739449755090 -0.056766935551646
0.128988092476629 -0.053573980422251 -0.057229299748425
0.117145515916949 -0.048722388318985 -0.057322202885632
0.113580768686636 -0.048640603537270 -0.057454912388805
0.107910644196544 -0.048421067950512 -0.057134996617319
0.097870894842410 -0.047219680510982 -0.056891721928599
0.092106619837194 -0.044846316336706 -0.056811605656628
0.078367576634420 -0.041514789415337 -0.057082304203991
0.067764821488776 -0.041944542315563 -0.055932157719615
0.052191412929296 -0.037021441826230 -0.056762090886120
0.044139817506134 -0.036555469485772 -0.056242407048227
0.035663797416307 -0.035432549498088 -0.055983358586313
0.022434643543622 -0.030651402777987 -0.056963587010386
0.013327487871139 -0.030644075299753 -0.056136266911508
0.010899822219075 -0.028850350781034 -0.056737913334849
-0.006485820694717 -0.026556845020823 -0.056204225743296
-0.034394417507688 -0.019781356557057 -0.056765638554576
-0.043857910171812 -0.018905763906471 -0.056308513208709
-0.056051067494395 -0.017697132784919 -0.056707899296764
-0.063725203661562 -0.014429182528538 -0.057357015812876
-0.069153981476219 -0.012164952885071 -0.057459104741100
-0.078808806763630 -0.013055085353398 -0.056068212712291
-0.086665175901236 -0.009564069526684 -0.057117475712779
0.144852603091119 -0.003538383488599 -0.051385612690928
0.139266955421615 -0.004639264397817 -0.052350172245983
0.119247737723985 -0.002953763754687 -0.048242033207895
0.142190227702422 -0.008494085045002 -0.053722654545786
0.136875828799203 -0.009366973198594 -0.054394331181530
0.127972844395363 -0.009309317813963 -0.054968750838919
0.121859957088016 -0.008890442367729 -0.054192686284069
0.113421675314435 -0.005151705913731 -0.052634499435110
0.105176214470886 -0.003712728659181 -0.053642873204234
0.100369856188164 -0.002250523260476 -0.054458123092336
0.091001384501983 -0.001706064654856 -0.054882955754284
0.118417544825734 -0.014586910845459 -0.050169100773814
0.110552757954952 -0.013925801511781 -0.052084926172577
0.105499291376866 -0.010965359240386 -0.054779580510143
0.118815848695648 -0.021038118492534 -0.050645470504446
0.111005005979240 -0.020444460714445 -0.051882189545089
0.105921240694443 -0.021925958083255 -0.054361868107800
0.121684670709919 -0.027339150412533 -0.048729139531140
0.115725812209367 -0.029269055923725 -0.048951736017549
0.109092273517137 -0.028757004890462 -0.053323443425181
0.103800680902833 -0.030389232300358 -0.053853590214732
0.125901193768627 -0.042650288414765 -0.055214964116100
0.120437626784947 -0.041289701386835 -0.055294775212292
0.113326896355413 -0.037184922650134 -0.050544943058971
0.107888289175723 -0.034510627545130 -0.052511131489756
0.100174727686265 -0.035236240850735 -0.054654984359426
0.090263490854042 -0.035197084376552 -0.055306921208385
0.059058161334560 -0.028872466457100 -0.055344846928598
0.045667217047321 -0.025918348159890 -0.055411615574840
0.025384951857451 -0.021857319947532 -0.055423856938364
-0.020569838441107 -0.012560517629056 -0.055455244267466
-0.028495140532701 -0.011074187379203 -0.055437757695201
-0.029420599800766 -0.011131557999209 -0.055364820683482
-0.054203941151597 -0.005778840690183 -0.055485520248097
-0.061366575160684 -0.003350776054564 -0.055098081791880
-0.068787821310062 -0.001223476448243 -0.052879562581065
0.132360189347958 -0.047310964686176 -0.054104978764538
0.126806778472816 -0.043000684170003 -0.055159834111215
0.112184441475031 -0.045294873137312 -0.051156938755992
0.105371510035025 -0.041298534205357 -0.053465060755097
0.099725896015353 -0.040825906206730 -0.053347718971785
0.090570967399350 -0.039674814125512 -0.053785215580943
0.084023047907981 -0.038879243428247 -0.053595696334523
0.078364709438812 -0.037705687668745 -0.053643408024792
0.071660566135401 -0.036216324465257 -0.053731985295300
0.062115735912532 -0.034221655171062 -0.053683288141571
0.053355476009093 -0.031497675075584 -0.054085046208384
0.046371178410165 -0.030524811341598 -0.053946500981334
0.039009673265193 -0.028568021538401 -0.054113842213633
0.031817622610036 -0.026984470150177 -0.054188116276744
0.024515367670911 -0.026010641459303 -0.054509927952769
0.018046171752464 -0.026207755073037 -0.054312287215871
-0.005327657415564 -0.020434023375171 -0.053797657851858
-0.012259270049560 -0.019837523867705 -0.053568462574961
-0.016697971597307 -0.017633241671398 -0.054048478011769
-0.024786283877836 -0.016072401991828 -0.054025494206432
-0.033052611405378 -0.013825707154712 -0.054255489552501
-0.041548758438213 -0.015974245157254 -0.052768636906625
-0.049529465191808 -0.011627465526907 -0.053878565037731
-0.054456413784752 -0.012536432915769 -0.053841114883108
-0.062904688632534 -0.008856695003265 -0.053454707666718
-0.070594501797163 -0.005541915410076 -0.053817445195201
-0.077404455328664 -0.007425728192080 -0.051908917312307
-0.086459134836772 -0.004478485464042 -0.052587764307342
0.135174823409151 -0.056797231317370 -0.052771238530162
0.125230277375578 -0.055628305845877 -0.051250044072154
0.110668988653071 -0.052614061585950 -0.053252878392222
0.105914106583516 -0.050442833400958 -0.051035753877113
0.096819383285260 -0.049412800765084 -0.050428494084361
0.089557575831006 -0.046418937256334 -0.050636114323619
0.084892893506521 -0.045417634671323 -0.052181770800321
0.073066940819381 -0.044040861809823 -0.051044367039683
0.067319666855715 -0.043196781159566 -0.049996781234427
0.061998514261779 -0.042068390561964 -0.050866164728486
0.052984183533031 -0.040063909566230 -0.050045116627696
0.046026130613604 -0.039823504884482 -0.054776207809133
0.038631903653904 -0.036466939304637 -0.051388649825734
0.030585787887454 -0.036524879517687 -0.052228479588512
0.022833060255562 -0.033918866547745 -0.052566008664982
0.016460469486891 -0.033432351974631 -0.052253942692759
0.010708843540283 -0.032846418987924 -0.054758222783092
-0.001052039209704 -0.030888716845650 -0.052434128646536
-0.003728444977482 -0.027466384867089 -0.050796728337290
-0.013745394583206 -0.028119698891807 -0.049381426060680
-0.023276373722275 -0.023613033852069 -0.050846426213269
-0.027951379136369 -0.024337878726205 -0.052537117843314
-0.034792689113638 -0.020892255843661 -0.051054107487681
-0.041140882399924 -0.022400439885943 -0.050358303908988
-0.050572286756541 -0.019165194368757 -0.051329807103160
-0.055860931586270 -0.019151079657553 -0.052364411239309
-0.065807593028440 -0.016631156803391 -0.053025702997528
-0.072136238081377 -0.015286556845617 -0.051050439401947
-0.078650756054095 -0.014854572769232 -0.053642172910587
-0.086842817828382 -0.012326345457647 -0.050768549168589
-0.090759376131772 -0.011339359374119 -0.048709707463267
0.132403852030588 -0.062549875634021 -0.050573881352427
0.126386069838670 -0.062969789209782 -0.050791898930553
0.117344463069642 -0.060217260531517 -0.050966205164276
0.109372092805228 -0.059476470212813 -0.050826360905650
0.104358724337912 -0.058199210146997 -0.051368581974986
0.095282892063805 -0.056622177825347 -0.049376547062877
0.088779327765483 -0.055615298467607 -0.050172219161673
0.083852185387044 -0.049900203763419 -0.053356626713757
0.073912127011626 -0.050427672710768 -0.051722504501028
0.059170735048116 -0.049951142048419 -0.049996252263073
0.048518054521853 -0.046533474632307 -0.050992162907604
0.044163547703211 -0.044914564337469 -0.051521326268198
0.036532085264480 -0.045930946453540 -0.049674843673391
0.029067635597889 -0.043277395716478 -0.050552381718638
0.021329267870626 -0.040657312302825 -0.049242288792613
0.015662364601220 -0.039397667790567 -0.051130326664927
0.008040074323409 -0.038059729300341 -0.051229576949758
-0.001632348440236 -0.035583984093343 -0.050498482589407
-0.006879563775345 -0.035961021132199 -0.050561880314829
-0.015123241892445 -0.034773794747916 -0.050497698033335
-0.023941879750838 -0.033020654308929 -0.050852926457407
-0.027902897465630 -0.031275647569115 -0.051039762700085
-0.037025712965538 -0.028061226236386 -0.052101610386852
-0.046427803919975 -0.025724385248467 -0.052287771428112
-0.050970597983232 -0.029255590587237 -0.050140070164683
-0.057484840491748 -0.025882808481130 -0.051056056035044
-0.067230673143395 -0.024663963003809 -0.049978117192271
-0.072940574234658 -0.022502544760551 -0.050899634373667
-0.079014507799862 -0.019500727312819 -0.050844398974149
-0.087746736043408 -0.018813454476421 -0.050779893533300
-0.092222920459713 -0.018802213151367 -0.049838133061413
0.131809696508596 -0.068121503943615 -0.048359335148813
0.124040702129648 -0.065471431842399 -0.048323538029673
0.107368521707507 -0.063272796030767 -0.048345648015025
-0.015959294297954 -0.037729244735828 -0.049125684941294
-0.030319845719985 -0.038476669663734 -0.049952507857961
-0.039568385596439 -0.035285489893146 -0.049075271809582
-0.045462095456836 -0.036589823695318 -0.050834181035046
-0.052320267340654 -0.034033553261333 -0.050914613926890
-0.061014277370058 -0.031018143248151 -0.050243753636362
-0.067430199749453 -0.029772554544322 -0.049675348484995
-0.075897431269548 -0.032039357677377 -0.049843000615123
-0.080848667896255 -0.028541735970071 -0.049328291142466
-0.088116658870456 -0.024232051939365 -0.048666937077525
-0.092704373504931 -0.022398979204150 -0.049207662785533
0.122565623933763 -0.006979677580296 -0.043396093571666
0.116012109931840 -0.004879049155922 -0.047269163334849
0.126544584632301 -0.013954280396360 -0.041946787083627
0.120500286318275 -0.015046863073674 -0.045436201298716
0.123556012397643 -0.023872483309933 -0.043667894142683
0.119222962313426 -0.024263667575922 -0.046095541203500
0.122409217636086 -0.029242290536065 -0.045568630421641
0.118484803022380 -0.029725386489575 -0.045490931523325
0.121115767090915 -0.038315120961414 -0.043569508437795
0.114985441840634 -0.035911137420345 -0.046025348866466
0.118295707690032 -0.043523147172889 -0.043969488347055
0.114319571542306 -0.045954643787941 -0.043226239089651
0.108928168243782 -0.045700853814554 -0.044960989201548
-0.071494734643942 -0.007360111541698 -0.048093488896373
-0.078288674704395 -0.004827570251157 -0.045286104405407
-0.083483107580155 -0.004108723846001 -0.042612024510386
-0.095110577471522 -0.002970546858366 -0.045338928425792
-0.098251764591851 -0.001643512352499 -0.044020857823375
0.111176757683638 -0.050297019055874 -0.044400867029511
0.105688891898863 -0.049003170164146 -0.045523875030929
0.097578377517154 -0.049749803025210 -0.047543391748748
-0.006848562824234 -0.031634174106013 -0.048029089177134
-0.069684817661859 -0.014461973808121 -0.046624281132700
-0.077410460364667 -0.013204540233143 -0.043047773564341
-0.088216964613172 -0.011692735211100 -0.046255033696176
-0.094728531798010 -0.009857481948020 -0.043806375161718
-0.099366090387800 -0.009775984868790 -0.041001451695445
0.134212379311756 -0.063608508634734 -0.047240827763560
0.124922720093435 -0.060273859729623 -0.046329202855113
0.107527433307670 -0.060448255867538 -0.043431259994191
0.103243048879362 -0.056315012109041 -0.042762943198479
0.095488496244278 -0.055820883449799 -0.045476174875580
0.087741063001475 -0.054253354283820 -0.045245008671763
0.080601536691334 -0.053089439585707 -0.045056528294566
0.074578673098569 -0.051581009772670 -0.045320763473195
0.067398922729108 -0.049329097387731 -0.045967298710825
0.061027187531055 -0.047528486055540 -0.046211304549856
0.053210691875144 -0.048218747147232 -0.044625851262095
0.045170482446663 -0.048335761838570 -0.043152319157602
0.036421283713976 -0.042451224777509 -0.046490257084850
0.029897305478327 -0.043045344353754 -0.044908704960826
0.022092198981505 -0.041553848215084 -0.045012450739228
0.014542445756114 -0.041302016667917 -0.044705303395274
-0.002403387488963 -0.036335037386299 -0.046327131474498
-0.006926437824946 -0.035659311616907 -0.044985088932994
-0.012917523021653 -0.034302391771477 -0.045238770370168
-0.022794815561674 -0.033436839871943 -0.044294261499726
-0.029298116340257 -0.030088056515489 -0.045969869816783
-0.036568274398042 -0.028879031915526 -0.045701631749157
-0.042970559906410 -0.028975240381825 -0.044646501744273
-0.053518227208351 -0.024623548891167 -0.046366020405772
-0.057358778238918 -0.027168233908274 -0.043748565495494
-0.066327155027939 -0.023359103445882 -0.045146413370453
-0.072427561823770 -0.022253441016734 -0.044643029098195
-0.079676958237075 -0.020553976413772 -0.045445597321937
-0.088326600352243 -0.019959187814546 -0.044474472630504
-0.093001337223868 -0.017580987630743 -0.042600244725230
0.131510929841787 -0.070231071544234 -0.044623491490366
0.122658711023604 -0.069723603962644 -0.044228541168625
0.115284757836509 -0.067498768589061 -0.043683137333873
0.106850095972900 -0.066677506430398 -0.044414442265513
0.102963600205184 -0.064219968202232 -0.046714559758190
0.095200213842944 -0.061658085088084 -0.043612472355844
0.089216718987947 -0.062009826449165 -0.042297875798228
0.078847308376962 -0.057862271363041 -0.044750738347056
0.070330502257815 -0.059851662088203 -0.043281095707895
0.064983051814446 -0.057182430695236 -0.043259610379222
0.057395753292342 -0.054154208264484 -0.044251323267304
0.051313892155559 -0.053369114567863 -0.041689044519745
0.034932821319775 -0.049812091615115 -0.046188707554820
0.027004455509960 -0.049424896518504 -0.045157781804088
0.020355929623407 -0.047902038978625 -0.043741547469778
0.010594278812058 -0.045476086485689 -0.045743098779999
0.007441790956581 -0.044918550328470 -0.045722051823620
-0.003172008652768 -0.043791854906882 -0.043175224295407
-0.007580572877820 -0.040336736221549 -0.044462970664299
-0.015899015815055 -0.042563715186917 -0.042054121220591
-0.023970218614160 -0.039800924234494 -0.044968372929576
-0.031051222410579 -0.036925518097886 -0.044763241653127
-0.038698544924137 -0.038518032206008 -0.044169184887889
-0.047168180162782 -0.033406012111950 -0.047578344548227
-0.052235608015088 -0.034397840640641 -0.045255212224009
-0.058988215217894 -0.033259577482079 -0.045282563603404
-0.066322327809471 -0.030380871440495 -0.044294814312938
-0.074296285074151 -0.029311739429572 -0.043804096636987
-0.081316187712244 -0.028723255382486 -0.044856241722770
-0.088856810063716 -0.026246935812010 -0.045196188811941
-0.093811080216707 -0.026783928570391 -0.046889745915414
0.106508598648895 -0.070414127037188 -0.041104917729381
0.101725561058392 -0.068835932025066 -0.041816381657603
-0.060029499689486 -0.037570416873080 -0.040714613163952
0.129885658454445 -0.000851144657006 -0.036993908131602
0.128211940620812 -0.009309083674657 -0.036528362477306
0.130630396223467 -0.019630841976603 -0.037018339360241
0.127388240098953 -0.013896029765884 -0.038358671391490
0.132126255998675 -0.024843881761426 -0.035523517811778
0.125804980527310 -0.026104613258875 -0.039596044743539
0.129892778146425 -0.030757954461201 -0.037690057957652
0.125410530814519 -0.032553726273105 -0.037969962895397
0.123790246436740 -0.038698044216928 -0.036665516102794
0.125394035786219 -0.045795621382301 -0.035003751957897
0.123345198229472 -0.043179880797343 -0.036888281071666
-0.086539220181344 -0.003880101879835 -0.036390812759085
-0.091138185727809 -0.000186410407220 -0.033428205693247
-0.101554586731138 -0.000163598685393 -0.039292785847667
0.118029308598256 -0.054086251755924 -0.035677950108530
0.112721563074751 -0.052928001970420 -0.037158128941539
-0.080326068389786 -0.015028943009301 -0.037929844105724
-0.085283989315971 -0.010908553888316 -0.038067503178598
-0.097458636037270 -0.012809673717207 -0.039205450261117
-0.102073314454858 -0.008484703925296 -0.036208818093848
-0.105911973805078 -0.007204002353655 -0.035413886591278
-0.138060886233418 -0.001065411456060 -0.035155625228567
-0.146958795839722 -0.001587098061281 -0.036489327315970
0.110344637970885 -0.059514427184508 -0.036419233525279
0.103203910605884 -0.058499212882589 -0.036758375370981
0.098779415942510 -0.059867653257671 -0.037732526982310
-0.074149388270461 -0.023443654160953 -0.038722699050588
-0.078967691898632 -0.020955266420421 -0.037488526229544
-0.087447490175165 -0.022628666677399 -0.039659284794811
-0.095455336179997 -0.018559736138689 -0.037886432215058
-0.102399491270382 -0.014247409812163 -0.034908608067516
-0.147133786324067 -0.005442302714831 -0.033475156987194
0.130894401117149 -0.073821754496334 -0.036463266575816
0.123987594682381 -0.071642637358220 -0.034979124272350
0.114521034522345 -0.066858001771629 -0.038436773503306
0.108052377580883 -0.066586250489555 -0.036096365178112
0.099228014379184 -0.066057837075789 -0.035260900700572
0.094711025602861 -0.062927088071841 -0.035640176658315
0.086926208876424 -0.061835200645577 -0.037934954655650
0.078994049304013 -0.061142995134805 -0.036799554483008
0.071556895056828 -0.059382440604415 -0.037257856572154
0.065669108045070 -0.057865697988557 -0.037555341923715
0.058799785864955 -0.056749141193975 -0.037305438562715
0.052102000910388 -0.055609079456387 -0.036960492337230
0.042832445374020 -0.055230339985684 -0.035286224186900
0.035071132134892 -0.051964996211163 -0.037293078943573
0.027898516809389 -0.051666976995915 -0.035940506184581
0.020719871632350 -0.048972553040971 -0.037962425435069
0.014793991732669 -0.047310474797115 -0.037986026331269
-0.004838511255698 -0.046880300921739 -0.033766843998911
-0.008628005389054 -0.043888799874692 -0.036609412968638
-0.016877709116308 -0.042031069085555 -0.036811939824108
-0.022810349438210 -0.040603414119266 -0.037149490559581
-0.030502325719045 -0.039672917452473 -0.036463894093516
-0.038974730187190 -0.037581781455651 -0.036956379775686
-0.045355947866410 -0.036816548676096 -0.036234832585337
-0.051232967159119 -0.033959710232344 -0.038292440617564
-0.059626666487787 -0.033331886475696 -0.037448614323618
-0.068002020234581 -0.030399733540605 -0.037432750269257
-0.076740255266858 -0.029413713249330 -0.037485442841532
-0.084222763682283 -0.028285915653830 -0.039183602218313
-0.090097649069003 -0.027626535507651 -0.036412619187011
-0.093914270389883 -0.026088819751482 -0.033572942936899
0.132123899141402 -0.077312903206911 -0.035910909855845
0.124687118343702 -0.075729543971236 -0.038245804671927
0.116685139457837 -0.075260662894378 -0.036326330388073
0.107024594837795 -0.074344961452792 -0.035450536931040
0.099028653496112 -0.070325473121666 -0.039369028294566
0.092888090931600 -0.070752784899270 -0.035197846615794
0.084346474392116 -0.068034533959379 -0.036630733057342
0.078562393342748 -0.068041669498949 -0.035030462468150
0.065086606150353 -0.063546847455545 -0.037824540023488
0.055322916680158 -0.062391327516115 -0.036822954380990
0.049311468453680 -0.061886090247124 -0.035581690037731
0.041767829590240 -0.059175549452635 -0.037420484745982
0.025757358502429 -0.057072043608138 -0.035924961674693
0.018703099074515 -0.053426336141494 -0.036325739109995
0.014363857763723 -0.054134039900210 -0.034950786157929
0.007029037537607 -0.052361708388589 -0.037042371953014
-0.003707617603745 -0.049803457262579 -0.037164428914073
-0.009453114784936 -0.048462388935812 -0.038123705876353
-0.024729544847229 -0.046561830059397 -0.036589587732636
-0.032836909599760 -0.044794012551835 -0.036874145710948
-0.041350817827786 -0.044297481637134 -0.035186238174123
-0.047185789037661 -0.041060644738540 -0.038010084355357
-0.050131622879803 -0.040079889089634 -0.038606291020396
-0.060690032821625 -0.038412071104815 -0.038570459568980
-0.068722140596258 -0.037246908106855 -0.037055487972126
-0.076916764927607 -0.035444125206971 -0.036552972996714
-0.083941890788373 -0.034149857401531 -0.037334846699718
-0.089912032715184 -0.033367952270448 -0.036165098938400
-0.094707517990511 -0.031973902855789 -0.038089597905162
0.134340785006247 -0.003362671220230 -0.027022106755260
0.130452967002552 -0.000281897130125 -0.029656140212697
0.139439256580765 -0.010343021657838 -0.025854074681283
0.134469034710563 -0.009613885935805 -0.030086162770275
0.130938209250948 -0.005891993080765 -0.031796591008187
0.137729735111665 -0.020947152686980 -0.028315477574352
0.134252708931598 -0.017105276272128 -0.028300154889111
0.133989342757076 -0.025765465197820 -0.029225591862681
0.136736708652382 -0.030196776768369 -0.027620332921031
0.130942976601192 -0.029979620834787 -0.031574116592093
0.134029417072582 -0.038924195919057 -0.027239223683361
0.130161575321554 -0.040424093224453 -0.029110313346184
0.127184926703205 -0.047525038898442 -0.027854467118266
0.122639774082027 -0.048004992064532 -0.030743124974254
-0.092618560905383 -0.001812142300847 -0.030268469059947
-0.109204634658162 -0.000180506453009 -0.029262685978893
0.124701345962051 -0.053154918475266 -0.028118265355112
0.119819509606344 -0.054255901083194 -0.030272043431285
-0.088139122219332 -0.012037544978654 -0.030054704392435
-0.090986434166677 -0.007666630770575 -0.028742588246348
-0.103807041707782 -0.010791663045201 -0.030964201176647
-0.107829169126186 -0.008959176541370 -0.030268339360240
-0.116160407374580 -0.006639355534792 -0.029648520482066
-0.122719645506764 -0.003980211180550 -0.028851756775859
-0.129005721193807 -0.004161496455916 -0.028546222254120
-0.139020467484823 -0.003930657166965 -0.031016655807180
0.120155515169442 -0.058863850392467 -0.026797193730356
0.112270511809699 -0.058826803833677 -0.029536813303314
-0.082302767086624 -0.022358011166680 -0.029243667424205
-0.085679750883080 -0.019184082178291 -0.030542612278941
-0.102197489225883 -0.017207962457504 -0.030183228219036
-0.107896282909124 -0.016094813651816 -0.027210756505016
-0.135150466711289 -0.007249923925356 -0.028105802739147
-0.141718977843034 -0.006283395494466 -0.031581106389049
-0.146946739243263 -0.006338793037733 -0.029533336461070
-0.152456100792152 -0.007612665776534 -0.028182848179820
0.107291057089142 -0.064716293151736 -0.027682498317585
0.102884873198543 -0.063750396201137 -0.029936695302013
0.095799794162162 -0.066170353120626 -0.029977582371715
0.027593723553333 -0.053828325077744 -0.033100462162973
-0.070832247305106 -0.033470553416640 -0.031027610981944
-0.074502388711545 -0.031318997066683 -0.028178816044809
-0.081342684946334 -0.026238006572794 -0.029906985486034
-0.095999495853404 -0.025966002369154 -0.029148606609453
0.130482352576082 -0.079201525718679 -0.031099976933482
0.121813576286049 -0.077793730183055 -0.030384708989146
0.115547555756022 -0.074478536977870 -0.027985019886972
0.107088201311530 -0.075455316958048 -0.031178353703501
0.101382690399899 -0.071351184627933 -0.030462973797801
0.093197963715003 -0.070293699102067 -0.028889081013682
0.085302297999600 -0.067643472221872 -0.029391892064098
0.079092750598826 -0.066698138221832 -0.028867380345347
0.069745324889639 -0.065121820911657 -0.030221403325084
0.063311885506647 -0.064880838746017 -0.030220358098033
0.055881851734027 -0.062880123746390 -0.028976637725515
0.050298091038809 -0.060925344683354 -0.028893720829966
0.042834295594970 -0.058653109120046 -0.030331183954559
0.032486545087322 -0.058728171989820 -0.029592511062307
0.029587413300384 -0.055263403978679 -0.031547098362924
0.018952847799281 -0.055437855998460 -0.030156708348278
0.010147011829929 -0.055188854650352 -0.030952445914544
0.003172521540249 -0.055531774815806 -0.030809707844736
-0.005335287197848 -0.052233510794871 -0.029394706547740
-0.011183545201575 -0.050328576909100 -0.029708094227794
-0.015772932850760 -0.047308054634342 -0.029751966679576
-0.024655549664157 -0.046154374152491 -0.030003217900280
-0.032040991137190 -0.043781476831252 -0.030200573806448
-0.037620250958267 -0.045168314012247 -0.030678417408945
-0.046364686648265 -0.041847650295125 -0.028575782025340
-0.055068793414044 -0.041378338579047 -0.031122956479075
-0.060936138980370 -0.039770718401102 -0.029534506047252
-0.069324123158297 -0.037286667104882 -0.030076675830102
-0.076606482410097 -0.037969814715484 -0.031082641804698
-0.083303335412871 -0.036418702700993 -0.028847877069794
-0.091045188311056 -0.034530445046382 -0.029880844864303
0.130411339529302 -0.083318935064052 -0.027099285328868
0.122394667058210 -0.081688142864500 -0.027914093856497
0.107851268924199 -0.078563516624362 -0.028366975987437
0.101823672747670 -0.077156884518391 -0.029760901972136
0.093561219971657 -0.075842125607277 -0.028914116108898
0.085625796189346 -0.074749570587913 -0.025971140110971
0.078568989721075 -0.072944121780277 -0.026807422841075
0.063130944013639 -0.069171338945136 -0.028255432332043
0.047430983580586 -0.067127008704397 -0.026003187382700
0.029707626032607 -0.063626754982497 -0.025928812230112
0.020563899256909 -0.060607147087401 -0.028460663044933
0.005190634737783 -0.057154421782090 -0.029202863896372
-0.004137629763043 -0.056964711489189 -0.025755850041391
-0.012988950399424 -0.054406025212884 -0.027473541462901
-0.017969522036776 -0.053349114233979 -0.027599987868948
-0.026700048777604 -0.051515922125918 -0.027854341710092
-0.033377418443459 -0.050385853921410 -0.027430673802378
-0.046723789408742 -0.047520506292052 -0.027852945530895
-0.065920102243165 -0.043767838097565 -0.029785009587289
-0.070923000547909 -0.042315510031816 -0.026575970534963
-0.076758062525825 -0.041982432110618 -0.027722861175223
-0.084539663480388 -0.040676778127541 -0.027445467834158
-0.095979359143656 -0.037689608544017 -0.025936380589488
0.137918374440176 -0.003294171370786 -0.021434362614635
0.140479831338474 -0.012105279640393 -0.022041130269053
0.136962520968039 -0.010364022208993 -0.023312020504955
0.139456317927890 -0.019757221847159 -0.021619463170054
0.137812957795711 -0.016834561656238 -0.020358343327526
0.138242045038810 -0.026816202930578 -0.021859207992238
0.135014031106283 -0.027765894629371 -0.024939586842540
0.137342261464383 -0.030783462656924 -0.021701360905650
0.133601516433986 -0.033387902778507 -0.024942157948495
0.131792981314157 -0.041391463088247 -0.021581407750132
0.132855379640315 -0.047921251127616 -0.019751571858409
0.129420724338230 -0.045323957514290 -0.022298526013377
-0.093306713448039 -0.003768508776717 -0.023130959141734
0.124425342585006 -0.053819158335852 -0.019673471653941
0.120977979706627 -0.055277165462410 -0.023787676060681
-0.090271327306259 -0.012125707832405 -0.022099743092539
-0.092679334427550 -0.009511707524120 -0.020455898488048
-0.110188783403407 -0.009220311342295 -0.025362932408334
-0.116035838175641 -0.006057988273093 -0.022849729317244
-0.124209403313060 -0.004389800651810 -0.022301884173123
-0.130520351827116 -0.004164796486837 -0.022218136036876
-0.137383083516590 -0.005534326966873 -0.018890951359750
0.118703210267495 -0.059464124166224 -0.022295334701223
-0.085638761634513 -0.022460727073434 -0.021402509892467
-0.092079736791662 -0.017038692994584 -0.021660179341319
-0.104492819590602 -0.016666061842909 -0.023048849308970
-0.110541847217965 -0.014364949502233 -0.019993581339204
-0.114400312466390 -0.012049314061666 -0.020191586379691
-0.123834917448367 -0.008518971849875 -0.023278288090707
-0.132211137130190 -0.009702515794904 -0.019243870938304
-0.138206754787378 -0.006807773561406 -0.022689133529349
-0.147435235766932 -0.007504663498873 -0.020578834101044
-0.153228719827345 -0.005480039495417 -0.019743147099496
0.114262493826123 -0.065724171944032 -0.021907680714609
0.108819572762979 -0.066356342466058 -0.020427880172414
0.102517266504282 -0.068479882596131 -0.020870456898692
-0.082254754677390 -0.028453511672751 -0.022239496434214
-0.087679455366987 -0.025219788738950 -0.021492417220754
-0.098190020518470 -0.027760040929926 -0.021902263844494
-0.102593702326220 -0.024140167577065 -0.021853075866385
-0.107591582827707 -0.020206903147944 -0.020302614415171
0.129950636847110 -0.079884126889423 -0.023584900105480
0.122897614161873 -0.079018246165699 -0.021392082417492
0.114754095469201 -0.077093468146045 -0.022137891972544
0.107127226719385 -0.072423647485164 -0.019574816906931
0.099581681691882 -0.071209380812008 -0.022821264470103
0.092262825519591 -0.071689946664545 -0.021829151356700
0.085173826235521 -0.071762794623932 -0.020548666203501
0.077426900117739 -0.069227534691777 -0.023194059575084
0.068420428746259 -0.068343611677572 -0.020859248682342
0.063380985465014 -0.066833482868642 -0.022046881560965
0.054590245561991 -0.065116874371565 -0.022112337315562
0.047586361907002 -0.063426923657662 -0.022694567883494
0.033786673994761 -0.060891879167067 -0.022269396667166
0.025554900475169 -0.059138633295992 -0.022476478507317
0.019459484057880 -0.058119646581809 -0.022044481480600
0.012939790297449 -0.057011773378161 -0.021570070469859
-0.005749348770001 -0.054507858116730 -0.021540003026011
-0.009164274939683 -0.052462328277929 -0.021867109501842
-0.016980259344209 -0.050525700504999 -0.022955040181164
-0.026286861742596 -0.048881556858961 -0.022422514164928
-0.033417098566074 -0.047117227547182 -0.023215565566702
-0.039060501132456 -0.046246305277814 -0.022563359463695
-0.047419371383564 -0.045248870988971 -0.020973745549204
-0.054604486275602 -0.043284974834535 -0.022227267786346
-0.061603542573797 -0.042386391520471 -0.021073367321971
-0.069171929253344 -0.039384168066048 -0.021982085431102
-0.076389089270251 -0.038364848209236 -0.020874268734934
-0.083818310683203 -0.035814303387915 -0.022031163282533
-0.092607873507165 -0.034046392353736 -0.022069964612010
0.129881547278057 -0.085461996941627 -0.022468911056204
0.120528806009450 -0.084209824418976 -0.020376292749725
0.113181614892547 -0.081755171986109 -0.023181133473400
0.106534211226784 -0.080527014315371 -0.022894618555390
0.099511153488842 -0.079745131545941 -0.022407061779978
0.091181673989149 -0.077573272084437 -0.022881900990489
0.084233887970345 -0.076772757101805 -0.019964428151133
0.075186498988554 -0.073710578926958 -0.023477960789683
0.066452104490753 -0.072482497571633 -0.022185941899301
0.061038877202184 -0.070910132783883 -0.023456352437022
0.055508733576165 -0.070671394557511 -0.021172353947642
0.047787374021158 -0.069205966034232 -0.020916040623667
0.038878416714461 -0.066840679252795 -0.022568876469616
0.032792807775692 -0.065814130928947 -0.022074648106577
0.023132679602681 -0.064518405952102 -0.020309198582651
0.016625320639874 -0.061981758436788 -0.020286576474193
0.010947415468567 -0.061556059958523 -0.021512374127392
0.004706711172911 -0.060311844071298 -0.021695561612132
-0.005544806648286 -0.057207546211103 -0.022108474934579
-0.014201151268965 -0.056396752668499 -0.022244775975231
-0.017036186103423 -0.055145965928655 -0.024015604222301
-0.022620339433632 -0.055501202958019 -0.020062132084848
-0.033690655008555 -0.053309635071522 -0.020010256016735
-0.041944123204152 -0.050956494460223 -0.022072385991100
-0.048687862357371 -0.049315377298644 -0.022857290471080
-0.053760069589467 -0.047715507870193 -0.024307834828378
-0.061208235457255 -0.045890295016512 -0.021228999658905
-0.071881249210692 -0.045447700985436 -0.022798001174611
-0.077581235603534 -0.043270059766850 -0.022013891423228
-0.085162941876524 -0.042020813581477 -0.021827025510684
-0.091791961900160 -0.040515858696376 -0.021173205896698
0.141508148978993 -0.004941851456529 -0.013908379439992
0.136936442648491 -0.001339294879812 -0.014858623071991
0.140853778491120 -0.012498948387068 -0.013069564386688
0.138631821391365 -0.010308866013095 -0.015945476735119
0.140530887056569 -0.018322594707538 -0.014038176930431
0.139615150438642 -0.026988267585541 -0.014974905217173
0.138823639387769 -0.033938446163148 -0.015421609128001
0.136296458293860 -0.042096798223906 -0.015180371351381
0.134593396352590 -0.046478198994328 -0.016655363286019
0.129810215704296 -0.048242024083396 -0.016690473759655
-0.095277980917310 -0.003162026273875 -0.013415075505258
0.131290057711431 -0.052011356732011 -0.015964229786877
0.126225129515627 -0.055502726290121 -0.015263780034069
-0.094263009490180 -0.011111017195568 -0.015044377720835
-0.112037437058214 -0.008936976375417 -0.017630869114878
-0.116028307961299 -0.006665532172368 -0.015788274205210
-0.123350079302797 -0.004542274916446 -0.016427854741098
-0.132157793783281 -0.002475174271707 -0.015806076252940
-0.139870770360373 -0.002661403458879 -0.016801140988352
-0.145690051264485 -0.000738311916459 -0.014903716290476
0.124826310918158 -0.059546329096926 -0.016684909387909
0.119031992656123 -0.062140731850672 -0.013792331898693
-0.091460391641974 -0.017696825269522 -0.015106065953258
-0.095171704318605 -0.016862680709682 -0.015696488265675
-0.102883615847919 -0.016342966917956 -0.016184005304657
-0.112268614383758 -0.015816758737653 -0.014894762242321
-0.117769012225096 -0.013458082164624 -0.015201533414737
-0.124881043763189 -0.012045955687090 -0.014281040182859
-0.132478404641799 -0.010055658564450 -0.015611006463054
-0.146399926093576 -0.004775126090079 -0.017359883193654
-0.153335206307649 -0.006027897418811 -0.017643552983287
0.113858608203120 -0.066805228747165 -0.016227981134735
0.109982259814694 -0.067622042306153 -0.015006921971324
0.104656720319689 -0.069062019378075 -0.016490232670786
-0.082973672259933 -0.029322965422150 -0.014980967724803
-0.089891438247704 -0.025660946124310 -0.013444536412242
-0.100002322658581 -0.025610164159701 -0.018024309361461
-0.105017207555692 -0.023527832385348 -0.014516112530711
-0.111609073024845 -0.019447851365145 -0.012492445195199
0.105970329512173 -0.072517002570442 -0.014282546564423
0.101292352261970 -0.072216437755341 -0.015616209233287
0.094052215568326 -0.074117570216834 -0.013919067967418
0.068609355171193 -0.069526240144020 -0.017562189305308
0.043556830558101 -0.064522322503716 -0.017646564686778
0.028310079779517 -0.061587382195187 -0.017270395482068
0.014492701719402 -0.058664688278442 -0.017847486699107
-0.021412951433710 -0.051609981998981 -0.017537515843395
-0.027928785268603 -0.050194667650199 -0.017936655247691
-0.041638047534551 -0.047549372786067 -0.017683595860486
-0.072315396641832 -0.040408759296678 -0.017883424962047
-0.076938448780900 -0.037259319239842 -0.015336431706431
-0.081197611462799 -0.035458741633137 -0.016748693669320
-0.091196524707437 -0.036113568949615 -0.015115802332245
-0.097812712987475 -0.032371504884537 -0.013446732797552
-0.101755847060239 -0.029530157673839 -0.013863418782237
0.127265102229694 -0.086240128934563 -0.013946846483915
0.121721023172357 -0.084490781714859 -0.015057420933726
0.113306133144295 -0.083889816831585 -0.013829647903128
0.106646943969968 -0.081602136252215 -0.015712463582042
0.096467558371308 -0.079917858080044 -0.015842356884959
0.091073852025083 -0.077055662738536 -0.013057730804520
0.082588883763299 -0.076474254611774 -0.013768273238821
0.077421097777291 -0.073720115718930 -0.014356189295136
0.069769103316866 -0.072037424381518 -0.014055928297182
0.063310044936918 -0.069147649390568 -0.015006509984019
0.054518337119501 -0.068657498932245 -0.014885978901866
0.047743952183826 -0.066785010067065 -0.011834745610240
0.039777348004325 -0.069435789408444 -0.014496942723278
0.032597282803055 -0.064237189314378 -0.014104722416881
0.026745719105031 -0.065589435580754 -0.014529088223461
0.017470422130427 -0.063305914219125 -0.014309091226171
0.009978581778164 -0.061663797768057 -0.013663961613659
0.005574452769999 -0.063162617862303 -0.011771103108409
-0.005054683621902 -0.059747974174878 -0.014096807682993
-0.011114084624139 -0.057410828664615 -0.014768074715617
-0.019473138708049 -0.055287849649525 -0.014158522332194
-0.025448244893795 -0.052155565538358 -0.012121580327037
-0.033044473289263 -0.052510513240138 -0.014450257186574
-0.038538403275646 -0.049948650227735 -0.013359405448235
-0.046290405088629 -0.047496687551958 -0.014431169713024
-0.054968992021050 -0.046599988739336 -0.014139470621430
-0.062095776929378 -0.045334371696653 -0.014248057091716
-0.070294164506369 -0.045653955884938 -0.014641093543922
-0.077233649114800 -0.044211683427543 -0.013154491246227
-0.085137712903201 -0.043392461345865 -0.014219836247447
-0.091724070090134 -0.041154825306110 -0.013719478174531
0.142063943947310 -0.004763156699982 -0.009510606968883
0.139027791572353 -0.003644122493635 -0.005317003453258
0.141587913317132 -0.011712840891155 -0.006428941929820
0.141514484877658 -0.019395166840616 -0.006506555760386
0.141702322551044 -0.026968230464685 -0.006724668705943
0.139113523842107 -0.034826579202158 -0.007943524245901
0.136657137293458 -0.041082665774722 -0.006915964329722
0.134933020313622 -0.049250890381874 -0.007046198094372
0.130558678032098 -0.050533637040336 -0.004998617375377
-0.097642795391862 -0.001774899510982 -0.007493853581430
0.133004938108603 -0.052526714187411 -0.005119806492807
0.125799292061915 -0.056552814964835 -0.004847147191050
-0.095816991229397 -0.009118423954340 -0.008751375401499
-0.098510661261011 -0.008500142977788 -0.004121587956433
-0.115603752461545 -0.008234860705498 -0.007835328495982
-0.132858482200173 -0.003011697436327 -0.007868738922530
0.124320726539627 -0.060663849114886 -0.006675487721446
0.119851619688483 -0.062112343538262 -0.005129326069834
-0.090886363558471 -0.018836820803327 -0.010206659520151
-0.096287169310575 -0.015407467351910 -0.005109102452280
-0.112551778152089 -0.016658585953032 -0.003317316258433
-0.116361686973825 -0.012899351390185 -0.005276848996165
-0.122522514508054 -0.010134169532682 -0.009493877614025
-0.133963445304908 -0.008788903404169 -0.007381778538707
0.115292769458242 -0.068548231081443 -0.006826228917125
0.109824454003582 -0.068580323317449 -0.007157084858897
-0.088861549125658 -0.028513728843222 -0.009428476536754
-0.104339706709461 -0.026143468074949 -0.006528073704723
-0.110301198735170 -0.020081638093877 -0.006300299438887
-0.116431612175884 -0.017960621682277 -0.008064857686045
-0.122002269145114 -0.016845579255234 -0.008170473301891
-0.130922283357017 -0.015582069384880 -0.003974783146862
0.107227966335980 -0.071845148990225 -0.008097129207478
0.100787079013724 -0.072215691762495 -0.007711673667229
0.094647616780910 -0.074012071190671 -0.005717901432992
-0.076591617413631 -0.037632492955015 -0.007419845148407
-0.084322023721927 -0.034720014367753 -0.005793991292003
-0.093298197501527 -0.035748623944841 -0.005733091557505
-0.098024879891116 -0.033606376187296 -0.005692121708872
0.128186954708150 -0.086200354546018 -0.006095977350556
0.119544888063000 -0.085017439119137 -0.005858200912161
0.112594127199772 -0.083768435831543 -0.007346650008840
0.106093077713177 -0.082938087189414 -0.006050870144847
0.098758614187332 -0.078522332434862 -0.007251592076305
0.091092629555662 -0.076978492857257 -0.007686549866679
0.084632206341743 -0.074946726144579 -0.005882238591197
0.077172362908107 -0.075689741754777 -0.006692929788911
0.069510987311680 -0.073147079471977 -0.005151364529613
0.061857753888633 -0.072006792223490 -0.007055743897441
0.055037425868827 -0.070775241197306 -0.007404504979137
0.044981058393575 -0.070113417439060 -0.006666998112681
0.039520329747022 -0.069702490979772 -0.005823367131236
0.033790909631809 -0.064735189700801 -0.006541379178049
0.025466437910028 -0.064924797940428 -0.008132338318282
0.017336251293345 -0.062044027453213 -0.007344455286347
0.009608776440118 -0.063520849042486 -0.006262290521943
0.004422766629968 -0.063729093143572 -0.004800260746959
-0.005347239347367 -0.060434859410130 -0.007334997380260
-0.011864323309810 -0.056976081516414 -0.008884631677949
-0.018958409593589 -0.057370340079558 -0.006389285608612
-0.026053710062818 -0.053598039480044 -0.006390336557709
-0.033296631502177 -0.051283693888978 -0.007444832051280
-0.041070299549645 -0.052188134618656 -0.006479939091684
-0.048629397451859 -0.051470073132994 -0.006438055241587
-0.055595080012464 -0.047869158862858 -0.006606428349498
-0.062633301207584 -0.046879121936870 -0.005662912095072
-0.071234765299697 -0.045589203098504 -0.007170203003342
-0.077773479432504 -0.043879128192052 -0.006086989033701
-0.086109118752680 -0.044463393063140 -0.006248457851673
-0.092323978667133 -0.041127835671564 -0.007453412068370
0.124044320835923 -0.088521981254222 -0.004411199772839
0.118974546911335 -0.087371654055915 -0.003531053746225
-0.076226377323966 -0.048507433252673 -0.004437696660044
0.141397876389202 -0.007042571579169 0.001007519518850
0.139136553690607 -0.001762486605586 0.001241185938832
0.142172822196028 -0.012295456006622 0.000938719137597
0.143164206011955 -0.019743432176363 0.000527704353648
0.141630184545596 -0.026216569553074 -0.001465344155314
0.141590008966257 -0.034039715300771 0.001018460547444
0.136843693308250 -0.041579989400831 0.001854253088948
0.133191617275717 -0.046388549752788 0.002092613017081
-0.096227690603584 -0.004158491562721 0.002885688578602
-0.099950444956060 -0.000686301846779 0.000612176692006
0.131683860057882 -0.054229270399892 0.001518775736806
0.128536910612319 -0.053290572191113 -0.000006214821818
-0.095403713482754 -0.007602208453994 0.003810722147940
-0.098932889153868 -0.006372991533666 0.002818038737293
-0.114420764633475 -0.007693729051316 0.001271161829945
-0.132454884040381 -0.002388199899609 -0.001245357716564
0.126308250815090 -0.059340187966907 0.001156324183461
-0.091408804375191 -0.019227014254538 -0.000089479649545
-0.112200451951014 -0.016917153185348 0.001387591158864
-0.116830934036092 -0.013563362467933 -0.000416955939084
-0.133502881609742 -0.009619071607385 0.000336206233022
0.121069935281747 -0.065189174867786 0.001347139155386
0.116075368649479 -0.066526515027592 -0.000452454960826
0.111017308800846 -0.068201411353705 0.000251619771637
-0.090096905413831 -0.027501067518126 -0.000042261326793
-0.104152976685018 -0.025574204593081 0.000728567737713
-0.111017583960300 -0.021172534133400 0.000759872233388
-0.114981754028931 -0.018377958835164 0.004368060862540
-0.124581659941808 -0.016774470417410 0.000422519957540
-0.134182294192932 -0.014817987889123 0.002151624953268
0.106968122100553 -0.071737454943119 0.002328407561299
0.098916755524484 -0.072977899556163 0.001034377848623
0.095376654110282 -0.074028641142498 0.000778270518300
-0.078930047654944 -0.038572938982098 0.003003722305614
-0.084547782457412 -0.034288197879146 0.002431220805166
-0.091767156101317 -0.036939169161722 0.000386361872669
-0.097727238971103 -0.033557597579836 0.000755072581289
-0.103605176717300 -0.029126955979277 -0.000327298844340
0.127298580971063 -0.085871055842196 0.001291096484181
0.123305791301423 -0.082726503751880 0.001263646876332
0.114152012217447 -0.085934458907773 -0.000853105748180
0.105977397560123 -0.083378448299799 -0.000936687672618
0.098855580574310 -0.077738011820129 -0.000725819155060
0.091728331560238 -0.076336043448082 0.000303857872688
0.084593654390033 -0.077024468673784 0.000402567524091
0.074876410340559 -0.075817122782265 0.002751980387685
0.069095668778472 -0.074329621791233 0.000491480624196
0.060542455899483 -0.071411667763267 0.000329500472065
0.055703094908853 -0.069336992728009 -0.001657079899791
0.045552966128254 -0.069082924852077 0.001555108248708
0.037509707508559 -0.068063959189033 -0.001383011067394
0.032717465839783 -0.066639908913838 -0.000883463871958
0.025100802925091 -0.064375699927338 0.000210806961375
0.016403151057636 -0.063371490687267 0.000086282288549
0.009302819875554 -0.062906965183015 0.001040129776316
-0.005685169647330 -0.061141245728499 0.001253711974141
-0.011185868653978 -0.058314829177106 0.001387076174732
-0.017798085210256 -0.055194072262578 0.001964049374578
-0.025688220690837 -0.054313087244421 -0.000752432072642
-0.032823962766807 -0.051687590266450 0.000110439097401
-0.040796594268681 -0.053556371971827 0.001914311205862
-0.048170234044819 -0.051428448009012 0.001037531840321
-0.055333119257838 -0.048504771516531 0.000821216652595
-0.060000688473700 -0.047537075462558 0.001044475352285
-0.070128999754284 -0.047586835665021 0.001091611659047
-0.077665254160515 -0.044870327935004 0.000528128787624
-0.085529613866849 -0.042878354489144 0.001588894746883
-0.090513826408053 -0.040453420551895 -0.001574775898937
-0.096683741008409 -0.038967367234143 0.000556483383494
0.122609935905856 -0.088249608380423 0.001096425806996
0.098643217154580 -0.083414002080879 0.001200708186148
0.092545636591183 -0.082294339792392 -0.002224390233042
-0.061560107703756 -0.051640054597015 -0.000640422070507
-0.071552388532693 -0.049511326667788 0.001574817454334
-0.076114730237100 -0.048681982496069 0.001732431208610
-0.085885363238157 -0.046701642058885 -0.002190876210215
-0.093012444966340 -0.045365873231662 -0.000677558148387
0.141949227052684 -0.004995318854988 0.007785571848868
0.137638224098168 -0.001725654173898 0.009092266515411
0.140369723646116 -0.011762183410932 0.007773778394379
0.141963993677892 -0.019615798009861 0.008092888819692
0.141889382513571 -0.025296428981286 0.006667785822866
0.139083050817240 -0.033398603777389 0.008676650321005
0.135814309753062 -0.041213120771703 0.007935162817953
0.133703891719564 -0.047722619407079 0.006252137934682
-0.095426368691489 -0.004550627988428 0.008235469614980
0.131650187843115 -0.053866279901442 0.005123235499380
0.127090792669255 -0.054938364844242 0.008466485774036
-0.096876214742358 -0.012727381312194 0.006049653803821
-0.098136927257977 -0.006378479094440 0.008977498805042
-0.116120548438015 -0.008345640062565 0.010422465693471
-0.130770821545421 -0.002803085240155 0.009575417748969
0.124713794834617 -0.061714642084424 0.005204626833913
0.120882712272417 -0.059913336257956 0.009416348254202
-0.091301411393578 -0.020644339722344 0.009919519221303
-0.094615997524963 -0.017616878835281 0.007793423131622
-0.103908212405095 -0.017748868084033 0.011424483096120
-0.109545547306849 -0.017086672074917 0.009468642508505
-0.117926947315744 -0.014753121639207 0.008278157167295
-0.124524571622645 -0.012707751768184 0.008807217500789
-0.132343900703547 -0.010804093559370 0.008588991135421
0.117120065412961 -0.067174514668233 0.008529418106395
0.108990497345847 -0.068455411852648 0.007576228892324
-0.084920818397821 -0.028029323064308 0.008770807063102
-0.086842722905469 -0.027870217408846 0.007178809916493
-0.105047685672285 -0.024415704424538 0.008625179850576
-0.111678600388068 -0.020129016267056 0.006616625582691
0.107761303978831 -0.072449581535841 0.008505128657338
0.101419538502678 -0.073071979927522 0.007555567728993
0.092715859665964 -0.073469505385755 0.009781583582875
-0.072577437262178 -0.039453541273709 0.011180558955190
-0.076051986741350 -0.038952090211657 0.008700083529469
-0.083631318158431 -0.033168955314390 0.007547305857656
-0.092887144751362 -0.037262445021366 0.009744777476308
-0.097710166959028 -0.033384385659984 0.008612287318227
0.127298079738868 -0.085147750042693 0.008430203870454
0.121115420151093 -0.083405989670219 0.008002173792836
0.113848201163467 -0.084613079629099 0.009912499796864
0.106911991428585 -0.078840526992454 0.006997681414602
0.098209575791407 -0.078916843750459 0.009664465891834
0.091413552299424 -0.079926544144235 0.007087672984121
0.084512904671331 -0.074849314174592 0.007433858244469
0.077947797254145 -0.074021615395171 0.008556774413106
0.068591627388596 -0.074435221561014 0.008982693945882
0.062128432621782 -0.070818069077939 0.008556712424276
0.054480406000050 -0.069494551814991 0.007564161574362
0.047209863211965 -0.068123703673493 0.007989423821174
0.040895795813372 -0.066056462152584 0.008390731608388
0.033302017591227 -0.063913243387659 0.008651369527496
0.024690148202998 -0.063546462425177 0.008686633315629
0.017002517642336 -0.062701561998980 0.008790329014776
0.010615909239137 -0.061089290006319 0.008279776608464
0.003024796265794 -0.062291284391171 0.010658535754201
-0.006110403525234 -0.058039956068751 0.007466816699026
-0.012787740474389 -0.054789811878237 0.008199606692311
-0.019541173526498 -0.055198768363260 0.008640847002980
-0.026814473291372 -0.054430709345413 0.007974398886678
-0.033982630726816 -0.052344728733017 0.008370478903767
-0.040169567167174 -0.051152653720343 0.006827286835032
-0.046409291869034 -0.049738742314008 0.008139883156138
-0.053267622608831 -0.048510613757309 0.007267031148591
-0.063918549719080 -0.046779393104161 0.007358945219567
-0.069437102649136 -0.044890384138240 0.007923922248924
-0.077547897036342 -0.043702066130697 0.007866464684211
-0.084807735748122 -0.044388574384278 0.007480282580373
-0.092565884152802 -0.041460400130836 0.007975505353244
0.136651069374554 -0.001330863276363 0.015610854899404
0.137872524238442 -0.011825994075779 0.015906482731816
0.139494993946359 -0.016390008510213 0.015195398763336
0.138807389818846 -0.026832631748362 0.014562111378939
0.136429985443911 -0.032160925347851 0.017031982059793
0.135212810454084 -0.040702416111046 0.012927226817129
0.131700342989884 -0.043224814568964 0.016648679530139
0.133068179056289 -0.047712415628012 0.015909374987599
0.130265095117640 -0.047734715144679 0.015724881922719
-0.093256556856483 -0.006713992039792 0.015592339312552
-0.098314628725994 -0.000363986659670 0.012899850642200
0.127101779155388 -0.054112567992504 0.016926305806158
0.121591533042421 -0.055936883833782 0.018340866839406
-0.089356307775630 -0.015270654413361 0.018435939585683
-0.094837696624777 -0.010222867654062 0.014165671940165
-0.097087008924566 -0.006293590961015 0.013940900599476
-0.109878593642002 -0.009792056424800 0.017957039153094
-0.114118143988536 -0.006003410151489 0.015201948757487
-0.120755861143354 -0.002103988464372 0.016896472091990
-0.131636387985150 -0.002368000240303 0.014086116969106
-0.137057721783499 -0.003198326453563 0.013929774653432
0.123241222145708 -0.059859733432861 0.016050893580434
0.119113400181522 -0.061087611162447 0.015220096623418
-0.090249066689876 -0.016745428631110 0.013987873351094
-0.092742633773396 -0.015910393325313 0.018045615628875
-0.105507709089061 -0.018874714346768 0.015811055933949
-0.111375658990514 -0.015388617046515 0.014266793206848
-0.117051106532895 -0.014390551190873 0.013617015158650
-0.123414818928209 -0.014103248853476 0.012297719752308
-0.132895755859564 -0.012190116106807 0.012150474822042
-0.139839822492522 -0.006156846252465 0.015597368037221
-0.148937394362021 -0.006965654280726 0.016368749256450
-0.152473596483297 -0.007410918001782 0.017095088994023
0.108647436867303 -0.067469092775798 0.015832160555837
0.103679623246344 -0.068319035021825 0.017048510825155
-0.085450193145126 -0.030350282429665 0.014514963423727
-0.087844345359243 -0.025166910241342 0.014451740061757
-0.098906014378359 -0.026709920906381 0.015113232409475
-0.104016234119723 -0.024461760915124 0.014855358993529
-0.108355099334653 -0.019772999807597 0.016593036925312
0.130070912648841 -0.081373091214752 0.018154122626302
0.123938401221515 -0.079724695345167 0.016907190755523
0.107474572865745 -0.075102454188873 0.015799310004231
0.101131877396682 -0.070388118510149 0.017025915578521
0.092442680190426 -0.072184132614200 0.015390978746275
0.085322423716547 -0.071784619273460 0.017611173108733
0.077353838103705 -0.070450815954296 0.016940293426830
0.070237230650697 -0.069394016632828 0.016029932772633
0.065273644973608 -0.068021032389143 0.017077310676890
0.055834647286593 -0.066058699032758 0.017319349085805
0.046697082552031 -0.064291655894712 0.017041965758321
0.040971510166619 -0.063169114721477 0.017090948219615
0.035865014304911 -0.061730780203962 0.018255655085562
0.026445532159394 -0.060527977873839 0.016336159502980
0.019771559209548 -0.059669912066797 0.014979851519581
0.013904378313197 -0.058170129315972 0.016022100245473
-0.005773433657427 -0.054643958105151 0.018538452898977
-0.011155487526885 -0.052205316798750 0.018710337117828
-0.018930458038294 -0.051486201129573 0.016359849011418
-0.026017613324198 -0.050442769404336 0.015310627018925
-0.033234475980736 -0.049124115809086 0.014960305487630
-0.040570718715315 -0.047050751822101 0.016821227824209
-0.050692926866545 -0.044879004011650 0.017305754458424
-0.054306169409706 -0.044163148005133 0.017145786082264
-0.062227616836341 -0.042684761793598 0.017340548312184
-0.069583317752446 -0.040272891010333 0.015512296235081
-0.075619571909489 -0.038161642794345 0.016107638394353
-0.083527067301867 -0.037319334998162 0.016569116389271
-0.090936397292633 -0.036475636292367 0.017002932981171
-0.096925337688419 -0.031519184751825 0.015441440855978
0.127847161925176 -0.084639472747104 0.016509944076853
0.120794507605706 -0.085033592211725 0.016767412936209
0.112513078517247 -0.080743657394291 0.017026092326162
0.106770241098473 -0.081241950117193 0.014606847559925
0.099472174751201 -0.079740863123676 0.015414265429494
0.092422724128645 -0.078429663282951 0.015785872574168
0.085209658178358 -0.074843531363041 0.013175842717804
0.077058588539956 -0.075251408176102 0.017238205706594
0.069460786109971 -0.071202583898991 0.014875006472585
0.063464322842315 -0.074060298381617 0.011893485819812
0.054915669866423 -0.072068624941823 0.013078330790518
0.046655910046628 -0.065577371164515 0.013126866137501
0.040085160208618 -0.066517003022277 0.015237165438649
0.034565026892245 -0.066799411077609 0.014817060676163
0.028380636182935 -0.065597636573797 0.017097455298420
0.017819428221191 -0.062408388478790 0.014275202929494
0.008746219804060 -0.061888757991618 0.013298973834033
-0.004790251221553 -0.059089846322368 0.015286398493764
-0.012626676851236 -0.057989651446145 0.015379157340047
-0.016128415982352 -0.054839223153944 0.015192551409719
-0.026391229756572 -0.052653944716271 0.015838553225515
-0.034099143794641 -0.054246977063750 0.013510532176014
-0.038855464502717 -0.051936286752544 0.014048452651022
-0.048033822217010 -0.049864785813611 0.014801736151693
-0.054863534638682 -0.047074711793667 0.015541357314106
-0.062522059860414 -0.047089186551657 0.015019345318793
-0.071135744872070 -0.045460742516706 0.016654985542611
-0.077599807114617 -0.044368457222460 0.015549018126909
-0.085526244928988 -0.042616593740438 0.014273835325844
-0.091515217655095 -0.041083744528256 0.014080038662272
-0.096717698214747 -0.041414003950278 0.012538694178578
0.136918702396455 -0.004550365786660 0.023981112277028
0.132522399813966 -0.001622557356625 0.023685776984211
0.135449023308173 -0.010420547590324 0.024280973549205
0.139075263995228 -0.018848029218817 0.023089448487279
0.136106718165242 -0.019956701388031 0.022858042037008
0.138972913502923 -0.026684837906205 0.022277445998735
0.134233440606442 -0.025153168548151 0.024316477016129
0.133021083766510 -0.034338160691940 0.022234263966285
0.132863791653128 -0.043192379856930 0.022558992182728
0.130471539695804 -0.040435976100922 0.024747296607015
0.127703205969428 -0.046375782479811 0.023214071017686
0.123144913060738 -0.049218756464402 0.025717843329428
-0.093062729440032 -0.001944238446288 0.024855323111532
0.125512620834412 -0.053838781764581 0.021227429377553
0.121898830619546 -0.053629251929587 0.023484849607464
-0.089075457853086 -0.013060318276096 0.025160201982177
-0.091585456192612 -0.008974930395138 0.021557706152912
-0.108364728993710 -0.009544721110734 0.023074373240785
-0.114478512640479 -0.006297629500130 0.023744003855702
-0.122033828417834 -0.005423564823267 0.022166292273518
-0.129739623930502 -0.005169482552280 0.023191298877713
-0.136106536470849 -0.004378510512435 0.024548918838816
0.116944789491263 -0.060134341962779 0.021948440730092
0.110601443588627 -0.060664822094965 0.025289537035939
-0.082573524564579 -0.023707187262230 0.022885510718343
-0.087988270573149 -0.019675901761777 0.024804835593220
-0.103671030277414 -0.018451545415422 0.022635100876806
-0.109399676521762 -0.013841097322682 0.022591846262928
-0.126171245514374 -0.009271981665095 0.020623435770987
-0.134406979667198 -0.006432984732179 0.026797194039344
-0.138844698492978 -0.007334801025265 0.024152228867527
-0.146986061766809 -0.007318036439669 0.022286043758706
-0.151730425033084 -0.006704230685165 0.022804340636251
0.113759590215364 -0.064834801388957 0.022125544344897
0.107865693364410 -0.066761407052920 0.022451101576803
0.100582152566575 -0.066495032809672 0.023755623518941
0.095965810935112 -0.066699281550921 0.026011200224875
-0.077062602358588 -0.029479159171765 0.024168619270640
-0.081516880983552 -0.027778255099622 0.024101690248168
-0.086653832038330 -0.025283736878305 0.020749005114553
-0.096413461297438 -0.026499275299561 0.021832372653005
-0.102964591803513 -0.021092917426490 0.023739676510808
0.130234946393169 -0.078959547115782 0.023620959635095
0.120708256651302 -0.074716225250238 0.026391879832265
0.115817833571599 -0.075237167302705 0.023518141066548
0.108535612376446 -0.075693738903367 0.019525241648670
0.092061810013474 -0.071014673548927 0.023888487135884
0.085534281418555 -0.070294054671567 0.021384040629383
0.077173253688971 -0.067890146151263 0.022909651632624
0.070576708366908 -0.066473048910524 0.023035178537684
0.062964329336461 -0.064546253374257 0.023801253830907
0.053630986035487 -0.063065411493935 0.023120416120209
0.050678626070108 -0.062223418743394 0.023679494018871
0.043403821796922 -0.060371786341910 0.024511322136240
0.033308182055590 -0.059473904477221 0.022222978484152
0.024584439254761 -0.057516504703480 0.022646944319722
0.017467112789680 -0.055999667671393 0.023273864662167
0.013855200343296 -0.054854143654057 0.023620234286306
0.001118307494898 -0.056015308500373 0.026860981976505
-0.005612968660224 -0.053838497511168 0.024737686669346
-0.010511880035235 -0.051249151450302 0.021252329623220
-0.017628936256416 -0.048584115506437 0.023713489329335
-0.023084270444225 -0.047713696473053 0.023262110507008
-0.032967227801248 -0.046559179089080 0.021695055281637
-0.037947851436426 -0.044521830592248 0.023799617166835
-0.046050594487178 -0.044456491307943 0.025940051590918
-0.054868200780402 -0.041572509349796 0.022951602375028
-0.059562046141621 -0.040730387119097 0.022751916086194
-0.070298377159573 -0.040344980089912 0.023319778239247
-0.074711238720154 -0.038030277958205 0.023289065089768
-0.083866356479244 -0.035995777584977 0.024260920798299
-0.090997231384353 -0.034283628501434 0.023677872633454
-0.094871809547738 -0.031364052326911 0.023372017657277
0.118692691200342 -0.082624125953862 0.020518743788717
0.113995829297383 -0.081083857474246 0.023332868253706
0.107178158064068 -0.078796701769745 0.024155209874627
0.100642625181307 -0.078112577832827 0.023485423361775
0.082967609996358 -0.074303716045657 0.022572421824452
0.076666528787552 -0.072487038907397 0.023850442921636
0.069725681104567 -0.070126157237317 0.025954671179769
0.061736456003715 -0.068819778794262 0.025386170184133
0.056436839318805 -0.069070228199359 0.022653728520389
0.045438558333362 -0.067450079950985 0.021296238219258
0.037062167278037 -0.066455757033496 0.019676277911185
0.029625610684177 -0.064041576829738 0.021926702296253
0.026006438110499 -0.062627580015867 0.023500793826100
0.016563035519199 -0.061164225698652 0.020693784749029
0.010349927681390 -0.059570658464159 0.023036129843709
0.000067457690933 -0.058963130860039 0.019977903162954
-0.006082570904189 -0.055505641625269 0.024380392189341
-0.007930575344049 -0.055507287394080 0.024283976351737
-0.016950508813948 -0.055149898223677 0.021045873120940
-0.024044320290283 -0.052816340443784 0.023213190352437
-0.034610569600986 -0.049146861803873 0.026395105635640
-0.042207434757706 -0.049289765868586 0.022964948768931
-0.058640542900340 -0.045221806646870 0.024731359755514
-0.061185610902314 -0.045029453833565 0.022769262825963
-0.070560298424675 -0.044157502926555 0.022463548377671
-0.076672680745411 -0.042990208212560 0.022535428320882
-0.083742303931474 -0.040899522123160 0.023814507228319
-0.091762515015996 -0.038431310779502 0.022660037791250
-0.095806426400135 -0.038046612020331 0.024295257365225
0.133055990360717 -0.005391730683999 0.031043862527128
0.129703090174798 -0.002039284867910 0.030220114247766
0.133359924082784 -0.006116315085305 0.030831492578504
0.129615583903958 -0.007805892975732 0.032244003498074
0.133791077736342 -0.017399059702008 0.029713301074025
0.129635590634060 -0.013401792389528 0.032498522078513
0.131965902897501 -0.024016923495841 0.031235099148271
0.130656181301225 -0.032497384338629 0.029040723133931
0.127089235841370 -0.029602048784581 0.034066562687870
0.128305321930502 -0.038649367573694 0.029838217144724
0.124397389620619 -0.040461832876004 0.031830256646391
0.126833287383219 -0.046646714024415 0.027922473167892
0.120984163973673 -0.046816485962623 0.030720338052032
-0.086973954891311 -0.005946775617795 0.032133597915886
-0.090676327937917 -0.007059954807972 0.028893916880606
0.119291484777778 -0.052466119776169 0.030339783635682
0.113662260057233 -0.054682424336682 0.030589623794474
-0.081596923018003 -0.015691446466941 0.031663404023168
-0.084002574204965 -0.013948898538642 0.031348687803267
-0.101852028619565 -0.010073824900716 0.032036768307803
-0.108751871854853 -0.007266714341688 0.028929451858518
-0.116851798405822 -0.005975754123959 0.028169601714131
-0.123767876909950 -0.003537903478045 0.027129504835126
-0.130374273128313 -0.002353872159216 0.028594185357807
-0.146929436677737 -0.000130719115218 0.032562392851230
-0.152338546314398 -0.001808248963468 0.031178395187376
0.115040067845734 -0.056161111730037 0.033151825224874
0.110040100963718 -0.058914959022688 0.030389441532079
-0.075699345964071 -0.024721323780964 0.031362300606339
-0.081166459080313 -0.023190016549168 0.031850583250837
-0.087275331971091 -0.019559829193885 0.031427248552956
-0.096895002280692 -0.019822796601114 0.032162658524033
-0.101219064965844 -0.016248282818060 0.030195685034511
-0.146369621830576 -0.004939386432212 0.030280386244772
0.132468217948057 -0.073595886485043 0.031580082630630
0.123068260336642 -0.071238726210218 0.032260038411139
0.108635917190088 -0.066794923322293 0.031570360099789
0.100332242090031 -0.064814076241466 0.031055163490292
0.093305822719824 -0.064599344477338 0.030570250933883
0.089649494158049 -0.064369778290606 0.032538219725606
0.078396835860268 -0.062414760471808 0.032155351823089
0.070488332872284 -0.061173725532602 0.031735886847493
0.062568611328571 -0.059132907797074 0.032320566510675
0.057964044285300 -0.058439341045453 0.031983815311906
0.051755957239852 -0.056853194738118 0.032525301253316
0.032643410972553 -0.053261315527296 0.032227426623818
0.026985785345436 -0.051624903622841 0.032837677663084
0.018495729605213 -0.050733478684310 0.032184724819181
-0.004697796857054 -0.044999046570484 0.033280503069876
-0.010868845309575 -0.044729904660624 0.032044606005667
-0.019853327386615 -0.043079688053436 0.031890278851507
-0.023198254537630 -0.042955251707045 0.031148346329001
-0.029204901598796 -0.040227334728443 0.033145561134336
-0.034939068955255 -0.038516868777925 0.033856704667725
-0.047343737197540 -0.038153827156833 0.031129997571823
-0.053558915738389 -0.035915716673124 0.032514312898635
-0.057209884935042 -0.036072176912759 0.033860399758336
-0.067912575186742 -0.033023058609399 0.032491931449888
-0.073724031498626 -0.029950492346745 0.030716528252281
-0.079760053651320 -0.029197749462411 0.030764512454984
-0.089149689603968 -0.027831615845795 0.031518690144536
-0.096120781262051 -0.024498521233871 0.030040682567176
0.128793965672869 -0.078957686853625 0.028684672927377
0.122259165954199 -0.077262543658529 0.030219141458985
0.114428166955231 -0.075085373186562 0.030118218973793
0.107110330500604 -0.072726338212285 0.029679615164069
0.101185151002425 -0.072169458370982 0.030197543942449
0.093022115909168 -0.069658267236252 0.030209210437057
0.082627072526722 -0.068796251006506 0.028110724961277
0.077698696314988 -0.066802418605075 0.028860200798032
0.068933440547772 -0.064889782120529 0.030039633890507
0.061365768793317 -0.060625658106917 0.029975084101676
0.056119072744259 -0.063406363450839 0.028297740554330
0.049129034954985 -0.062012971402630 0.029412186270472
0.041796757145175 -0.059801206295909 0.030947032407440
0.031596069741048 -0.057389111447528 0.032209591781614
0.029117125061108 -0.057052882062152 0.028404507394153
0.019308034063487 -0.055267051025203 0.030266764002559
0.011145362823944 -0.054599844668111 0.030342738289013
0.003630762878661 -0.053760312191815 0.031361500358101
-0.005047269501142 -0.050998290058731 0.031859366213795
-0.010539643965194 -0.049149724835145 0.029866219228027
-0.016915018488314 -0.047821676377313 0.028508303359664
-0.026959084852509 -0.044919198914129 0.027081566369053
-0.032019688111972 -0.045784487981442 0.030611862776229
-0.038579246985806 -0.045571987452893 0.031112851933159
-0.045677113346831 -0.040719885125403 0.029955703234193
-0.054869104568511 -0.040277449633984 0.028535259401319
-0.060659654932722 -0.040229717537058 0.030007711684224
-0.068944431660091 -0.038693788615179 0.028960714476075
-0.076430612647153 -0.037209548643050 0.030123263096329
-0.083794874464559 -0.036383994410728 0.030260430673890
-0.090774103303893 -0.033479408177252 0.030830147927520
-0.095052609045625 -0.033053046800908 0.033201977526661
-0.071372241858929 -0.042254693621176 0.029118080770490
-0.076753440717943 -0.042647479670486 0.029777828609463
-0.092256416602202 -0.038540371238646 0.029813057541368
0.128511613500706 -0.001184581452483 0.035503534113883
0.122991113333596 -0.000644157584309 0.038079229946452
0.125480945344563 -0.011472650411211 0.037284531390189
0.130672114796701 -0.017173551834822 0.036459777628896
0.127472227635494 -0.015389516804009 0.038871722018239
0.125757894451704 -0.023567863484847 0.038624965524194
0.120958984541192 -0.023980700643605 0.041666284834859
0.129246036346982 -0.030792769364303 0.035911726986882
0.123109918256125 -0.031718865788679 0.038287884100366
0.127576152434727 -0.037911390674013 0.036028337275501
0.122776522322454 -0.037939480606736 0.036634864820737
0.117061819406690 -0.038064056042537 0.040487695872304
-0.083206958942702 -0.000287663497574 0.038290398633001
0.120527112539446 -0.045300733964010 0.037655496394154
0.115371264085156 -0.043110624261008 0.038973700797078
-0.079311031659282 -0.006452056969774 0.038629648641265
-0.085147964816833 -0.004513215431056 0.035906923408823
-0.094640131801989 -0.005397783282180 0.040192069804189
-0.099017758628018 -0.000397376267620 0.039591409321146
0.117572488914895 -0.053005664347746 0.035583929812429
0.112799172499362 -0.051840909306240 0.036338632687021
0.106222235885721 -0.053759436633684 0.039409731184955
-0.073831722799834 -0.014851601444538 0.040155319010731
-0.080115453077176 -0.013494984519538 0.038654890652018
-0.086053802886147 -0.011580029435795 0.037852509772298
-0.095226522248204 -0.010487131613570 0.038950555870734
-0.100819210050736 -0.008309582446332 0.038459596907613
-0.104897504861912 -0.005621674194990 0.035920260703084
0.133195737619026 -0.066516171820658 0.040498384272573
0.109847523520042 -0.058544644191263 0.038341786380129
0.102576901595285 -0.056942293192981 0.038078458719114
0.093592288464331 -0.057710485753269 0.039606564795492
0.087527356431119 -0.055761556598301 0.041020944392201
0.073075166449719 -0.054742562881835 0.039399338042257
0.067063475436736 -0.052441293382479 0.040373706614492
0.060242514415206 -0.051449110010463 0.040054879303294
0.050367792970823 -0.049593270541123 0.039966692244526
0.045067839991011 -0.047004679137143 0.041303590571400
0.036278288852614 -0.047425449159419 0.039381484782216
0.033123304445519 -0.044420165298791 0.041452944552419
0.023447932191663 -0.042328835271350 0.041588042056081
0.015315407128306 -0.042857892779607 0.039749415194507
-0.003480354470502 -0.039276503072773 0.039605013644217
-0.007308721958685 -0.038560297531815 0.039576291834827
-0.013000936339335 -0.035303233651133 0.041426063811299
-0.024257877717257 -0.034860819500191 0.039862974917409
-0.032028913434559 -0.032029124954270 0.040994565124827
-0.037553599421813 -0.031942320035045 0.040114828860280
-0.044214171541975 -0.030529662802282 0.040157504832265
-0.052927464498867 -0.029517529832712 0.039535127436637
-0.059686025280621 -0.027530447713956 0.040097942864414
-0.067390281277103 -0.025974278385926 0.039216523158071
-0.073757844071638 -0.023378524596533 0.038917491982185
-0.080676844277812 -0.020926615351810 0.037678247391698
-0.087069665960733 -0.019916207911282 0.040313791866617
-0.093262448618201 -0.018715668254126 0.037962481235978
0.130850913598329 -0.070857385196152 0.039151007925985
0.117496372057065 -0.066772304590941 0.037879334485051
0.106100686077620 -0.067843751955859 0.037187879518189
0.101352690140947 -0.062994203052289 0.036807133471485
0.094424557416591 -0.061826141077144 0.037479048466203
0.088519855223938 -0.061570462107288 0.037281997596739
0.079305782592653 -0.059525212795093 0.038351812815186
0.071073704574883 -0.060250160308500 0.038711195456503
0.067570365239684 -0.057812828818316 0.035161929881092
0.058589922559514 -0.054943441022712 0.037447265739756
0.052623207962784 -0.054764147546581 0.037505056972820
0.045095385464387 -0.050634652166737 0.037981264547028
0.035670753035840 -0.050522786934380 0.037515069090841
0.028147950974212 -0.049234622509130 0.037857597829135
0.019711889686390 -0.048650764930707 0.038142748033520
0.013888793752089 -0.047833297059559 0.037123020445820
0.003317110150533 -0.045361636613020 0.041550778185841
-0.002324979680573 -0.045379508333837 0.037958711421010
-0.008982721755422 -0.042812159499554 0.037206712042806
-0.016994870310418 -0.039532816264914 0.036659228598591
-0.022315519281451 -0.038534961822383 0.036687689101217
-0.029837099631131 -0.037306170439273 0.039045216039337
-0.038576173814654 -0.037968977768414 0.038460060495510
-0.043369613168880 -0.037781026512639 0.038447111721354
-0.052734628138288 -0.033019099500171 0.038086664831159
-0.058634275731394 -0.033412457116872 0.038296102691542
-0.068264188597377 -0.031656840291295 0.040068638757384
-0.074350517185827 -0.029856859289134 0.038437206351277
-0.082773595651114 -0.027559062564640 0.039203080927847
-0.090283114739552 -0.027623779702121 0.038855946704495
0.128513235888305 -0.074599948181647 0.036867122923849
0.124577899813852 -0.074703080339509 0.036601298367498
0.108880539795875 -0.070994632114559 0.037233247553822
0.100859155210010 -0.071244433305867 0.035678710734363
0.091659852574695 -0.067458868312133 0.037086256141977
0.072318435313269 -0.063267276871576 0.037024246012684
0.064550062274127 -0.062996374398349 0.035446858679768
0.041698469698710 -0.056835561659125 0.037419599329944
0.036903447801505 -0.057074614501460 0.036008723055837
0.026124283525075 -0.054830935967816 0.036133727347370
0.018721247822422 -0.053550549647059 0.035523898398397
0.010499293690471 -0.051587517798833 0.036294211661336
0.007163776541346 -0.051304397481611 0.035818481719013
-0.004702715288055 -0.049268601903217 0.035201160227772
-0.009721802584018 -0.047093830326640 0.036849109923360
-0.021819783758744 -0.044289612301731 0.038771133696552
-0.030480059540797 -0.043840220673409 0.039796135699269
-0.040225483379961 -0.041974669967867 0.036962861175852
-0.046997027802220 -0.041169881686063 0.037564476382253
-0.052388238479810 -0.040413636207854 0.038673032462116
-0.059271602860070 -0.038155211748938 0.036791911875721
-0.068692234323621 -0.037013250067324 0.038323035831767
-0.076257801194989 -0.035880312458911 0.036031656538961
-0.086010523827333 -0.034180282367549 0.034695091044423
-0.088921523828940 -0.034283962988064 0.035799136912344
0.146242425585929 -0.004853843572051 0.048754033839224
0.135346705035596 -0.001709441809795 0.048243996734934
0.129104091727853 -0.000783924793370 0.048410385882376
0.119841700575673 -0.003011172947736 0.044665782725332
0.120117419728765 -0.009298267851757 0.045111221491810
0.113834529226382 -0.006262794944065 0.046371272599218
0.106736625702781 -0.003698168854449 0.049263866221424
0.124312137716628 -0.015536581845166 0.043187391077993
0.119305812517901 -0.015000212624447 0.045294875657079
0.114373643932966 -0.013525639766897 0.046783750712392
0.123478910349185 -0.022977948523887 0.044641970908162
0.117943265953501 -0.021233870674970 0.046168448960301
0.120278814847847 -0.033010276416917 0.044129569804188
0.118235523160526 -0.027609768764271 0.044491415456452
0.110561662087893 -0.029792470817333 0.047807258402820
0.119338588744325 -0.038266881545097 0.043087141469635
0.112922442079610 -0.036878804648483 0.045052517687794
0.105696590476064 -0.035935002261769 0.048305981750802
0.116662561689266 -0.048412248434777 0.049340074336048
0.112087398360997 -0.044159645461603 0.043226123034474
0.107695192232810 -0.041956131781197 0.046188988673206
0.099108032288031 -0.042016326502898 0.048233632202464
0.092759626262326 -0.043720885561824 0.049299159800527
0.047305271510262 -0.034647590026683 0.049319501673694
-0.021021939138164 -0.020965356754280 0.049362527644153
-0.047930122845114 -0.015709568596816 0.049335185801504
-0.065430066672044 -0.010017839674256 0.048325446243600
-0.071007339170802 -0.007369273464871 0.047596611137706
-0.077102680653629 -0.007200073562891 0.045119067624725
-0.086784725252007 -0.006526695845181 0.048160207354542
-0.092547579588514 -0.002852822382266 0.045143863832471
-0.099067435713184 -0.003348192448322 0.043292366969106
0.130350526076657 -0.058435385839571 0.045342349802969
0.123872149772526 -0.051541992385467 0.048528564249989
0.119260013783226 -0.053810803866559 0.046762204920766
0.109447024999449 -0.050718559921334 0.044951946055410
0.104766461614448 -0.049494305950318 0.047295026576040
0.097216626618210 -0.048568899101913 0.046803478124529
0.089090850436830 -0.046981366347420 0.047251981395855
0.082633812847442 -0.045304180237776 0.047478424059866
0.074035842861223 -0.043806219738520 0.047366067492482
0.065119925719699 -0.041799790826501 0.047505106722827
0.060172151670914 -0.042596541435157 0.046443623935696
0.054386732899588 -0.039379435099788 0.047643448626515
0.049381374756917 -0.037970967633950 0.047885558878897
0.036558441062923 -0.036125777082600 0.047462159907339
0.028467448844550 -0.034492979845466 0.047469243164377
0.022369210400304 -0.035091033508334 0.046692185770986
0.015988244566835 -0.034523844673438 0.047119214172679
-0.000690064646391 -0.029105656252744 0.049144619738576
-0.004769524943960 -0.028471061381187 0.047136169945713
-0.012604489366293 -0.026332639506195 0.047472802276926
-0.023318965448329 -0.025357647930507 0.046837145920116
-0.025446690505759 -0.023949841200238 0.047427240804351
-0.037850961562563 -0.019602773029846 0.048422549998279
-0.042846450123659 -0.022786843516918 0.046092011820790
-0.049851885066578 -0.019265975019630 0.047304865252492
-0.053536339117019 -0.018179669782573 0.047782819544790
-0.066186483394861 -0.016817658474614 0.046149729167935
-0.072102313221231 -0.014395810798543 0.046311440794518
-0.079813195428065 -0.012998680033008 0.047479044393218
-0.085427753387320 -0.012941128006287 0.046059375241914
-0.093286148745981 -0.009196844225846 0.043736648356435
0.132740956432807 -0.063249527768311 0.046895403976756
0.124919105073190 -0.061166361589851 0.044594893570261
0.116913750210784 -0.061032731418217 0.046008055722234
0.110686878791443 -0.060562432444013 0.043879208361624
0.102850372214950 -0.058017750874280 0.045990984077769
0.095425541592763 -0.055734300286550 0.044597448690820
0.088213481044380 -0.052470688884274 0.045449170386312
0.080299476632949 -0.051653804165863 0.044085479215301
0.073406980804443 -0.053253373041140 0.044759284134226
0.064929542563788 -0.049432004845715 0.044437092577932
0.058831075549755 -0.048334587137527 0.044885274683949
0.052316892764230 -0.048711294170898 0.044997255122182
0.045922717563857 -0.042867101569721 0.044533422266957
0.037290296971786 -0.043743840285850 0.046978281008717
0.028448149960985 -0.043110527753387 0.047569261347768
0.022580836874896 -0.041320349302613 0.044591147100445
0.014899857144958 -0.037731295383718 0.046682329451558
0.008536969088132 -0.039536608989097 0.047288713728903
-0.001821388142801 -0.036577375989402 0.045755466803003
-0.007514018537521 -0.034308882866347 0.044681979657443
-0.014393890928398 -0.032801527340909 0.046004439150809
-0.028897005523594 -0.031971329623936 0.044891491686818
-0.035574050399193 -0.029883183440286 0.045075340544698
-0.042818404595540 -0.027517390754234 0.044012437235829
-0.051493833608812 -0.026615578252560 0.046848003756520
-0.057374820967203 -0.023723250558477 0.046193588053701
-0.067227744832805 -0.022306298396760 0.046110231302364
-0.072738513092671 -0.021855076139214 0.046177326586134
-0.080900769708947 -0.020424137323126 0.046714760656672
-0.087888045712384 -0.018959295356221 0.046098109302257
-0.091557949305469 -0.014971122218709 0.041899553095814
0.129555148496673 -0.068765721595000 0.043937298571584
0.124880385085633 -0.068161047158547 0.043219941174504
0.115053501193794 -0.067721805434101 0.042322459971424
0.109695797471407 -0.065080239422763 0.043435031687734
0.101940616112023 -0.064420984901209 0.043354081904408
0.096167775340013 -0.063410101316425 0.042864465748785
0.081589728934254 -0.058473654513894 0.043788806712148
0.065438445400434 -0.056285534100622 0.042881703650472
0.058207467435662 -0.054601930412367 0.043103579953826
0.042574979090333 -0.051208496268707 0.043359051501273
0.035726837118952 -0.049742266062777 0.043453728472706
0.011663526505941 -0.043882417321059 0.042102824961660
0.007324931280362 -0.043331069449144 0.044141204630848
-0.008574642613613 -0.040842366786510 0.043528675511994
-0.022319027886680 -0.038705274446143 0.044248056685444
-0.028056387630646 -0.041815907034753 0.043083118235587
-0.036474750169548 -0.038322422727733 0.043571118151662
-0.045280861664594 -0.037284276319784 0.043673245703695
-0.053400473859717 -0.033862746306570 0.043087911084808
-0.062395228380803 -0.032919918707654 0.042214785372732
-0.067519938807652 -0.029738150914905 0.044037981307027
-0.075193057726654 -0.027989797233657 0.044206467834061
-0.082487562056587 -0.027920308799987 0.043049416179972
-0.090048032364863 -0.024193549802562 0.044667782898264
-0.092757706296629 -0.023045031168737 0.043068813120841
-0.029239847993681 -0.043498209720826 0.043172148501395
-0.042090252530799 -0.042854834448693 0.042615742480277
-0.045715543065916 -0.040279238337472 0.044227361475941
-0.053744791151012 -0.039709678306719 0.043646512782095
-0.059316367494267 -0.036846013479605 0.044359270846365
-0.068217345944612 -0.035654495130241 0.044261519228933
-0.076115274072505 -0.036077875613274 0.042639062678334
-0.092972360296874 -0.030223608125282 0.042559587275502
0.142932563531409 -0.003753880568577 0.053659779981292
0.136531728799650 -0.001353922601135 0.052440641676900
0.131000190023469 -0.002100602920404 0.054340162709869
0.121737937978892 -0.002782477921292 0.052605588709828
0.143742228870330 -0.010482160491422 0.053334399735448
0.138581250357598 -0.010986084931073 0.054426596438404
0.126786651894840 -0.007281119372728 0.056351731097218
0.122234604010704 -0.007397409247939 0.054098422801016
0.113620590754022 -0.005302583001305 0.052910995757100
0.105268858567871 -0.004340969806505 0.052714890467641
0.099503998949531 -0.002726988507847 0.054871074155487
0.142986693216038 -0.019454004857019 0.054142571818348
0.134327472408901 -0.018191390462291 0.053702229296683
0.124962538436034 -0.015810828140367 0.053680753504751
0.117460367811719 -0.013516272785328 0.053516322886464
0.110334830348111 -0.014297657618099 0.051762595291453
0.104300343729570 -0.012185836413923 0.053033071587288
0.096048139401684 -0.011609858847778 0.053919291611033
0.090053640015952 -0.007739641426215 0.053446773325918
0.080830578653632 -0.007087364689001 0.053628563995676
0.078767364305710 -0.004978145088875 0.053380740916251
0.067824545447206 -0.005800390427311 0.053841901576041
0.060581559434051 -0.003378538474022 0.053722476120311
0.052969715000921 -0.002187764702955 0.053761619364735
0.043095335537160 -0.002747002830323 0.054158029353140
0.139039204997136 -0.024473002523303 0.054408611094470
0.133231518516014 -0.026539351380157 0.054571155344960
0.125380153796163 -0.024330914265030 0.054479277089752
0.109849042957002 -0.020319259987303 0.052411428486821
0.103154580156698 -0.018693317103258 0.053935566699026
0.093814645296761 -0.019079949879625 0.054539434229847
0.087265021801580 -0.016057235886696 0.054481405436513
0.073603289573370 -0.014835132157139 0.054559903895377
0.066294796598129 -0.011414636975219 0.054468560969349
0.060055238019315 -0.009752664735611 0.054452826826623
0.044902124094455 -0.010703046534405 0.054567601954457
0.036369681225863 -0.006951720390107 0.054553881442067
0.029457651704840 -0.004127785596567 0.054985364472387
0.022110913418575 -0.004577809271370 0.054621939455983
0.141935348378394 -0.034250791892921 0.054411657130239
0.134651071269147 -0.031856945017045 0.054423494135855
0.121942481519337 -0.028873768038101 0.054459040438649
0.116390208879065 -0.027070623734223 0.054504634654042
0.109666326374087 -0.029089895398064 0.052232889687535
0.102117282377172 -0.025320188110507 0.052623751543148
0.095055866509460 -0.026454772062907 0.054148212706563
0.086855306604821 -0.023591407346520 0.054320951894440
0.078841608231890 -0.022995816281980 0.054204039847371
0.070961319059465 -0.019195816310413 0.054405184860545
0.063833912506352 -0.019250760638284 0.054263553893086
0.052089317234002 -0.016774595851027 0.054282917582508
0.042121811934137 -0.014385336817688 0.054340286324225
0.034795076941074 -0.014175753467666 0.054255196050324
0.027263608584936 -0.011412787366083 0.054440891698516
0.022246444756945 -0.007735397557756 0.054524369990347
0.003954531240675 -0.005763204466080 0.055541211878773
-0.000795249711711 -0.004532152126305 0.054451713358877
-0.008366322333452 -0.004258144940530 0.054335926997182
-0.016472879549885 -0.005053604819168 0.054098321075754
-0.023301977615637 -0.001241157735075 0.054312441622731
0.138365564337884 -0.039607048612287 0.053782534396169
0.130934331675765 -0.041824840248515 0.052682084834097
0.121277777652029 -0.034287817453611 0.053859882151600
0.114699167139999 -0.038405287588233 0.052746000086782
0.103625308546077 -0.037495469455123 0.052385789668080
0.099902193934379 -0.033255465396135 0.053038618838307
0.091916698083694 -0.032779304488500 0.052969293391224
0.085976617316072 -0.030530435587871 0.053244052411349
0.076119273208582 -0.030478612076130 0.052761759554861
0.068364055861768 -0.028777936933776 0.052835946833607
0.064575208129716 -0.027054382258617 0.052991655528066
0.055065605422943 -0.022579408936299 0.053583167826649
0.047436071265087 -0.024157580354809 0.052897189890859
0.041529890193169 -0.021572615573538 0.053206433093067
0.031183149403318 -0.020240382151894 0.053115326678272
0.027092275291701 -0.020122232273812 0.052900743599253
0.019936078664545 -0.016372004186198 0.053477233683584
0.002217799280440 -0.014491842789888 0.054779393946645
-0.001241605475105 -0.013287290857864 0.053184192454336
-0.009807556298533 -0.012232045881607 0.053015281474111
-0.018222922629946 -0.008472045915342 0.053496172511098
-0.024764386103103 -0.009530497923024 0.052980724767363
-0.030631998372021 -0.005604287842745 0.053588411763825
-0.039312937385756 -0.005891997615682 0.053192158178009
-0.047281669064984 -0.005608664416789 0.052812838351246
-0.055216213374682 -0.001859796327277 0.053352341639515
-0.062078327971994 -0.002163578160847 0.053287771294319
0.135775950455591 -0.048804382060430 0.054202464377401
0.127696602605640 -0.047585039882198 0.053039825236317
0.121276203964329 -0.045129123886796 0.054809078830853
0.113356647759739 -0.043686668453477 0.054573824043589
0.105057108167179 -0.041315485395669 0.052239341532704
0.098030873674144 -0.041329096363728 0.052801602420544
0.092430814108223 -0.040165198183410 0.051348815476415
0.083837386115775 -0.037308321177296 0.052353236472127
0.076399854104974 -0.037417534637059 0.053032833849903
0.069048816116783 -0.036880297557385 0.051182460200307
0.061843929780806 -0.033362072727169 0.052412795272416
0.053894996461938 -0.031451605629856 0.053565153872487
0.045518896482327 -0.032200303816438 0.051834603424387
0.041241023230841 -0.029186946850510 0.051714384420801
0.031632596479187 -0.028203112455094 0.051903095042226
0.024068958618943 -0.026579145783715 0.054241339889114
0.016647337644539 -0.024384500011051 0.052847067221093
0.010698864342243 -0.023626667794977 0.055691502844808
0.001749284782265 -0.021846411060563 0.053021857630727
-0.002898991027665 -0.019415773813465 0.053835353648183
-0.011541333840298 -0.019403076377884 0.052869172846791
-0.019123143903294 -0.018320819122792 0.053549475275990
-0.025126103016506 -0.018021562060494 0.052739214217183
-0.034116068237931 -0.014713493833073 0.051829232584951
-0.041051255728220 -0.012628002092713 0.052089869868276
-0.046599457632160 -0.011851083479614 0.051971701609609
-0.054806845905643 -0.011979119446122 0.050627550303456
-0.063092497829713 -0.009105982556659 0.053032464924663
-0.069385373766066 -0.007526640864934 0.053742705550736
-0.078293394401513 -0.004320694182076 0.054723821675298
-0.084765954524339 -0.004524532922076 0.052308322996797
-0.089303893008117 -0.004546498057442 0.055282455241201
0.133508653126406 -0.057235730206702 0.051801663672444
0.127318865634592 -0.056514549425856 0.051522090708730
0.117025861908227 -0.050642930073046 0.053561384951589
0.112665086520518 -0.050721178759360 0.053104358469960
0.104048883557892 -0.050492387762729 0.052989422912914
0.099296562499429 -0.046543082052792 0.051882409846304
0.087331392455571 -0.047255937764189 0.052192049777028
0.083569582984504 -0.044393061162601 0.053200156008718
0.075591929770912 -0.045498280693755 0.051615099567547
0.070266080242124 -0.042320847811410 0.052881360804555
0.060044850393464 -0.041705786877963 0.052078115641592
0.043865513590524 -0.041453491439972 0.050656236445424
0.038818643042337 -0.038350931409153 0.051817806040759
0.023098956606335 -0.034430398395012 0.052132597243306
0.015426806093913 -0.032633525359566 0.051930388565379
0.008910202312044 -0.030451622024794 0.052780852432566
-0.000192552793616 -0.032026913546325 0.050684504305835
-0.004508854769513 -0.031045628356027 0.051106104647633
-0.013068509952844 -0.029017912828428 0.050580102717398
-0.021864321744039 -0.024765638980300 0.052277451629953
-0.029623550861670 -0.024875085201599 0.051517356192586
-0.037555207896190 -0.021539813798914 0.052588562444366
-0.041728296713533 -0.020318468375500 0.052811562811848
-0.046587769551128 -0.020782049802859 0.052119212901114
-0.055863815356550 -0.017736868787181 0.053003387248036
-0.065190377512566 -0.016781310201324 0.052832920961241
-0.071245846502080 -0.015553777093934 0.051942694460866
-0.078449403414703 -0.012175011236176 0.052817051820617
-0.086184336628723 -0.011848325571778 0.052372936427113
0.133097154929352 -0.060735474182799 0.050303782577830
0.128989518767546 -0.060384565520128 0.049435800349234
0.104147357049208 -0.056183949022790 0.049724277293202
0.097317996532683 -0.054622880925954 0.050157928263663
0.080638087231691 -0.049429650106477 0.050253419672963
0.069666524229984 -0.047169606365698 0.049591439997670
0.053434129614939 -0.043926344754466 0.050106040751456
0.028784677191780 -0.039443944740574 0.050061034953115
0.013190195161994 -0.035979576607451 0.050285671030996
0.007467145814647 -0.035743290521475 0.049734769618031
-0.005913142246299 -0.033501470974771 0.049472490107534
-0.024797759503518 -0.029746082743569 0.049473012721059
-0.031316902452719 -0.027089723759564 0.050303151881214
-0.058621471449198 -0.022532727062798 0.050844079768176
-0.074803256114447 -0.018420583085060 0.050699108874318
-0.080788598903125 -0.017078927742461 0.050676973139759
-0.087078391389762 -0.017632008645290 0.050397029673573
0.144810687107437 -0.015808452489888 0.057784520899770
0.126715389374381 -0.010072147653804 0.057345459417024
0.120382897445362 -0.010023964989490 0.057860584055898
0.110979933036539 -0.004243008967350 0.057221652781483
0.102909772820434 -0.006718608162691 0.057394605433463
0.082347596738794 -0.002424170745652 0.057350312983511
0.141921391236692 -0.019131680599343 0.058647088419911
0.132446926607318 -0.016750639137327 0.058943837916372
0.130001681452643 -0.016789777186840 0.058357515131949
0.115453812029290 -0.015206857836174 0.059371166026111
0.112241881715843 -0.010400485883938 0.058764982020375
0.102197990666257 -0.009466033453350 0.058031146800037
0.099660297814531 -0.010236490679160 0.058251443659780
0.073467113303589 -0.006773537245971 0.058534024989126
0.067187795712860 -0.004157912630345 0.058241084849354
0.059390868037591 -0.005319113131039 0.058712334747629
0.132170684393098 -0.024377053733914 0.059572772988529
0.124771521779961 -0.022242357516720 0.059151625430104
0.116955871412827 -0.022341576548197 0.059626841341970
0.110867393385770 -0.017130300354764 0.059818067347525
0.102740164496328 -0.019930345852087 0.058920480048176
0.096276222603484 -0.017086574913664 0.059024839198110
0.078065955410419 -0.016360802828358 0.059173606669422
0.073541369791004 -0.012490152279168 0.059077013575550
0.064634384311135 -0.008943119434701 0.058968772685049
0.060048589023658 -0.008075256442575 0.058968030726429
0.051291461362923 -0.012395143505916 0.059169229304310
0.045401277302022 -0.007884949423624 0.059076003825185
0.039276034971931 -0.003008879260347 0.058895170008658
0.030639949791872 -0.004492710746293 0.058516242777821
0.021815124857001 -0.003278752805962 0.058707482770600
0.009025376188826 -0.000522132846476 0.059105896746634
0.136850152804376 -0.036208942420434 0.059132062073069
0.131588249455413 -0.031851434638582 0.059461451645213
0.123530961282665 -0.030100921228921 0.059244183814047
0.115817159511739 -0.028880318883470 0.059284426486014
0.108550029640072 -0.030566256049066 0.059607665812488
0.102038295668492 -0.026459434872177 0.058580005987573
0.096557502393861 -0.023526420168106 0.059081731593129
0.078256741046409 -0.021823130085699 0.058902570521352
0.071820580017352 -0.020103215966504 0.058969681536672
0.062587045478896 -0.019661270809659 0.058867414271351
0.051429110603293 -0.018203028006423 0.058769208704946
0.041556403502440 -0.013573501390023 0.058994613444326
0.033498136681453 -0.013046377382060 0.058919846649485
0.028762149090616 -0.010926507270839 0.058532691275594
0.019777249397577 -0.008259105672682 0.058873295580862
0.014112592118727 -0.009970562427944 0.058869003092762
0.003938578068525 -0.006395284267739 0.058508736407279
0.000402502776762 -0.006626125515875 0.058876203333852
-0.010200538553390 -0.005363306805801 0.058825437978423
-0.015162315342586 -0.003461470750622 0.058940580800689
0.137743977945994 -0.043779103090551 0.057931185837108
0.129868201856297 -0.039548450239891 0.057906027590749
0.119520929017040 -0.038798509289405 0.057870028292653
0.114584229972573 -0.036641702271253 0.058295109545704
0.107249108433509 -0.033153181585765 0.059197000300405
0.099731584924037 -0.034048100786501 0.058146745478628
0.092281259431321 -0.035986764352355 0.056956756388662
0.083874962711288 -0.029014566198277 0.058158764953928
0.076921908224898 -0.032927118817263 0.056961013590808
0.069893716212654 -0.029090668698625 0.057565055644034
0.061397973458696 -0.029024240261446 0.057180944239614
0.055492298868349 -0.024428820125809 0.057972278391834
0.047062192320812 -0.023256950730907 0.057820277964588
0.032300182626239 -0.022111526925413 0.057449097748118
0.030500983603309 -0.016330262048042 0.058504200732229
0.018693076930017 -0.016457317728333 0.057702564036367
0.013046351619426 -0.015598720039695 0.057975618159293
0.004241676012184 -0.013049560960185 0.058181676661488
-0.001952702324485 -0.014050267395600 0.057709593569753
-0.010709648801208 -0.012821682950718 0.057626651560782
-0.014583813595101 -0.010526157547842 0.057965743815420
-0.026448243484696 -0.008600132559641 0.057833319142974
-0.032143647925972 -0.006138325932470 0.058074904556589
-0.037193694823473 -0.008772408714934 0.057343801295279
-0.046770482035373 -0.002538809963357 0.058244508063313
-0.053042412432525 -0.001195036459880 0.059213851725574
0.108790768513660 -0.040955424966020 0.057453662669178
0.024853623958760 -0.022860338072452 0.056882915293692
-0.029804958324488 -0.012067725632110 0.056876180445667
-0.062117616322797 -0.006558368653519 0.057579965388297
-0.087358471928155 -0.002268490066351 0.057366760050770
