17:11:09.181205
17:11:09.602159
17:11:10.102938
17:11:10.602700
17:11:11.102365
17:11:11.601973
17:11:12.101981
17:11:12.601582
17:11:13.102297
17:11:13.602393
17:11:14.102774
17:11:14.601769
17:11:15.102309
17:11:15.601733
17:11:16.102308
17:11:16.601940
17:11:17.102309
17:11:17.601968
17:11:18.104895
17:11:18.605436
17:11:19.105227
17:11:19.605115
17:11:20.106479
17:11:20.604050
17:11:21.104741
17:11:21.603956
17:11:22.105530
17:11:22.603999
17:11:23.104109
17:11:23.604197
