ply
format ascii 1.0
element vertex 1767
property double x
property double y
property double z
end_header
0.060681349576072 -0.007122225759856 -0.055850248539929
-0.124378261356892 -0.074057020228385 -0.056277692997936
-0.118697509027847 -0.068773339480507 -0.057522695744516
-0.110469967385453 -0.067131266499488 -0.057349803491914
-0.103194147500135 -0.065703409598496 -0.056127996647837
-0.099518562716828 -0.064108918199233 -0.056946665013317
-0.089268569818384 -0.059696924367957 -0.056654310429576
-0.082939674552917 -0.055784620793200 -0.056766769612316
-0.070918443076368 -0.048125423183085 -0.058330564702035
-0.061078623509414 -0.047759807739881 -0.057072569096568
-0.053476230553747 -0.042646634413840 -0.057944784367563
-0.046727799088043 -0.043037791342717 -0.056785059178354
-0.042440317029719 -0.042492211625412 -0.055666387761117
-0.032841576544262 -0.038178791463399 -0.056113710606579
-0.027742012649056 -0.034279758379331 -0.057458985213918
-0.019532091874044 -0.032481803721203 -0.056768494491262
-0.005897230029874 -0.026834320515321 -0.057140989506725
0.000002366679103 -0.023924805283931 -0.057104635441783
0.008733425302134 -0.020709397830752 -0.057429197514536
0.013379063768086 -0.019196273515712 -0.057316234155976
0.024959904176753 -0.014590436614083 -0.057455763066293
0.029730911473761 -0.015508668752909 -0.056317312443736
0.041002043798227 -0.008681146301348 -0.057405887171111
0.057700591934127 -0.004354611678268 -0.057593407516165
-0.127502174607241 -0.065993414556880 -0.058928332341197
-0.119870419397940 -0.062982500646611 -0.059772227808320
-0.105341947188406 -0.055553451556838 -0.059596826756480
-0.101326880357371 -0.055908693096834 -0.060386526310924
-0.094267044266972 -0.052434537433900 -0.060430026575410
-0.083778370619875 -0.045639091241361 -0.058063173497202
-0.079154899073003 -0.047297186549484 -0.058564816105845
-0.073733895908161 -0.043730385616165 -0.058341139042858
-0.058003877105116 -0.040208200038992 -0.059311666691783
-0.050795475737693 -0.035412970914713 -0.058284701868378
-0.041495092279652 -0.031353762565615 -0.060052763188366
-0.036240845984304 -0.029656356479024 -0.058379380111379
-0.030483595867977 -0.026657054237367 -0.057033834660534
-0.020926487463730 -0.026052565074122 -0.058375757420543
-0.014329968946919 -0.022345635894575 -0.057224059625946
-0.009371410330495 -0.020471550108361 -0.059732774937634
0.000144185051226 -0.015888343317349 -0.058474616571747
0.013723044648654 -0.013747298058154 -0.059187189305309
0.016083271573148 -0.007889488598562 -0.060534651005749
0.025287451455782 -0.007581943437863 -0.059697153294566
0.040650286631374 -0.000662584468418 -0.056810028915091
-0.130780097625792 -0.058956910056357 -0.060032062097869
-0.124684609736816 -0.054583342696698 -0.061112488631886
-0.115628437020015 -0.052533540930974 -0.056702403589569
-0.109746664438117 -0.051669664757816 -0.058414463246349
-0.102025847226656 -0.046113880918285 -0.059427896702770
-0.095011225051481 -0.043067670076467 -0.060072143757823
-0.089145511281099 -0.041831273706452 -0.059163540089610
-0.081129173296193 -0.039774575935734 -0.057334093841965
-0.073577065121785 -0.037829003048544 -0.057927928746226
-0.066979089412225 -0.032219502338697 -0.057044336522105
-0.059918620856468 -0.032469455344084 -0.057895582402232
-0.054245767152194 -0.029848057601102 -0.058977651799205
-0.045469617320592 -0.025901705838674 -0.058309167641219
-0.039545670378812 -0.021964913077573 -0.058165060246471
-0.031479031372605 -0.022840191144511 -0.058395999839104
-0.023993498831141 -0.017711903250289 -0.059151707110620
-0.016520954040041 -0.016236471720411 -0.059090921605113
-0.008163729539781 -0.013657367305400 -0.061168585026745
-0.002278417938584 -0.010843029326657 -0.060694947127981
0.003536402882117 -0.009350374570595 -0.058791341984751
0.009668753715413 -0.004656392357867 -0.058187448159765
0.018132671597097 -0.004775690326140 -0.059436323369029
-0.132802983602664 -0.051981793706815 -0.061543277671135
-0.127080016793251 -0.050329045438479 -0.060900823796275
-0.118879220631967 -0.045030323080440 -0.057522188389780
-0.111983546916396 -0.043335077417135 -0.062022236073496
-0.104583463321350 -0.039358159802359 -0.059408549829804
-0.097483947710847 -0.037955292135076 -0.059334799016001
-0.091432011688158 -0.035615247435751 -0.060545384292287
-0.083087478923176 -0.033800413091787 -0.057441178207082
-0.075654003869909 -0.030627074386818 -0.058608938420298
-0.067130874928035 -0.027075827318451 -0.057499883854869
-0.063658622598096 -0.025588480038334 -0.058401925480845
-0.053953735452044 -0.021639271574265 -0.057496735458060
-0.050070238320162 -0.019427036857071 -0.060285177433970
-0.040983138452747 -0.016130848918271 -0.059073599064829
-0.035201092901975 -0.015602504274900 -0.060513822758677
-0.027667353426678 -0.012186918443063 -0.059939037526133
-0.021273215519088 -0.009590318637590 -0.060004780836244
-0.012008916330076 -0.003696417120999 -0.062167776310925
-0.005842991341371 -0.003168162233360 -0.062098730290416
0.000309123598790 -0.000998173796055 -0.058664483273510
-0.134954782431346 -0.043925788017244 -0.061269300663951
-0.128283300368817 -0.040568695151617 -0.061097582829478
-0.122681362688779 -0.037160869294510 -0.057137685978893
-0.114270612393779 -0.036398739043997 -0.059541650212291
-0.107083568316675 -0.032801921227430 -0.061906511509898
-0.101041341540918 -0.032574654029285 -0.057449220860485
-0.093800098122929 -0.029187027991036 -0.059662840855601
-0.084817843620982 -0.026143770518301 -0.059672960484508
-0.080946663592819 -0.021206595377143 -0.058631002629283
-0.071645501727816 -0.021399461935914 -0.059287373173716
-0.064690490736591 -0.017896556834539 -0.058121961796763
-0.059321595734414 -0.015412225571767 -0.059626909459117
-0.051395178607117 -0.012832071112943 -0.059641981328013
-0.045727031957141 -0.008769976543138 -0.057921318893118
-0.040421985616859 -0.007181346167880 -0.058141724980357
-0.030263917265354 -0.005762966468592 -0.058162609939260
-0.023100504223061 -0.002602942839334 -0.059579924680607
-0.014622277107178 -0.001030973405474 -0.062091940129283
-0.139141853230417 -0.037189820553261 -0.059547333602591
-0.131024939901737 -0.034090251592630 -0.060441033757213
-0.123762931525256 -0.031167240769787 -0.059256562118215
-0.117432927811871 -0.030518177133504 -0.060524772465709
-0.109244713620184 -0.025613469755711 -0.059735535506887
-0.103276004439439 -0.023108772477996 -0.057848706639292
-0.096199743339870 -0.022786353441595 -0.058402226514956
-0.089304673896074 -0.019549254046834 -0.056291702746122
-0.082620795649416 -0.017152874746371 -0.057258790410045
-0.073257351705545 -0.011609337401204 -0.058225679600718
-0.069276101495264 -0.011252407099781 -0.058487369740489
-0.061411801601550 -0.009315947071555 -0.059846443379404
-0.053629980801005 -0.005543702530405 -0.058040801823619
-0.046544317775228 -0.002111349700807 -0.057985025064063
-0.038091394238899 -0.003030463372635 -0.056789213383676
-0.141019597329760 -0.028760683793954 -0.058260372365002
-0.133611775861333 -0.027788824261016 -0.058925337040903
-0.124469630539449 -0.027772678447204 -0.059920339787485
-0.119072618904637 -0.021403841160420 -0.059077507222179
-0.107132949716569 -0.016778962686599 -0.059508993351940
-0.098865400298359 -0.012747699552171 -0.058196039402966
-0.091968269723682 -0.010541693046662 -0.058302671635630
-0.085269312462342 -0.008228109675219 -0.058400137150769
-0.079007693901495 -0.007848440609149 -0.059023575668020
-0.068040129404590 -0.003603090406608 -0.058963529789927
-0.060934236622365 -0.001619426367003 -0.059203041279796
-0.143961034749856 -0.025889096948891 -0.056766935551646
-0.137876685879076 -0.022318576792567 -0.057229299748425
-0.125253349235254 -0.020212410254733 -0.057322202885632
-0.122179022205529 -0.018406136498945 -0.057454912388805
-0.117241896546889 -0.015609120618085 -0.057134996617319
-0.108072386546821 -0.011347667200251 -0.056891721928599
-0.101921825196249 -0.010332620939068 -0.056811605656628
-0.088485703386415 -0.005935916438333 -0.057082304203991
-0.122441743655425 -0.085397023867924 -0.049431863987926
-0.116303563008061 -0.082822378128979 -0.049204317296030
-0.106283437341585 -0.078190850064153 -0.053065183842661
-0.096597674661020 -0.075178884047658 -0.050170377934460
-0.091944250683632 -0.074470158924684 -0.049609789097790
-0.083951772629774 -0.069897265438648 -0.051170310795787
-0.063967030631297 -0.062229687210243 -0.053322408879281
-0.054893985162682 -0.059474435334790 -0.052279844487195
-0.047035570203025 -0.056178165649342 -0.052998594487192
-0.045017876706510 -0.055443459797807 -0.050775049412730
-0.034934501061443 -0.051687992907259 -0.051825430119518
-0.021019462129466 -0.046201963063459 -0.053289213383678
-0.014574036251288 -0.043468915021376 -0.053604379857066
-0.006481950818829 -0.040769043010204 -0.051419871851288
0.007204793183947 -0.035647000590549 -0.052245001042368
0.020435273136013 -0.031211976536641 -0.050127477849009
0.027899816204750 -0.028617625944146 -0.050750288212778
0.032887130582439 -0.026421924048557 -0.052770101750375
0.042133073714499 -0.022767958570198 -0.051353590214733
0.046672288626453 -0.021520344535336 -0.050836594466848
0.062202093293019 -0.016637025757517 -0.050500543797497
0.069754332875535 -0.011499857931281 -0.053918844426156
0.075999217696247 -0.010922063496589 -0.050370451176647
0.083106719817364 -0.008984531724173 -0.048813551152232
0.090285701256249 -0.005749804148280 -0.049706091130258
-0.123864264815844 -0.078776603745371 -0.052573713505748
-0.116078594386688 -0.078604581049928 -0.053668363774302
-0.107499177556196 -0.072077201166885 -0.053368177617076
-0.101581887328352 -0.070250296272992 -0.049971713587127
-0.093798399857772 -0.067091686255600 -0.053752773869517
-0.086710694138430 -0.066036338902806 -0.051891458714487
-0.082325896122468 -0.061147185583654 -0.051871511662486
-0.073708417706793 -0.058731553357623 -0.050144241536144
-0.066717071717386 -0.057075212610041 -0.051584840977671
-0.059984863977550 -0.054611445551150 -0.053546812260630
-0.051100402969603 -0.053294707337034 -0.054254545414928
-0.045210611228352 -0.049186624587969 -0.051689970219616
-0.036785880391037 -0.044714572377121 -0.052422620976450
-0.032673554656994 -0.043871313027179 -0.050153478825572
-0.027048850010547 -0.040470561629810 -0.051863352025036
-0.017097214467717 -0.038803098720858 -0.052751343249051
-0.009697622460427 -0.036840116007952 -0.050730944427902
-0.000742572288182 -0.034637366177369 -0.053888535384816
0.006188273161686 -0.030759650322038 -0.052370714390758
0.010577960203082 -0.027587269925861 -0.051173664677624
0.018284500398086 -0.026292313404053 -0.053946106795950
0.025870376477174 -0.023964853145021 -0.052919532979014
0.031396066017841 -0.021483932749003 -0.052283521855357
0.042876108521233 -0.018987577308486 -0.054295263493539
0.045286832967329 -0.015319043994416 -0.052347768986704
0.053554804729592 -0.010643738430964 -0.051162060368540
0.059044598800000 -0.011287710183100 -0.051458085263256
0.067238441700817 -0.007745740623187 -0.052601452458384
0.074370314594783 -0.005217310954761 -0.051953355447363
0.081294090376086 -0.003463934462566 -0.053050061746919
-0.125037679993853 -0.073214584351347 -0.051385612690928
-0.120867210932762 -0.069339202244432 -0.052350172245983
-0.109575966193665 -0.068182959160402 -0.052629532699270
-0.102956890714173 -0.060238080373438 -0.048242033207895
-0.096718832090968 -0.062443939690220 -0.051106629765513
-0.090314121430816 -0.058538868191485 -0.051513310826304
-0.082703238770419 -0.058722460948939 -0.051324982165066
-0.076151867513341 -0.054087219396253 -0.052770286763195
-0.068837372235229 -0.052284688456885 -0.051215536320688
-0.062355031695430 -0.048979433811648 -0.052284766536579
-0.052638579898772 -0.046178120546066 -0.052368202412608
-0.046879706532414 -0.043033508971342 -0.052407245203339
-0.040537054929090 -0.039892798316455 -0.052031185734752
-0.032004403600930 -0.039292044710184 -0.050839063847545
-0.030422002377122 -0.034820681259992 -0.052655863011363
-0.019987846457443 -0.032406500311080 -0.052330674565319
-0.013011111179916 -0.031117834478630 -0.052852281773570
0.004250272773642 -0.024051373686441 -0.052495657170298
0.010129190062469 -0.023499321231567 -0.050856546605112
0.016187309084159 -0.019430607367007 -0.053309779688203
0.023726665373742 -0.014844572135723 -0.052506864750865
0.029697787767967 -0.015838412419688 -0.052204922879222
0.037870536463076 -0.011500924942750 -0.051613447392466
0.044314883498470 -0.008667253557061 -0.051759573185924
0.051964583020577 -0.008151544589697 -0.052433103764537
0.056179413989487 -0.004813363849629 -0.052347606226288
0.064801510435996 -0.001813415934773 -0.053358073755585
-0.125381482318744 -0.067599513506925 -0.053722654545786
-0.121321697287088 -0.064060740424632 -0.054394331181530
-0.113720685624015 -0.059424893453880 -0.054968750838919
-0.108302160208981 -0.056564398706740 -0.054192686284069
-0.099159273348719 -0.055303300208113 -0.052634499435110
-0.091390517507131 -0.052188061415436 -0.053642873204234
-0.086533987207255 -0.050902278379197 -0.054458123092336
-0.078280984764974 -0.046435439721298 -0.054882955754284
-0.070219557670881 -0.044999264585817 -0.054377083663625
-0.066350135397676 -0.044400517858424 -0.054129530156138
-0.056931566284363 -0.039658189471960 -0.054450552189830
-0.047015327098893 -0.038112464265259 -0.053785528386118
-0.045416210509183 -0.036037232911085 -0.054298055851940
-0.035986999470385 -0.032183827197342 -0.054375725268095
-0.029419833824617 -0.026754819506463 -0.055308386052133
-0.021794443356481 -0.026495935433587 -0.054491270268444
-0.016866389084313 -0.024092238843864 -0.054653681004527
0.004719510645901 -0.015622134329616 -0.054774740422252
0.014043393856044 -0.013878396959097 -0.054231622899059
0.020862727445589 -0.008622665218887 -0.055063067448619
0.026906071529521 -0.008772188350360 -0.054309492314341
0.034898647012383 -0.003943894061955 -0.054940916264537
0.040745818010978 -0.002427849374585 -0.054713741505627
0.049104575877866 -0.000345485784730 -0.054333418095591
-0.108372458311024 -0.049908948798723 -0.050169100773814
-0.101336734359901 -0.046332564233621 -0.052084926172577
-0.095481681867909 -0.046190778429975 -0.054779580510143
-0.112105872181290 -0.044632743064317 -0.050645470504446
-0.105151513709587 -0.041027387083972 -0.051882189545089
-0.101608107131626 -0.037092444422642 -0.054361868107800
-0.117861072093920 -0.040784260639766 -0.048729139531140
-0.113809486660863 -0.036007526882231 -0.048951736017549
-0.107899193891008 -0.032952290194743 -0.053323443425181
-0.104258377127318 -0.028779812273099 -0.053853590214732
-0.129503535862367 -0.029983193515245 -0.055214964116100
-0.124141619682945 -0.028265166702129 -0.055294775212292
-0.115935002516085 -0.028013909074642 -0.050544943058971
-0.109903019479752 -0.027426131044250 -0.052511131489756
-0.103725603129148 -0.022750120698645 -0.054654984359426
-0.095276956154492 -0.017567986671862 -0.055306921208385
-0.065413332754888 -0.006525460706619 -0.055344846928598
-0.052471815305336 -0.001991000438760 -0.055411615574840
-0.137448469872138 -0.029418790484517 -0.054104978764538
-0.130457984955691 -0.030161764985540 -0.055159834111215
-0.119231082333076 -0.020516418968065 -0.051156938755992
-0.111334761734698 -0.020329655286072 -0.053465060755097
-0.106285297858019 -0.017760754851584 -0.053347718971785
-0.097894663259182 -0.013922137656243 -0.053785215580943
-0.091907984972454 -0.011153046561494 -0.053595696334523
-0.086478862884587 -0.009173485825531 -0.053643408024792
-0.079994256054792 -0.006912155587031 -0.053731985295300
-0.070828165681884 -0.003585704497313 -0.053683288141571
-0.061945462927464 -0.001292276296348 -0.054085046208384
-0.144833705793429 -0.022833222180765 -0.052771238530162
-0.135762234088399 -0.018594261969039 -0.051250044072154
-0.121793872525551 -0.013495078410050 -0.053252878392222
-0.116608017475746 -0.012839301977810 -0.051035753877113
-0.108332281768543 -0.008929422490239 -0.050428494084361
-0.100581774978510 -0.007653996792930 -0.050636114323619
-0.096088252622966 -0.006050835885432 -0.052181770800321
-0.085307550393337 -0.000998596787100 -0.051044367039683
-0.145504525653508 -0.016483324565052 -0.050573881352427
-0.140608255547368 -0.012959609342706 -0.050791898930553
-0.131471286198036 -0.010542408854586 -0.050966205164276
-0.124302149224995 -0.006977169312708 -0.050826360905650
-0.119366908163333 -0.005425185959673 -0.051368581974986
-0.110819397629658 -0.001990389591914 -0.049376547062877
-0.097562074427990 -0.001691438181345 -0.053356626713757
-0.147931152577311 -0.011432825126654 -0.048359335148813
-0.139930266082853 -0.009598166819345 -0.048323538029673
-0.124596087588238 -0.002694648197955 -0.048345648015025
-0.109705907406992 -0.088771206452315 -0.042376714909557
-0.105137693468981 -0.086096395320570 -0.042798727238657
-0.096478262684242 -0.084401100917454 -0.041257243677460
-0.087505391519250 -0.080537412388190 -0.042643861973765
-0.081306984137409 -0.078321835736487 -0.041128103459360
-0.067710562400026 -0.071971077127254 -0.042452947819711
-0.065336771721223 -0.070460607266750 -0.043075918400766
-0.052739062918676 -0.066598140398792 -0.042231687748911
-0.047641850605577 -0.065862675016611 -0.040983221257213
-0.041277019602403 -0.061888585635467 -0.042655725682260
-0.026941457243592 -0.057578884524692 -0.041588003361706
-0.019833306351820 -0.054469815519192 -0.042009073460581
-0.004959840553735 -0.049120499742113 -0.040641424382211
-0.001679817692431 -0.048699548111430 -0.040950155461313
0.014919704545934 -0.041438142743224 -0.042106275761607
0.029825816974452 -0.036405035881012 -0.042897637252491
0.033523182900864 -0.034793278207436 -0.046041113102916
0.043605621886932 -0.033957449314461 -0.043632030054413
0.051043890501909 -0.030180202501631 -0.044346098149302
0.058527197726330 -0.027186389054189 -0.043057829106333
0.063699557133517 -0.023566781135807 -0.042069584477427
0.072189388141145 -0.020402650422471 -0.043491629803660
0.077874738233497 -0.017543446787448 -0.044284402287486
0.083176582503830 -0.015296386028267 -0.043731245244029
0.093106035580959 -0.013845026787319 -0.044161939824107
0.096630121315151 -0.010884220703454 -0.042756765568735
-0.119408138983876 -0.087408775407414 -0.044258161747935
-0.113534538719286 -0.083609438034716 -0.044599419479054
-0.106423802769195 -0.082551040496918 -0.046455072606089
-0.096714642735984 -0.078181131760006 -0.044679935022674
-0.083955302136187 -0.072239668442981 -0.043745109549313
-0.080975065267518 -0.068801418591806 -0.043518781865124
-0.069380364533211 -0.067319551450971 -0.043136640751841
-0.063583926495545 -0.064911427531628 -0.044357485020640
-0.055738341438102 -0.062111708412068 -0.044214895451549
-0.049209941620240 -0.059811745408061 -0.044763755620006
-0.043031730677454 -0.056462712387999 -0.041873056614878
-0.035583776940951 -0.054371704655572 -0.042318502629283
-0.028844565653594 -0.050486349115840 -0.043745957768442
-0.020477271037308 -0.049747138836360 -0.045418488896372
-0.013457700288672 -0.046125993641498 -0.042596508229258
-0.007023331918232 -0.044210037255373 -0.044687064373973
-0.000140623871807 -0.042254300797088 -0.046555321578665
0.007389140726859 -0.038593498898133 -0.045577717666311
0.013553504352972 -0.037042093963884 -0.044571438674611
0.021719665152925 -0.032861420301118 -0.043811014378551
0.025615117107760 -0.030842755310576 -0.044128992283824
0.036537867845494 -0.028072001376429 -0.042569278920176
0.039565629158106 -0.023961600068124 -0.045349244002981
0.049327068070137 -0.022340648670665 -0.044591625144280
0.057016108753834 -0.021350962265364 -0.045255716526987
0.060962863519804 -0.018127650773415 -0.044347322667124
0.070956539159720 -0.015628148707899 -0.044676634037975
0.077544736802220 -0.012238633402208 -0.044206648076060
0.083935229369153 -0.010716671862839 -0.045055293858531
0.090194798675441 -0.007487834960505 -0.044063393795969
0.094886880867170 -0.006059280674079 -0.047173383915904
-0.122135109082287 -0.081890059571405 -0.045317762578015
-0.115605385684868 -0.079037395354105 -0.045616087162976
-0.100883545370980 -0.070104315925071 -0.045110670292858
-0.094241099639733 -0.068735941198618 -0.043536032773869
-0.088359928538742 -0.066378827087847 -0.045604334080699
-0.079282396721674 -0.064877107745950 -0.046036532923066
-0.072287163560267 -0.060571141980336 -0.047174958114308
-0.066314137724044 -0.062226248350789 -0.044408666813854
-0.057715826304899 -0.056663669170037 -0.046118231022838
-0.051394241050219 -0.054211661763457 -0.046193038507782
-0.045042055075990 -0.053972677414394 -0.044648481572153
-0.038704090609945 -0.049099653309150 -0.046456995976451
-0.032056650668639 -0.047250881143925 -0.046012151921274
-0.024620393889089 -0.043412482906424 -0.046719505513194
-0.017461317561648 -0.040799107683804 -0.046665088220918
-0.011158653750921 -0.039116714355756 -0.046234634602549
0.017728117737281 -0.028998077571980 -0.045737551483565
0.024590010746119 -0.024676580530686 -0.046955071843150
0.030926796193806 -0.025086891194515 -0.044985815251354
0.039053374454957 -0.021283229030384 -0.045546112899465
0.047002290976354 -0.015926158781505 -0.047225352808319
0.053547311891509 -0.012887841870467 -0.047623968327525
0.060797948625959 -0.013781815685894 -0.045379345143321
0.068546862394475 -0.008444440041445 -0.045691379750255
0.072881946462255 -0.006202888128775 -0.045581341628713
0.083233279630095 -0.004482498194334 -0.045764547551158
0.088966695030998 -0.001556400269218 -0.045681633471219
-0.102000054714226 -0.064026529857664 -0.041589320703827
-0.097741478093804 -0.061689558463520 -0.045346604959082
-0.090271463776460 -0.062632746034202 -0.047128446782114
0.067313328070102 -0.002734695903481 -0.048067861760141
-0.107896754545397 -0.058560553514869 -0.043396093571666
-0.101218579406998 -0.056898277252765 -0.047269163334849
-0.114950405742324 -0.054723469013003 -0.041946787083627
-0.110385555439998 -0.050613794970810 -0.045436201298716
-0.117628163163749 -0.044716874775772 -0.043667894142683
-0.114149390991095 -0.042104119078608 -0.046095541203500
-0.119478651016363 -0.039547187882131 -0.045568630421641
-0.116395728134989 -0.037071304551262 -0.045490931523325
-0.123153012164105 -0.031151454656504 -0.043569508437795
-0.116675066836042 -0.029969824906292 -0.046025348866466
-0.123495504285167 -0.025238843457471 -0.043969488347055
-0.121393875439215 -0.021078916697523 -0.043226239089651
-0.116675735830788 -0.018457696082369 -0.044960989201548
-0.121006395009459 -0.015732575814794 -0.044400867029511
-0.115658934826969 -0.013945011711601 -0.045523875030929
-0.109155029483972 -0.009042245201307 -0.047543391748748
-0.147599478276027 -0.016534785874096 -0.047240827763560
-0.137945257205918 -0.014482063963476 -0.046329202855113
-0.123244906059208 -0.005180123706982 -0.043431259994191
-0.117426699812292 -0.006440333993015 -0.042762943198479
-0.110572581344635 -0.002779963829564 -0.045476174875580
-0.103159678575743 -0.000036108498673 -0.045245008671763
-0.148787179521766 -0.009481734443691 -0.044623491490366
-0.140992639046341 -0.005255099833467 -0.044228541168625
-0.133551442195270 -0.003266716704237 -0.043683137333873
-0.116686208271836 -0.097286422061628 -0.035002065861703
-0.108996606520628 -0.094686119520966 -0.034073118412976
-0.100649421945725 -0.091387213315348 -0.034195486271860
-0.083016645860550 -0.085207192392133 -0.034811880314830
-0.049936607078598 -0.072517434522226 -0.033571417057995
-0.046928662946449 -0.071621136906441 -0.033232687199596
-0.023430256431540 -0.062639436311586 -0.033531950200085
-0.018695791762974 -0.060758778255903 -0.033690229619029
0.023855218063449 -0.044966377359355 -0.033531402791026
0.072497162577034 -0.027605107349012 -0.033837450230601
0.088238456203761 -0.021125404083217 -0.034181446278575
-0.118322999907966 -0.094192740340783 -0.036008078914509
-0.111810308957543 -0.089631164824944 -0.036496557438854
-0.103280709542368 -0.088528121642755 -0.038089260940236
-0.094170491407461 -0.085761100092554 -0.036586149418833
-0.092165727838900 -0.084135385431857 -0.035853094304089
-0.082716864528748 -0.080256787036766 -0.036829058850291
-0.073873279882472 -0.076476541538293 -0.035544196904186
-0.065968051143038 -0.074055501623575 -0.034315489018443
-0.063287944604198 -0.069646275653305 -0.036093010787648
-0.053288113754113 -0.069264523814078 -0.036274010180204
-0.048332612331145 -0.064754108332948 -0.035229917729381
-0.040093346123238 -0.063726010225922 -0.037246079838755
-0.033593966601314 -0.059313060316162 -0.035156113509817
-0.024668275959071 -0.057834249697563 -0.036604749882702
-0.019646668121402 -0.056992775118390 -0.036576043014210
-0.010261456821616 -0.052831693503873 -0.037573834622386
-0.003071141683336 -0.051165558209398 -0.037960320357962
0.010675793780511 -0.045289636155215 -0.038027392908417
0.015196110586763 -0.041793537157727 -0.036778982365610
0.021688681666168 -0.041171434480840 -0.036165563786509
0.030290571145721 -0.037720346684000 -0.036465570652964
0.036610906664080 -0.034656912066342 -0.036978712285046
0.044040852008151 -0.032134316331485 -0.035331393762909
0.050258361610864 -0.029811465833067 -0.034730269635203
0.058629482443404 -0.026964998535227 -0.036963722432139
0.065785607258755 -0.026439074286999 -0.037304459457082
0.073677991528203 -0.021746538561347 -0.037025796330455
0.077863026363428 -0.020485162929295 -0.037573975252667
0.085585071479286 -0.018100270973210 -0.036307888615612
0.093294434842065 -0.014548186943773 -0.036880331242564
-0.118299551767187 -0.089659963867215 -0.037882749760630
-0.110046026561966 -0.085681121245103 -0.037753709996227
-0.107021781755283 -0.082989388655941 -0.039425367558482
-0.096389254133458 -0.076466226834636 -0.035436037266734
-0.091537234393027 -0.076724377445554 -0.038576696599009
-0.084468508629923 -0.073703838005635 -0.037308438981059
-0.078864450268718 -0.072787341672772 -0.039082090580944
-0.069269242240594 -0.068988716472557 -0.039309286320690
-0.065073026740304 -0.068296631678647 -0.038373159611705
-0.054412914433692 -0.063991426007583 -0.038683782780650
-0.041730122794438 -0.060132943466740 -0.037761912866913
-0.034826611569202 -0.055201487150923 -0.040220823491100
-0.019050014576251 -0.050898539056487 -0.038539968693736
-0.012584733828658 -0.047858410625271 -0.039207044804576
-0.007797381165459 -0.047023155218781 -0.038218702519419
0.010139661654342 -0.041392719775092 -0.037893079960825
0.012929667569693 -0.038758721458157 -0.038732948506359
0.018654416212816 -0.037734024348132 -0.037563894474985
0.026889966594231 -0.033785881744450 -0.038519293034557
0.034519506161596 -0.031885195965541 -0.037466489995004
0.040616771149100 -0.029161379823241 -0.037982443058972
0.049221865698922 -0.025486370994331 -0.038446123326303
0.053800908711313 -0.023143311020564 -0.039108663762096
0.061168441099599 -0.020096388129351 -0.039406168187145
0.072289930499705 -0.015477410056575 -0.039206217015268
0.076017162891872 -0.014111613854310 -0.037547555363658
0.084611707187825 -0.010127512776083 -0.036218912327769
0.092145399250285 -0.009189870522307 -0.037676653111461
0.096949851225063 -0.002300564166316 -0.036909797871593
-0.107381789356999 -0.072499504415113 -0.033735395634653
-0.100122001929982 -0.071075799900476 -0.036645677769664
-0.096388551440791 -0.071268666571247 -0.038615598881725
0.073290507357125 -0.008965728768090 -0.040336187565806
0.079912376551872 -0.003929318993268 -0.039368762537324
-0.110896442831309 -0.067623869208542 -0.036993908131602
-0.105274570537053 -0.066782729384213 -0.036812638168020
-0.113923878423951 -0.059550908317683 -0.036528362477306
-0.121411870461775 -0.052046403191608 -0.037018339360241
-0.115637157752703 -0.055216945819552 -0.038358671391490
-0.125427052269229 -0.048400625453139 -0.035523517811778
-0.120715156075289 -0.044002216450890 -0.039596044743539
-0.126639876808202 -0.042196293430078 -0.037690057957652
-0.123773347947660 -0.038310633918941 -0.037969962895397
-0.125628761175274 -0.032233183284467 -0.036665516102794
-0.130727390945641 -0.027041679036115 -0.035003751957897
-0.127608718254140 -0.028187853012885 -0.036888281071666
-0.128827423933322 -0.016116301061085 -0.035677950108530
-0.123704483553500 -0.014308211745620 -0.037158128941539
-0.125149128657525 -0.007456659324922 -0.036419233525279
-0.118542775353450 -0.004562398900940 -0.036758375370981
-0.115500488851024 -0.001070511886225 -0.037732526982310
-0.150152380313810 -0.006103963206882 -0.036463266575816
-0.143132480315048 -0.004322522599861 -0.034979124272350
-0.132564827954642 -0.003409712351413 -0.038436773503306
-0.126921191823340 -0.000236899308845 -0.036096365178112
-0.153034977755407 -0.003782236112517 -0.035910909855845
-0.145877908981323 -0.001215311558644 -0.038245804671927
-0.114715806828771 -0.099649461424612 -0.028002228940013
-0.110519379286757 -0.098147598013544 -0.029392387211803
-0.104382694792748 -0.095285496930280 -0.030247686589245
-0.090467881445367 -0.091140144892853 -0.029755274022104
-0.080493678949929 -0.086498027912067 -0.030482962811473
-0.071108933757194 -0.083134786711106 -0.029125295842174
-0.063995680583932 -0.080593583983391 -0.028828680241587
-0.059814310318377 -0.079225545050292 -0.028354996566457
-0.044159913206482 -0.072387013305023 -0.030181040013315
-0.034937660697390 -0.067479332204538 -0.032730245793345
-0.028103556372721 -0.067406218058614 -0.028360886459035
-0.023429591182261 -0.064140513252838 -0.031129872207326
-0.015966108014877 -0.062639451046243 -0.028841785634044
-0.006293481638031 -0.060437273864340 -0.026103592122081
-0.000931454475661 -0.056800480075378 -0.028890905583383
0.007344949044159 -0.051774249646833 -0.032560308659558
0.012343222688821 -0.050858048942254 -0.029725589319550
0.019362841007399 -0.048303200779605 -0.030864042485240
0.024760045852093 -0.047754534685367 -0.028228874409676
0.031490854624211 -0.043668286388754 -0.030922544682506
0.039279872186363 -0.041705454644981 -0.029280479634287
0.046892222778660 -0.037795439957625 -0.031213244959199
0.060316909707013 -0.034304631566136 -0.028485227787975
0.067744696400042 -0.032091040402859 -0.027206840336802
0.075530214138521 -0.028225099977612 -0.028813194750516
0.080469279571458 -0.026502096692197 -0.028759769007050
0.088225121784044 -0.023130940823665 -0.029131958210948
0.095019653302359 -0.020613224137229 -0.029853433812144
0.100351806063952 -0.020614539489061 -0.026588854039196
-0.116446740136934 -0.094292761756181 -0.030086670125011
-0.108307186644086 -0.092609388735589 -0.027084739252412
-0.104015927523389 -0.088991195384045 -0.030495275700572
-0.087502393896419 -0.081786556484109 -0.028057722718665
-0.082971341659540 -0.080348255155361 -0.029827959808761
-0.075587537714168 -0.076773005444482 -0.032826833928110
-0.066478453380810 -0.075724982595309 -0.029171165669444
-0.060286095188789 -0.072429496810399 -0.030683448613169
-0.054568408401365 -0.071666879173761 -0.028542035623872
-0.045451645231992 -0.068465040906649 -0.028127201283458
-0.039022258489921 -0.065104200850832 -0.029762840855601
-0.031023812595283 -0.062642800133844 -0.028902130965872
-0.024844128927734 -0.059840818071292 -0.029701321487112
-0.017249673217557 -0.055918727435355 -0.031434368336681
-0.010391899387272 -0.055424181432658 -0.029003951752666
-0.005367750127718 -0.050735760821239 -0.032546930516246
0.012356451970629 -0.047324118574494 -0.029790056431773
0.017872437094498 -0.043892381307349 -0.029679502690318
0.024589985548889 -0.041750520366923 -0.029137470448496
0.030218056662794 -0.039530999747424 -0.029251654351237
0.036290238967129 -0.035537893512012 -0.032013757908824
0.044949405309857 -0.034880246077191 -0.027799017918590
0.052728714808479 -0.031092988888136 -0.029201482975963
0.056049316426975 -0.029065277821225 -0.030603066647531
0.064934937227816 -0.026521971220277 -0.029450370610240
0.072516900650985 -0.022602301008208 -0.029737783635142
0.079178860878000 -0.020927190358794 -0.028347591221812
0.086187273957513 -0.018879884108742 -0.030596546376231
0.094008693787716 -0.014800431809183 -0.028822339578950
0.101420407949064 -0.007614295879220 -0.025837469304089
-0.106574585871952 -0.077638705710386 -0.026153665745738
-0.098580882867882 -0.078668635254257 -0.028571531498911
-0.093910059210109 -0.075284381248001 -0.032746587956431
0.084342759868417 -0.011709063274412 -0.026318628514293
0.086975258844214 -0.005150358756575 -0.030769289219857
0.099563546678932 -0.005323330900523 -0.029014806526717
0.103932968473118 -0.000044641136275 -0.028678594156586
-0.106671705628960 -0.075296615091560 -0.030151210988048
-0.103172721387389 -0.072894463797584 -0.030630523884775
0.083628084439718 -0.004287449003878 -0.030547090733531
-0.116006469854461 -0.067832536630558 -0.027022106755260
-0.111079308942802 -0.068406455766620 -0.029656140212697
-0.124015124094168 -0.064579666836545 -0.025854074681283
-0.119405003498955 -0.062584289068359 -0.030086162770275
-0.114444046370637 -0.063891239420004 -0.031796591008187
-0.128141470105004 -0.054662846421947 -0.028315477574352
-0.123163124293972 -0.056100134990621 -0.028300154889111
-0.127496282275633 -0.048597337120724 -0.029225591862681
-0.132164328826046 -0.046274863654535 -0.027620332921031
-0.127123345409434 -0.043410780210584 -0.031574116592093
-0.134454666882089 -0.037428868836602 -0.027239223683361
-0.131954905889319 -0.034118115641822 -0.029110313346184
-0.133160322598425 -0.026513456739578 -0.027854467118266
-0.129547899992759 -0.023713604902513 -0.030743124974254
-0.134010925211037 -0.020419181348459 -0.028118265355112
-0.130438997181887 -0.016914068074764 -0.030272043431285
-0.133149487346099 -0.013172498932684 -0.026797193730356
-0.126424962779986 -0.009054803000441 -0.029536813303314
-0.125289803661457 -0.001426404248590 -0.027682498317585
-0.152632904443367 -0.001312437098464 -0.031099976933482
-0.108968590293211 -0.102267765177664 -0.020223051274303
0.081026013364684 -0.031707634773616 -0.018780859196667
0.098591770951375 -0.025130162549350 -0.018814932072643
-0.115502165363783 -0.101735546025920 -0.022216113611542
-0.108495835845485 -0.097342024520924 -0.023193186009410
-0.100513480163533 -0.096916053184060 -0.021721556457931
-0.096751570288713 -0.091063419306413 -0.021079508030895
-0.085931325092236 -0.089397079547681 -0.020499437535288
-0.079562840862687 -0.087080315464886 -0.021383178914073
-0.072506765567337 -0.084220498617101 -0.019815906727794
-0.065183304167426 -0.079768864010058 -0.021771685394699
-0.059555001337231 -0.079045360177991 -0.022833403790476
-0.051746837129749 -0.074971654581364 -0.021931063664439
-0.043696442791735 -0.072950403605575 -0.021208669229828
-0.036265878004938 -0.069161614678848 -0.019359411442760
-0.030401316417097 -0.070476078199713 -0.020351909840587
-0.022561554840576 -0.065844755707194 -0.021448953195894
-0.015380564100996 -0.063128181256701 -0.022181678763180
-0.009041229304635 -0.058720115339370 -0.021196922232903
-0.001496049686395 -0.058363317757613 -0.022413849897524
0.014548056950794 -0.052195847422843 -0.021806064332011
0.017240723377057 -0.048598271334937 -0.020816074574474
0.027408913965155 -0.047889549554833 -0.021662939274791
0.032711264547387 -0.045720806314767 -0.021294273198130
0.039968584136647 -0.041014587023261 -0.020707675501191
0.046460233988159 -0.040294803855488 -0.022386058056834
0.054714318735070 -0.035701576901318 -0.020666451848033
0.061191699530513 -0.035468069878205 -0.021073526585581
0.066812581696865 -0.031653090444473 -0.021816392556738
0.076770531993386 -0.030026186388448 -0.021340242589000
0.080733180130696 -0.028349909787181 -0.021354648793223
0.089196777501288 -0.023689033453228 -0.023498859755372
0.095149818545827 -0.021202086429719 -0.021014079106334
-0.100573296584391 -0.091004532184286 -0.024634931767465
-0.094738222875952 -0.082293337218075 -0.020584534530325
-0.090322610872022 -0.082670934836188 -0.019234598362925
-0.080993825348357 -0.082488220258855 -0.022736068928721
-0.047808857978141 -0.071022325674090 -0.025160040104868
-0.003362655282103 -0.054336281958626 -0.025274755681042
0.026317885823536 -0.043094784023614 -0.025553503239635
0.034043000969412 -0.040703795950761 -0.024542295659067
0.038132973483073 -0.038787818011488 -0.025340494359021
0.045863811041093 -0.036097031751024 -0.024940775120739
0.059164326601750 -0.031078298913797 -0.025044294560433
0.063848850407482 -0.029423787848196 -0.024834211552622
0.075340703367716 -0.023461279395706 -0.022388357365611
0.078969955422444 -0.020614674211196 -0.023738138401988
0.085138001471555 -0.017742758932947 -0.020385776087129
0.095717838667989 -0.015302450983839 -0.022578714573863
0.100164975603896 -0.011619394111415 -0.022258147034103
0.105759305955873 -0.006298569045795 -0.018210249150278
-0.103504681593925 -0.080879686643386 -0.022008245671276
-0.098981407671294 -0.080251595308179 -0.022466425145153
0.085740493751223 -0.008805202666597 -0.022635107243540
0.088978971824201 -0.007067096818823 -0.020932878697399
0.099985025761080 -0.007642180701101 -0.024594616139415
0.104537911569702 -0.003032359073243 -0.022774850285532
-0.109717233035775 -0.073820091288336 -0.022047348225598
-0.119012635415178 -0.069773363003188 -0.021434362614635
-0.125827303842147 -0.063628691766170 -0.022041130269053
-0.121920077237583 -0.063258516206523 -0.023312020504955
-0.128983515468324 -0.056583258677415 -0.021619463170054
-0.126048136036891 -0.058203790290543 -0.020358343327526
-0.131665489948233 -0.049941671105581 -0.021859207992238
-0.129420282113474 -0.047435472779415 -0.024939586842540
-0.132987984290451 -0.046094624325011 -0.021701360905650
-0.131177526086007 -0.041911500752929 -0.024942157948495
-0.133851219096650 -0.034153979074188 -0.021581407750132
-0.138190697261941 -0.029160408077849 -0.019751571858409
-0.133903298420576 -0.029561659038006 -0.022298526013377
-0.134125757388545 -0.019709106685103 -0.019673471653941
-0.131961508345327 -0.016655236734492 -0.023787676060681
-0.132230389059111 -0.011897831732770 -0.022295334701223
-0.131748340256025 -0.004237819353894 -0.021907680714609
-0.127452597150317 -0.000836110895148 -0.020427880172414
-0.152539953030518 -0.000452189454129 -0.023584900105480
-0.111682355465408 -0.104357307873895 -0.014436039174083
-0.105826917429155 -0.101768738376333 -0.015851693547251
-0.098929767640740 -0.099749521572846 -0.014414100214325
-0.091770096620321 -0.096775095720313 -0.014903752393861
-0.075698691164207 -0.091085498558443 -0.011298414433482
-0.067862173029944 -0.087447627731695 -0.014772939885144
-0.064636684856270 -0.085989882294167 -0.015729238713267
-0.056585535421983 -0.083132419903393 -0.015165655339245
-0.049620219278033 -0.080452086038746 -0.015463190281870
-0.037417979351442 -0.076820885906264 -0.011121221745493
-0.028567833801299 -0.073430421749396 -0.011541005528453
-0.023776039529564 -0.071376841103182 -0.012840973103525
-0.017809484788470 -0.068897380632455 -0.014017500126840
-0.007395503377113 -0.065011832581646 -0.013874248707774
0.000289196206605 -0.061872781387182 -0.015169710362437
0.014537219649401 -0.056809351405838 -0.013862096989634
0.020571473347725 -0.054391982898261 -0.014713602269175
0.026440152286392 -0.052943223651815 -0.011081911290172
0.039324317152423 -0.048178682457548 -0.010789133275036
0.048448224201980 -0.044036930689135 -0.014402852261546
0.054622004391105 -0.041685772460466 -0.014578638279917
0.060141841621344 -0.040036678973186 -0.012755640233041
0.070330976817053 -0.036728601902834 -0.015000539982798
0.080132034583877 -0.033164746232559 -0.014658048832895
0.083427360172130 -0.031296696246936 -0.011515992367748
0.090863909894257 -0.028152030310399 -0.012414880002025
0.097075265950756 -0.026034176870237 -0.013341232502940
-0.114354813829380 -0.100426755533359 -0.014925215924265
-0.097505612735750 -0.094003246703528 -0.012524506454153
-0.092713406555935 -0.091400033807373 -0.015811964238171
-0.083914465923080 -0.088721722142486 -0.013551401341441
-0.079635766212112 -0.086738715207948 -0.014440248692515
-0.074061727260613 -0.085007829398221 -0.013395524228098
-0.066500936434733 -0.081900574729903 -0.014592592442516
-0.058411235145262 -0.079137974569272 -0.013529030685110
-0.050639774987030 -0.075854059264679 -0.014972214584035
-0.046690249487734 -0.075650347803914 -0.014964652264598
-0.038262679796881 -0.071513772671516 -0.014014009678844
-0.030186078635361 -0.068460171148664 -0.014064871037487
-0.022959057588981 -0.067366550210791 -0.017513937199595
-0.016652196858161 -0.063345932442479 -0.014374113286020
-0.008888279070437 -0.061579716416931 -0.016978346837046
-0.002685184120655 -0.059193331629677 -0.015735600865367
0.006531306384194 -0.058797411828852 -0.017827985966686
0.014799653799907 -0.053862709113369 -0.014422289097790
0.019402303735560 -0.049749930210109 -0.014733000549728
0.026414525592540 -0.047505025951220 -0.013134559834483
0.031984119192463 -0.045292577471411 -0.013733186924937
0.040376711057656 -0.041825692786115 -0.014954529647513
0.048343099513207 -0.038480799648879 -0.016463635329885
0.053467295460130 -0.037185671685096 -0.014081870282175
0.059950129321781 -0.034959800682333 -0.013324341023448
0.068919628636441 -0.031203282326355 -0.014512148106577
0.075272130330955 -0.028962211879743 -0.014702825455962
0.082687892550087 -0.026005836042852 -0.015524113638148
0.096146353727861 -0.021343266822436 -0.014430899717228
0.101406985479128 -0.023439533559159 -0.014744825566296
-0.095765143261585 -0.084338215419551 -0.014186459744456
-0.086444300699875 -0.084417640412693 -0.015180706863089
0.079255025113423 -0.022551562068944 -0.015633895441375
0.087558434593285 -0.016492004626703 -0.015719383824351
0.093349599653896 -0.014648675553562 -0.014657512867931
0.102428951369382 -0.012469887979769 -0.014272006374226
0.107021480638049 -0.008544280829706 -0.012440814963132
-0.106887272592425 -0.081271349080075 -0.013456320012096
-0.100054054033499 -0.081047260630935 -0.015366621220593
0.090887456512849 -0.006034303410854 -0.013428322422983
0.098246478763487 -0.001115547319970 -0.013168583119394
0.106124930170866 -0.002224462460400 -0.015955875327386
-0.115758745337622 -0.074529244526538 -0.013178474629405
-0.109878642157268 -0.076104756183866 -0.015597365900360
0.091108652202506 -0.001319073717726 -0.011317798817638
-0.122932240384335 -0.070261243921292 -0.013908379439992
-0.117148964302754 -0.070918990396018 -0.014858623071991
-0.126352444611238 -0.063490710869956 -0.013069564386688
-0.123310546608487 -0.064183827525939 -0.015945476735119
-0.129142356941690 -0.058368650295068 -0.014038176930431
-0.132923655997343 -0.050517902723424 -0.014974905217173
-0.135907873553528 -0.044191298770145 -0.015421609128001
-0.138051917935781 -0.035923988063778 -0.015180371351381
-0.138909269515212 -0.031302079263714 -0.016655363286019
-0.135770030529134 -0.027285230418248 -0.016690473759655
-0.139011892795120 -0.024858683482709 -0.015964229786877
-0.136542127108467 -0.019224553871759 -0.015263780034069
-0.137480438700403 -0.015049989405343 -0.016684909387909
-0.133918438126530 -0.009794782303607 -0.013792331898693
-0.131973762359927 -0.003106010057616 -0.016227981134735
-0.129107319550738 -0.000371642335408 -0.015006921971324
-0.114406371565850 -0.106215406041382 -0.007031004155162
-0.107124761665030 -0.103795447730116 -0.005926115239145
-0.098181436239863 -0.100467001402859 -0.005170351231578
-0.090600177910792 -0.097699523423816 -0.007643373692515
-0.082361721395764 -0.095189481727816 -0.006107921422007
-0.076868619040020 -0.091817447570883 -0.008818696225168
-0.071063574115693 -0.089929050066296 -0.006531522953989
-0.061202616541506 -0.086357394997513 -0.005840624058727
-0.053909705610634 -0.083309570452674 -0.008871034825329
-0.046609252964924 -0.080847987983344 -0.006502828801156
-0.042881663123443 -0.079341699825129 -0.007663385594369
-0.037733575286059 -0.077658267606928 -0.004689405644420
-0.031079082575554 -0.075172079260448 -0.004652967656138
-0.019103672410219 -0.070640702977897 -0.005314964497570
-0.015059560154424 -0.069102606681608 -0.005753572667124
-0.006242498119371 -0.064578656405873 -0.009156055653574
-0.000273065573014 -0.063319901924036 -0.008219726765635
0.007104654242181 -0.060579079175773 -0.007605358326914
0.014619363744937 -0.057430603559397 -0.004206079686167
0.025781374965713 -0.053431584410226 -0.009428579533579
0.036218072899639 -0.049896801196197 -0.006391412938121
0.041121974968013 -0.047967389314366 -0.007341329777719
0.050208395929849 -0.044858912398976 -0.005707784855846
0.055069453425496 -0.043262465976347 -0.006837251866344
0.063917669493491 -0.039490041566104 -0.007931617939952
0.068421162983780 -0.038002347634823 -0.007011746291800
0.077482310362868 -0.034829991486879 -0.009144552433971
0.083456370842966 -0.031532421490754 -0.005884853566173
0.090401460468393 -0.029065873773364 -0.007175856221202
0.099363952920405 -0.025508398617513 -0.007561955845835
0.101853407769411 -0.025043457581116 -0.007764030659679
-0.114066486831162 -0.101108688277842 -0.007801083195690
-0.107295260516933 -0.098580575294343 -0.006736946309092
-0.102945656973040 -0.096807581009297 -0.006991934025767
-0.089896296855741 -0.091861638952309 -0.008485231602673
-0.088938098235516 -0.087879089173464 -0.006036824429514
-0.078640294221036 -0.087094990790978 -0.006299447072032
-0.070344643499519 -0.084733506782308 -0.006448227131846
-0.065613471770949 -0.082772236805803 -0.008563287938119
-0.056689622507385 -0.079762944922133 -0.005449336572967
-0.050681059827825 -0.077382245720738 -0.006529284680369
-0.045695035977396 -0.075585685640611 -0.006006567204478
-0.036332169908111 -0.071955251346211 -0.007153870467825
-0.029751426122943 -0.069418442547847 -0.007765410626415
-0.021743934486657 -0.066571438585498 -0.006787014210705
-0.017079097283549 -0.064679045448591 -0.007889542210582
-0.007984129732934 -0.061745890099778 -0.006713826382640
-0.003176658007962 -0.059948841044980 -0.006486346765839
0.014942978346340 -0.054247790854814 -0.005970369542125
0.019452883650779 -0.051366019404508 -0.004347908223155
0.026512965198521 -0.048629272138443 -0.005539841855053
0.033387383287409 -0.045936919500720 -0.006716894352916
0.039681954449875 -0.043486602045376 -0.007534633203827
0.049083024811483 -0.040060479548846 -0.007077717984203
0.053764798514789 -0.038486103013464 -0.005415594304088
0.062447710715834 -0.034944773294384 -0.007899054539683
0.068506588238613 -0.033477552368377 -0.004783511364940
0.075443412960291 -0.029902681848719 -0.007089542319573
0.080134482746348 -0.027063027237193 -0.006632908452036
0.089466213609245 -0.025043580166987 -0.006014913762095
0.096648387747726 -0.021402830941193 -0.007007631505015
0.101154914160799 -0.016980075588519 -0.005116154555960
-0.100393240732704 -0.085767543085161 -0.007051138127330
-0.096816180108962 -0.083593875671664 -0.006761981785777
-0.090082688332520 -0.085522543925591 -0.003954431736950
0.080516580331791 -0.022717080486548 -0.010321993077280
0.086768395145368 -0.017374104258256 -0.007817039692883
0.090023673883480 -0.015403475461751 -0.005807584965708
0.104065406831196 -0.011675664052332 -0.006930259907725
0.106050519102472 -0.009501380490415 -0.008203589960419
0.112830419222434 -0.003954184439354 -0.007989771092419
-0.110392460128764 -0.081003277549532 -0.008577944005015
-0.107424983425300 -0.078886122877617 -0.010053381169320
-0.100521404614822 -0.082532354286182 -0.006207250798228
0.088039096566493 -0.012035599500318 -0.008828058445933
0.091748973544704 -0.008854970456048 -0.006423378575327
0.095453590182697 -0.002124838898315 -0.007482462132457
0.106852429687479 -0.004179676179055 -0.008088986282033
0.111290510195657 -0.000025130447384 -0.007577422822001
-0.116343203484241 -0.075965332639335 -0.007589809620860
-0.110425143684377 -0.077389769877913 -0.008247835362437
0.092328708233954 -0.002623322063635 -0.004652933323864
-0.123310830203306 -0.070705664456141 -0.009510606968883
-0.120140179895413 -0.070059572029323 -0.005317003453258
-0.126563057084147 -0.064545491095476 -0.006428941929820
-0.130543163927901 -0.057974169063968 -0.006506555760386
-0.134687943635089 -0.051633240360329 -0.006724668705943
-0.136621725415449 -0.043588614100454 -0.007943524245901
-0.137824971510411 -0.036976152159939 -0.006915964329722
-0.140657098320254 -0.029123029830189 -0.007046198094372
-0.137612365780468 -0.025730403539703 -0.004998617375377
-0.140741333425145 -0.025322842066231 -0.005119806492807
-0.136732586563920 -0.018107527033418 -0.004847147191050
-0.137638568492606 -0.013833658232030 -0.006675487721446
-0.134600471471905 -0.010250221524859 -0.005129326069834
-0.134110496671477 -0.002378519765697 -0.006826228917125
-0.112897412838815 -0.106250786677023 0.000670815073964
-0.105819897891937 -0.103297778836211 0.001333724009511
-0.098835836332429 -0.101008339779196 0.002293642794605
-0.084025972109541 -0.096033373625969 -0.000217901432993
-0.077120268806626 -0.092989570799649 0.000533527806915
-0.073852992086994 -0.091071016501026 0.002799718653677
-0.060933640204841 -0.086206784677166 0.003305799281116
-0.055628048219128 -0.084405036596600 -0.000295129979136
-0.049683079545732 -0.082201070460446 -0.000499069417003
-0.042645454148149 -0.079504648440006 0.000731872355458
-0.024088060091375 -0.072531917731130 0.002066476618766
-0.013530410500177 -0.068607120247311 0.000920029437062
-0.006452949687382 -0.066039551095174 -0.001467963739716
0.000346551082040 -0.063257318339955 0.000656101405141
0.016049882877178 -0.057023601636038 0.001551182066915
0.018591860755025 -0.056640232203003 0.000751596247672
0.027104667160543 -0.054476553364280 -0.002022989476205
0.036389129825944 -0.051863371221330 0.001176667646088
0.041857846804348 -0.049143626469806 -0.000149765535676
0.049834121612341 -0.046700573667241 -0.000481899192132
0.057367874526576 -0.044046296997550 0.001537913013350
0.064107568514621 -0.042531275936037 0.000531907832143
0.070237608407985 -0.039738664016834 0.000522454535481
0.078076993112591 -0.035919119243632 0.001545271861074
0.085491013182317 -0.032921080429734 0.001091017202057
0.092167346868687 -0.031069720054755 0.000477976953503
0.099342326150497 -0.027600625174969 0.000565356528280
0.102804940568868 -0.027787827290579 0.002407863413808
-0.113762829795640 -0.101185149717814 0.001132584050812
-0.109951154951940 -0.099815453780395 -0.000523924077036
-0.094108553503841 -0.093908568565257 -0.001837640011789
-0.086922759268313 -0.089747170498265 -0.000031156743052
-0.077838201396842 -0.086979534260423 0.001860060806588
-0.072628182400663 -0.085723865924729 0.002418087438262
-0.067111877778807 -0.083650066002693 0.002412513052937
-0.056071449014026 -0.079566137821316 0.001422057425496
-0.051822983420748 -0.078025269668832 0.000812153136251
-0.041355652868236 -0.074153789601142 0.000333357607839
-0.029801217713659 -0.069852269240775 -0.000659581705414
-0.024123008787513 -0.067636136120319 0.001129110768951
-0.014979829477968 -0.064318468331865 -0.002360117161754
-0.008733460345237 -0.061898988012144 -0.000094073021891
-0.003145790799722 -0.060253551740403 0.000748637949940
0.014624890068264 -0.053397373675097 0.000080360209463
0.017657285105111 -0.051969728342145 0.001421798026081
0.026444782375781 -0.048817434329959 -0.000258833516123
0.033127857892080 -0.046195069038335 0.001476354123385
0.041119102171890 -0.043309140902405 0.000606862818714
0.048661252533559 -0.040365352311307 0.002609112854320
0.056195901572670 -0.037582754732446 0.001939834391591
0.062074217146449 -0.035440330046914 0.000215127264974
0.068614963147174 -0.033412922819824 0.001903230463979
0.075228981352764 -0.030503924764654 0.001197352069988
0.079947209586389 -0.025672137767955 0.000974827245390
0.089642850822628 -0.025083447709181 0.001308701788899
0.097229661992903 -0.021188524909423 0.000072561251638
0.100105253951802 -0.018172191894866 0.000904174839971
-0.103027866803423 -0.084670933602645 0.000796312605856
-0.097088145736777 -0.084536957167768 0.002332705430846
-0.091337217102989 -0.085340497263177 -0.002559040272715
0.082870596849988 -0.020827464651660 -0.000766022885326
0.087464880798301 -0.019320595545395 0.003986926829335
0.102609158034592 -0.012809299232771 -0.000123549092295
0.107051529105438 -0.007407457367888 0.001273687371463
0.111052012849091 -0.004640823904355 -0.000328645909310
-0.111339061271837 -0.080169690314799 0.001545155322072
-0.107336111873942 -0.081288274768438 0.001236965739248
-0.100666919872045 -0.082721775262859 0.001471899465240
0.091015756736334 -0.006353011865524 -0.000498228276255
0.095525940475312 -0.002417341230385 0.002493047511099
0.107970915355973 -0.003874699124371 0.001342918192860
-0.115036935375861 -0.076498885530011 0.000932211809019
-0.109536113744680 -0.078348228566636 -0.000120623791698
0.092557786396094 -0.002188927806831 -0.002508020604135
-0.123943898020479 -0.068416864918767 0.001007519518850
-0.119242523001132 -0.071716857434348 0.001241185938832
-0.127367015836625 -0.064357850231865 0.000938719137597
-0.132129270033867 -0.058546127091836 0.000527704353648
-0.134231066484095 -0.052234456866069 -0.001465344155314
-0.138313551310010 -0.045560886523812 0.001018460547444
-0.138245308449296 -0.036651420280459 0.001854253088948
-0.137670088879098 -0.030640677027592 0.002092613017081
-0.140513860550130 -0.023179899938247 0.001518775736806
-0.137343889019580 -0.022322155433398 -0.000006214821818
-0.138632135256215 -0.016005099381698 0.001156324183461
-0.137255540333708 -0.008274925786439 0.001347139155386
-0.133712126497819 -0.004509505101466 -0.000452454960826
-0.130292347818847 -0.000423631764903 0.000251619771637
-0.111298681917289 -0.104523089596399 0.008151982676504
-0.104073337112783 -0.102052472691418 0.008435451304433
-0.100453035144995 -0.100478129396283 0.007249300753592
-0.091226383680281 -0.097792120945429 0.007840866839406
-0.081330680323517 -0.094192096798642 0.008361236369130
-0.078897475974405 -0.092898165561723 0.007611099040028
-0.069820159679973 -0.088736951838206 0.008984111582754
-0.063697090225284 -0.086624869813454 0.008188283717154
-0.056129073340087 -0.083703556566300 0.008440337454793
-0.050877653133439 -0.081224310954021 0.011185775553701
-0.043460040507338 -0.079342391350005 0.006241481577871
-0.037648181999997 -0.077294797613907 0.005389570986745
-0.029482564855482 -0.073971768362289 0.006955255305288
-0.023777610865678 -0.071873178848223 0.007168060099599
-0.005805498644265 -0.064530040479080 0.010439923401194
-0.000178674025756 -0.062944596597449 0.007404265677450
0.006732620770813 -0.060134067273358 0.008847838198661
0.014342728263957 -0.057212395154964 0.009404001986503
0.021307107873317 -0.054476806791889 0.010032083944000
0.027305303191347 -0.053400481083156 0.007034232890126
0.042423592659635 -0.046768647296002 0.009113235906281
0.047775219044896 -0.045355514753283 0.008223635470387
0.055410877599729 -0.043479909094527 0.005397603785511
0.061619614247117 -0.039146885447034 0.011359399592398
0.068446559459388 -0.038135339208481 0.006326525802928
0.077583622161400 -0.034337370743605 0.008649545466421
0.083700100015738 -0.030935509738101 0.007410610949513
0.090083098516807 -0.028976818904748 0.007045380252971
0.096650034452611 -0.026422585741234 0.007808427989004
0.101431258090467 -0.024039850660544 0.006469043528555
-0.116055222307998 -0.102287769459467 0.009540056025503
-0.106859565422087 -0.097596638098896 0.008947079455372
-0.093787321600203 -0.092888972711354 0.007840976511951
-0.085846045645071 -0.088170687740391 0.007048903943332
-0.078806616350341 -0.087172293602389 0.008580376040456
-0.072035744260567 -0.084527230507646 0.009214205729482
-0.067496453147461 -0.083421779509416 0.005964745318409
-0.056069130734143 -0.078539886472647 0.009361740862844
-0.050487053841850 -0.076321554329256 0.009943174159047
-0.044674334671386 -0.074674557050578 0.007150586401937
-0.038106458079415 -0.072268321187975 0.007026616847036
-0.029749766417031 -0.069094672085121 0.007115754496572
-0.024575445897361 -0.066708841145928 0.009726220881458
-0.017163021153614 -0.064182978398322 0.008437967860220
-0.008345128495091 -0.061066992319179 0.008760815735178
-0.001868773024585 -0.059967322240490 0.008303391253468
0.014498290571387 -0.053061556465949 0.009486746584890
0.017468742649080 -0.050921221249995 0.009963645731923
0.024705775783786 -0.048389821597928 0.009070684706686
0.033921272215925 -0.044926304037709 0.009161223685262
0.039470545330547 -0.043272981741482 0.006792684828755
0.047912889141729 -0.039953223500487 0.008058124339102
0.055760646381814 -0.036670973475572 0.009596640860555
0.059203570533866 -0.036237465532622 0.004790693079944
0.067113145616981 -0.033581591190906 0.007705501671153
0.075131135036004 -0.028917125154644 0.008934421097753
0.083399782846713 -0.027852654716466 0.007534863904632
0.088209546330152 -0.024831812559051 0.008185370378355
0.096470734636174 -0.021646883523869 0.009181076800344
0.100179881354838 -0.018093985016459 0.007409711634634
-0.096101142348150 -0.084279339618935 0.008412311078342
-0.088297391508967 -0.085261657829951 0.009144984995840
0.086491093048131 -0.016162559423803 0.010559547698017
0.100445499989025 -0.014008706759999 0.006858298289295
0.105929079059871 -0.007542497918899 0.007346114909169
-0.105524141309374 -0.080840592968819 0.008477269160269
-0.100119385642971 -0.082382045551745 0.005721633707996
0.091991209359241 -0.008558803986668 0.006944463526724
0.094899254405656 -0.003458612097099 0.005955302989002
0.106227268791641 -0.004129135464797 0.009110577698069
-0.114866268337325 -0.075581159530209 0.008480449950215
-0.110659616379847 -0.076255132376683 0.010289361750600
0.091901526590721 -0.000863114279016 0.009235721385001
0.095175004644451 -0.001027676581962 0.008317689692494
-0.123335447395225 -0.070447879223842 0.007785571848868
-0.117949033360028 -0.070959736080825 0.009092266515411
-0.125553131507866 -0.063862504207459 0.007773778394379
-0.131041503929583 -0.058023092647784 0.008092888819692
-0.133967285272285 -0.053153294028328 0.006667785822866
-0.135844392059805 -0.044786860850164 0.008676650321005
-0.137176918471969 -0.036421711876001 0.007935162817953
-0.138807708619441 -0.029775813873851 0.006252137934682
-0.140294216652945 -0.023470850928006 0.005123235499380
-0.136981270846458 -0.020159983887596 0.008466485774036
-0.138525756883272 -0.013146952102143 0.005204626833913
-0.134320115095722 -0.012662727532688 0.009416348254202
-0.134941473148518 -0.004508211148189 0.008529418106395
-0.112397382560572 -0.103955565170134 0.012372171198841
-0.101270122226750 -0.100243304885651 0.014474073206899
-0.091236280431082 -0.096289126196728 0.013505588900563
-0.086254295604434 -0.094891328059991 0.013474875247000
-0.078573331291391 -0.091627259719607 0.014418786799427
-0.072302240943185 -0.088721422517058 0.013255140101429
-0.020838592777393 -0.069403844046814 0.013565271174429
-0.011947096331986 -0.066284318146596 0.012742151057240
-0.009979452400269 -0.065229614521448 0.014003820216175
0.050502049929329 -0.042615986114552 0.013977561747549
0.054004124431297 -0.041407223783337 0.013595498835561
0.061648461329532 -0.038751385262507 0.012821605479236
0.068494405381379 -0.037285465710388 0.012498840128896
0.076121336335375 -0.034254026771248 0.013185102259634
0.086517087102428 -0.029492223461960 0.014582155501362
0.097444320975047 -0.025453875201776 0.014908073540049
-0.114630033426146 -0.100080483263796 0.016339001452444
-0.107360458547627 -0.100966759533163 0.016930252507842
-0.101505288841348 -0.093152842966430 0.017214699542042
-0.093351649371391 -0.094129056475086 0.015841327464100
-0.088320807330848 -0.090093855766066 0.016629928067840
-0.079235744918622 -0.086300182936708 0.015490647854590
-0.073158989888719 -0.084806323922777 0.015809679781911
-0.066284862239876 -0.082571558481669 0.015447036540029
-0.060921946634348 -0.078488048778081 0.015853238379476
-0.052853041126593 -0.076918971375326 0.015442061697957
-0.045186441624723 -0.073082758664628 0.017579211222646
-0.037055046587994 -0.069568229559396 0.015829550063130
-0.030516059782910 -0.068866035064862 0.016884122645375
-0.023284375074057 -0.064167332464315 0.016676026522634
-0.016308521678698 -0.062901915897566 0.015822798716543
-0.007864238695299 -0.061132919777545 0.015654475366588
-0.001857901040592 -0.058281766832192 0.015919792819868
0.014388378592544 -0.053683893273553 0.014923645007132
0.019522812506932 -0.050677222984639 0.016912791049001
0.026760577248356 -0.046740620009535 0.015421203410146
0.032830158729860 -0.044693106924257 0.014801888421692
0.038743545379950 -0.040797317783624 0.017261000191686
0.047398217186509 -0.040320545473925 0.016699067866323
0.052742877060698 -0.036408850743962 0.014713446890829
0.061112107864320 -0.035039015113807 0.016120841640606
0.067841000968325 -0.032021369615719 0.015981422962928
0.076041045463638 -0.030092584828766 0.015028826987263
0.081544180269650 -0.027133060106692 0.015694338254790
0.088665616553774 -0.024268663971110 0.016566833102223
0.096680805910928 -0.022067505812489 0.016159759699819
-0.095908870563450 -0.083932536775533 0.014100271403309
-0.089981444855620 -0.082676556201392 0.016118093696183
-0.082557747486114 -0.082966342237785 0.018024192606923
0.081462812323649 -0.019526766410931 0.016598248914398
0.086098666625444 -0.017542610261267 0.012780711161611
0.094306842271827 -0.016960061260347 0.016546250617025
0.100891666848235 -0.012219745168676 0.015769280502998
0.107063612155615 -0.009732253424665 0.014960005557057
-0.104304499819689 -0.079862757878981 0.015332373960902
-0.098680535635093 -0.079802174410834 0.017912252699850
0.088312065850976 -0.006050220506327 0.016070567881582
0.105910442743431 -0.004077962921574 0.016266363703725
-0.115248113525952 -0.074475166694390 0.013858168398854
-0.108199468220056 -0.075615602881366 0.016964673157054
0.090548058435977 -0.001221629187643 0.017172073161122
0.096173116748200 -0.000421427373914 0.013281389414784
-0.116901859677174 -0.070775992838588 0.015610854899404
-0.123463210495613 -0.062494181568175 0.015906482731816
-0.127244529164876 -0.059466927889951 0.015195398763336
-0.132154877212493 -0.050225193118743 0.014562111378939
-0.132937068393910 -0.044443243516747 0.017031982059793
-0.136396692301438 -0.036539473414317 0.012927226817129
-0.134737178967585 -0.032546236987265 0.016648679530139
-0.138261759571149 -0.029449969825226 0.015909374987599
-0.135889885223229 -0.027955985583929 0.015724881922719
-0.136556067427893 -0.020867983319841 0.016926305806158
-0.132830397782278 -0.016417104057724 0.018340866839406
-0.136297472661236 -0.013949389548670 0.016050893580434
-0.133433496427455 -0.010733143597384 0.015220096623418
-0.115961683440746 -0.100310183568823 0.024065686976431
-0.098159154994455 -0.095157427298447 0.023140228545185
-0.093693874981686 -0.093727983230815 0.022106870924947
-0.085531342548285 -0.087949771698998 0.022947413002964
-0.078756860408575 -0.085228895789710 0.022389497485703
-0.071186713254061 -0.085529845316452 0.021208686307587
-0.064076044273950 -0.082767711455153 0.021433900868412
-0.056774671975462 -0.078109835705815 0.019816937243459
-0.047192603151018 -0.071881421131969 0.019817060267447
-0.038325084126641 -0.070975758332111 0.022288756008463
-0.031061961291563 -0.065731305674947 0.020084532534596
-0.023955508559131 -0.065322286413467 0.022135167204855
-0.016703158835538 -0.062201111423449 0.023677366212524
-0.009317420969980 -0.059711886936628 0.021607813700128
-0.003001199874373 -0.057353401928030 0.022807616030690
0.006470219690743 -0.056717613332330 0.020709287917134
0.013435527421151 -0.051338892995931 0.024196553543724
0.018188322656642 -0.051113569617297 0.023294926201818
0.026508753011145 -0.047292642809511 0.024822746232665
0.032579510243561 -0.043731548472163 0.021983296191214
0.040022849776272 -0.039984595602818 0.021169392263410
0.047094368966637 -0.039693652060217 0.021860214030264
0.054026901975684 -0.035337105224854 0.020867322082834
0.060659812420586 -0.032440908661850 0.023553325926779
0.063806037999614 -0.030541809495218 0.026547736441608
0.075351967603343 -0.027934458898506 0.024035521939911
0.082691039400105 -0.026119698295805 0.023537082608061
0.088988539031179 -0.023213775803022 0.021492629430874
0.096789678165982 -0.021450614289934 0.022925857817647
-0.113938109831013 -0.095444168205944 0.022717865263936
-0.103921922094695 -0.090281350378270 0.025249877726552
-0.095671107059567 -0.087787817789599 0.024242794469512
-0.089659547818883 -0.082548179632537 0.023180858289716
-0.081603773497922 -0.081323569420611 0.023873105620859
-0.073163718078266 -0.079620264350740 0.023787722861288
-0.066985353290228 -0.078410024216769 0.021680009638783
-0.060475368754275 -0.073360189276467 0.026457227980612
-0.050958531942886 -0.071655970607132 0.023206235682485
-0.045983991599171 -0.068497523741248 0.025521080767629
-0.039337431461276 -0.066934732056366 0.023866218363759
-0.029412747801237 -0.064351255489783 0.021726180827138
-0.026077289294311 -0.061124826724255 0.025438573872564
-0.017457818657890 -0.058439853092160 0.024424457346914
-0.011029933595042 -0.056063064438767 0.024415898914653
0.013989525394510 -0.048237452499430 0.021488579546926
0.016315551897100 -0.045623712089074 0.024713587557790
0.023643714347785 -0.042760799122212 0.024985130742706
0.030954405734595 -0.040317213371285 0.024485242259023
0.046666265075123 -0.034640516553260 0.024139552628514
0.053092544882018 -0.032152076184482 0.024308046137807
0.059387323516208 -0.030181010655690 0.023571524734812
0.064453842800714 -0.028027981309573 0.024137757575032
0.074363525446072 -0.023883473976483 0.023109086846826
0.079472204910123 -0.020312770957624 0.022705459391591
0.086206689231837 -0.018871278359901 0.024304207320528
0.094537820485067 -0.016204491341651 0.023263128792760
0.098905575338952 -0.011743604308782 0.023520616396357
-0.100037872443024 -0.077990860879067 0.023597447033243
-0.091942514821528 -0.078869054424259 0.024448440269150
0.081127482509431 -0.013332150829202 0.023803686415669
0.090570362975223 -0.005236112840656 0.020237542902944
0.100188828969071 -0.006405269397113 0.023610427844045
0.105061984460208 -0.002132808853421 0.022343267688007
-0.108194823410793 -0.073636460490517 0.021222499262807
-0.102793429443525 -0.075559036632809 0.023457722699162
0.087737531524987 -0.003202951278774 0.020422907626149
-0.118823589060980 -0.068179113938131 0.023981112277028
-0.113544529816537 -0.068355386719480 0.023685776984211
-0.120662815577687 -0.062414026180703 0.024280973549205
-0.128181055588526 -0.057155876766846 0.023089448487279
-0.126240144769202 -0.054651024772227 0.022858042037008
-0.132217859467965 -0.050437970808518 0.022277445998735
-0.127381652402497 -0.049246452626197 0.024316477016129
-0.131183992820867 -0.040798015070553 0.022234263966285
-0.135709452529961 -0.033186040802864 0.022558992182728
-0.132224737719684 -0.034271118580943 0.024747296607015
-0.132996287796297 -0.027763455258478 0.023214071017686
-0.130616145774483 -0.022947288808441 0.025717843329428
-0.135060652988543 -0.020264560812544 0.021227429377553
-0.131877400922070 -0.018541108245714 0.023484849607464
-0.131087789975990 -0.010402605042146 0.021948440730092
-0.125972857705544 -0.006613553144918 0.025289537035939
-0.130852695882291 -0.004729462702011 0.022125544344897
-0.152295189535179 -0.001388015563593 0.023620959635095
-0.116439981354110 -0.098892736251071 0.029049077873942
-0.109438977616907 -0.095854136720471 0.029092153698720
-0.101732683701280 -0.092586940435631 0.031266254564639
-0.095427275938351 -0.091044922084291 0.029298315739152
-0.087838218441543 -0.087393055332652 0.031064649617191
-0.079141797195156 -0.084883918798009 0.028367652719733
-0.070504974457824 -0.080263410386240 0.030508574528512
-0.068026609191763 -0.079579189123201 0.028946916138648
-0.057157959154928 -0.076257889523473 0.028904513472584
-0.044060819102293 -0.071542219050763 0.028050561701773
-0.036320293141311 -0.068674480311347 0.028011022364614
-0.023679752975147 -0.063411704205944 0.028843435605882
-0.016767512776569 -0.060686313566605 0.029700035599885
-0.009273223043460 -0.058996927832645 0.027866182759918
-0.001595639232962 -0.055362006637511 0.029179292118070
0.004923256333279 -0.052127633490767 0.030420431604502
0.026076809688756 -0.044781901746718 0.029025071238993
0.037415141590761 -0.039705214933595 0.029668019747256
0.048833029732420 -0.036055017029677 0.029882516836641
0.058797581463737 -0.032354706540682 0.029829671179770
0.069426025235946 -0.027727973970100 0.032526077186582
0.073406447792016 -0.027228822747969 0.029781192218778
0.078736972574199 -0.024748759178997 0.030732831081267
0.086531186137320 -0.022917175253716 0.029099972859539
0.093427206558104 -0.019455570246209 0.028845641022440
-0.118388382574721 -0.092077052136430 0.030762302523372
-0.111115392013582 -0.091025514987524 0.031690372935948
-0.100918598071818 -0.087740013558729 0.032640258407113
-0.092223089962271 -0.087245236389397 0.032545531516788
-0.089814211859996 -0.083148698886318 0.029857101016756
-0.081359936184606 -0.079140081779406 0.030377556895730
-0.071877643546208 -0.076492117945278 0.028188978588101
-0.068803476290575 -0.074420739231089 0.030826610064027
-0.060597801330959 -0.071605351565408 0.030032029470321
-0.055109435054451 -0.070273632978884 0.031076261734483
-0.046659984425860 -0.068415596589150 0.029948200797556
-0.040092937273901 -0.063433232905139 0.029788855707166
-0.033034678324504 -0.060277730498713 0.030534071853277
-0.025933338542753 -0.058240641954367 0.031719354307172
-0.019329804718273 -0.055841170268433 0.029584081065175
-0.010737143111616 -0.054628917931276 0.031537937163827
-0.004000374791718 -0.051371952583553 0.030497979045739
0.004942928229295 -0.050303570153509 0.032641465103148
0.012471747422599 -0.046810804512943 0.032708635047592
0.017802576380758 -0.045159049684951 0.032884208625077
0.022454662712537 -0.042867395271955 0.031901176459981
0.031461966953849 -0.036691898853467 0.029816222067195
0.035881914902395 -0.035590471246230 0.029097936220360
0.042955661485798 -0.033650494766172 0.030872199853775
0.049907897448917 -0.028210631236242 0.031977007858141
0.059866645134806 -0.025840694842614 0.030088229238507
0.064832293304895 -0.025103977010173 0.030644608803834
0.072977796592739 -0.022285897239661 0.032580279794282
0.078955337742316 -0.020320427291481 0.031277910189257
0.086770627718559 -0.018498908356689 0.031386844762409
0.093346729110110 -0.014726326840835 0.030819727801797
-0.117952948545200 -0.089198310187389 0.034124691998479
-0.099834855404829 -0.076963681917866 0.029658144151685
-0.089740437465660 -0.075628770877303 0.030497069108006
-0.086413578862169 -0.075328346634617 0.033704522764205
-0.072877277577461 -0.072657983575837 0.033736857449530
-0.050857831735157 -0.064203179036298 0.034000742470739
-0.021290945005737 -0.052946311137865 0.034242415701862
-0.012778995311282 -0.049730460761945 0.034277147328375
-0.008990913482079 -0.048312069826832 0.034285569226264
0.015081679432285 -0.039378421725911 0.034207906281467
0.027712825081338 -0.034868517686322 0.033966588174817
0.071904465877006 -0.018261490662714 0.031183068191525
0.077125369656635 -0.014267880335741 0.031059123146054
0.082570355256579 -0.011591231310161 0.030108799790856
0.091910839196781 -0.010593487831110 0.033939445292468
0.098475827144563 -0.003851932270927 0.031307252272058
0.101605211837122 -0.000240052187729 0.030275581633566
-0.107551826573615 -0.071321096640817 0.032659746682165
-0.102547353812505 -0.071058886867583 0.030480722730873
0.081696221546993 -0.001316690317084 0.032245599138258
0.085802849392409 -0.000006171155321 0.030405729329107
-0.115981661210726 -0.065431044569383 0.031043862527128
-0.111366411410727 -0.066517461565826 0.030220114247766
-0.106761532038945 -0.066900621091111 0.032620114480971
-0.116621398328364 -0.064974826767954 0.030831492578504
-0.114326469737196 -0.061567766512539 0.032244003498074
-0.122925168111300 -0.055607398834819 0.029713301074025
-0.117288122691548 -0.056819808815113 0.032498522078513
-0.124855538699232 -0.049019451219719 0.031235099148271
-0.128204350600173 -0.041118878732999 0.029040723133931
-0.123647624709763 -0.041703957397609 0.034066562687870
-0.129442551339991 -0.034650471167504 0.029838217144724
-0.127073176883362 -0.031052828870808 0.031830256646391
-0.132399118542076 -0.027075304744196 0.027922473167892
-0.127514639794225 -0.023853048619538 0.030720338052032
-0.129048182250015 -0.018158158574623 0.030339783635682
-0.125427608802695 -0.013311342633006 0.030589623794474
-0.127377336616374 -0.012778959160420 0.033151825224874
-0.124574716442352 -0.007806166796701 0.030389441532079
-0.151371824065260 -0.007124194902541 0.031580082630630
-0.142138178638637 -0.004182222810045 0.032260038411139
-0.127527212578475 -0.000366520568596 0.031570360099789
-0.151068869477648 -0.000631333322922 0.028684672927377
-0.119716255540725 -0.092899019240190 0.036609546839710
-0.106274119159601 -0.090573824191362 0.035021054541585
-0.101485600459137 -0.086910636147113 0.037526528234797
-0.096557027110142 -0.084823431365560 0.037908538297333
-0.091275778411974 -0.082065175291357 0.039445425784107
-0.082194552207361 -0.079228279748625 0.035839036142346
-0.075173218183677 -0.076754937298712 0.037175804411886
-0.070222465543040 -0.075684563952333 0.036426606928821
-0.062670390245845 -0.071182740725944 0.038195765133219
-0.055015850411306 -0.067064421011546 0.039613687788960
-0.048005202341829 -0.066299052444430 0.037615103518484
-0.039933661390923 -0.063583968221369 0.037203496372220
-0.037129005723185 -0.060491749064773 0.039494380747791
-0.018470459869498 -0.055127705193740 0.037785056387898
-0.011687303246045 -0.054401518353157 0.035708382164952
-0.005299503454892 -0.051002299194653 0.036814078723904
0.002657717407762 -0.048134472388158 0.036749077593801
0.010069551511632 -0.044545391457086 0.037185569321629
0.016449010567432 -0.042170374678598 0.037503909146304
0.022957503982062 -0.039667356004115 0.037779567992207
0.029168267749466 -0.038257249797386 0.036716118371007
0.036239240894581 -0.034098902613931 0.039045784627911
0.044012354296267 -0.031968165764943 0.038386792297679
0.051627657438079 -0.028126466100239 0.039377141749380
0.059234929008360 -0.026283107585939 0.038356849467274
0.064179725731556 -0.023482441671116 0.038168296491619
0.074105802203016 -0.020731195979233 0.036731843983647
0.080193327297133 -0.018282412692196 0.037923870201426
0.086021328442741 -0.015951194610518 0.037769128755249
0.092662239564445 -0.013867447525208 0.037880979275224
0.097584621070765 -0.013224521133889 0.037255892550466
-0.121080426731110 -0.090306113717635 0.038826300894734
-0.113768307123956 -0.083512389395379 0.038332956110951
-0.105207626819874 -0.080711722918939 0.039200497233388
-0.094939186021076 -0.079360957516391 0.035473336016651
-0.091630161052986 -0.075990630223841 0.037036323248860
-0.085047703258510 -0.072168211824022 0.038469005895099
-0.077362760524377 -0.069614574127070 0.038489659991806
-0.069690477702414 -0.070322248397937 0.038446548974034
-0.063093970102401 -0.068252619724148 0.034615734374044
-0.057428254582029 -0.063309554227684 0.038422096049306
-0.049851547891671 -0.060029255633944 0.037915960049150
-0.044259655176334 -0.057027063730529 0.038720117556569
-0.034788571277804 -0.053528612382067 0.038704596220968
-0.029682894556644 -0.054480954579436 0.035970152413365
-0.020794681404385 -0.049342956194175 0.037694653212544
-0.013717149224626 -0.046230165411237 0.038863314584412
-0.007983858475538 -0.043147726001132 0.039734650408742
0.009071152152456 -0.039162478897269 0.038975667069159
0.014051380260211 -0.035909363431648 0.038141026373224
0.019793653674257 -0.034129023813512 0.039082218443867
0.028389860012889 -0.029958981435876 0.038618210303304
0.033315146994040 -0.026919767836608 0.039790879046436
0.042899634481629 -0.026450691495081 0.036814169680593
0.048468279392216 -0.021720176037367 0.039321596133229
0.054652358038988 -0.019184773710893 0.039545891320226
0.062789639633954 -0.017347454869383 0.038484620950803
0.071099185203578 -0.015582206736547 0.037850208615777
0.075609330803895 -0.011834020584225 0.037860985463378
0.083622282222474 -0.010777407254687 0.039029205542986
0.090605689718355 -0.007352454371833 0.038399570768592
0.095442571491763 -0.004138893108671 0.036107867037769
-0.100231724362766 -0.070330034954328 0.035788378393170
-0.093687112317857 -0.068965831656713 0.039672344481466
-0.087961805721388 -0.067414549688901 0.041440937792775
-0.075503514238304 -0.065131859817059 0.041780544077871
-0.036368834456607 -0.050935804088698 0.041465700900073
-0.008287299189878 -0.040195710616852 0.041662079607961
0.018997027209885 -0.029999905686810 0.041652890320139
0.034233587067258 -0.024234204863768 0.041713621890065
0.043242567456600 -0.020662059307269 0.041863200938221
0.061470878267773 -0.014059460965017 0.041685678278921
0.074143100769587 -0.007376415624683 0.040075983934264
0.080414926657087 -0.004026049532768 0.036750340099651
-0.109903479732092 -0.066617288901232 0.035503534113883
-0.104924731567794 -0.064171875486518 0.038079229946452
-0.112740069455865 -0.056274026789539 0.037284531390189
-0.120154285656291 -0.054157918225241 0.036459777628896
-0.116494470415527 -0.053991151204822 0.038871722018239
-0.119340243274217 -0.046134569916897 0.038624965524194
-0.115476720215399 -0.043258259707124 0.041666284834859
-0.126108238566811 -0.041826363959887 0.035911726986882
-0.121377701728566 -0.037809945028278 0.038287884100366
-0.128434166716914 -0.034894312324763 0.036028337275501
-0.124367571885501 -0.032344793794516 0.036634864820737
-0.119573614874756 -0.029231704551694 0.040487695872304
-0.126328375283720 -0.024901464875585 0.037655496394154
-0.120791621858829 -0.024050750289630 0.038973700797078
-0.127870346159248 -0.016794796089949 0.035583929812429
-0.123198435604208 -0.015273462571219 0.036338632687021
-0.118615278713751 -0.010181162968539 0.039409731184955
-0.148265027604315 -0.013527277000329 0.040498384272573
-0.124216092964207 -0.008019727905308 0.038341786380129
-0.117190324027515 -0.005556388151505 0.038078458719114
-0.109954471882153 -0.000175325370506 0.039606564795492
-0.148555508204820 -0.008601837499093 0.039151007925985
-0.135049817797708 -0.005048249178020 0.037879334485051
-0.148537047515890 -0.004189222177166 0.036867122923849
-0.145244895306317 -0.002030694880633 0.036601298367498
0.039409694075513 -0.033050618968468 0.045327976977344
0.044914671882929 -0.030496641858827 0.043230088984487
0.053335179851845 -0.027780756005704 0.044192505156514
0.067911999657548 -0.022328881877021 0.044134783541676
0.073098389627696 -0.020340768523692 0.045877985751148
0.079144081290951 -0.017759260154974 0.044449374313669
0.086212769317868 -0.014213505422455 0.042571711337086
0.089741111296081 -0.013668954753893 0.043637829577442
-0.119251664681785 -0.085376170304006 0.044745697772024
-0.115654503417587 -0.081771699558336 0.047214428380644
-0.105662574032209 -0.081641658313457 0.043798628365514
-0.099046506364001 -0.077687016757865 0.045462371623036
-0.091319878351460 -0.075151586004186 0.045769791876791
-0.084043821843613 -0.073309336311648 0.043297808852738
-0.076857720996310 -0.068801517075140 0.045206636225698
-0.070026881739993 -0.069179196006989 0.042904456889151
-0.056207217286846 -0.062867821899757 0.043789152260142
-0.048923936464549 -0.060024991012491 0.043980270182606
-0.034832432185233 -0.054812953810919 0.043924579894065
-0.029636358537377 -0.051932153584976 0.044658369179086
-0.020774353586984 -0.048601061720927 0.044680619513509
-0.013677234152525 -0.043624151766317 0.046001621520040
-0.007469342981387 -0.043205212579595 0.044148744189259
-0.002549626223267 -0.041046357117022 0.045248488223073
0.007214157526321 -0.037904610546657 0.043475334441182
0.011775980470730 -0.036266652686315 0.044794955765721
0.028228044925675 -0.029997448273605 0.046099486147878
0.034273183107126 -0.030532961484769 0.046762883301096
0.043028705574755 -0.025959907624351 0.045686205501872
0.050409616938536 -0.023943774373573 0.044374517918856
0.060561971098157 -0.019434028236442 0.044078844503082
0.070194489661588 -0.015319239419886 0.045724928925239
0.074966448736984 -0.011722836944899 0.045274785911557
0.083924864646037 -0.010615193630459 0.044432333456990
0.090449786739181 -0.008419808641532 0.044022351842097
0.095620401996714 -0.008499404317239 0.042641680514333
-0.122802346548404 -0.078612196058768 0.046373290335653
-0.117439397614012 -0.076305763894517 0.044884632861135
-0.108007166594969 -0.074931149476295 0.045768577181813
-0.099550600912536 -0.072603424047898 0.046351574967109
-0.096523243679078 -0.071766817167743 0.048978688990591
-0.087204528668025 -0.063789727717364 0.045032934700963
-0.079846643476856 -0.064677639108154 0.043285995598155
-0.072830558199790 -0.060330427381071 0.044386380230901
-0.065459724152966 -0.058265647050927 0.044936908518789
-0.057960589295761 -0.057436235059629 0.045505189374603
-0.051097614250265 -0.052386367586885 0.045583914341712
-0.044555683430230 -0.051806004993616 0.044509982621189
-0.037716563641610 -0.045135174165724 0.045779710248627
-0.031330077855925 -0.046141681594398 0.044500907853759
-0.022750061698548 -0.040898440889240 0.046778098221140
-0.016494129790215 -0.038795589809306 0.046064812457082
-0.009434299298209 -0.038316528817354 0.045992316281317
-0.000043562805891 -0.036993085051566 0.047544353281972
0.006769421840341 -0.032370935481496 0.044614696537968
0.010111650716765 -0.028436482638099 0.046158408152578
0.017266235536124 -0.028753640254858 0.044511420523641
0.024375480043941 -0.024847886336162 0.046687973772999
0.032516460164262 -0.023046888682848 0.044188769709584
0.040474218269204 -0.016185725703663 0.045600307738302
0.044829076534332 -0.015993240469077 0.045624608472503
0.053049443837877 -0.013286414264240 0.046045714720178
0.068848163284351 -0.007695353888613 0.045993774330136
0.074554965972267 -0.005706801527932 0.045705599445476
0.081514440703006 -0.003605574790698 0.046067330687096
0.088359291974736 -0.000718611913687 0.046270189082143
0.092777020204478 -0.000367402785857 0.048902795588490
-0.126911732056584 -0.072827323890664 0.048754033839224
-0.115991903854824 -0.069767693063674 0.048243996734934
-0.110196463798178 -0.067269758475353 0.048410385882376
-0.103492177863398 -0.060501813861083 0.044665782725332
-0.097169570770580 -0.060286660296666 0.045522092616079
-0.089242467869212 -0.060039062147605 0.046763053344117
-0.081264071530379 -0.058580909058089 0.047364954427398
-0.076984413139096 -0.055487999147092 0.048129562174794
-0.069264662524156 -0.051161368350212 0.048822690760610
-0.062423564254252 -0.049128268559511 0.048578032290454
-0.053135757337601 -0.047516978769845 0.047653186594960
-0.047616178212380 -0.042655509760606 0.049015359675405
-0.039866314542051 -0.041909020520155 0.047954363429066
-0.034306616338961 -0.040248724810623 0.047747579371450
-0.026559185024468 -0.036796901215880 0.048017769928293
-0.016290591128441 -0.033427838136750 0.047819001948354
0.004980722247322 -0.024870119336849 0.048124650752066
0.010945023145352 -0.022825217847537 0.048038806712147
0.014254154395243 -0.023494355192679 0.047045763766285
0.020440920849479 -0.018252069066842 0.048518974101065
0.031095507229542 -0.014656741952171 0.048341856944081
0.037774186102462 -0.012931305080383 0.047956136500355
0.045727895824526 -0.009295491954239 0.048250562464712
0.050252011525933 -0.007909081504939 0.048127964293477
0.056188471101189 -0.007115659280339 0.047397676264759
0.064848912031162 -0.002763974410333 0.047144856726643
-0.107034993136521 -0.055300655978066 0.045111221491810
-0.100095015109520 -0.054575732655901 0.046371272599218
-0.092709755098105 -0.053021552494631 0.049263866221424
-0.113884668594173 -0.052203210804555 0.043187391077993
-0.109345283870223 -0.050024915538914 0.045294875657079
-0.104375262570888 -0.048683446066058 0.046783750712392
-0.117091882605682 -0.045436972249982 0.044641970908162
-0.111466877028995 -0.044007119571979 0.046168448960301
-0.119649824899874 -0.035222025094439 0.044129569804188
-0.115070484945635 -0.038739150257020 0.044491415456452
-0.109693568319720 -0.032844992165108 0.047807258402820
-0.121616400350334 -0.030257299160713 0.043087141469635
-0.115429990367998 -0.028061387727048 0.045052517687794
-0.108788829422371 -0.025061608462519 0.048305981750802
-0.124679468107822 -0.020222001156237 0.049340074336048
-0.118551188895663 -0.021430696910181 0.043226123034474
-0.113656747062334 -0.020993219650921 0.046188988673206
-0.106386311797587 -0.016423349807821 0.048233632202464
-0.101884893318948 -0.011633254575707 0.049299159800527
-0.141593373541379 -0.018901601409730 0.045342349802969
-0.132457072220042 -0.021354402057307 0.048528564249989
-0.129729012311051 -0.016998142990919 0.046762204920766
-0.119757333645604 -0.014463908179307 0.044951946055410
-0.115132986671301 -0.013041977643798 0.047295026576040
-0.108226005715227 -0.009856071120070 0.046803478124529
-0.100480852019907 -0.006930136562986 0.047251981395855
-0.094107537055441 -0.004958552417974 0.047478424059866
-0.086007986475426 -0.001707974939582 0.047366067492482
-0.146159349826767 -0.016065762846107 0.046895403976756
-0.138411830071146 -0.013721220746831 0.044594893570261
-0.131534140695087 -0.009622324268234 0.046008055722234
-0.125991628860383 -0.006745577605714 0.043879208361624
-0.117988791183616 -0.004785774367102 0.045990984077769
-0.110473486450590 -0.002820462400894 0.044597448690820
-0.102623336955203 -0.001800594939560 0.045449170386312
-0.146352988957033 -0.009698638658001 0.043937298571584
-0.142059605381390 -0.007752899313770 0.043219941174504
-0.133472157687939 -0.002955366361467 0.042322459971424
-0.127526193591328 -0.002382329599160 0.043435031687734
-0.123084230192910 -0.077921702978159 0.050889313971518
-0.115057173596829 -0.074183739137007 0.051376814066884
-0.107465666702462 -0.074672599767458 0.050274539744376
-0.102612946574290 -0.071141622118834 0.051124132906910
-0.098254308769266 -0.066471809742890 0.052889344965931
-0.086244680498022 -0.062100969968296 0.051772344386099
-0.079863986558575 -0.062095552995624 0.050479598795889
-0.074267385185056 -0.061163469115591 0.049827972208972
-0.052342172418742 -0.052469175134010 0.050120143687246
-0.044713686408414 -0.048636708407141 0.050656862055775
-0.037737250587843 -0.046916088996216 0.050169310366627
-0.016924794613230 -0.037967193470077 0.050830018794056
-0.009719489083396 -0.034360194320392 0.051318777834889
0.005085167746736 -0.031203362154623 0.050000581538197
0.026043446662334 -0.020728073087528 0.051464772021291
0.033884781815450 -0.017774423674415 0.051482118403432
0.036207803004395 -0.016227157329450 0.051834617411612
0.046143033906944 -0.014779632724894 0.050613150711375
0.052394735450879 -0.014547722287218 0.049408622538565
0.057700651528986 -0.009391198171151 0.051550866400715
0.066093193615451 -0.005327668091377 0.051868373031931
0.074718216866202 -0.004425006533228 0.050654959475515
0.081301665841950 -0.001109068673577 0.050572391306874
-0.123518367646165 -0.072020984379626 0.053659779981292
-0.116812512291538 -0.070693585618290 0.052440641676900
-0.112501669566079 -0.067147871624192 0.054340162709869
-0.104984305051160 -0.061694111709789 0.052605588709828
-0.097307270985068 -0.061425562819085 0.051958566462514
-0.090587623997957 -0.060775250621995 0.053530144011494
-0.083317299631113 -0.055257380261509 0.051844867980000
-0.075788025060215 -0.051790813131924 0.052118538176534
-0.070416697037509 -0.050115271538056 0.051153461253163
-0.061969435119667 -0.047186512687166 0.052723457769072
-0.056238465080815 -0.045794950095064 0.051915890354289
-0.047185076462988 -0.043718846168980 0.053487713928538
-0.032612831477222 -0.034988442299405 0.052382590567587
-0.027278638631928 -0.034055596921807 0.051099687373159
-0.018374579963025 -0.033264361801751 0.053123414517673
-0.012350250124972 -0.029093224243066 0.052505355631825
-0.004727443430812 -0.030540978976240 0.052327897822377
0.003462986010115 -0.024549814603647 0.052636458193776
0.016023661363140 -0.018234432495975 0.053288645731923
0.023249074182169 -0.016418743483969 0.052919323527333
0.027698461247791 -0.015287061722458 0.052445495402334
0.034281559829540 -0.009817095806877 0.051611818746247
0.044608150620199 -0.008035060733887 0.054131843363760
0.050269742519162 -0.006769290119920 0.051218013560291
0.055543340164445 -0.002416772595815 0.052953098856923
0.064284661263292 -0.000534959109189 0.053233116709707
-0.127747382946246 -0.066725633751680 0.053334399735448
-0.123623905441403 -0.063581341730125 0.054426596438404
-0.111644737932216 -0.060525385501210 0.056351731097218
-0.107835087237170 -0.058031147169317 0.054098422801016
-0.099407815159600 -0.055279673614934 0.052910995757100
-0.091799886860268 -0.051702585771753 0.052714890467641
-0.086048426225158 -0.050041488961099 0.054871074155487
-0.077213060891706 -0.049493900024797 0.050720523631093
-0.070923893455649 -0.044653351697696 0.051532163798330
-0.065311399813273 -0.041309243041768 0.054353212153432
-0.056490174267698 -0.038976408826314 0.053014442785669
-0.050660023169287 -0.036883462100471 0.051628280436512
-0.044926068896905 -0.035264914664333 0.051434908345855
-0.035330528090282 -0.032450367425537 0.051224643504139
-0.028667950665084 -0.028826821379118 0.054010878836629
-0.022025263546713 -0.027893289057551 0.055559631144521
-0.014861975283787 -0.023485541982612 0.053953086922370
-0.009950820161641 -0.021527725965958 0.056534950053213
0.001570824456723 -0.018391132593176 0.053435622118100
0.004054528429281 -0.015632816513009 0.055479696547505
0.014711281068928 -0.013979775425507 0.052758746897694
0.019255885418349 -0.009471800499222 0.052012112414357
0.027231851470740 -0.009302994205012 0.052526017394609
0.034566981023067 -0.005260097436490 0.052740595137593
0.038849911616887 -0.001762656590431 0.053749744212147
0.047838758521790 -0.000199905486355 0.052249808517044
-0.131826020947570 -0.058698832551977 0.054142571818348
-0.123798227992785 -0.055215896955154 0.053702229296683
-0.114582050512103 -0.052312254771740 0.053680753504751
-0.106995136053009 -0.050315688383146 0.053516322886464
-0.101347094995275 -0.045901679025167 0.051762595291453
-0.095104386150593 -0.044522040004164 0.053033071587288
-0.087784018424240 -0.040669398990930 0.053919291611033
-0.080650020239061 -0.040806057944477 0.053446773325918
-0.072463932387146 -0.036507419611732 0.053628563995676
-0.069599572754122 -0.037215307074348 0.053380740916251
-0.060726999335813 -0.030757845273972 0.053841901576041
-0.053293497845070 -0.029005912382123 0.053722476120311
-0.046194147256783 -0.026013030982431 0.053761619364735
-0.038091725598581 -0.020341445635269 0.054158029353140
-0.031233112396539 -0.021130671658674 0.053629676615712
-0.023603631121347 -0.019740279672112 0.053829941546437
-0.018384598666194 -0.016037503665277 0.054516916389780
-0.001987508022332 -0.008971073728960 0.054534448420523
0.003016448352413 -0.007698268667111 0.053760303294179
0.010359246847918 -0.005394096984549 0.053666406428334
0.017546618701030 -0.003840054242346 0.053474290644642
-0.131110332012258 -0.052353693454967 0.054408611094470
-0.127259094430558 -0.047540483616353 0.054571155344960
-0.119420558612291 -0.045286935595710 0.054479277089752
-0.104102655615741 -0.040525567963341 0.052411428486821
-0.097554410493706 -0.038385472575614 0.053935566699026
-0.089815627654509 -0.033141894764674 0.054539434229847
-0.082655546552202 -0.032265763256245 0.054481405436513
-0.070395174156010 -0.026115988162161 0.054559903895377
-0.062380468702639 -0.025178783086210 0.054468560969349
-0.056200093248950 -0.023308702276428 0.054452826826623
-0.043814713242644 -0.014526763465284 0.054567601954457
-0.034585131415401 -0.013226821758554 0.054553881442067
-0.027221477925118 -0.011990954818829 0.054985364472387
-0.021210971400588 -0.007742320206000 0.054621939455983
-0.003978370984701 -0.003645223160972 0.056217376982686
-0.138718282889246 -0.045563119481085 0.054411657130239
-0.131264406084736 -0.043765644459660 0.054423494135855
-0.118887839251392 -0.039614958764931 0.054459040438649
-0.113217612218900 -0.038226583364499 0.054504634654042
-0.108562512635332 -0.032971290617163 0.052232889687535
-0.100159493813162 -0.032204457535282 0.052623751543148
-0.094751836991738 -0.027523846196628 0.054148212706563
-0.086271730248363 -0.025643465950619 0.054320951894440
-0.079143855695534 -0.021933008473756 0.054204039847371
-0.070443221369239 -0.021017629019628 0.054405184860545
-0.064411327818703 -0.017220366420396 0.054263553893086
-0.053121292708877 -0.013145809096729 0.054282917582508
-0.043388141028928 -0.009932480758956 0.054340286324225
-0.037047549948676 -0.006255270458713 0.054255196050324
-0.029189237841319 -0.004641601316238 0.054440891698516
-0.022987787697183 -0.005128576458394 0.054524369990347
-0.138501245952028 -0.039129944595578 0.053782534396169
-0.133349113562078 -0.033333622446431 0.052682084834097
-0.121171555024644 -0.034661333368133 0.053859882151600
-0.117744089053419 -0.027698277028092 0.052746000086782
-0.107848649789157 -0.022644724321250 0.052385789668080
-0.102451541823007 -0.024291066458773 0.053038618838307
-0.095410495159187 -0.020493891842142 0.052969293391224
-0.089175948133808 -0.019280469307976 0.053244052411349
-0.080766463386007 -0.014137465826902 0.052761759554861
-0.073276878120303 -0.011502735369358 0.052835946833607
-0.069148064552940 -0.010974619491079 0.052991655528066
-0.058706759462237 -0.009775837659806 0.053583167826649
-0.053049423889754 -0.004419068977810 0.052897189890859
-0.046666845213967 -0.003509284815447 0.053206433093067
-0.141138926946223 -0.029946280752178 0.054202464377401
-0.133627000693623 -0.026731685753798 0.053039825236317
-0.126875063231525 -0.025441576224436 0.054809078830853
-0.119381610858714 -0.022500790667618 0.054573824043589
-0.111076329359197 -0.020149798163191 0.052239341532704
-0.105108717505611 -0.016440921625140 0.052801602420544
-0.099734234965426 -0.014483815715574 0.051348815476415
-0.090923465892930 -0.012391185972736 0.052353236472127
-0.084656413642247 -0.008384583162537 0.053032833849903
-0.078122740501336 -0.004973205365908 0.051182460200307
-0.070144710482500 -0.004173624169997 0.052412795272416
-0.062380002961175 -0.001615354726409 0.053565153872487
-0.143647618407348 -0.021583581672607 0.051801663672444
-0.138004623473084 -0.018939686991585 0.051522090708730
-0.126162216994649 -0.018516309695560 0.053561384951589
-0.122495197489251 -0.016155070024119 0.053104358469960
-0.115047997120935 -0.011815656989220 0.052989422912914
-0.108928670681651 -0.012673220376225 0.051882409846304
-0.099129176313298 -0.005770802859997 0.052192049777028
-0.094423827730114 -0.006225739826244 0.053200156008718
-0.088221594475678 -0.001087961739761 0.051615099567547
-0.082020737054723 -0.000987362683714 0.052881360804555
-0.145139314009341 -0.018391030514771 0.050303782577830
-0.141461723435450 -0.016527931135206 0.049435800349234
-0.118126713055740 -0.007027643330269 0.049724277293202
-0.111497895376893 -0.004761396466349 0.050157928263663
-0.094581347024123 -0.000400271329175 0.050253419672963
-0.131458717796513 -0.062758647101015 0.057784520899770
-0.113052817632193 -0.058114529061871 0.057345459417024
-0.107642614641745 -0.054823255873214 0.057860584055898
-0.096604763384279 -0.054791133893717 0.057221652781483
-0.091044979454412 -0.048439371937946 0.057394605433463
-0.071300094509542 -0.041271052995888 0.057350312983511
-0.052305046046324 -0.033648323048414 0.057472988879203
-0.036856047549785 -0.028343689289708 0.057364854609486
-0.030773182254129 -0.026377483686365 0.057285508906361
-0.020054597527551 -0.023340096525402 0.057040876185415
-0.002781204709200 -0.017220159156779 0.056952491557120
0.004358662896924 -0.014345803646886 0.057007776057241
0.016754412520044 -0.008608165441174 0.057298549448965
-0.130750527526822 -0.058412344967236 0.058647088419911
-0.121440958278486 -0.055451473665144 0.058943837916372
-0.119382233607147 -0.054131470490526 0.058357515131949
-0.106178466271715 -0.047822218032316 0.059371166026111
-0.100918014339629 -0.050219164663321 0.058764982020375
-0.091885447358035 -0.045728543048890 0.058031146800037
-0.090132939915013 -0.043738013720128 0.058251443659780
-0.066037252872913 -0.032899525482656 0.058534024989126
-0.059321243096393 -0.031819463347034 0.058241084849354
-0.053302148171215 -0.026729182013169 0.058712334747629
-0.043982614217830 -0.028107464954259 0.057968428408620
-0.036862474487327 -0.024086080640907 0.058195803121247
-0.032752983450704 -0.021661581195223 0.058365221774099
-0.024670824154568 -0.019342750123555 0.057981544291494
-0.017804715580465 -0.015295977467456 0.058287185084341
-0.010310522484807 -0.016509746868979 0.057771533762929
-0.002853785464258 -0.012284841234162 0.057741996562000
0.005126969486933 -0.007252275243050 0.058400932108877
0.009732875690355 -0.007418236140842 0.058066388880728
0.014294268287390 -0.003070190133158 0.058493515447296
0.024671028290608 -0.000302745397043 0.058293433304148
-0.125219180645252 -0.048820972544775 0.059572772988529
-0.117803979381813 -0.046742673832358 0.059151625430104
-0.111210134138187 -0.042545598662600 0.059626841341970
-0.103290537208063 -0.043773177057066 0.059818067347525
-0.097852952966428 -0.037115491135998 0.058920480048176
-0.090859893732131 -0.036132281855172 0.059024839198110
-0.074992841130060 -0.027166947612341 0.059173606669422
-0.069108559468832 -0.028077463967333 0.059077013575550
-0.059667986477613 -0.026406711461486 0.058968772685049
-0.055311763661254 -0.024731591356545 0.058968030726429
-0.050138305391712 -0.016450043274227 0.059169229304310
-0.042756247345417 -0.017185799981548 0.059076003825185
-0.034981777888767 -0.018108989294289 0.058895170008658
-0.028418876428910 -0.012302781621106 0.058516242777821
-0.020275865339416 -0.008691327702198 0.058707482770600
-0.011700347786811 -0.008933169816954 0.058927345072743
-0.007949502297401 -0.004305281789012 0.059105896746634
0.000119107095164 -0.000132323070753 0.059153140818593
0.004430622334478 -0.000139712253418 0.059125409876821
-0.135424481590526 -0.041222101107596 0.059132062073069
-0.128657029102791 -0.042158630738195 0.059461451645213
-0.120884351647961 -0.039407326487609 0.059244183814047
-0.113682605199461 -0.036386158511747 0.059284426486014
-0.108390148754696 -0.031128453168322 0.059607665812488
-0.100691814798156 -0.031194132610786 0.058580005987573
-0.094487816866776 -0.030804158456569 0.059081731593129
-0.078029428778476 -0.022622439533497 0.058902570521352
-0.071651382169982 -0.020698174783201 0.058969681536672
-0.063567067835610 -0.016215169391994 0.058867414271351
-0.053311545420658 -0.011583728713566 0.058769208704946
-0.042480145605251 -0.010325301031893 0.058994613444326
-0.035350400491935 -0.006533169903208 0.058919846649485
-0.030207637737659 -0.005843663556445 0.058532691275594
-0.021163684431399 -0.003383915119302 0.058873295580862
-0.140168071737355 -0.035255141373018 0.057931185837108
-0.131244659579759 -0.034708343399798 0.057906027590749
-0.122051203728198 -0.029901178315817 0.057870028292653
-0.116718328828020 -0.029137464188511 0.058295109545704
-0.108645183749013 -0.028244092429824 0.059197000300405
-0.102723559850248 -0.023527270354223 0.058146745478628
-0.097408310752205 -0.017958258467476 0.056956756388662
-0.086591129885216 -0.019463572300476 0.058158764953928
-0.082737424197329 -0.012477730392860 0.056961013590808
-0.074742192012199 -0.012041731792386 0.057565055644034
-0.067482862689811 -0.007627641232848 0.057180944239614
-0.060042785101406 -0.008427718771978 0.057972278391834
-0.052257571249460 -0.004988181076154 0.057820277964588
-0.034529790538191 -0.002163567589825 0.058504200732229
-0.114061786930767 -0.022420680411182 0.057453662669178
