ply
format ascii 1.0
element vertex 1790
property double x
property double y
property double z
end_header
0.124106820488746 -0.074511014296175 -0.056277692997936
0.116763663252563 -0.072007762196577 -0.057522695744516
0.111422919100200 -0.065537422402461 -0.057349803491914
0.106721344534018 -0.059804052805800 -0.056127996647837
0.103577045261914 -0.057320968351124 -0.056946665013317
0.094839037531585 -0.050380127992055 -0.056654310429576
0.088397134946835 -0.046656832995563 -0.056766769612316
0.075960333428368 -0.039692690389771 -0.058330564702035
0.070980886048116 -0.031197937447524 -0.057072569096568
0.062878376918782 -0.026921225401619 -0.057944784367563
0.060028778099248 -0.020791452358674 -0.056785059178354
0.057518832398414 -0.017272882733492 -0.055666387761117
0.049175907875738 -0.010859067736929 -0.056113710606579
0.043327561858360 -0.008212398174449 -0.057458985213918
0.037857843283460 -0.001831362302739 -0.056768494491262
0.118482274516147 -0.081079503698110 -0.058928332341197
0.112217728503355 -0.075781885987917 -0.059772227808320
0.098796936335580 -0.066500204420936 -0.059596826756480
0.097209455221798 -0.062795226428721 -0.060386526310924
0.090807544406548 -0.058220668405569 -0.060430026575410
0.079857003273713 -0.052197711264007 -0.058063173497202
0.079129224059897 -0.047340128880609 -0.058564816105845
0.073421394738922 -0.044253054431590 -0.058341139042858
0.062873406821081 -0.032063746261343 -0.059311666691783
0.055237455761768 -0.027983608512691 -0.058284701868378
0.047259682319550 -0.021712290007574 -0.060052763188366
0.043277514911078 -0.017887288793734 -0.058379380111379
0.037910437636364 -0.014235409227538 -0.057033834660534
0.032854381361967 -0.006102757559776 -0.058375757420543
0.026466719831566 -0.002046507979458 -0.057224059625946
0.113835388304494 -0.087297511694034 -0.060032062097869
0.107097639025514 -0.083998148314877 -0.061112488631886
0.101005522978646 -0.076990861134606 -0.056702403589569
0.097460583817834 -0.072218551725750 -0.058414463246349
0.088912130657196 -0.068047017110675 -0.059427896702770
0.082908593106636 -0.063309732906377 -0.060072143757823
0.079043105305940 -0.058727890691448 -0.059163540089610
0.073437088861370 -0.052639848310557 -0.057334093841965
0.068148690396886 -0.046908144077244 -0.057927928746226
0.060084381508683 -0.043751135392846 -0.057044336522105
0.056962704169135 -0.037413326361367 -0.057895582402232
0.051968465948895 -0.033656921181346 -0.058977651799205
0.044338236914213 -0.027793977980372 -0.058309167641219
0.038066432037821 -0.024438989425198 -0.058165060246471
0.035019357490622 -0.016918875512846 -0.058395999839104
0.026958846410525 -0.012752258745857 -0.059151707110620
0.022122250027452 -0.006868114009228 -0.059090921605113
0.015894702116352 -0.000727053193194 -0.061168585026745
0.108648544631604 -0.092380912964648 -0.061543277671135
0.104483861243900 -0.088121882767488 -0.060900823796275
0.095934667684672 -0.083405866886114 -0.057522188389780
0.091177483492814 -0.078133924889533 -0.062022236073496
0.084171648495005 -0.073497613110560 -0.059408549829804
0.079575534994031 -0.067907720420905 -0.059334799016001
0.074649710947325 -0.063684215208590 -0.060545384292287
0.069101408711217 -0.057192590368946 -0.057441178207082
0.062787634098582 -0.052146514661543 -0.058608938420298
0.055625208892837 -0.046319444396607 -0.057499883854869
0.052671533132098 -0.043964760198065 -0.058401925480845
0.044599198018822 -0.037285053031636 -0.057496735458060
0.040812325375734 -0.034911210576390 -0.060285177433970
0.033607640864139 -0.028466619044209 -0.059073599064829
0.030405471085475 -0.023623344581411 -0.060513822758677
0.023830846099559 -0.018603607202736 -0.059939037526133
0.018517054153738 -0.014200092096871 -0.060004780836244
0.008940195887034 -0.008828956249560 -0.062167776310925
0.005556407485560 -0.003647483462146 -0.062098730290416
0.102570572538171 -0.098089478555141 -0.061269300663951
0.096455596856079 -0.093801609874024 -0.061097582829478
0.090802167342831 -0.090479905856184 -0.057137685978893
0.086149840333444 -0.083431685056485 -0.059541650212291
0.079579667521200 -0.078803129105752 -0.061906511509898
0.076519565184700 -0.073588157535439 -0.057449220860485
0.070108013858496 -0.068812843304413 -0.059662840855601
0.063175758825358 -0.062340892119596 -0.059672960484508
0.056994341328071 -0.061267667581509 -0.058631002629283
0.052761812855026 -0.052983072704669 -0.059287373173716
0.046384192706780 -0.048514461815145 -0.058121961796763
0.041654564711189 -0.044960934779803 -0.059626909459117
0.035630001428610 -0.039199865194950 -0.059641981328013
0.029368894658434 -0.036129516558050 -0.057921318893118
0.025458502106254 -0.032208280371642 -0.058141724980357
0.019401051034518 -0.023931479049953 -0.058162609939260
0.013226831209908 -0.019116996179554 -0.059579924680607
0.007829186258072 -0.012392648486030 -0.062091940129283
0.001186625104424 -0.005980068997086 -0.057880003178600
-0.004101044084616 -0.004172857850405 -0.060087203801158
-0.011394897982747 -0.000340472302619 -0.057932300134979
0.098618744143391 -0.104966096320474 -0.059547333602591
0.092046467838244 -0.099283069495286 -0.060441033757213
0.086034363288878 -0.094269552085519 -0.059256562118215
0.082466493892272 -0.089000725025901 -0.060524772465709
0.074270339773519 -0.084109297445698 -0.059735535506887
0.069238867696618 -0.080037039291224 -0.057848706639292
0.065605518205071 -0.073956233698495 -0.058402226514956
0.059490415355220 -0.069414613694344 -0.056291702746122
0.054215855997004 -0.064661100704515 -0.057258790410045
0.044900703121534 -0.059036794907895 -0.058225679600718
0.042701882500315 -0.055698690602658 -0.058487369740489
0.037273744988212 -0.049687666279892 -0.059846443379404
0.030267520878261 -0.044618209941074 -0.058040801823619
0.023890209395270 -0.040001115106589 -0.057985025064063
0.020698913161187 -0.032119978475425 -0.056789213383676
0.008957161329434 -0.026832476124029 -0.057551219507538
0.002817550376899 -0.018797890659349 -0.061085031712536
-0.003882446280440 -0.014544473690880 -0.059640913212779
-0.009433862918873 -0.009441236322846 -0.057388580525402
-0.015416246453525 -0.004486916242084 -0.059699693882945
-0.019673195255859 -0.000034245740601 -0.057047168299043
0.092082368853211 -0.110609859911876 -0.058260372365002
0.087719999199808 -0.104544378820740 -0.058925337040903
0.083378619320851 -0.096498789810584 -0.059920339787485
0.075213857791004 -0.094759108192427 -0.059077507222179
0.065488564931696 -0.086430610127421 -0.059508993351940
0.058024268834248 -0.081055878542386 -0.058196039402966
0.052816470586988 -0.076024406363956 -0.058302671635630
0.047607708201594 -0.071218421468183 -0.058400137150769
0.044309514024452 -0.065882324507751 -0.059023575668020
0.035378660373092 -0.058230506266707 -0.058963529789927
0.030267910286159 -0.052909898331197 -0.059203041279796
0.026779941381392 -0.051725502487979 -0.058755994999888
0.015424421979629 -0.044357629392557 -0.058000379765512
0.006576930353090 -0.036342921245646 -0.057635979537650
0.001871409083600 -0.030541795079628 -0.057809940268792
-0.004226252842332 -0.026073209421259 -0.058269234542532
-0.010588835742510 -0.019959403586311 -0.057400480473521
-0.012169868747126 -0.012738786023447 -0.059899374211315
-0.018141516076069 -0.012015783806672 -0.058771969044687
0.090945054778167 -0.114560123422047 -0.056766935551646
0.084919974659332 -0.110890474265834 -0.057229299748425
0.077089798564019 -0.100767583975766 -0.057322202885632
0.074043529295355 -0.098914382662001 -0.057454912388805
0.069242825237695 -0.095889197021788 -0.057134996617319
0.061148840969151 -0.089828890302300 -0.056891721928599
0.057343514467373 -0.084891359132337 -0.056811605656628
0.047110917490763 -0.075136650583653 -0.057082304203991
0.037713785734416 -0.070207449939777 -0.055932157719615
0.026688368543059 -0.058157215570891 -0.056762090886120
0.019948468535835 -0.053727873975013 -0.056242407048227
0.013169479808900 -0.048517386694347 -0.055983358586313
0.004103269844632 -0.037762215239176 -0.056963587010386
-0.003780094584841 -0.033202291620639 -0.056136266911508
-0.004985652452064 -0.030435047794005 -0.056737913334849
-0.018895307996427 -0.019755992085040 -0.056204225743296
0.133179532752076 -0.067437707040041 -0.049431863987926
0.128006229545349 -0.063249271022622 -0.049204317296030
0.119183636823699 -0.056614828449570 -0.053065183842661
0.111945961887582 -0.049508352564304 -0.050170377934460
0.109119095402574 -0.045744648021012 -0.049609789097790
0.101307878831491 -0.040868588550941 -0.051170310795787
0.085094408754130 -0.026893429994240 -0.053322408879281
0.078372882034062 -0.020205183174321 -0.052279844487195
0.071749686244219 -0.014842967489853 -0.052998594487192
0.070147476650045 -0.013413350705363 -0.050775049412730
0.062066660644101 -0.006308534828535 -0.051825430119518
0.128020973225304 -0.071824367804185 -0.052573713505748
0.124184329089787 -0.065047464557377 -0.053668363774302
0.114373613887218 -0.060579473006025 -0.053368177617076
0.109963540445327 -0.056231696865400 -0.049971713587127
0.103497072436291 -0.050870327083826 -0.053752773869517
0.099212676215442 -0.045126349418322 -0.051891458714487
0.092830455201347 -0.043577953878995 -0.051871511662486
0.086623725130846 -0.037130263197209 -0.050144241536144
0.081855528350109 -0.031755629918941 -0.051584840977671
0.076498732439998 -0.026991439877580 -0.053546812260630
0.071133639815144 -0.019788438555008 -0.054254545414928
0.064727113502954 -0.016544611919736 -0.051689970219616
0.056800133333608 -0.011240054817344 -0.052422620976450
0.054110869334546 -0.008016676400606 -0.050153478825572
0.048452895594394 -0.004671568691992 -0.051863352025036
0.123676842336914 -0.075490631535018 -0.051385612690928
0.118289089103925 -0.073651198534190 -0.052350172245983
0.111926197078077 -0.064252118212427 -0.052629532699270
0.101794688335451 -0.062181903310330 -0.048242033207895
0.100785213545974 -0.055642778647090 -0.051106629765513
0.094313796712630 -0.051849275487791 -0.051513310826304
0.090873141424471 -0.045058021379824 -0.051324982165066
0.083689107208361 -0.041480930105958 -0.052770286763195
0.078639179927881 -0.035890832305134 -0.051215536320688
0.072659392456606 -0.031745040590376 -0.052284766536579
0.065592753815531 -0.024511824857027 -0.052368202412608
0.060096906578979 -0.020927293150079 -0.052407245203339
0.054328181905751 -0.016826670218942 -0.052031185734752
0.049760311931195 -0.009594685188610 -0.050839063847545
0.045072547660165 -0.010317146866540 -0.052655863011363
0.038007226814659 -0.002268474879167 -0.052330674565319
0.118893306837691 -0.078451207282088 -0.053722654545786
0.113854458304862 -0.076549951146152 -0.054394331181530
0.106173075333956 -0.072048527916476 -0.054968750838919
0.101088597358439 -0.068629327485342 -0.054192686284069
0.095650199205225 -0.061172345851335 -0.052634499435110
0.089228909276077 -0.055803424571653 -0.053642873204234
0.085797583602902 -0.052133938409462 -0.054458123092336
0.077956478430845 -0.046978187582596 -0.054882955754284
0.072875733066348 -0.040556721055836 -0.054377083663625
0.070516828957105 -0.037431581414902 -0.054129530156138
0.061881361805870 -0.031379488409400 -0.054450552189830
0.055826195756485 -0.023375987293485 -0.053785528386118
0.053241250344929 -0.022949588114188 -0.054298055851940
0.045383789910445 -0.016467376151484 -0.054375725268095
0.037493058660101 -0.013252076871257 -0.055308386052133
0.033655762799503 -0.006657475955889 -0.054491270268444
0.029205823728189 -0.003454115460024 -0.054653681004527
0.095259146650139 -0.071841407767774 -0.050169100773814
0.088778596091530 -0.067336476854738 -0.052084926172577
0.085882386793430 -0.062245925352230 -0.054779580510143
0.092378484096373 -0.077627469410186 -0.050645470504446
0.085910924768043 -0.073207925335002 -0.051882189545089
0.080767506200126 -0.071949057049633 -0.054361868107800
0.091712440879667 -0.084518734130097 -0.048729139531140
0.085586965285037 -0.083210652079417 -0.048951736017549
0.080098177777210 -0.079450433530462 -0.053323443425181
0.074699410441796 -0.078218187625034 -0.053853590214732
0.087708487963035 -0.099886830130233 -0.055214964116100
0.083657193673856 -0.095976743708146 -0.055294775212292
0.079551509850767 -0.088866535830482 -0.050544943058971
0.076178685424453 -0.083831224742487 -0.052511131489756
0.069135738568126 -0.080602843553736 -0.054654984359426
0.060571933925589 -0.075613314636259 -0.055306921208385
0.036709634787979 -0.054533370089043 -0.055344846928598
0.026589796003173 -0.045279556454255 -0.055411615574840
0.011055353208632 -0.031621470261932 -0.055423856938364
-0.024094261456269 -0.000592808130891 -0.055455244267466
0.090971804081962 -0.107152591969756 -0.054104978764538
0.088317549444523 -0.100643074107742 -0.055159834111215
0.074507139658090 -0.095318731535621 -0.051156938755992
0.070605137422780 -0.088451334778412 -0.053465060755097
0.065952206261096 -0.085219219915226 -0.053347718971785
0.058599351550413 -0.079644880622794 -0.053785215580943
0.053326472277585 -0.075681936442771 -0.053595696334523
0.049012985299825 -0.071836438107701 -0.053643408024792
0.043951708490204 -0.067194540086313 -0.053731985295300
0.036682977689487 -0.060694690693957 -0.053683288141571
0.030458360117094 -0.053955524780150 -0.054085046208384
0.024896212835824 -0.049620851272634 -0.053946500981334
0.019499357271787 -0.044245469020713 -0.054113842213633
0.014062634393229 -0.039278047962734 -0.054188116276744
0.008225610456473 -0.034783560107941 -0.054509927952769
0.002524565642173 -0.031719667545643 -0.054312287215871
-0.014830898352124 -0.015032554636641 -0.053797657851858
-0.020535601228625 -0.011050164592832 -0.053568462574961
-0.023277488430638 -0.006921849439848 -0.054048478011769
-0.029501752499533 -0.001525966485841 -0.054025494206432
0.088666215365715 -0.116775256890038 -0.052771238530162
0.080638448607283 -0.110790664719809 -0.051250044072154
0.069535124791716 -0.100899608256247 -0.053252878392222
0.066502890219979 -0.096641828455853 -0.051035753877113
0.059141645121236 -0.091202432377333 -0.050428494084361
0.054349667142835 -0.084978766796164 -0.050636114323619
0.050810585041753 -0.081779272158427 -0.052181770800321
0.041257396021487 -0.074673975541557 -0.051044367039683
0.036702151091571 -0.071069343273758 -0.049996781234427
0.032658093066610 -0.067431552053876 -0.050866164728486
0.025853694155267 -0.061188455225793 -0.050045116627696
0.019948045907041 -0.057501232204498 -0.054776207809133
0.015222740308515 -0.050897247663033 -0.051388649825734
0.008225629546454 -0.046924367476210 -0.052228479588512
0.002814576953585 -0.040791130225703 -0.052566008664982
-0.002460991253450 -0.037183500861739 -0.052253942692759
-0.007149078942924 -0.033800255037031 -0.054758222783092
-0.016355451104206 -0.026224393873786 -0.052434128646536
-0.016962120500656 -0.021922364556278 -0.050796728337290
-0.025963710340001 -0.017479676295471 -0.049381426060680
-0.031964447877505 -0.008811300315176 -0.050846426213269
-0.036375543766008 -0.007101531682934 -0.052537117843314
-0.040577480560215 -0.000696879746155 -0.051054107487681
0.083390161600395 -0.120371707317913 -0.050573881352427
0.077968652559872 -0.117726472045957 -0.050791898930553
0.071514655745997 -0.110821908901421 -0.050966205164276
0.064980775727991 -0.106194180534338 -0.050826360905650
0.061277701309670 -0.102581356636445 -0.051368581974986
0.054206316160632 -0.096677690446253 -0.049376547062877
0.049077503942010 -0.092553925194743 -0.050172219161673
0.047668020826313 -0.085140936806663 -0.053356626713757
0.038795943284426 -0.080627709127065 -0.051722504501028
0.026267788688057 -0.072844325486034 -0.049996252263073
0.018751130441970 -0.064558198418863 -0.050992162907604
0.015789472063492 -0.060978927567764 -0.051521326268198
0.008672240665489 -0.058043409080868 -0.049674843673391
0.003534612997481 -0.052013141899046 -0.050552381718638
-0.001856968331327 -0.045874899239157 -0.049242288792613
-0.006134828267293 -0.041950563457101 -0.051130326664927
-0.012066956037783 -0.036980729596959 -0.051229576949758
-0.019205647263744 -0.030000459972578 -0.050498482589407
-0.023938387562503 -0.027703375958841 -0.050561880314829
-0.030484009040392 -0.022553368691459 -0.050497698033335
-0.037244603233043 -0.016625785605698 -0.050852926457407
-0.039802441828985 -0.013134056581848 -0.051039762700085
-0.046095821139580 -0.005788878299284 -0.052101610386852
0.080089793669754 -0.124899801213471 -0.048359335148813
0.074686683226334 -0.118720274262483 -0.048323538029673
0.061347469350099 -0.108480109584869 -0.048345648015025
-0.032685776656414 -0.024694837257850 -0.049125684941294
-0.045496091464199 -0.018161850521823 -0.049952507857961
-0.051909972059827 -0.010773937834224 -0.049075271809582
-0.057666241422552 -0.008956669111721 -0.050834181035046
-0.062327457280466 -0.003313788035038 -0.050914613926890
0.130123697165251 -0.054621759867630 -0.042376714909557
0.125605255312080 -0.051863703234156 -0.042798727238657
0.120013207276800 -0.045038107040411 -0.041257243677460
0.112362683442555 -0.038962747704837 -0.042643861973765
0.107477174371237 -0.034551304053956 -0.041128103459360
0.095447396120142 -0.025580281024054 -0.042452947819711
0.092993275395629 -0.024204165892325 -0.043075918400766
0.083628120767306 -0.014935142418007 -0.042231687748911
0.080567645288265 -0.010793165530651 -0.040983221257213
0.074054307067505 -0.007067459512959 -0.042655725682260
0.133515801297275 -0.063813231212366 -0.044258161747935
0.127388909671936 -0.060437532240136 -0.044599419479054
0.123090925910213 -0.054674711170217 -0.046455072606089
0.114645977381501 -0.048190365770191 -0.044679935022674
0.103372950527953 -0.039762992250026 -0.043745109549313
0.098933623355606 -0.038765120470015 -0.043518781865124
0.092140260423324 -0.029252852842812 -0.043136640751841
0.087275398243478 -0.025286636672894 -0.044357485020640
0.081095681893221 -0.019700695581871 -0.044214895451549
0.075979645755737 -0.015038506370609 -0.044763755620006
0.070105244839184 -0.011181340766877 -0.041873056614878
0.064738032510402 -0.005610222385802 -0.042318502629283
0.058125657557198 -0.001512728770921 -0.043745957768442
0.129945144209950 -0.068827510658207 -0.045317762578015
0.124341612216446 -0.064425759872300 -0.045616087162976
0.109504408726039 -0.055685629272743 -0.045110670292858
0.105155019900305 -0.050482039019165 -0.043536032773869
0.100294985963055 -0.046417038332927 -0.045604334080699
0.094675560964880 -0.039131517928620 -0.046036532923066
0.087571494171083 -0.035007580108238 -0.047174958114308
0.086202311442673 -0.028962602573630 -0.044408666813854
0.077232537062553 -0.024021307806822 -0.046118231022838
0.072080455819260 -0.019613265234816 -0.046193038507782
0.068863322168376 -0.014130799435320 -0.044648481572153
0.061570837135317 -0.010854243385785 -0.046456995976451
0.056795906797268 -0.005873635334656 -0.046012151921274
0.049894970756312 -0.001139894986931 -0.046719505513194
0.104679009101220 -0.059545887690975 -0.041589320703827
0.100604724576008 -0.056900681510604 -0.045346604959082
0.097899865080861 -0.049873985857145 -0.047128446782114
0.102655105167181 -0.067327390061642 -0.043396093571666
0.098029909769645 -0.062231435481261 -0.047269163334849
0.102613684804743 -0.075357053630929 -0.041946787083627
0.096832877578087 -0.073281108828205 -0.045436201298716
0.095066403871698 -0.082452183196644 -0.043667894142683
0.091118280289900 -0.080624433666443 -0.046095541203500
0.091388346862196 -0.086529175287121 -0.045568630421641
0.087748156134988 -0.084985341348473 -0.045490931523325
0.085731770618865 -0.093739751647115 -0.043569508437795
0.081624744989195 -0.088592678205130 -0.046025348866466
0.080685514431782 -0.096840004949387 -0.043969488347055
0.076026331211419 -0.096957674713374 -0.043226239089651
0.071484133979544 -0.094042184499934 -0.044960989201548
0.071133386936481 -0.099146875078836 -0.044400867029511
0.067027680200170 -0.095282436177553 -0.045523875030929
0.059630452277319 -0.091873782011680 -0.047543391748748
-0.021748116438207 -0.023971716991430 -0.048029089177134
0.084427075668967 -0.122192774030400 -0.047240827763560
0.078049319245956 -0.114660053756711 -0.046329202855113
0.062897360914411 -0.106113441849584 -0.043431259994191
0.061253597039165 -0.100391755540539 -0.042762943198479
0.054785021791820 -0.096086551251355 -0.045476174875580
0.048859312372418 -0.090855314551042 -0.045245008671763
0.043258258565906 -0.086277571699569 -0.045056528294566
0.038796520597561 -0.081959801365270 -0.045320763473195
0.033704630577247 -0.076419712848085 -0.045967298710825
0.029086851695641 -0.071674470093040 -0.046211304549856
0.021972437343205 -0.068364005905734 -0.044625851262095
0.014950904380725 -0.064445238886807 -0.043152319157602
0.010316144545990 -0.054974480936074 -0.046490257084850
0.004369153872058 -0.052227014464164 -0.044908704960826
-0.001644518564098 -0.047032787670017 -0.045012450739228
-0.008056880876007 -0.043039818540002 -0.044705303395274
-0.020248913313729 -0.030265371679511 -0.046327131474498
-0.023828126922590 -0.027418650829235 -0.044985088932994
-0.028338098976460 -0.023247981173839 -0.045238770370168
-0.036459309286962 -0.017559744970538 -0.044294261499726
-0.040416941291439 -0.011407963122787 -0.045969869816783
-0.046108570559027 -0.006725838076526 -0.045701631749157
-0.051701216684704 -0.003608014298216 -0.044646501744273
0.078776270346184 -0.126577357013202 -0.044623491490366
0.071363757760573 -0.121711767786857 -0.044228541168625
0.066090144661024 -0.116098027240548 -0.043683137333873
0.059196144294137 -0.111169462416175 -0.044414442265513
0.057059109341677 -0.107097923995954 -0.046714559758190
0.051616761089658 -0.100997574956455 -0.043612472355844
0.046259031861277 -0.098310444483214 -0.042297875798228
0.039352636392954 -0.089533851109544 -0.044750738347056
0.030982170572085 -0.086998310956013 -0.043281095707895
0.027685758339133 -0.082012963539440 -0.043259610379222
0.022629076288270 -0.075596796725048 -0.044251323267304
0.017754576889838 -0.071875955071031 -0.041689044519745
0.005346664881231 -0.060604947414215 -0.046188707554820
-0.001325903772260 -0.056305443719421 -0.045157781804088
-0.006322267317793 -0.051662347460265 -0.043741547469778
-0.013563128656827 -0.044680585567334 -0.045743098779999
-0.016014495146183 -0.042621501163915 -0.045722051823620
-0.024642967527762 -0.036338854501817 -0.043175224295407
-0.026733336798206 -0.031142351834704 -0.044462970664299
-0.035050809184467 -0.028911750723788 -0.042054121220591
-0.040659280371376 -0.022483502174091 -0.044968372929576
-0.045353906475065 -0.016452825515382 -0.044763241653127
-0.052772939096800 -0.014008321932122 -0.044169184887889
-0.057551848327225 -0.005346365046688 -0.047578344548227
-0.062436283843513 -0.003671599822580 -0.045255212224009
0.057032088632830 -0.114234722123957 -0.041104917729381
0.053678954078259 -0.110476446356082 -0.041816381657603
-0.070772280144105 -0.002522185598116 -0.040714613163952
0.140928585411515 -0.056740223231151 -0.035002065861703
0.134998363245248 -0.051197298601150 -0.034073118412976
0.128141500697587 -0.045405778206344 -0.034195486271860
0.114351637796232 -0.032798354510636 -0.034811880314830
0.087515914671827 -0.009664766699780 -0.033571417057995
0.085302655287867 -0.007439331861933 -0.033232687199596
0.138978115509131 -0.059646358226276 -0.036008078914509
0.131877281172473 -0.056068472492250 -0.036496557438854
0.126868393493030 -0.049076919398704 -0.038089260940236
0.120118904421448 -0.042361498339869 -0.036586149418833
0.117737933408820 -0.041365003402170 -0.035853094304089
0.109848979168130 -0.034877404127197 -0.036829058850291
0.102333153378886 -0.028876436860971 -0.035544196904186
0.096458781505217 -0.023058719887684 -0.034315489018443
0.091306188050367 -0.022784812229007 -0.036093010787648
0.086236789781033 -0.014156744503037 -0.036274010180204
0.079918070273994 -0.011926357550775 -0.035229917729381
0.075112621434174 -0.005155083312472 -0.037246079838755
0.068149010578277 -0.001518576070118 -0.035156113509817
0.134974136229020 -0.061771155228128 -0.037882749760630
0.127562654811188 -0.056383965782983 -0.037753709996227
0.123760097958285 -0.054993986515963 -0.039425367558482
0.112981320690786 -0.048715432192438 -0.035436037266734
0.110912166804291 -0.044319145180260 -0.038576696599009
0.104905634661669 -0.039522050847048 -0.037308438981059
0.101445790492041 -0.035019283479547 -0.039082090580944
0.093558016064817 -0.028364917611944 -0.039309286320690
0.090962213655776 -0.024996087586542 -0.038373159611705
0.082124157044948 -0.017643431902809 -0.038683782780650
0.072722240793525 -0.008297573885272 -0.037761912866913
0.065110598963522 -0.004550490048004 -0.040220823491100
0.114690054763921 -0.060276182395675 -0.033735395634653
0.109999726474248 -0.054554970236913 -0.036645677769664
0.108402505395244 -0.051174920691016 -0.038615598881725
0.112058707480315 -0.065679942122485 -0.036993908131602
0.108656812476255 -0.061125814908808 -0.036812638168020
0.106380255808796 -0.072167873258614 -0.036528362477306
0.103313820647647 -0.082316005961150 -0.037018339360241
0.103373437186143 -0.075728434838477 -0.038358671391490
0.102002753321065 -0.087578560733349 -0.035523517811778
0.095898002429820 -0.085509748501809 -0.039596044743539
0.097111468412340 -0.091583559005057 -0.037690057957652
0.092331842450912 -0.090897619347613 -0.037969962895397
0.087856476046489 -0.095408612587003 -0.036665516102794
0.085696609782770 -0.102357189392276 -0.035003751957897
0.085230134702879 -0.099067472817618 -0.036888281071666
0.075173253759241 -0.105854722315239 -0.035677950108530
0.071155736191814 -0.102197775815312 -0.037158128941539
0.065804046061929 -0.106713324818905 -0.036419233525279
0.060127601913299 -0.102263759760658 -0.036758375370981
0.055611656948368 -0.101236616557356 -0.037732526982310
0.076446999332434 -0.129378715304338 -0.036463266575816
0.071555088069960 -0.124038141287525 -0.034979124272350
0.065749124278211 -0.115161245241668 -0.038436773503306
0.060282978679576 -0.111691573257150 -0.036096365178112
0.052905062681566 -0.106821772216279 -0.035260900700572
0.050558610154635 -0.101851969657826 -0.035640176658315
0.044362704818868 -0.097013959045389 -0.037934954655650
0.037839355877673 -0.092448411702215 -0.036799554483008
0.032278868632942 -0.087205149630558 -0.037257856572154
0.027938266816617 -0.082947718488343 -0.037555341923715
0.022547537699149 -0.078546090849410 -0.037305438562715
0.017317116648202 -0.074209875945492 -0.036960492337230
0.009478815807268 -0.069247100174263 -0.035286224186900
0.004389993262716 -0.062538572893875 -0.037293078943573
-0.001672664213119 -0.058694173019904 -0.035940506184581
-0.006542341323718 -0.052771410837837 -0.037962425435069
-0.010843264734689 -0.048369068905740 -0.037986026331269
-0.027630424124801 -0.038180275907436 -0.033766843998911
-0.029416471788256 -0.033694812938568 -0.036609412968638
-0.035632059395184 -0.027961119018156 -0.036811939824108
-0.040056049142323 -0.023758413388559 -0.037149490559581
-0.046252247673437 -0.019106591496562 -0.036463894093516
-0.052543997175576 -0.013059412366473 -0.036956379775686
-0.057687677403082 -0.009206092499961 -0.036234832585337
-0.061348906187223 -0.003793488186808 -0.038292440617564
0.075766201500051 -0.133016887788214 -0.035910909855845
0.070117440024704 -0.127927268067952 -0.038245804671927
0.063421963567428 -0.123520215701106 -0.036326330388073
0.055513537232872 -0.117896922680391 -0.035450536931040
0.050598593069367 -0.110417973004579 -0.039369028294566
0.045067054006169 -0.107717754577064 -0.035197846615794
0.039028922563537 -0.101092871939516 -0.036630733057342
0.034016193667451 -0.098207010973369 -0.035030462468150
0.024593230644546 -0.087576487302093 -0.037824540023488
0.016715387498410 -0.081693932944870 -0.036822954380990
0.011761939255240 -0.078250660521746 -0.035581690037731
0.006584226759770 -0.072131443904004 -0.037420484745982
-0.006229495006582 -0.062304518861755 -0.035924961674693
-0.010515809142720 -0.055620113866918 -0.036325739109995
-0.014627554230375 -0.054063382644924 -0.034950786157929
-0.020093529122572 -0.048861088418874 -0.037042371953014
-0.028112619663651 -0.041277250383813 -0.037164428914073
-0.032417832016550 -0.037243102554027 -0.038123705876353
-0.044697329091426 -0.027958955254518 -0.036589587732636
-0.050834604171082 -0.022374298007448 -0.036874145710948
-0.057959599524692 -0.017687335507539 -0.035186238174123
-0.061394414373498 -0.011966666920513 -0.038010084355357
-0.063455203491667 -0.009644390692585 -0.038606291020396
-0.071765145732446 -0.002920812977931 -0.038570459568980
0.142077535145130 -0.053886041844577 -0.028002228940013
0.138768305888720 -0.050900309179150 -0.029392387211803
0.133342494090342 -0.046849249377269 -0.030247686589245
0.123104737051450 -0.036553895822423 -0.029755274022104
0.114294552991835 -0.029964918487585 -0.030482962811473
0.106889920496318 -0.023289871572789 -0.029125295842174
0.101284555925001 -0.018226673963284 -0.028828680241587
0.098100338316861 -0.015190863355860 -0.028354996566457
0.084666805008548 -0.004637861497506 -0.030181040013315
0.138178152797200 -0.057946236268459 -0.030086670125011
0.132842674344148 -0.051572952541337 -0.027084739252412
0.127624303992924 -0.049505384199638 -0.030495275700572
0.113461624073494 -0.038368862658902 -0.028057722718665
0.110050001617495 -0.035058277015345 -0.029827959808761
0.103405697634427 -0.030246188510398 -0.032826833928110
0.098170995248140 -0.022718130313784 -0.029171165669444
0.092337067423788 -0.018823157569709 -0.030683448613169
0.088958991003592 -0.014147462160671 -0.028542035623872
0.081823378019730 -0.007632082945327 -0.028127201283458
0.075819689949011 -0.003559247408577 -0.029762840855601
0.118835064301808 -0.057132639275175 -0.026153665745738
0.115958742852546 -0.049603574425996 -0.028571531498911
0.110766792143525 -0.047090923105984 -0.032746587956431
0.116817907058710 -0.058326748721840 -0.030151210988048
0.113045736175374 -0.056381511361306 -0.030630523884775
0.114661196969639 -0.070082551204417 -0.027022106755260
0.112834634858201 -0.065470613577218 -0.029656140212697
0.115586427654840 -0.078676947797963 -0.025854074681283
0.111646657113817 -0.075560386804775 -0.030086162770275
0.110449818996981 -0.070571720312338 -0.031796591008187
0.108803873119714 -0.087005633919709 -0.028315477574352
0.107713618325578 -0.081939958256213 -0.028300154889111
0.103155442065098 -0.089308218780174 -0.029225591862681
0.103319074938649 -0.094519530120006 -0.027620332921031
0.098410133766391 -0.091434601539347 -0.031574116592093
0.096610782079747 -0.100724051024077 -0.027239223683361
0.092511184212841 -0.100089079318104 -0.029110313346184
0.086382858054216 -0.104750354353497 -0.027854467118266
0.082206663837154 -0.102893429677369 -0.030743124974254
0.081417074251615 -0.108384182716697 -0.028118265355112
0.076638788646491 -0.106896743446433 -0.030272043431285
0.074625803345310 -0.111055347389164 -0.026797193730356
0.067815713406242 -0.107080762448257 -0.029536813303314
0.060558634462215 -0.109691482452735 -0.027682498317585
0.057225715754510 -0.106651899210779 -0.029936695302013
0.049879878861439 -0.105205103860930 -0.029977582371715
-0.003017296956681 -0.060413558737160 -0.033100462162973
0.073400269217105 -0.133831709578904 -0.031099976933482
0.066596786498025 -0.128278134736702 -0.030384708989146
0.062827850140979 -0.122274082937546 -0.027985019886972
0.055013444302343 -0.118890321992041 -0.031178353703501
0.052124393076359 -0.112483283677853 -0.030462973797801
0.045564954607139 -0.107475111005871 -0.028889081013682
0.040052220957908 -0.101232114344128 -0.029391892064098
0.035147262162854 -0.097308657384646 -0.028867380345347
0.027840312693799 -0.091269813695015 -0.030221403325084
0.022389281837240 -0.087844397326216 -0.030220358098033
0.016955041338988 -0.082396710424496 -0.028976637725515
0.013096752259794 -0.077911941749512 -0.028893720829966
0.007769033578433 -0.072212230306385 -0.030331183954559
-0.001229912668101 -0.067103361404667 -0.029592511062307
-0.002008250438938 -0.062653218395330 -0.031547098362924
-0.011305280330992 -0.057487015525650 -0.030156708348278
-0.018806857307956 -0.052868456047936 -0.030952445914544
-0.025018403159994 -0.049678188477849 -0.030809707844736
-0.030737249647257 -0.042567903678283 -0.029394706547740
-0.034849522703485 -0.037994053538812 -0.029708094227794
-0.037313787858115 -0.033083510691582 -0.029751966679576
-0.044429519429675 -0.027643085679751 -0.030003217900280
-0.049639050702864 -0.021895375582469 -0.030200573806448
-0.055164250032729 -0.020306781901585 -0.030678417408945
-0.061076821623465 -0.013058784920133 -0.028575782025340
-0.068380143341843 -0.008300295668827 -0.031122956479075
-0.072657603566091 -0.003974382971927 -0.029534506047252
0.071280065441907 -0.137361984146386 -0.027099285328868
0.065152819527898 -0.131941340437735 -0.027914093856497
0.054120180406563 -0.121963635669438 -0.028366975987437
0.049603445046920 -0.117731658443624 -0.029760901972136
0.043105330500880 -0.112461817438741 -0.028914116108898
0.036779329425287 -0.107547925145784 -0.025971140110971
0.031570680157991 -0.102455957379003 -0.026807422841075
0.020087331808137 -0.091469608747091 -0.028255432332043
0.007512932355071 -0.081849186608360 -0.026003187382700
-0.006085818660883 -0.069956199191514 -0.025928812230112
-0.012494714386353 -0.062769278657044 -0.028460663044933
-0.024081989346358 -0.052092498570792 -0.029202863896372
-0.032065648230844 -0.047264072387368 -0.025755850041391
-0.038451773620839 -0.040622524753582 -0.027473541462901
-0.042236619694702 -0.037216927177636 -0.027599987868948
-0.048880881586648 -0.031264072871624 -0.027854341710092
-0.054098619245484 -0.026946720265583 -0.027430673802378
-0.064224241735071 -0.017792070945244 -0.027852945530895
-0.078972402211431 -0.004944008539633 -0.029785009587289
-0.082578875203015 -0.001184806387693 -0.026575970534963
0.141663704053151 -0.047584077366957 -0.020223051274303
0.144287346709615 -0.053591352925766 -0.022216113611542
0.137100900751970 -0.049499082280797 -0.023193186009410
0.132947460611853 -0.042669119702900 -0.021721556457931
0.126011343704998 -0.042125454855330 -0.021079508030895
0.119422045589572 -0.033382712456662 -0.020499437535288
0.114366900730429 -0.028869343687059 -0.021383178914073
0.108507935345825 -0.024007319869909 -0.019815906727794
0.101120193338160 -0.019663196761756 -0.021771685394699
0.097818879091032 -0.015047725519824 -0.022833403790476
0.090534631876778 -0.010097750964270 -0.021931063664439
0.084943720643841 -0.003962930992170 -0.021208669229828
0.127768368802858 -0.045519850586194 -0.024634931767465
0.117332902692744 -0.044502968101874 -0.020584534530325
0.115575528933190 -0.040434572005169 -0.019234598362925
0.110999079694983 -0.032303413641601 -0.022736068928721
0.085191781638814 -0.008498116646367 -0.025160040104868
0.120236968317222 -0.052894369012924 -0.022008245671276
0.117542733969646 -0.049207146889854 -0.022466425145153
0.116958758934307 -0.061708393362586 -0.022047348225598
0.117793730228454 -0.071812023311609 -0.021434362614635
0.115606462838275 -0.080723395357732 -0.022041130269053
0.113431011420184 -0.077456767002393 -0.023312020504955
0.110894103120213 -0.086838414991790 -0.021619463170054
0.110932241593639 -0.083485636953734 -0.020358343327526
0.106313021409433 -0.092344535490324 -0.021859207992238
0.103042633490698 -0.091552985660979 -0.024939586842540
0.103550156112898 -0.095330391409537 -0.021701360905650
0.099008355826703 -0.095715530202265 -0.024942157948495
0.093440338314424 -0.101742549191306 -0.021581407750132
0.091095508234130 -0.107928710677807 -0.019751571858409
0.089419656295945 -0.103962060776536 -0.022298526013377
0.080845928385270 -0.108821429621648 -0.019673471653941
0.077131420993253 -0.108360419392956 -0.023787676060681
0.073067933519304 -0.110849047275490 -0.022295334701223
0.066092136381170 -0.114050049459289 -0.021907680714609
0.061062343208681 -0.111876064659316 -0.020427880172414
0.054542615821183 -0.110563951228566 -0.020870456898692
0.072598489302852 -0.134157001668935 -0.023584900105480
0.066923332845830 -0.129880615622924 -0.021392082417492
0.060833227791610 -0.124141949614921 -0.022137891972544
0.056563076033381 -0.116284331916574 -0.019574816906931
0.050635575690741 -0.111459973616900 -0.022821264470103
0.044056977392624 -0.108216727767243 -0.021829151356700
0.037881299945516 -0.104735316308651 -0.020548666203501
0.032439895092354 -0.098666253743317 -0.023194059575084
0.025082023593297 -0.093397518272286 -0.020859248682342
0.021472802095273 -0.089569986720143 -0.022046881560965
0.014718102269733 -0.083687990201811 -0.022112337315562
0.009497536456313 -0.078722508124932 -0.022694567883494
-0.001185821594688 -0.069627251240233 -0.022269396667166
-0.007438123645317 -0.063993009017006 -0.022476478507317
-0.012207415752242 -0.060062832427761 -0.022044481480600
-0.017299699571847 -0.055843539209013 -0.021570070469859
-0.032233011148402 -0.044330515449966 -0.021540003026011
-0.034167659043995 -0.040851571560524 -0.021867109501842
-0.039968186207432 -0.035266410509229 -0.022955040181164
-0.047205868484338 -0.029189239145095 -0.022422514164928
-0.052498670052579 -0.024096166728715 -0.023215565566702
-0.056950538904165 -0.020520224635529 -0.022563359463695
-0.063690815744140 -0.015476986077231 -0.020973745549204
-0.068931359692537 -0.010183644671077 -0.022227267786346
-0.074543428592260 -0.005905920544583 -0.021073367321971
0.069749720954813 -0.138953034048626 -0.022468911056204
0.062276095682502 -0.133192250199785 -0.020376292749725
0.057140567745238 -0.127392863277010 -0.023181133473400
0.051997826136846 -0.123005545701417 -0.022894618555390
0.046306621108259 -0.118816886491338 -0.022407061779978
0.040179009991975 -0.112771261274379 -0.022881900990489
0.034562308290949 -0.108604101953908 -0.019964428151133
0.028258128682221 -0.101428483372680 -0.023477960789683
0.021307961838114 -0.095997736472154 -0.022185941899301
0.017406151883628 -0.091929414977662 -0.023456352437022
0.012736276130106 -0.088957589795760 -0.021172353947642
0.006782096865355 -0.083827811689667 -0.020916040623667
0.000249356907243 -0.077324934596359 -0.022568876469616
-0.004507660869305 -0.073393113200310 -0.022074648106577
-0.012225714782523 -0.067440918367538 -0.020309198582651
-0.016592929198201 -0.061990437697426 -0.020286576474193
-0.021297290077700 -0.058782819415242 -0.021512374127392
-0.026079790591632 -0.054584944701285 -0.021695561612132
-0.033405716522040 -0.046770784982845 -0.022108474934579
-0.040496934096159 -0.041740444867386 -0.022244775975231
-0.042326752913491 -0.039239714358734 -0.024015604222301
-0.047340390070762 -0.036755281985425 -0.020062132084848
-0.055831780643307 -0.029322170734138 -0.020010256016735
-0.061802923464372 -0.023157557088278 -0.022072385991100
-0.066822614306765 -0.018364438359154 -0.022857290471080
-0.070415339908795 -0.014442807175330 -0.024307834828378
-0.075953034335058 -0.009138043542835 -0.021228999658905
-0.084974838364938 -0.003418238991641 -0.022798001174611
0.144788841289469 -0.048985586319261 -0.014436039174083
0.139737100411324 -0.045052806038061 -0.015851693547251
0.134693834388327 -0.039932905694832 -0.014414100214325
0.128684877098815 -0.035033872058934 -0.014903752393861
0.116066051373123 -0.023569718077772 -0.011298414433482
0.109152306499856 -0.018388477642499 -0.014772939885144
0.106341505056405 -0.016237154569449 -0.015729238713267
0.100013625530909 -0.010497464748673 -0.015165655339245
0.094355723135152 -0.005630437001554 -0.015463190281870
0.142591381240060 -0.053200137865999 -0.014925215924265
0.128957913551113 -0.041398205737954 -0.012524506454153
0.124396521987202 -0.038408947560204 -0.015811964238171
0.117872510395654 -0.031925739836544 -0.013551401341441
0.114100505230043 -0.029095269071872 -0.014440248692515
0.109937481689965 -0.025004412080495 -0.013395524228098
0.103621658834038 -0.019814906213936 -0.014592592442516
0.097359095217216 -0.013996356261787 -0.013529030685110
0.090787939704714 -0.008704890685102 -0.014972214584035
0.088739104070795 -0.005322210893277 -0.014964652264598
0.119620278576335 -0.044439691688697 -0.014186459744456
0.115278505217985 -0.036191454392495 -0.015180706863089
0.122183026975837 -0.055688680560458 -0.013456320012096
0.118751332802338 -0.049775427089933 -0.015366621220593
0.120443012045810 -0.066694649419348 -0.013178474629405
0.119047697192347 -0.060769200334790 -0.015597365900360
0.120078726130057 -0.075033843392580 -0.013908379439992
0.117920790597558 -0.069628084713321 -0.014858623071991
0.115733476198803 -0.081251296069352 -0.013069564386688
0.114904246091281 -0.078243650547233 -0.015945476735119
0.112542020853582 -0.086133276008258 -0.014038176930431
0.107416133240280 -0.093180100552531 -0.014974905217173
0.103255575274044 -0.098803376236141 -0.015421609128001
0.096987796216376 -0.104605125826820 -0.015180371351381
0.093322200925807 -0.107547999227531 -0.016655363286019
0.088297932428960 -0.106683926238350 -0.016690473759655
0.087694846876419 -0.110688185070932 -0.015964229786877
0.081562805611454 -0.111179335704353 -0.015263780034069
0.078329591767357 -0.113981789159126 -0.016684909387909
0.072014363577949 -0.113331448720500 -0.013792331898693
0.065201832769859 -0.114784329302235 -0.016227981134735
0.061436409812069 -0.113553536400261 -0.015006921971324
0.056104368784576 -0.112137823377911 -0.016490232670786
0.055514496119728 -0.115786731188391 -0.014282546564423
0.051613531390278 -0.113187445797928 -0.015616209233287
0.044392822855964 -0.111213806458719 -0.013919067967418
0.024654324443513 -0.094516167779935 -0.017562189305308
0.005460160519792 -0.077656385678441 -0.017646564686778
-0.006276442825367 -0.067491277423372 -0.017270395482068
-0.016781296280748 -0.058051461213927 -0.017847486699107
-0.044349150911085 -0.033989079783120 -0.017537515843395
-0.049284371364551 -0.029505464685288 -0.017936655247691
-0.059834293321939 -0.020359940999475 -0.017683595860486
0.067094747078857 -0.138318693597824 -0.013946846483915
0.063168107384465 -0.134031674936852 -0.015057420933726
0.056181081291749 -0.129303779067124 -0.013829647903128
0.051557894587861 -0.123992994982481 -0.015712463582042
0.043584427150588 -0.117444674499012 -0.015842356884959
0.040344438104959 -0.112269087449559 -0.013057730804520
0.033286944103330 -0.107523089110925 -0.013768273238821
0.030188579604547 -0.102554041871167 -0.014356189295136
0.024403103680908 -0.097270791196028 -0.014055928297182
0.020254282534821 -0.091538643452670 -0.015006509984019
0.012885515451450 -0.086718306795377 -0.014885978901866
0.007954970434730 -0.081709491401991 -0.011834745610240
-0.000269700837302 -0.080021831561701 -0.014496942723278
-0.003888519655397 -0.071929679215490 -0.014104722416881
-0.009632245602937 -0.070174976985331 -0.014529088223461
-0.016523127729775 -0.063559740988774 -0.014309091226171
-0.022190193570398 -0.058391706250046 -0.013663961613659
-0.026753691220136 -0.057487658023282 -0.011771103108409
-0.034251471512099 -0.049215921649150 -0.014096807682993
-0.038330493956622 -0.044162193763803 -0.014768074715617
-0.044508157637351 -0.038144112963079 -0.014158522332194
-0.048116609328933 -0.032443922258065 -0.012121580327037
-0.054872609943247 -0.028953201787087 -0.014450257186574
-0.058349561371866 -0.023987598344138 -0.013359405448235
-0.063837010534204 -0.017988135471293 -0.014431169713024
-0.070904537880322 -0.012872278053809 -0.014139470621430
-0.076443706136900 -0.008212829089218 -0.014248057091716
-0.083703510142787 -0.004390403326426 -0.014641093543922
0.147714953149952 -0.050505672466631 -0.007031004155162
0.142136705111888 -0.045236783608263 -0.005926115239145
0.134971655755828 -0.038934110180338 -0.005170351231578
0.128945451366743 -0.033565751690298 -0.007643373692515
0.122834955388417 -0.027496623749273 -0.006107921422007
0.117264568351830 -0.024253850844980 -0.008818696225168
0.112853454548414 -0.020034056214658 -0.006531522953989
0.105039831521121 -0.013038164606175 -0.005840624058727
0.098903152933288 -0.008056502211814 -0.008871034825329
0.093279319918160 -0.002790716486632 -0.006502828801156
0.090188103047349 -0.000220072929175 -0.007663385594369
0.143055618639917 -0.052623381104033 -0.007801083195690
0.137623672742131 -0.047855276153491 -0.006736946309092
0.134003105595761 -0.044862943741729 -0.006991934025767
0.123469752258365 -0.035708894923223 -0.008485231602673
0.119508026791717 -0.036749845769176 -0.006036824429514
0.113943168619874 -0.028049734774404 -0.006299447072032
0.107936464589627 -0.021859909711479 -0.006448227131846
0.103969443404242 -0.018620572007462 -0.008563287938119
0.097094752691923 -0.012183992874889 -0.005449336572967
0.092153645927213 -0.008017937414209 -0.006529284680369
0.088211089642538 -0.004476142403098 -0.006006567204478
0.123069929633561 -0.047840010991533 -0.007051138127330
0.119462072997143 -0.045717850954806 -0.006761981785777
0.117973924912480 -0.038873503797097 -0.003954431736950
0.123605959445526 -0.058903251324509 -0.008577944005015
0.120336412418025 -0.057291319525277 -0.010053381169320
0.120280744270223 -0.049484187853875 -0.006207250798228
0.121984684299060 -0.066529764439976 -0.007589809620860
0.120438323774827 -0.060642386214442 -0.008247835362437
0.120649406070188 -0.075156986678046 -0.009510606968883
0.118579538086888 -0.072669798440166 -0.005317003453258
0.116762309355888 -0.080937574420792 -0.006428941929820
0.112857555487213 -0.087553949633440 -0.006506555760386
0.109233695872118 -0.094206333953053 -0.006724668705943
0.103062556056158 -0.099717464237033 -0.007943524245901
0.097807219617231 -0.103907200862824 -0.006915964329722
0.092229978210021 -0.110119032386517 -0.007046198094372
0.087800313340142 -0.109042752438602 -0.004998617375377
0.088922298137121 -0.111991937917924 -0.005119806492807
0.080668975221299 -0.111875820446025 -0.004847147191050
0.077332982842812 -0.114696797694651 -0.006675487721446
0.072738375565807 -0.113716677236962 -0.005129326069834
0.065572351682778 -0.117010894230136 -0.006826228917125
0.060820605465133 -0.114304529194452 -0.007157084858897
0.056939568347989 -0.115833707332203 -0.008097129207478
0.051176324917867 -0.112934163125049 -0.007711673667229
0.044961204944587 -0.111420142228278 -0.005717901432992
0.067912981938014 -0.138745174206152 -0.006095977350556
0.061020190395556 -0.133399706073370 -0.005858200912161
0.055625156556167 -0.128842657065289 -0.007346650008840
0.050410256870581 -0.124873029303909 -0.006050870144847
0.046266302511344 -0.117381641746663 -0.007251592076305
0.040399284864100 -0.112211645137255 -0.007686549866679
0.035820277597987 -0.107221871942552 -0.005882238591197
0.028988355871104 -0.104135420619574 -0.006692929788911
0.023624741118064 -0.098102722691212 -0.005151364529613
0.017566990176857 -0.093288588254887 -0.007055743897441
0.012276188362654 -0.088811869770252 -0.007404504979137
0.003898030538418 -0.083210529845156 -0.006666998112681
-0.000625635963027 -0.080124292769049 -0.005823367131236
-0.003103808692270 -0.072957773615603 -0.006541379178049
-0.010407816796231 -0.068959743306996 -0.008132338318282
-0.016008379700179 -0.062399829574254 -0.007344455286347
-0.023438980024815 -0.059815057160808 -0.006262290521943
-0.028034318315224 -0.057402396937462 -0.004800260746959
-0.034848274820000 -0.049664503849630 -0.007334997380260
-0.038762846143214 -0.043410572346403 -0.008884631677949
-0.045103634363178 -0.040204967135855 -0.006389285608612
-0.049362194517257 -0.033390408751351 -0.006390336557709
-0.054477575685824 -0.027764665956671 -0.007444832051280
-0.061661990060357 -0.024661100581055 -0.006479939091684
-0.067849330130537 -0.020259692141887 -0.006438055241587
-0.072081331047652 -0.013658367626796 -0.006606428349498
-0.077681590937085 -0.009281859900646 -0.005662912095072
-0.084485717931412 -0.003864025371744 -0.007170203003342
0.063164542411986 -0.138684444977447 -0.004411199772839
0.059349153001002 -0.135153345438755 -0.003531053746225
-0.090267695827349 -0.003895480807209 -0.004437696660044
0.147031899781723 -0.049159698348965 0.000670815073964
0.141080695505752 -0.044322897671158 0.001333724009511
0.135758256151797 -0.039254339060837 0.002293642794605
0.124366054539504 -0.028563216156717 -0.000217901432993
0.118416191631862 -0.023920737817115 0.000533527806915
0.115179688589925 -0.021950713497737 0.002799718653677
0.104779848494697 -0.012872512669112 0.003305799281116
0.100681464265052 -0.009051668630046 -0.000295129979136
0.095926140314479 -0.004857981304781 -0.000499069417003
0.142979245967226 -0.052319701730531 0.001132584050812
0.139968552833359 -0.049610336688909 -0.000523924077036
0.127266617510945 -0.038450580748327 -0.001837640011789
0.120199702759727 -0.034090352707693 -0.000031156743052
0.113461817722844 -0.027397826481007 0.001860060806588
0.109889706658376 -0.023402701520144 0.002418087438262
0.105451940046457 -0.019525010158538 0.002412513052937
0.096628793467462 -0.011732602241443 0.001422057425496
0.093260574662486 -0.008719491449849 0.000812153136251
0.084895830314282 -0.001331364569559 0.000333357607839
0.123350956831934 -0.050679875531160 0.000796312605856
0.120421551432877 -0.045511043937594 0.002332705430846
0.118407354833752 -0.040064772837481 -0.002559040272715
0.123319705108959 -0.060131656736731 0.001545155322072
0.122410381117301 -0.056076047665306 0.001236965739248
0.120516478687320 -0.049522714222592 0.001471899465240
0.121836403712488 -0.065126543885051 0.000932211809019
0.120861825801502 -0.059405590627018 -0.000120623791698
0.118932867204636 -0.076797984090131 0.001007519518850
0.119614546788290 -0.071094635019571 0.001241185938832
0.116977547746177 -0.081734588350863 0.000938719137597
0.114112123230800 -0.088680416828603 0.000527704353648
0.109547052982627 -0.093519307505842 -0.001465344155314
0.105600687036460 -0.100274262671186 0.001018460547444
0.097720120052216 -0.104431173764333 0.001854253088948
0.092153049255511 -0.106769471168491 0.002092613017081
0.086926932878575 -0.112805855823943 0.001518775736806
0.084670943818681 -0.110419444605872 -0.000006214821818
0.079716059929991 -0.114544235652231 0.001156324183461
0.072255052154638 -0.116990449128122 0.001347139155386
0.067260960490297 -0.115651336363881 -0.000452454960826
0.062043104004461 -0.114572809206684 0.000251619771637
0.056768383662635 -0.115610519433859 0.002328407561299
0.049175473366056 -0.112659092692708 0.001034377848623
0.045584284816217 -0.111799010892186 0.000778270518300
0.067308277065553 -0.138015806294665 0.001291096484181
0.065422695824835 -0.133296149466108 0.001263646876332
0.055891313019535 -0.131497430583325 -0.000853105748180
0.050089894364130 -0.125196553135815 -0.000936687672618
0.046742438173148 -0.116750883363081 -0.000725819155060
0.041271043653887 -0.111973118630551 0.000303857872688
0.034748019363837 -0.109001973779512 0.000402567524091
0.026936312107979 -0.103097759541565 0.002751980387685
0.022673793558015 -0.098919175114133 0.000491480624196
0.016725470934818 -0.092115546359345 0.000329500472065
0.013571798896478 -0.087899144578899 -0.001657079899791
0.004908563458761 -0.082604050953757 0.001555108248708
-0.001547620003580 -0.077699971494129 -0.001383011067394
-0.004985797892217 -0.074070586945156 -0.000883463871958
-0.010449916975154 -0.068301392986024 0.000210806961375
-0.017480199825607 -0.063082896339681 0.000086282288549
-0.023397004252447 -0.059130439861252 0.001040129776316
-0.035494124203661 -0.050107287196243 0.001253711974141
-0.038844661006294 -0.044909189157734 0.001387076174732
-0.043010630062091 -0.038900426112578 0.001964049374578
-0.049403195318496 -0.034192402966210 -0.000752432072642
-0.054270180742154 -0.028350784847743 0.000110439097401
-0.062109073010478 -0.025982881527790 0.001914311205862
-0.067430870393561 -0.020453225430602 0.001037531840321
-0.072172272706187 -0.014339804709157 0.000821216652595
-0.075730658194059 -0.011167970735343 0.001044475352285
-0.084526913161713 -0.006146908694481 0.001091611659047
-0.089695247061883 -0.000026216787594 0.000528128787624
0.062058515060642 -0.137731370684402 0.001096425806996
0.043720530926452 -0.121560253410659 0.001200708186148
0.038999702401171 -0.117541807143472 -0.002224390233042
-0.079132644429666 -0.013941545281953 -0.000640422070507
-0.086721849504661 -0.007101872403028 0.001574817454334
-0.090258281235563 -0.004102468429635 0.001732431208610
0.144753276637282 -0.048569144094508 0.008151982676504
0.139157035289866 -0.043373796347085 0.008435451304433
0.136056650739925 -0.040929873518642 0.007249300753592
0.129323415172317 -0.034073542324740 0.007840866839406
0.121468356224713 -0.027060471120754 0.008361236369130
0.119176860709522 -0.025529527047878 0.007611099040028
0.111214813753371 -0.019502987491052 0.008984111582754
0.106456131062993 -0.015108922280050 0.008188283717154
0.100300682046828 -0.009825041313185 0.008440337454793
0.095631137084776 -0.006372589598797 0.011185775553701
0.090462469596059 -0.000729232897511 0.006241481577871
0.145035567946417 -0.053817157453848 0.009540056025503
0.136550708522399 -0.047937193205640 0.008947079455372
0.126216419588811 -0.038650205309829 0.007840976511951
0.118301363965570 -0.033888065943559 0.007048903943332
0.114089987485372 -0.028159657456698 0.008580376040456
0.108555188979161 -0.023447219326930 0.009214205729482
0.105432871674370 -0.019971831525948 0.005964745318409
0.095723680871886 -0.012216305036965 0.009361740862844
0.091127465855649 -0.008349085434409 0.009943174159047
0.086925366903808 -0.004008271157156 0.007150586401937
0.119727450404696 -0.044763537246450 0.008412311078342
0.116899096668755 -0.037424334880243 0.009144984995840
0.121158381061783 -0.054691796177477 0.008477269160269
0.119958055212228 -0.049201197145148 0.005721633707996
0.120947207313172 -0.065410582636281 0.008480449950215
0.119549812646958 -0.061385977284700 0.010289361750600
0.120433977247696 -0.075300686554765 0.007785571848868
0.118335371513840 -0.070313572401826 0.009092266515411
0.115682654894271 -0.080371211460897 0.007773778394379
0.113136525942818 -0.087969776230990 0.008092888819692
0.110231595293397 -0.092852041379608 0.006667785822866
0.103750153354877 -0.098465564730770 0.008676650321005
0.097012082057749 -0.103598764434062 0.007935162817953
0.091929657110447 -0.108180946601449 0.006252137934682
0.087079267134410 -0.112474660723570 0.005123235499380
0.082594672616555 -0.111123415932119 0.008466485774036
0.077147993486927 -0.115803345247884 0.005204626833913
0.074730831577300 -0.112327827361078 0.009416348254202
0.067841694606403 -0.116734868896060 0.008529418106395
0.060160833546280 -0.113779374363843 0.007576228892324
0.057099236022684 -0.116623830093006 0.008505128657338
0.051295906819652 -0.113991960173399 0.007555567728993
0.043559537111560 -0.109984387900523 0.009781583582875
0.067669495885491 -0.137389154481493 0.008430203870454
0.063186035805763 -0.132789415957738 0.008002173792836
0.056288894568174 -0.130201177032968 0.009912499796864
0.053168237050112 -0.121733894937510 0.006997681414602
0.045593565655022 -0.117448779370088 0.009664465891834
0.039203186469361 -0.114925193815318 0.007087672984121
0.035765665305689 -0.107077859866705 0.007433858244469
0.030493964893543 -0.103078497988452 0.008556774413106
0.022184481024934 -0.098758606502459 0.008982693945882
0.018395766408804 -0.092394463179347 0.008556712424276
0.012434139697038 -0.087424250296422 0.007564161574362
0.006823089014003 -0.082601789587111 0.007989423821174
0.002388567006069 -0.077654472214949 0.008390731608388
-0.003116228462551 -0.072001501207584 0.008651369527496
-0.010390935645590 -0.067377924882336 0.008686633315629
-0.016626168792934 -0.062802404369249 0.008790329014776
-0.021350997917797 -0.058212831664196 0.008279776608464
-0.028526091788135 -0.055458232850012 0.010658535754201
-0.034311742714602 -0.047208874627455 0.007466816699026
-0.038469414046942 -0.041055498717929 0.008199606692311
-0.044522536875338 -0.038032948896947 0.008640847002980
-0.050437369732134 -0.033731140393448 0.007974398886678
-0.055602185863357 -0.028340549473590 0.008370478903767
-0.060364192485970 -0.024214714009219 0.006827286835032
-0.065060996887234 -0.019870368461702 0.008139883156138
-0.070386421257104 -0.015377612562590 0.007267031148591
-0.078744784381863 -0.008552867942282 0.007358945219567
-0.082579486928459 -0.004157661724790 0.007923922248924
0.144773386249295 -0.049805599787796 0.012372171198841
0.136236539389003 -0.041760785020486 0.014474073206899
0.128004125345411 -0.034793657255095 0.013505588900563
0.124414746512809 -0.031066678312293 0.013474875247000
0.117903907470587 -0.025845535728986 0.014418786799427
0.112375951995630 -0.021696780220406 0.013255140101429
0.142416620052848 -0.053606473735147 0.016339001452444
0.139756499847949 -0.046783280565119 0.016930252507842
0.130101926138517 -0.045323996189013 0.017214699542042
0.127102585656538 -0.037679469644244 0.015841327464100
0.121166818244873 -0.035157787341973 0.016629928067840
0.113524868268402 -0.028950459968025 0.015490647854590
0.109332694030528 -0.024304575595136 0.015809679781911
0.104110450040458 -0.019306978650849 0.015447036540029
0.097974950733647 -0.016515641418011 0.015853238379476
0.092773593312555 -0.010150492482834 0.015442061697957
0.085765556741251 -0.005212810911585 0.017579211222646
0.119330948974816 -0.044758315418507 0.014100271403309
0.115419000156397 -0.040131381318422 0.016118093696183
0.112160488023701 -0.033454753632085 0.018024192606923
0.119719734883671 -0.054080253864566 0.015332373960902
0.117004434611579 -0.049154831249337 0.017912252699850
0.120153683305175 -0.066270434687330 0.013858168398854
0.117822020529506 -0.059521557444005 0.016964673157054
0.117677865894492 -0.069478096093571 0.015610854899404
0.113488111436487 -0.079177873413850 0.015906482731816
0.112611204203197 -0.083941660711267 0.015195398763336
0.106794409941949 -0.092641435653897 0.014562111378939
0.102071370558443 -0.096067171082409 0.017031982059793
0.096746520714804 -0.102855731574613 0.012927226817129
0.092443435431881 -0.103283958985536 0.016648679530139
0.091384215684077 -0.107854253537925 0.015909374987599
0.088945524025932 -0.106472023516526 0.015724881922719
0.083017085618514 -0.110413748123215 0.016926305806158
0.077332914582941 -0.109238528929805 0.018340866839406
0.076800162455194 -0.113460660889476 0.016050893580434
0.072611424907117 -0.112460123213946 0.015220096623418
0.060356893995251 -0.112753666747782 0.015832160555837
0.055629670075221 -0.111005831514112 0.017048510825155
0.071958169039947 -0.135506620500864 0.018154122626302
0.067471456289677 -0.131012812088647 0.016907190755523
0.055524483268180 -0.118777919646994 0.015799310004231
0.052388715702865 -0.111523837452720 0.017025915578521
0.043965643131729 -0.108734632689255 0.015390978746275
0.037999076814260 -0.104828515750084 0.017611173108733
0.031764980900890 -0.099689115385615 0.016940293426830
0.026130217718557 -0.095215596600017 0.016029932772633
0.022518118550179 -0.091544764527446 0.017077310676890
0.015324873445155 -0.085125835146616 0.017319349085805
0.008295031825322 -0.079026748532204 0.017041965758321
0.003897811274966 -0.075191813166682 0.017090948219615
0.000194623393165 -0.071392931004520 0.018255655085562
-0.007361486270286 -0.065641532558144 0.016336159502980
-0.012712283485502 -0.061561439296204 0.014979851519581
-0.017043519814928 -0.057328998885656 0.016022100245473
-0.032321919266971 -0.044436339053680 0.018538452898977
-0.035763593989258 -0.039633386796890 0.018710337117828
-0.042137358131224 -0.035123129103419 0.016359849011418
-0.047753298786764 -0.030675913079297 0.015310627018925
-0.053343958385324 -0.025925494238749 0.014960305487630
-0.058660648968306 -0.020461786987439 0.016821227824209
-0.066340864464439 -0.013519894137360 0.017305754458424
-0.069112096293594 -0.011093323378684 0.017145786082264
-0.075233077894034 -0.005852279649573 0.017340548312184
-0.080397366358390 -0.000085687822567 0.015512296235081
0.068399153655393 -0.137223514524500 0.016509944076853
0.062094316118312 -0.134038504833254 0.016767412936209
0.057067355556784 -0.126182597756546 0.017026092326162
0.051844766100871 -0.123742713203714 0.014606847559925
0.046274998742387 -0.118793700560402 0.015414265429494
0.040825595340892 -0.114133442877618 0.015785872574168
0.036371962948726 -0.107421228558510 0.013175842717804
0.029108991167324 -0.103698925421035 0.017238205706594
0.024553513388577 -0.096393639526605 0.014875006472585
0.017931566624614 -0.095870261231493 0.011893485819812
0.011524052699251 -0.089871094948643 0.013078330790518
0.007616517754804 -0.080119624365185 0.013126866137501
0.001456265544294 -0.077647994505207 0.015237165438649
-0.003465514167628 -0.075132500397171 0.014817060676163
-0.008220466376913 -0.070999537792595 0.017097455298420
-0.015772116718930 -0.062956963942476 0.014275202929494
-0.023369930458411 -0.057970346531438 0.013298973834033
-0.033693402409559 -0.048778182410113 0.015286398493764
-0.039929848641619 -0.043907172883349 0.015379157340047
-0.041387229540492 -0.039427952383944 0.015192551409719
-0.049182447764438 -0.032404038855466 0.015838553225515
-0.056654213305333 -0.029929688318399 0.013510532176014
-0.059617962711469 -0.025550411454578 0.014048452651022
-0.066530903187602 -0.019167260160352 0.014801736151693
-0.071050570635339 -0.013336128969805 0.015541357314106
-0.077690285411879 -0.009519401867072 0.015019345318793
-0.084335733434694 -0.003802285458336 0.016654985542611
0.143249257065826 -0.054670790227612 0.024065686976431
0.130283954951775 -0.041427608685616 0.023140228545185
0.126911266062284 -0.038170768869225 0.022106870924947
0.117957805905753 -0.033715410807504 0.022947413002964
0.112354515885738 -0.029035676314331 0.022389497485703
0.109036520004797 -0.022224758469230 0.021208686307587
0.103237762393567 -0.017268408302156 0.021433900868412
0.095678799679951 -0.013041361267694 0.019816937243459
0.085656865341219 -0.007548636700577 0.019817060267447
0.080661904215513 -0.000165989336153 0.022288756008463
0.138005032013218 -0.055191423748796 0.022717865263936
0.128716294959963 -0.048811919955677 0.025249877726552
0.122614492170760 -0.042724091423572 0.024242794469512
0.115153554227593 -0.039908588354950 0.023180858289716
0.110261850013483 -0.033391963464483 0.023873105620859
0.104766580130842 -0.026763404604153 0.023787722861288
0.100776149240602 -0.021893770742541 0.021680009638783
0.093246492698288 -0.018549371852242 0.026457227980612
0.087240756224375 -0.010972718661457 0.023206235682485
0.082103961853219 -0.008085647165230 0.025521080767629
0.077581365499870 -0.002970453939001 0.023866218363759
0.116051319503647 -0.051207826990092 0.023597447033243
0.112993220088810 -0.043661035162322 0.024448440269150
0.116076413848242 -0.060454232892293 0.021222499262807
0.115213407370560 -0.054786201873321 0.023457722699162
0.116299891635201 -0.072400083565987 0.023981112277028
0.113956486131060 -0.067666375796917 0.023685776984211
0.112092021307506 -0.076748970588652 0.024280973549205
0.111018697048486 -0.085860504112381 0.023089448487279
0.107893524862813 -0.085336369460396 0.022858042037008
0.107011654578367 -0.092596204274105 0.022277445998735
0.103672985328492 -0.088900003251592 0.024316477016129
0.098030557434765 -0.096248261361707 0.022234263966285
0.093467228886267 -0.103837594032572 0.022558992182728
0.092773679796975 -0.100254352378121 0.024747296607015
0.087406329274336 -0.104014208732612 0.023214071017686
0.082037244825225 -0.104197149971221 0.025717843329428
0.081777727255874 -0.109382063134139 0.021227429377553
0.078752858043349 -0.107393709866751 0.023484849607464
0.071209987558268 -0.110550262525258 0.021948440730092
0.065451248795500 -0.107837998844617 0.025289537035939
0.066101294356135 -0.113028380159838 0.022125544344897
0.060033727123942 -0.111749921182428 0.022451101576803
0.053859182885140 -0.107877463921944 0.023755623518941
0.049759189389121 -0.105746177704824 0.026011200224875
0.073306998479098 -0.133498446870166 0.023620959635095
0.067178304081441 -0.125060277467238 0.026391879832265
0.062682602432930 -0.123066214978722 0.023518141066548
0.056147728081619 -0.119820506985965 0.019525241648670
0.044220529415581 -0.107531416341566 0.023888487135884
0.038927833267132 -0.103643577789866 0.021384040629383
0.032888925111719 -0.097381218078118 0.022909651632624
0.027884697905967 -0.092855703206973 0.023035178537684
0.022255582050497 -0.087380859809444 0.023801253830907
0.014913090589772 -0.081431741471611 0.023120416120209
0.012777268233909 -0.079226374377150 0.023679494018871
0.007402919126512 -0.073985411542401 0.024511322136240
-0.000891220424592 -0.068160003167317 0.022222978484152
-0.007467503419321 -0.062102973837481 0.022646944319722
-0.012872870429066 -0.057230691201752 0.023273864662167
-0.015428116355212 -0.054432682078902 0.023620234286306
-0.027039171550362 -0.049069833909594 0.026860981976505
-0.031780222205984 -0.043819022216145 0.024737686669346
-0.034728130877199 -0.039127127060740 0.021252329623220
-0.039559164392971 -0.033260610120764 0.023713489329335
-0.043848412869056 -0.029779138032011 0.023262110507008
-0.051830046312769 -0.023837817969868 0.021695055281637
-0.055124718659107 -0.019583110597661 0.023799617166835
-0.062109230339244 -0.015475153592212 0.025940051590918
-0.068303510410671 -0.008568748805789 0.022951602375028
-0.071947438619573 -0.005492526880302 0.022751916086194
0.061478822846107 -0.130900937641701 0.020518743788717
0.058181355359885 -0.127218595058225 0.023332868253706
0.053420656729434 -0.121829024499060 0.024155209874627
0.048102781194153 -0.117968789348971 0.023485423361775
0.034700199925297 -0.105832710689304 0.022572421824452
0.030151642096293 -0.101108881532693 0.023850442921636
0.025321132514070 -0.095593874189582 0.025954671179769
0.019055449841706 -0.090467904720513 0.025386170184133
0.014340622459706 -0.088034991925235 0.022653728520389
0.005625905852540 -0.081132761891525 0.021296238219258
-0.001131100134660 -0.076083457457753 0.019676277911185
-0.006364256959744 -0.070274437775054 0.021926702296253
-0.008791553942294 -0.067240294326533 0.023500793826100
-0.016238103325916 -0.061251291017437 0.020693784749029
-0.020822028932664 -0.056764667390823 0.023036129843709
-0.029423145355991 -0.051097298056926 0.019977903162954
-0.033020481735982 -0.045028010248744 0.024380392189341
-0.034621723411613 -0.044105433306413 0.024283976351737
-0.042254520351790 -0.039285958470856 0.021045873120940
-0.047231162410006 -0.033718132414103 0.023213190352437
-0.054547063415840 -0.025257146037944 0.026395105635640
-0.061197593663041 -0.021582472009929 0.022964948768931
-0.073395103166841 -0.009842961911047 0.024731359755514
-0.075503020304257 -0.008403845487248 0.022769262825963
-0.083185762397657 -0.002961370089745 0.022463548377671
0.142227028660894 -0.055763024122288 0.029049077873942
0.136236641718420 -0.051034133690576 0.029092153698720
0.129711058299832 -0.045792159012579 0.031266254564639
0.125368235112180 -0.040967651326457 0.029298315739152
0.118559289344865 -0.036011021221300 0.031064649617191
0.112232827000566 -0.029538047959323 0.028367652719733
0.104074685871270 -0.024116928306168 0.030508574528512
0.102298902674881 -0.022257614677909 0.028946916138648
0.094228854800492 -0.014255557944829 0.028904513472584
0.083875730385867 -0.004950428154181 0.028050561701773
0.137145372267055 -0.060705350048611 0.030762302523372
0.132776633459868 -0.054796353237601 0.031690372935948
0.125056122566013 -0.047369184337725 0.032640258407113
0.120504522935659 -0.039943579545154 0.032545531516788
0.115755751608828 -0.039760592902962 0.029857101016756
0.108223022977373 -0.034210657077191 0.030377556895730
0.101402300565031 -0.027111126675760 0.028188978588101
0.098122578418079 -0.025383545496192 0.030826610064027
0.091758622158011 -0.019487820776459 0.030032029470321
0.087987771889861 -0.015283498353762 0.031076261734483
0.082351753683476 -0.008719900717719 0.029948200797556
0.074854523087508 -0.005293300424910 0.029788855707166
0.068734057466469 -0.000569306837341 0.030534071853277
0.134403415656527 -0.061684345426138 0.034124691998479
0.115050395113294 -0.051515175165503 0.029658144151685
0.109096597801942 -0.043254935544756 0.030497069108006
0.107257289262052 -0.040466533316184 0.033704522764205
0.098497993556935 -0.029806466239172 0.033736857449530
0.080627997767045 -0.014411565607038 0.034000742470739
0.113732488228492 -0.060983730180480 0.032659746682165
0.111132794686060 -0.056699445518216 0.030480722730873
0.112534002436079 -0.071197370923066 0.031043862527128
0.111306528606764 -0.066617617588562 0.030220114247766
0.109464470312165 -0.062379865060420 0.032620114480971
0.112434924559802 -0.071976846282816 0.030831492578504
0.108347441899315 -0.071567893568185 0.032244003498074
0.107166942268367 -0.081963566572072 0.029713301074025
0.105566818528932 -0.076424087982606 0.032498522078513
0.102277362594666 -0.086782217316896 0.031235099148271
0.096902879999012 -0.093471651044412 0.029040723133931
0.095261482393888 -0.089180744172198 0.034066562687870
0.091790984445709 -0.097623995124272 0.029838217144724
0.087500383137925 -0.097239669964609 0.031830256646391
0.086517491907152 -0.103813883039821 0.027922473167892
0.081367116475512 -0.101036348146386 0.030720338052032
0.077076396384636 -0.105082734953049 0.030339783635682
0.071093192492776 -0.104187498644704 0.030589623794474
0.071547065342472 -0.106156983385855 0.033151825224874
0.065840043358240 -0.106041901658426 0.030389441532079
0.077922898694550 -0.129970016284112 0.031580082630630
0.070960876745979 -0.123228676799614 0.032260038411139
0.060684002388892 -0.112164059035983 0.031570360099789
0.054483232347884 -0.106296757592946 0.031055163490292
0.048505540557705 -0.102597584745109 0.030570250933883
0.045453850231992 -0.100570610314661 0.032538219725606
0.036686271195406 -0.093251186069841 0.032155351823089
0.030457824171511 -0.088222166791512 0.031735886847493
0.024619552991520 -0.082494906016194 0.032320566510675
0.020978664334430 -0.079591976068435 0.031983815311906
0.016395376397834 -0.075114289549440 0.032525301253316
0.001639365404759 -0.062447357771894 0.032227426623818
-0.002442076161200 -0.058201370678022 0.032837677663084
-0.009348967642513 -0.053184346165575 0.032184724819181
-0.026567934705269 -0.036621419047591 0.033280503069876
-0.031777648478207 -0.033302811090169 0.032044606005667
-0.038733329893175 -0.027381440548077 0.031890278851507
-0.041567903606568 -0.025601211935441 0.031148346329001
-0.045405854063804 -0.020235443001973 0.033145561134336
-0.049516555688789 -0.015887052358287 0.033856704667725
-0.060077792701580 -0.009370314970648 0.031129997571823
-0.064341239965157 -0.004324465164855 0.032514312898635
-0.067581302157710 -0.002634479108735 0.033860399758336
0.072060002700033 -0.132776345475730 0.028684672927377
0.067248271732569 -0.128040908546389 0.030219141458985
0.061555012898436 -0.122239924109813 0.030118218973793
0.056397098115128 -0.116538021666359 0.029679615164069
0.051544182068374 -0.113093159827846 0.030197543942449
0.045730381872994 -0.106836886964783 0.030209210437057
0.037159018345228 -0.100892837320126 0.028110724961277
0.033887835547175 -0.096701939703731 0.028860200798032
0.027253219624370 -0.090662920036301 0.030039633890507
0.022831485644316 -0.083186244438399 0.029975084101676
0.016897360907936 -0.082971057882145 0.028297740554330
0.011540506633116 -0.078269326076328 0.029412186270472
0.006296450335576 -0.072687742401798 0.030947032407440
-0.001331556668272 -0.065498463284699 0.032209591781614
-0.003310271042988 -0.063967807755495 0.028404507394153
-0.010912277516486 -0.057516687211820 0.030266764002559
-0.017647754994125 -0.052857533937240 0.030342738289013
-0.023735823207869 -0.048373177512824 0.031361500358101
-0.029870208637101 -0.041642179989857 0.031859366213795
-0.033702461838274 -0.037295088313654 0.029866219228027
-0.038559673905020 -0.032957277350154 0.028508303359664
-0.045806851802118 -0.025421624951028 0.027081566369053
-0.050622107316943 -0.023640685635207 0.030611862776229
-0.056196601675028 -0.020176875342248 0.031112851933159
-0.059917483092598 -0.012425898284368 0.029955703234193
-0.067656763256228 -0.007446742298423 0.028535259401319
-0.072647660925064 -0.004510129907803 0.030007711684224
-0.082937521385467 -0.000907517175602 0.029118080770490
0.138497943866199 -0.061486007849889 0.036609546839710
0.130087273564999 -0.050745514956714 0.035021054541585
0.124593905066903 -0.048261212129692 0.037526528234797
0.120422515008852 -0.044907592586547 0.037908538297333
0.115493073903351 -0.041560926369224 0.039445425784107
0.108695755929704 -0.034904116768157 0.035839036142346
0.103193675989883 -0.029889770282074 0.037175804411886
0.099907505430455 -0.026035326889863 0.036426606928821
0.092367345279067 -0.021513575177573 0.038195765133219
0.085116511338748 -0.016720043648683 0.039613687788960
0.081124027645667 -0.010906692690924 0.037615103518484
0.074911916023574 -0.005081649785064 0.037203496372220
0.070860510120805 -0.004074662725561 0.039494380747791
0.136859566460155 -0.063914966795803 0.038826300894734
0.127414067607885 -0.060689391692366 0.038332956110951
0.120895048095583 -0.054473978224288 0.039200497233388
0.114844916381596 -0.046067947659595 0.035473336016651
0.110309799688264 -0.044748300405128 0.037036323248860
0.103827059989779 -0.040759100104190 0.038469005895099
0.097940149656547 -0.035198192170886 0.038489659991806
0.094932091015580 -0.028104793141764 0.038446548974034
0.089986717503495 -0.023273586647485 0.034615734374044
0.082950722304851 -0.020622360435943 0.038422096049306
0.076474933366040 -0.015500739524963 0.037915960049150
0.071183577525049 -0.011995889495534 0.038720117556569
0.063618973855395 -0.005308785236469 0.038704596220968
0.062041266070247 -0.000360479608623 0.035970152413365
0.109394722825676 -0.055004608927835 0.035788378393170
0.105095315180827 -0.049885225043127 0.039672344481466
0.101018905050265 -0.045576107753626 0.041440937792775
0.093111350305499 -0.035682156182740 0.041780544077871
0.062082962685680 -0.007928051593095 0.041465700900073
0.110702031246698 -0.065281684381055 0.035503534113883
0.106191349794471 -0.062053413498850 0.038079229946452
0.102933361153673 -0.072676079377128 0.037284531390189
0.104578595062768 -0.080208789560515 0.036459777628896
0.102699429007326 -0.077063826321987 0.038871722018239
0.097125599579194 -0.083289315716653 0.038624965524194
0.092763203106839 -0.081247388228508 0.041666284834859
0.096533966132782 -0.091290338695853 0.035911726986882
0.090756883773291 -0.089024302680287 0.038287884100366
0.091528493588543 -0.096620303633855 0.036028337275501
0.087357847016184 -0.094244815173048 0.036634864820737
0.082346481398151 -0.091495349207257 0.040487695872304
0.081729174321942 -0.099495142692636 0.037655496394154
0.078359133433964 -0.095020527825616 0.038973700797078
0.075317930012590 -0.104690496327066 0.035583929812429
0.071766494257190 -0.101295130664170 0.036338632687021
0.065111436406976 -0.099668155760771 0.039409731184955
0.082092806543554 -0.124202563368694 0.040498384272573
0.065858423815534 -0.105624910885176 0.038341786380129
0.060363056026523 -0.100601923252505 0.038078458719114
0.052198056531797 -0.096774890959236 0.039606564795492
0.047920135896293 -0.092054602784252 0.041020944392201
0.035913669090316 -0.083946033348796 0.039399338042257
0.031858026703048 -0.078947229994907 0.040373706614492
0.026446992866187 -0.074677493478764 0.040054879303294
0.018823152974727 -0.068132928630778 0.039966692244526
0.015527554757336 -0.063241166225007 0.041303590571400
0.007705195172484 -0.059210788184251 0.039381484782216
0.006475540457710 -0.055030643811817 0.041452944552419
-0.000857912691480 -0.048381812753427 0.041588042056081
-0.008165414747389 -0.044773727463962 0.039749415194507
-0.022652326922016 -0.032274272197589 0.039605013644217
-0.025609687651326 -0.029739836260695 0.039576291834827
-0.028910757968414 -0.024073029007951 0.041426063811299
-0.038438348095137 -0.018061416425281 0.039862974917409
-0.043752415167076 -0.011723579154104 0.040994565124827
-0.048493531120357 -0.008886060895256 0.040114828860280
-0.053555427163775 -0.004332377784762 0.040157504832265
0.077891522686480 -0.126789752424771 0.039151007925985
0.068368690758456 -0.116574698073519 0.037879334485051
0.057964013524247 -0.111804755720634 0.037187879518189
0.056276902877809 -0.105230925204911 0.036807133471485
0.050860994925299 -0.100755287499063 0.037479048466203
0.045875212309607 -0.097581511919628 0.037281997596739
0.038918215994697 -0.091203237742552 0.038351812815186
0.031426553548668 -0.087715021696687 0.038711195456503
0.029611238431402 -0.083852561041145 0.035161929881092
0.023268640830946 -0.076877376976757 0.037447265739756
0.018190961151112 -0.073738746973330 0.037505056972820
0.013736423322242 -0.066398587820377 0.037981264547028
0.005630384833968 -0.061589393473082 0.037515069090841
-0.000240470646419 -0.056712409325749 0.037857597829135
-0.007254385240343 -0.051988743186732 0.038142748033520
-0.011888600312547 -0.048369247276390 0.037123020445820
-0.019808116648998 -0.040942884739380 0.041550778185841
-0.024703245633577 -0.038137317188064 0.037958711421010
-0.029185344985100 -0.032585056839774 0.037206712042806
-0.034484397555301 -0.025738988013349 0.036659228598591
-0.038593287507570 -0.022214496231321 0.036687689101217
-0.044492771475444 -0.017389541502757 0.039045216039337
-0.052392435388501 -0.013594012395846 0.038460060495510
-0.056449700012873 -0.011034522156559 0.038447111721354
-0.062179077376969 -0.002228064908090 0.038086664831159
0.073995752910990 -0.128862068190461 0.036867122923849
0.070536085819154 -0.126983715221891 0.036601298367498
0.058795997383711 -0.115923424841476 0.037233247553822
0.051724373963173 -0.112129066726113 0.035678710734363
0.045650326680756 -0.104251019956204 0.037086256141977
0.030995963707444 -0.090950286655682 0.037024246012684
0.024403806546087 -0.086831491712349 0.035446858679768
0.007694153228456 -0.070070275084514 0.037419599329944
0.003422016032606 -0.067879789970221 0.036008723055837
-0.004791174795526 -0.060547125223944 0.036133727347370
-0.010562198618768 -0.055736760292184 0.035523898398397
-0.016701103841675 -0.049925747777206 0.036294211661336
-0.019448186268965 -0.048012799815603 0.035818481719013
-0.028706971857830 -0.040316503213101 0.035201160227772
-0.031966243171657 -0.035923552132375 0.036849109923360
-0.041041293191021 -0.027446037497690 0.038771133696552
-0.048316616207897 -0.022726715040290 0.039796135699269
-0.055823625470489 -0.016238388817660 0.036962861175852
-0.061285560822117 -0.012155649509820 0.037564476382253
-0.065576363486960 -0.008805116375399 0.038673032462116
-0.070408319674312 -0.003407581231320 0.036791911875721
0.131651235922665 -0.064637466419950 0.044745697772024
0.126773483854292 -0.063174827272205 0.047214428380644
0.121929555034872 -0.054434580298569 0.043798628365514
0.115314432968840 -0.050478357191233 0.045462371623036
0.109423830501206 -0.044872111377929 0.045769791876791
0.104357109164875 -0.039334673600851 0.043297808852738
0.096984890088529 -0.035138143421405 0.045206636225698
0.094084413398218 -0.028942157520021 0.042904456889151
0.081983663422238 -0.019755840590052 0.043789152260142
0.076032119968538 -0.014685633739364 0.043980270182606
0.064771098554871 -0.004739517845936 0.043924579894065
0.059774024467547 -0.001525884098676 0.044658369179086
0.127373521215963 -0.070966751229172 0.046373290335653
0.122803417279419 -0.067334258887764 0.044884632861135
0.117128071723060 -0.059676125981417 0.045768577181813
0.111074941097765 -0.053328573819803 0.046351574967109
0.108905074127327 -0.051057785361690 0.048978688990591
0.097467398825030 -0.046624728940235 0.045032934700963
0.094766919975655 -0.039722970098577 0.043285995598155
0.087616650279969 -0.035600186367395 0.044386380230901
0.082309043692799 -0.030084588061372 0.044936908518789
0.078028934336721 -0.023871246628788 0.045505189374603
0.070332171786384 -0.020215917066202 0.045583914341712
0.066724511234688 -0.014727887826346 0.044509982621189
0.057611148240076 -0.011860805974378 0.045779710248627
0.055474921985368 -0.005758610034929 0.044500907853759
0.046795109417964 -0.000682282213778 0.046778098221140
0.124222733882444 -0.077324764632356 0.048754033839224
0.116358963974448 -0.069153772551371 0.048243996734934
0.111415460772152 -0.065230944649641 0.048410385882376
0.102280370657392 -0.062528602555764 0.044665782725332
0.099098229590293 -0.057060912939893 0.045522092616079
0.095128068966973 -0.050195194486786 0.046763053344117
0.090067263515767 -0.043857271581211 0.047364954427398
0.085317101335639 -0.041551295231352 0.048129562174794
0.077851902547220 -0.036798917862207 0.048822690760610
0.072822937415454 -0.031734963873384 0.048578032290454
0.067007465484506 -0.024316075929249 0.047653186594960
0.060112517105645 -0.021754958692533 0.049015359675405
0.055786778754394 -0.015281503601833 0.047954363429066
0.051692725138051 -0.011169867560178 0.047747579371450
0.044985034092209 -0.005979043065403 0.048017769928293
0.099375602996270 -0.068111246035197 0.045111221491810
0.095452196665856 -0.062341004133444 0.046371272599218
0.090587544945615 -0.056571021026828 0.049263866221424
0.099889178338766 -0.075611143424204 0.043187391077993
0.095821758147422 -0.072643471453889 0.045294875657079
0.092287661285896 -0.068900369607053 0.046783750712392
0.095446898932072 -0.081638942323130 0.044641970908162
0.091524929183551 -0.077360704401948 0.046168448960301
0.087659370986862 -0.088727145386919 0.044129569804188
0.088590082304623 -0.083028522722736 0.044491415456452
0.080852972644080 -0.081081867613264 0.047807258402820
0.084216808731820 -0.092809385913826 0.043087141469635
0.079354301174077 -0.088399202726595 0.045052517687794
0.073568431314788 -0.083968920081776 0.048305981750802
0.076826617876085 -0.100257517843473 0.049340074336048
0.074990711693928 -0.094287073972361 0.043226123034474
0.072288706448463 -0.090182672083450 0.046188988673206
0.064821910429074 -0.085941222269227 0.048233632202464
0.058471750007813 -0.084243210703655 0.049299159800527
0.023643771847465 -0.053658328898146 0.049319501673694
-0.028688211707601 -0.007645561979528 0.049362527644153
0.083669174059265 -0.115781791655342 0.045342349802969
0.081505432331665 -0.106572749653741 0.048528564249989
0.076376799658677 -0.106231530038115 0.046762204920766
0.069424624057486 -0.098647073834963 0.044951946055410
0.065983264247560 -0.095246557102879 0.047295026576040
0.059907618770640 -0.090670213765205 0.046803478124529
0.053664256549345 -0.085232481979784 0.047251981395855
0.048910891018566 -0.080551477407264 0.047478424059866
0.042213810839152 -0.074955220567933 0.047366067492482
0.035495614552564 -0.068759643588475 0.047505106722827
0.030812341229804 -0.066975762831659 0.046443623935696
0.027410574769988 -0.061296957632891 0.047643448626515
0.023780041196315 -0.057574509955736 0.047885558878897
0.013597650141948 -0.049565061216447 0.047462159907339
0.007407043957581 -0.044105521220673 0.047469243164377
0.001826787715096 -0.041574331663421 0.046692185770986
-0.003415696379922 -0.037892648806923 0.047119214172679
-0.015150441640400 -0.024861205385498 0.049144619738576
-0.018366060456047 -0.022271899956833 0.047136169945713
-0.024082127746038 -0.016502490077916 0.047472802276926
-0.032873640433478 -0.010300884563876 0.046837145920116
-0.034012401020347 -0.008017825643130 0.047427240804351
0.083332276509298 -0.121146176041130 0.046895403976756
0.077599937616475 -0.115431175530470 0.044594893570261
0.070733912025139 -0.111312770975921 0.046008055722234
0.065576432676992 -0.107792044407215 0.043879208361624
0.060062159689692 -0.101670032235038 0.045990984077769
0.054773793045947 -0.095980090706684 0.044597448690820
0.050159771098553 -0.089547690050041 0.045449170386312
0.043714484591798 -0.084883244926219 0.044085479215301
0.036945623671194 -0.082822264293058 0.044759284134226
0.031514630893486 -0.075274143238278 0.044437092577932
0.026781912389286 -0.071274518117409 0.044885274683949
0.020952111095440 -0.068343664585330 0.044997255122182
0.018336689236258 -0.060085357727915 0.044533422266957
0.010422424349307 -0.056528425432528 0.046978281008717
0.003081556680189 -0.051558887185479 0.047569261347768
-0.001104596278934 -0.047074890626758 0.044591147100445
-0.005961992891566 -0.040126188892474 0.046682329451558
-0.012375072392903 -0.038508192308116 0.047288713728903
-0.019866056396519 -0.030766242739197 0.045755466803003
-0.023661772371174 -0.025955354868960 0.044681979657443
-0.028866238873750 -0.021210010495958 0.046004439150809
-0.041011205688700 -0.013239480885297 0.044891491686818
-0.045749623081352 -0.008092570805642 0.045075340544698
-0.050840521506376 -0.002421557141260 0.044012437235829
0.077815188991684 -0.124330436059174 0.043937298571584
0.074069062339268 -0.121469390930667 0.043219941174504
0.065778352111118 -0.116175554492976 0.042322459971424
0.062459227587250 -0.111209039360189 0.043435031687734
0.056072670779844 -0.106760517517272 0.043354081904408
0.051578685811674 -0.102998646266575 0.042864465748785
0.041421950688003 -0.091434534728274 0.043788806712148
0.028528589050626 -0.081463925096931 0.042881703650472
0.023108180283055 -0.076390392550611 0.043103579953826
0.011266765323466 -0.065635348203468 0.043359051501273
0.006069215510493 -0.060941484611646 0.043453728472706
-0.011840298408672 -0.043835051432478 0.042102824961660
-0.015321958154803 -0.041188272556288 0.044141204630848
-0.027847041725017 -0.031083205880993 0.043528675511994
-0.038681482360709 -0.022360236987469 0.044248056685444
-0.045205497943940 -0.022185443959061 0.043083118235587
-0.050749271607386 -0.014950816532009 0.043571118151662
-0.057856514666679 -0.009648699622354 0.043673245703695
-0.063177540089927 -0.002625761613539 0.043087911084808
-0.047071556025736 -0.023050630640538 0.043172148501395
-0.057878645167720 -0.016068249042145 0.042615742480277
-0.059730440811621 -0.012025072112381 0.044227361475941
-0.066399193611225 -0.007517194614220 0.043646512782095
-0.069792487850051 -0.002251399954388 0.044359270846365
0.126898693329262 -0.071541883875976 0.050889313971518
0.119806591845314 -0.066240175866680 0.051376814066884
0.116644015130278 -0.059321500403505 0.050274539744376
0.111236721746787 -0.056718065352979 0.051124132906910
0.105060098280408 -0.055088895718939 0.052889344965931
0.095525472748430 -0.046578529832941 0.051772344386099
0.092500593055546 -0.040960399598061 0.050479598795889
0.089030547498915 -0.036471578914586 0.049827972208972
0.070994190045796 -0.021273042389327 0.050120143687246
0.064007493142085 -0.016367161591958 0.050656862055775
0.059189731158295 -0.011036086898863 0.050169310366627
0.121906290761945 -0.074717237700865 0.053659779981292
0.117562984262537 -0.069438395767166 0.052440641676900
0.112399191000711 -0.067319270504068 0.054340162709869
0.104036907933409 -0.063278665554754 0.052605588709828
0.100166654493703 -0.056643146820617 0.051958566462514
0.096413259426805 -0.051031677578355 0.053530144011494
0.088111431021995 -0.047239032742447 0.051844867980000
0.081494010410135 -0.042247358907586 0.052118538176534
0.077475686146571 -0.038308872590086 0.051153461253163
0.070897514400809 -0.032253996968031 0.052723457769072
0.066959118970357 -0.027864292482835 0.051915890354289
0.060845151362833 -0.020871907119353 0.053487713928538
0.046257289306534 -0.012167623330467 0.052382590567587
0.042910776070996 -0.007910316320906 0.051099687373159
0.037999318296236 -0.000441320650722 0.053123414517673
0.119243341552592 -0.080948931707282 0.053334399735448
0.114521840832354 -0.078804853817242 0.054426596438404
0.106159901715342 -0.069698960292189 0.056351731097218
0.102159567670831 -0.067523646336257 0.054098422801016
0.095747026485326 -0.061402466961817 0.052910995757100
0.088995020843915 -0.056393819413430 0.052714890467641
0.084809496614511 -0.052113640798390 0.054871074155487
0.080145178413093 -0.044589833920575 0.050720523631093
0.072904397586209 -0.041340891298306 0.051532163798330
0.067302099620764 -0.037979730026553 0.054353212153432
0.061071868027208 -0.031313370458292 0.053014442785669
0.056468685463317 -0.027168277201076 0.051628280436512
0.052328928689621 -0.022883380323037 0.051434908345855
0.045307861913674 -0.015762937860753 0.051224643504139
0.038962384832435 -0.011609030723040 0.054010878836629
0.034995930400471 -0.006199408371421 0.055559631144521
0.027722661609248 -0.001975607464060 0.053953086922370
0.114103106299711 -0.088341009019543 0.054142571818348
0.107235308301116 -0.082917942474957 0.053702229296683
0.100315318736812 -0.076173848042444 0.053680753504751
0.094965526070149 -0.070435619502434 0.053516322886464
0.088403937194661 -0.067549549885941 0.051762595291453
0.084233829086295 -0.062703415765604 0.053033071587288
0.077375199284199 -0.058078502397369 0.053919291611033
0.074118919243966 -0.051729546099260 0.053446773325918
0.066457652172141 -0.046553127193376 0.053628563995676
0.065725465933451 -0.043694882263546 0.053380740916251
0.055837584143757 -0.038935558185523 0.053841901576041
0.050775900233753 -0.033216679863192 0.053722476120311
0.044779236470541 -0.028379517310722 0.053761619364735
0.035948153944633 -0.023926642003907 0.054158029353140
0.033397059320862 -0.017511396958563 0.053629676615712
0.028561092359457 -0.011448757438271 0.053829941546437
0.022829080564687 -0.008603956793349 0.054516916389780
0.108174982387861 -0.090713844390629 0.054408611094470
0.102112203929567 -0.089599511753184 0.054571155344960
0.096416941185362 -0.083761266748898 0.054479277089752
0.084972431788521 -0.072521516813606 0.052411428486821
0.079987828380790 -0.067766177570769 0.053935566699026
0.071705891134209 -0.063431043947070 0.054539434229847
0.067545107798623 -0.057538485093228 0.054481405436513
0.056324752494071 -0.049649246103267 0.054559903895377
0.051705659505092 -0.043032763894582 0.054468560969349
0.047133029387242 -0.038473674425289 0.054452826826623
0.033534856882477 -0.031720172243909 0.054567601954457
0.028021207674085 -0.024205207070771 0.054553881442067
0.023447181913942 -0.018303593040422 0.054985364472387
0.016859708085679 -0.015019955831974 0.054621939455983
0.005094084551609 -0.001779154340203 0.056217376982686
0.105794221444224 -0.100629730068201 0.054411657130239
0.100682775857348 -0.094914459306298 0.054423494135855
0.091168402777210 -0.085976657383644 0.054459040438649
0.087261565773936 -0.081638952289659 0.054504634654042
0.080428876880643 -0.080025751595199 0.052232889687535
0.075776066648806 -0.072986567320886 0.052623751543148
0.069093409144481 -0.070438437912534 0.054148212706563
0.063423198300002 -0.063858411375523 0.054320951894440
0.056780927463047 -0.059335765196899 0.054204039847371
0.051856396836343 -0.052104724100930 0.054405184860545
0.045656409534312 -0.048588604008103 0.054263553893086
0.036723374064919 -0.040571884762208 0.054282917582508
0.029285890779549 -0.033518973093182 0.054340286324225
0.023045543823771 -0.029674101091321 0.054255196050324
0.017904583950349 -0.023515568079486 0.054440891698516
0.015398287524524 -0.017822273171862 0.054524369990347
0.000543122281444 -0.006968347095166 0.055541211878773
-0.002954782515846 -0.003527334019340 0.054451713358877
0.100024569419434 -0.103483492436107 0.053782534396169
0.092480037334493 -0.101688540002323 0.052682084834097
0.087885727634372 -0.090333009781165 0.053859882151600
0.080129748742040 -0.090609538261057 0.052746000086782
0.070994414948342 -0.084284683347999 0.052385789668080
0.069890105142904 -0.078751174814917 0.053038618838307
0.063212543328214 -0.074346059447273 0.052969293391224
0.059192716933236 -0.069428441465737 0.053244052411349
0.050681918278175 -0.064454888934311 0.052761759554861
0.044816040615141 -0.059104452384040 0.052835946833607
0.042396579565693 -0.055717386384515 0.052991655528066
0.036398508702889 -0.047087144452744 0.053583167826649
0.029002052593890 -0.044639113913772 0.052897189890859
0.025179632136893 -0.039447378209344 0.053206433093067
0.016885208477331 -0.033120259827504 0.053115326678272
0.013401482512029 -0.030972501975823 0.052900743599253
0.009079148482242 -0.024146610868385 0.053477233683584
-0.005325250877588 -0.013659203643914 0.054779393946645
-0.007718907311851 -0.010886328692830 0.053184192454336
-0.014609615844379 -0.005689484324461 0.053015281474111
0.093183231287304 -0.110153809908129 0.054202464377401
0.086795981892351 -0.105058154680900 0.053039825236317
0.082463711564254 -0.099721069718665 0.054809078830853
0.076326402421040 -0.094512088567288 0.054573824043589
0.070324381823072 -0.088308814005924 0.052239341532704
0.064232678775128 -0.084807484203515 0.052801602420544
0.059964834018493 -0.080999489028981 0.051348815476415
0.053951145574498 -0.074228646969975 0.052353236472127
0.047455447181803 -0.070604462595164 0.053032833849903
0.041357880079682 -0.066463682642216 0.051182460200307
0.036877377896454 -0.059814367395035 0.052412795272416
0.030948633257983 -0.054185387696234 0.053565153872487
0.023320368797711 -0.050645729355776 0.051834603424387
0.021122300370718 -0.045897149046868 0.051714384420801
0.013293075911092 -0.040240910091494 0.051903095042226
0.007554756714783 -0.035052694769059 0.054241339889114
0.002224767300022 -0.029441265290421 0.052847067221093
-0.002547845585463 -0.025810726688348 0.055691502844808
-0.009408280470386 -0.019794189351098 0.053021857630727
-0.012218486782034 -0.015365057842761 0.053835353648183
-0.019696626488197 -0.011032890134669 0.052869172846791
-0.025721537981874 -0.006304722826831 0.053549475275990
-0.030770624540646 -0.003044079052012 0.052739214217183
0.087004020129161 -0.116321922926359 0.051801663672444
0.082004097307646 -0.112602468303519 0.051522090708730
0.076025904275771 -0.102370994919451 0.053561384951589
0.072210237666660 -0.100258372575756 0.053104358469960
0.064862782515179 -0.095752132279204 0.052989422912914
0.062721804606578 -0.089955772677856 0.051882409846304
0.052003235532298 -0.084590538811230 0.052192049777028
0.050176851266952 -0.080230310210821 0.053200156008718
0.042715391155821 -0.077198631794763 0.051615099567547
0.039691786608330 -0.071783969435438 0.052881360804555
0.031147472368194 -0.066140696117867 0.052078115641592
0.017261903399459 -0.057832533457839 0.050656236445424
0.014442465310527 -0.052622202380290 0.051817806040759
0.002789084024495 -0.041367077975667 0.052132597243306
-0.002956756703198 -0.035974865023384 0.051930388565379
-0.007509349457308 -0.030826979415935 0.052780852432566
-0.016180212384004 -0.027639844339117 0.050684504305835
-0.019427596950387 -0.024631875448014 0.051106104647633
-0.025826618022987 -0.018595994697799 0.050580102717398
-0.031317877557005 -0.010515511625875 0.052277451629953
-0.038092290197306 -0.006730680275052 0.051517356192586
0.084897780248853 -0.119147041017874 0.050303782577830
0.081515917314561 -0.116789327120690 0.049435800349234
0.062102282430227 -0.100730405663269 0.049724277293202
0.056968416779732 -0.095963800776110 0.050157928263663
0.045119807001992 -0.083126376308230 0.050253419672963
0.036748176593681 -0.075683339514198 0.049591439997670
0.024312141298415 -0.064758395260231 0.050106040751456
0.005206289317529 -0.048551796766697 0.050061034953115
-0.006566744212564 -0.037754324940458 0.050285671030996
-0.011404907291490 -0.034688170513768 0.049734769618031
-0.021871666888872 -0.026056553805149 0.049472490107534
-0.036348531058768 -0.013361983567245 0.049473012721059
-0.040666094971676 -0.007801937730926 0.050303151881214
0.117505507529577 -0.086095865004481 0.057784520899770
0.104702672421748 -0.072080430426052 0.057345459417024
0.099242664874116 -0.068872457050225 0.057860584055898
0.093989936836264 -0.059164520072480 0.057221652781483
0.085763173478836 -0.057273371757180 0.057394605433463
0.070103025343566 -0.043273191818242 0.057350312983511
0.054397503116225 -0.030148617557010 0.057472988879203
0.042412385541888 -0.019050525352068 0.057364854609486
0.037801233459225 -0.014622829433165 0.057285508906361
0.030052310285313 -0.006618582500991 0.057040876185415
0.113341689851734 -0.087529217034467 0.058647088419911
0.106327083526446 -0.080729942326210 0.058943837916372
0.104189870079260 -0.079541214294005 0.058357515131949
0.092382505263031 -0.070896431212510 0.059371166026111
0.092004077992519 -0.065128025845113 0.058764982020375
0.083773039406029 -0.059296820776803 0.058031146800037
0.081190104316526 -0.058695209881020 0.058251443659780
0.060237617840632 -0.042599611980286 0.058534024989126
0.056107381596444 -0.037194755821025 0.058241084849354
0.048774443907843 -0.034301921115879 0.058712334747629
0.045577441876142 -0.025440061548987 0.057968428408620
0.038664939512194 -0.021071396690477 0.058195803121247
0.034584117475954 -0.018598947368299 0.058365221774099
0.028716035713277 -0.012576996450732 0.057981544291494
0.021901406935747 -0.008444122087050 0.058287185084341
0.019423456178010 -0.001268055869594 0.057771533762929
0.102274643453041 -0.087196489999537 0.059572772988529
0.096934128771930 -0.081648207539515 0.059151625430104
0.090115967491156 -0.077826308557746 0.059626841341970
0.087448828946058 -0.070268971974568 0.059818067347525
0.079010419516768 -0.068630268062281 0.058920480048176
0.074834367098190 -0.062935519240641 0.059024839198110
0.059426699141947 -0.053201848580876 0.059173606669422
0.057443618328531 -0.047587474066398 0.059077013575550
0.051503459054059 -0.040062160775097 0.058968772685049
0.047965975334612 -0.037017671733172 0.058968030726429
0.038222136784561 -0.036380239841139 0.059169229304310
0.035376184796001 -0.029529205159425 0.059076003825185
0.032509604415445 -0.022243783362346 0.058895170008658
0.024288619517294 -0.019210776534080 0.058516242777821
0.017253075909911 -0.013747045651193 0.058707482770600
0.013407151274971 -0.006078483034517 0.058927345072743
0.007555138634996 -0.004964868403611 0.059105896746634
0.100411237630155 -0.099782940382452 0.059132062073069
0.098033049548620 -0.093378276271698 0.059461451645213
0.091930490010239 -0.087833643102892 0.059244183814047
0.085860442889586 -0.082919669578350 0.059284426486014
0.078723955225323 -0.080746169057106 0.059607665812488
0.075138038771693 -0.073933690603331 0.058580005987573
0.071858039915007 -0.068653228722617 0.059081731593129
0.056860760720721 -0.058027755567512 0.058902570521352
0.052146838826308 -0.053320185733433 0.058969681536672
0.044371335927707 -0.048320682731298 0.058867414271351
0.035437402273280 -0.041478839981008 0.058769208704946
0.029202150428018 -0.032533198773283 0.058994613444326
0.022487048654551 -0.028047562580949 0.058919846649485
0.019445498144489 -0.023843707416490 0.058532691275594
0.012998047558941 -0.017041220023872 0.058873295580862
0.007236582074094 -0.015691056411981 0.058869003092762
0.000213266528261 -0.007507767674548 0.058508736407279
-0.002964485128168 -0.005939644413793 0.058876203333852
0.097400232574279 -0.106785804404312 0.057931185837108
0.092694936831414 -0.099184063516199 0.057906027590749
0.084108906167971 -0.093360959182111 0.057870028292653
0.080912002893700 -0.089024759991097 0.058295109545704
0.076303861643768 -0.082336051686305 0.059197000300405
0.069346035710650 -0.079352312693741 0.058146745478628
0.061924532784569 -0.077306081844804 0.056956756388662
0.058130565350310 -0.067064832763137 0.058158764953928
0.050152767221706 -0.066976675481627 0.056961013590808
0.045984399455746 -0.060140116212413 0.057565055644034
0.038660084625391 -0.055834716121303 0.057180944239614
0.035843330471484 -0.048902128247605 0.057972278391834
0.029128578742158 -0.043672206307935 0.057820277964588
0.016917015238493 -0.035299235346990 0.057449097748118
0.018249495616857 -0.029392913585716 0.058504200732229
0.007960020632125 -0.023598993695897 0.057702564036367
0.003499111909280 -0.020032063630610 0.057975618159293
-0.002851381298918 -0.013422089305846 0.058181676661488
-0.008716223516833 -0.011191537332311 0.057709593569753
-0.015685669402815 -0.005749078753988 0.057626651560782
-0.017893031831335 -0.001824013043118 0.057965743815420
0.073737856747052 -0.089863822700190 0.057453662669178
0.010093700688166 -0.032224445489224 0.056882915293692
