18:07:08.958544
18:07:09.405775
18:07:09.906124
18:07:10.405922
18:07:10.905702
18:07:11.405258
18:07:11.905406
18:07:12.406129
18:07:12.905581
18:07:13.405441
18:07:13.905303
18:07:14.405642
18:07:14.905508
18:07:15.405617
18:07:15.905330
18:07:16.405988
18:07:16.905806
18:07:17.405900
18:07:17.907950
18:07:18.407417
18:07:18.907273
18:07:19.408397
18:07:19.908163
18:07:20.408562
18:07:20.909477
18:07:21.408379
18:07:21.908618
18:07:22.409663
18:07:22.907595
18:07:23.408695
18:07:23.908920
18:07:24.407176
18:07:24.910620
18:07:25.408555
18:07:25.909471
18:07:26.409164
18:07:26.909056
18:07:27.407647
18:07:27.907268
18:07:28.407511
18:07:28.908957
18:07:29.409077
18:07:29.908276
18:07:30.407491
18:07:30.908050
18:07:31.408448
18:07:31.908117
18:07:32.408488
18:07:32.907554
18:07:33.408106
18:07:33.908429
18:07:34.410741
18:07:34.908819
18:07:35.407872
18:07:35.907732
18:07:36.406789
18:07:36.905676
18:07:37.407141
18:07:37.906730
18:07:38.408295
18:07:38.920293
18:07:39.426216
18:07:39.926358
18:07:40.434229
18:07:40.925138
18:07:41.415390
18:07:41.920511
18:07:42.414911
18:07:42.914748
18:07:43.415538
18:07:43.916958
18:07:44.411198
18:07:44.911693
18:07:45.405748
18:07:45.906052
18:07:46.414568
18:07:46.913651
18:07:47.417330
18:07:47.914286
18:07:48.412770
18:07:48.943676
18:07:49.456778
18:07:49.953882
18:07:50.444858
18:07:50.920651
18:07:51.427980
18:07:51.922460
18:07:52.411157
18:07:52.912990
18:07:53.412580
18:07:53.913377
18:07:54.424663
18:07:54.905676
18:07:55.406166
18:07:55.905589
18:07:56.405159
18:07:56.905288
18:07:57.405707
18:07:57.905575
18:07:58.405313
18:07:58.905397
18:07:59.405623
18:07:59.905685
18:08:00.416002
18:08:00.919298
18:08:01.420148
18:08:01.915076
18:08:02.418158
18:08:02.906032
18:08:03.406732
18:08:03.905499
18:08:04.406039
18:08:04.905034
18:08:05.405033
18:08:05.905633
18:08:06.405770
18:08:06.905425
18:08:07.405044
18:08:07.905246
18:08:08.412179
