16:10:50.569591
16:10:51.066356
16:10:51.568217
16:10:52.067522
16:10:52.566476
16:10:53.065834
16:10:53.566611
16:10:54.066012
16:10:54.565689
16:10:55.065604
16:10:55.565810
16:10:56.066044
16:10:56.565755
16:10:57.065768
16:10:57.565974
16:10:58.067732
16:10:58.567592
16:10:59.067785
16:10:59.569378
16:11:00.068497
16:11:00.569140
16:11:01.068410
16:11:01.568095
16:11:02.068560
16:11:02.569264
16:11:03.069219
16:11:03.569217
16:11:04.068615
16:11:04.568300
16:11:05.068591
