ply
format ascii 1.0
element vertex 1739
property double x
property double y
property double z
end_header
0.144263403254591 -0.011935854584979 -0.056277692997936
0.136570365600251 -0.012938551407729 -0.057522695744516
0.128918639637685 -0.009497630753876 -0.057349803491914
0.122166121037544 -0.006434981102342 -0.056127996647837
0.118247844558012 -0.005598658346735 -0.056946665013317
0.107341108417946 -0.003238329819527 -0.056654310429576
0.099916770318777 -0.002748188685215 -0.056766769612316
0.085682380533397 -0.002002895668051 -0.058330564702035
0.142124069862570 -0.020314626753919 -0.058928332341197
0.134162492907296 -0.018334075685401 -0.059772227808320
0.118020567458953 -0.015945453081976 -0.059596826756480
0.114958129056838 -0.013324684255341 -0.060386526310924
0.107193154476526 -0.012053380609192 -0.060430026575410
0.094708026804067 -0.011494855020336 -0.058063173497202
0.091906847715357 -0.007460110306165 -0.058564816105845
0.085422273069389 -0.007215905736125 -0.058341139042858
0.070570877082567 -0.000948903260717 -0.059311666691783
0.061917801941027 -0.000666833724853 -0.058284701868378
0.140706558898622 -0.027946653848244 -0.060032062097869
0.133204384123499 -0.027967575072691 -0.061112488631886
0.124641287433859 -0.024377404235646 -0.056702403589569
0.119351189652372 -0.021665136511024 -0.058414463246349
0.109839292449222 -0.021704684976221 -0.059427896702770
0.102359636041443 -0.020111240664410 -0.060072143757823
0.096866288408241 -0.017711572812264 -0.059163540089610
0.089145732779880 -0.014730851222162 -0.057334093841965
0.081867644392646 -0.011929240762989 -0.057927928746226
0.073238676335485 -0.012664558344855 -0.057044336522105
0.067635787766393 -0.008361032765277 -0.057895582402232
0.061495176114935 -0.007200910434236 -0.058977651799205
0.052058718212891 -0.005317360497948 -0.058309167641219
0.044949833885275 -0.005082311078747 -0.058165060246471
0.138302951083653 -0.034799900176584 -0.061543277671135
0.132684039188602 -0.032822084448110 -0.060900823796275
0.122930660036019 -0.032373629977211 -0.057522188389780
0.116332350887313 -0.029749417670884 -0.062022236073496
0.107998420181933 -0.028689837600146 -0.059408549829804
0.101403944949747 -0.025709224239146 -0.059334799016001
0.095118099044183 -0.024099913806366 -0.060545384292287
0.087270805759113 -0.020731703768380 -0.057441178207082
0.079376331197486 -0.018998527118461 -0.058608938420298
0.070375299991894 -0.016940246297884 -0.057499883854869
0.066684778524709 -0.016134771608843 -0.058401925480845
0.056490562267408 -0.013714226854112 -0.057496735458060
0.052044295747850 -0.013260083204647 -0.060285177433970
0.042732240650293 -0.010666655205195 -0.059073599064829
0.037718176343527 -0.007739137837015 -0.060513822758677
0.029601401337402 -0.006144954486131 -0.059939037526133
0.022887981258486 -0.004545791900566 -0.060004780836244
0.011923165490662 -0.003964302667238 -0.062167776310925
0.006596631097715 -0.000813792303279 -0.062098730290416
0.135376617587305 -0.042607975364341 -0.061269300663951
0.127995786760099 -0.041466887410128 -0.061097582829478
0.121456227814145 -0.040988189555748 -0.057137685978893
0.114166334188856 -0.036724504063646 -0.059541650212291
0.106226567337340 -0.035479191526415 -0.061906511509898
0.101175522020070 -0.032155474331481 -0.057449220860485
0.093313108928035 -0.030708381803758 -0.059662840855601
0.084233287538767 -0.027969923200437 -0.059672960484508
0.078214667606156 -0.029741348415254 -0.058631002629283
0.070754445573848 -0.024183120570233 -0.059287373173716
0.063058115849610 -0.022996094532985 -0.058121961796763
0.057244556604656 -0.021900893970080 -0.059626909459117
0.049293234095927 -0.019398543900746 -0.059641981328013
0.042319837624800 -0.019414048614011 -0.057921318893118
0.037078394719132 -0.017626721165455 -0.058141724980357
0.027984896353951 -0.012882625773535 -0.058162609939260
0.020318015570197 -0.011295434921848 -0.059579924680607
0.012502912010478 -0.007651868086954 -0.062091940129283
0.003709168594717 -0.004838530012754 -0.057880003178600
-0.001832506818191 -0.005556367877034 -0.060087203801158
-0.010069186344490 -0.005345194831434 -0.057932300134979
-0.015446661866381 -0.001219345875628 -0.058722409315248
-0.025020382660678 -0.000113940188947 -0.059581751072886
0.134873780685378 -0.050523275396705 -0.059547333602591
0.126465746726478 -0.048333167026556 -0.060441033757213
0.118856231988351 -0.046495765769135 -0.059256562118215
0.113325964561997 -0.043348326681810 -0.060524772465709
0.103811634249738 -0.042586404887962 -0.059735535506887
0.097497930368807 -0.041159470747496 -0.057848706639292
0.091549806708292 -0.037312751352542 -0.058402226514956
0.084056630487484 -0.035944136998434 -0.056291702746122
0.077223596941293 -0.034013718721363 -0.057258790410045
0.066381523399896 -0.033089418926812 -0.058225679600718
0.062933055340228 -0.031068077659637 -0.058487369740489
0.055406098693740 -0.028077757626415 -0.059846443379404
0.046880244064238 -0.026629874106710 -0.058040801823619
0.039118518403919 -0.025309540347520 -0.057985025064063
0.032770594203379 -0.019652637962207 -0.056789213383676
0.019901134558110 -0.020103665270993 -0.057551219507538
0.010841078569540 -0.015613145064858 -0.061085031712536
0.002950795979272 -0.014761704073511 -0.059640913212779
-0.004285222452013 -0.012640078378423 -0.057388580525402
-0.011841898913083 -0.010842624323089 -0.059699693882945
-0.017629206060074 -0.008731945833396 -0.057047168299043
-0.023761844306893 -0.005503106712472 -0.058166764144584
-0.033989884189711 -0.005113855750155 -0.057061327946667
-0.039678432841011 -0.002516164631977 -0.058360094818526
-0.047362339752394 -0.000349703536250 -0.058739156926157
-0.051927354180592 -0.001252353680601 -0.058956098759654
0.131507656665934 -0.058475977987361 -0.058260372365002
0.124912472547961 -0.054965440092694 -0.058925337040903
0.117460334248544 -0.049669713840317 -0.059920339787485
0.109368140687017 -0.051720622501033 -0.059077507222179
0.096962190117417 -0.048552406649361 -0.059508993351940
0.087890483419864 -0.047033330142035 -0.058196039402966
0.080994387888823 -0.044824090161127 -0.058302671635630
0.074197158123479 -0.042817510004988 -0.058400137150769
0.068879002334208 -0.039490464077698 -0.059023575668020
0.057484850468060 -0.036577772438140 -0.058963529789927
0.050547913311338 -0.034066291174385 -0.059203041279796
0.046895804191142 -0.034546728025832 -0.058755994999888
0.033452621432681 -0.032961101286438 -0.058000379765512
0.021972732593115 -0.029686073501360 -0.057635979537650
0.015186706338043 -0.026564400411946 -0.057809940268792
0.007741474671621 -0.025253574648370 -0.058269234542532
-0.000669019672283 -0.022584367305312 -0.057400480473521
-0.005280602562038 -0.016807665252951 -0.059899374211315
-0.010956185976895 -0.018800416348225 -0.058771969044687
-0.027887808715437 -0.013100432523767 -0.059194277012828
-0.041639455713749 -0.010152464734401 -0.058935130640351
-0.047565478628153 -0.009213492814722 -0.058705752893769
-0.054355023930107 -0.008346023082175 -0.057697309697154
-0.064418742754111 -0.005154651678853 -0.058154577458385
-0.070667539804013 -0.002900500305634 -0.058571567466057
-0.077992835222600 -0.001026577015498 -0.058214059686057
0.132234787547399 -0.062521882804124 -0.056766935551646
0.125208013104401 -0.061895499299152 -0.057229299748425
0.113708101715489 -0.056279753261844 -0.057322202885632
0.110156335863279 -0.055964997963847 -0.057454912388805
0.104512709859319 -0.055375088534856 -0.057134996617319
0.094573030877180 -0.053519642333607 -0.056891721928599
0.088976323071024 -0.050774358091127 -0.056811605656628
0.075484588500148 -0.046551387806540 -0.057082304203991
0.064876427482682 -0.046286767207832 -0.055932157719615
0.049658348963882 -0.040355657801981 -0.056762090886120
0.041654468673773 -0.039364083608103 -0.056242407048227
0.033270038874659 -0.037689209641017 -0.055983358586313
0.020381911592707 -0.032053071662710 -0.056963587010386
0.011294734279603 -0.031450123393803 -0.056136266911508
0.008989581642552 -0.029501462446598 -0.056737913334849
-0.008208834821591 -0.026075791808032 -0.056204225743296
-0.035614539038890 -0.017489500621173 -0.056765638554576
-0.045000503139509 -0.015996840647984 -0.056308513208709
-0.057088505718867 -0.013993326654346 -0.056707899296764
-0.064532476798486 -0.010230460810846 -0.057357015812876
-0.069801543479143 -0.007616019999877 -0.057459104741100
-0.079493914493354 -0.007872790840295 -0.056068212712291
-0.087105139182311 -0.003875418420454 -0.057117475712779
0.149272027773509 -0.001579240090785 -0.049431863987926
0.142779735263502 -0.000110839496518 -0.049204317296030
0.146585626792182 -0.007795089093010 -0.052573713505748
0.140147297587304 -0.003413973608478 -0.053668363774302
0.129372192416023 -0.003745922153727 -0.053368177617076
0.123493945543230 -0.001797045853298 -0.049971713587127
0.144311041196242 -0.013004621057230 -0.051385612690928
0.138665351770788 -0.013737826059553 -0.052350172245983
0.128801540430714 -0.008122282303605 -0.052629532699270
0.118799233771332 -0.010746614720518 -0.048242033207895
0.115001682466903 -0.005328331339021 -0.051106629765513
0.107519821566313 -0.004788276235608 -0.051513310826304
0.101430296740995 -0.000219148466246 -0.051324982165066
0.093405025264015 -0.000188369892673 -0.052770286763195
0.141330247768301 -0.017775584394588 -0.053722654545786
0.135970137784361 -0.018299025309391 -0.054394331181530
0.127089986196107 -0.017659210329866 -0.054968750838919
0.121017582814660 -0.016841429769584 -0.054192686284069
0.112841893113549 -0.012558808204007 -0.052634499435110
0.104708200049938 -0.010583632969104 -0.053642873204234
0.100007765357894 -0.008810207392508 -0.054458123092336
0.090694961585275 -0.007654187150176 -0.054882955754284
0.083298037541783 -0.004142105074259 -0.054377083663625
0.079800186827774 -0.002382569125652 -0.054129530156138
0.069378499440943 -0.000773981335545 -0.054450552189830
0.117209974157272 -0.022300557136981 -0.050169100773814
0.109405265018078 -0.021126481617057 -0.052084926172577
0.104556240488301 -0.017841865352146 -0.054779580510143
0.117185496060594 -0.028764002572757 -0.050645470504446
0.109430204034391 -0.027660762305963 -0.051882189545089
0.104260428917440 -0.028806593517287 -0.054361868107800
0.119636068501771 -0.035239173436677 -0.048729139531140
0.113563746515128 -0.036775218879451 -0.048951736017549
0.106977900478339 -0.035830409998415 -0.053323443425181
0.101590884789790 -0.037113055968548 -0.053853590214732
0.122842167323523 -0.050793302919652 -0.055214964116100
0.117479284905363 -0.049078294635498 -0.055294775212292
0.110652244469686 -0.044517240523957 -0.050544943058971
0.105400189033794 -0.041492969361851 -0.052511131489756
0.097655685490791 -0.041712538014750 -0.054654984359426
0.087768230333368 -0.041025239474215 -0.055306921208385
0.057043363622869 -0.032673236847983 -0.055344846928598
0.043874298956010 -0.028849633885078 -0.055411615574840
0.023901063605787 -0.023470777034559 -0.055423856938364
-0.021347293995726 -0.011188292794843 -0.055455244267466
-0.029158416757774 -0.009186805335263 -0.055437757695201
-0.030085646764581 -0.009183525188261 -0.055364820683482
-0.054465840617282 -0.002221360380752 -0.055485520248097
0.128982510885038 -0.055866438847978 -0.054104978764538
0.123722896122485 -0.051202176524119 -0.055159834111215
0.108981819533136 -0.052535106860430 -0.051156938755992
0.102444848173927 -0.048101737361486 -0.053465060755097
0.096842233197309 -0.047260880472372 -0.053347718971785
0.087782191010361 -0.045513491988294 -0.053785215580943
0.081300323930376 -0.044291370244278 -0.053595696334523
0.075730854617209 -0.042750254115615 -0.053643408024792
0.069138474413298 -0.040825607802220 -0.053731985295300
0.059744538018230 -0.038210947483551 -0.053683288141571
0.051181191325899 -0.034919851228000 -0.054085046208384
0.044275475976772 -0.033492275551503 -0.053946500981334
0.037057712555770 -0.031058209913155 -0.054113842213633
0.029984629849224 -0.029007666411580 -0.054188116276744
0.022761701042172 -0.027558332439231 -0.054509927952769
0.016293464321619 -0.027331918360917 -0.054312287215871
-0.006652699563577 -0.020041827096136 -0.053797657851858
-0.013530458148471 -0.018993255583029 -0.053568462574961
-0.017815489142139 -0.016503387953167 -0.054048478011769
-0.025784399925934 -0.014416889217827 -0.054025494206432
-0.033886087738932 -0.011634361039273 -0.054255489552501
-0.042504564977430 -0.013222624254681 -0.052768636906625
-0.050183891435357 -0.008363188218034 -0.053878565037731
-0.055159740364763 -0.008947971582408 -0.053841114883108
-0.063349260433370 -0.004723568659596 -0.053454707666718
-0.070805812159630 -0.000912948419800 -0.053817445195201
-0.077724392308706 -0.002347335543162 -0.051908917312307
0.131170687076259 -0.065516480529375 -0.052771238530162
0.121323884462774 -0.063699653387676 -0.051250044072154
0.106990913584030 -0.059739509008012 -0.053252878392222
0.102388217199549 -0.057261945422761 -0.051035753877113
0.093380333759594 -0.055639294802639 -0.050428494084361
0.086329882434485 -0.052176896454099 -0.050636114323619
0.081740675875291 -0.050872652913898 -0.052181770800321
0.070030088714012 -0.048725373516912 -0.051044367039683
0.064350325620920 -0.047507210406352 -0.049996781234427
0.059114366299223 -0.046033215748883 -0.050866164728486
0.050250435274122 -0.043443461063252 -0.050045116627696
0.043323003298574 -0.042748492672102 -0.054776207809133
0.036164137838773 -0.038915508175415 -0.051388649825734
0.028131459952568 -0.038447083184748 -0.052228479588512
0.020565772908695 -0.035339597241421 -0.052566008664982
0.014238645921526 -0.034437336955779 -0.052253942692759
0.008537656498422 -0.033476484161504 -0.054758222783092
-0.003070005452609 -0.030753775075435 -0.052434128646536
-0.005516849609532 -0.027163725260040 -0.050796728337290
-0.015555080938822 -0.027160500639728 -0.049381426060680
-0.024770903523951 -0.022040128855455 -0.050846426213269
-0.029483306515569 -0.022457661797826 -0.052537117843314
-0.036084614204363 -0.018571973177818 -0.051054107487681
-0.042517855477346 -0.019661736376414 -0.050358303908988
-0.051717471292616 -0.015816574410264 -0.051329807103160
-0.056993869581520 -0.015456595998489 -0.052364411239309
-0.066754423617942 -0.012291525708881 -0.053025702997528
-0.072981577511224 -0.010535891452580 -0.051050439401947
-0.079453894290526 -0.009678762426421 -0.053642172910587
-0.087463062254137 -0.006620161768695 -0.050768549168589
-0.091306682927190 -0.005379133729281 -0.048709707463267
0.128029407620465 -0.071075577793798 -0.050573881352427
0.121997046300292 -0.071101010515983 -0.050791898930553
0.113154822294257 -0.067763025836943 -0.050966205164276
0.105247971491496 -0.066502403644502 -0.050826360905650
0.100328873836046 -0.064899988304785 -0.051368581974986
0.091375616464245 -0.062732744699296 -0.049376547062877
0.084951829857062 -0.061302667691291 -0.050172219161673
0.080409021946170 -0.055277558913851 -0.053356626713757
0.070455747879018 -0.055153787587212 -0.051722504501028
0.055777084963764 -0.053714144049968 -0.049996252263073
0.045370738787904 -0.049607075481032 -0.050992162907604
0.041131437101844 -0.047706833025212 -0.051521326268198
0.033449839639111 -0.048221917465059 -0.049674843673391
0.026174922454012 -0.045085849817639 -0.050552381718638
0.018624484820159 -0.041965262739199 -0.049242288792613
0.013052099518471 -0.040337682015671 -0.051130326664927
0.005533634513221 -0.038504086518385 -0.051229576949758
-0.003956157367105 -0.035401035355938 -0.050498482589407
-0.009216797413574 -0.035434080826891 -0.050561880314829
-0.017365176862392 -0.033710234040205 -0.050497698033335
-0.026050272469510 -0.031384080697986 -0.050852926457407
-0.029888680440010 -0.029383747198067 -0.051039762700085
-0.038781730077828 -0.025579547507072 -0.052101610386852
-0.048010853720691 -0.022632783705360 -0.052287771428112
-0.052774873192257 -0.025859315515255 -0.050140070164683
-0.059054577703569 -0.022067702949915 -0.051056056035044
-0.068699827471140 -0.020214059161951 -0.049978117192271
-0.074256139709183 -0.017683823282102 -0.050899634373667
-0.080120740261921 -0.014291178694048 -0.050844398974149
-0.088789322340364 -0.013034262309270 -0.050779893533300
-0.093255187684401 -0.012730288584918 -0.049838133061413
0.127072122304699 -0.076596417189108 -0.048359335148813
0.119493084947180 -0.073443902552329 -0.048323538029673
0.103000398605221 -0.070159561418042 -0.048345648015025
-0.018392734893018 -0.036604675739308 -0.049125684941294
-0.032771423201267 -0.036411275372599 -0.049952507857961
-0.041791448100983 -0.032622044714129 -0.049075271809582
-0.047757846588382 -0.033538118769863 -0.050834181035046
-0.054434146514213 -0.030538775605101 -0.050914613926890
-0.062912324750006 -0.026961206354743 -0.050243753636362
-0.069233044748127 -0.025298663151432 -0.049675348484995
-0.077830403293831 -0.027006829447646 -0.049843000615123
-0.082542283538336 -0.023192870047952 -0.049328291142466
-0.089512846364358 -0.018417064028643 -0.048666937077525
-0.093970849656652 -0.016287865149755 -0.049207662785533
0.146985887276491 -0.004256250543958 -0.045317762578015
0.140013387585441 -0.002786819075066 -0.045616087162976
0.122840643299101 -0.001510361481172 -0.045110670292858
0.120220222548305 -0.007106741711601 -0.041589320703827
0.115396163039519 -0.006536338358928 -0.045346604959082
0.109862420271510 -0.001430615327629 -0.047128446782114
0.121846708769843 -0.014980908896139 -0.043396093571666
0.115444614016759 -0.012456157755290 -0.047269163334849
0.125360989358788 -0.022200815032962 -0.041946787083627
0.119258174025381 -0.022895742383159 -0.045436201298716
0.121730134379804 -0.031902320336685 -0.043667894142683
0.117380777013326 -0.032009272012515 -0.046095541203500
0.120234592797909 -0.037185626427362 -0.045568630421641
0.116286984670056 -0.037411019039220 -0.045490931523325
0.118350520128850 -0.046154435513168 -0.043569508437795
0.112390548421706 -0.043354656630827 -0.046025348866466
0.115195877480273 -0.051166870231317 -0.043969488347055
0.111069227057916 -0.053333109079164 -0.043226239089651
0.105705965826132 -0.052727247842926 -0.044960989201548
-0.071823033255344 -0.002668373608723 -0.048093488896373
0.107649137274152 -0.057460637127377 -0.044400867029511
0.102257643197548 -0.055810634870324 -0.045523875030929
0.094115661924205 -0.056025216112890 -0.047543391748748
-0.008902873502666 -0.031118525471534 -0.048029089177134
-0.070481475460036 -0.009873404477159 -0.046624281132700
-0.078108336878184 -0.008113381955910 -0.043047773564341
-0.088792826792343 -0.005898034630576 -0.046255033696176
-0.095170420905666 -0.003640833915528 -0.043806375161718
-0.099792719962525 -0.003256200484041 -0.041001451695445
0.129764824794946 -0.072250227523481 -0.047240827763560
0.120713151923377 -0.068315145575288 -0.046329202855113
0.103343703728761 -0.067351462128040 -0.043431259994191
0.099338819572066 -0.062946855813268 -0.042762943198479
0.091633187589981 -0.061946613113300 -0.045476174875580
0.084004863509068 -0.059875733770010 -0.045245008671763
0.076956747136212 -0.058247363740706 -0.045056528294566
0.071045434986719 -0.056348249465795 -0.045320763473195
0.064028339130653 -0.053631580456877 -0.045967298710825
0.057788011922416 -0.051418092951188 -0.046211304549856
0.049943106748327 -0.051595652865387 -0.044625851262095
0.041912458898430 -0.051186562163000 -0.043152319157602
0.033566860009695 -0.044742399372118 -0.046490257084850
0.027017992832815 -0.044908558301104 -0.044908704960826
0.019327146182837 -0.042909777181289 -0.045012450739228
0.011810028129854 -0.042164707338940 -0.044705303395274
-0.004774666797620 -0.036100052219596 -0.046327131474498
-0.009243838355818 -0.035129951585307 -0.044985088932994
-0.015133349375229 -0.033384101290077 -0.045238770370168
-0.024932884070986 -0.031874396763161 -0.044294261499726
-0.031203239872774 -0.028107447187687 -0.045969869816783
-0.038378757971936 -0.026425520115221 -0.045701631749157
-0.044773628030337 -0.026102793085337 -0.044646501744273
-0.055014097725998 -0.021070568452578 -0.046366020405772
-0.059012856205026 -0.023358621048361 -0.043748565495494
-0.067712901959031 -0.018971086320567 -0.045146413370453
-0.073727933532897 -0.017468805505528 -0.044643029098195
-0.080850658128958 -0.015298846376274 -0.045445597321937
-0.089442879660779 -0.014139617604043 -0.044474472630504
-0.093952065827966 -0.011460766909656 -0.042600244725230
0.126636022997854 -0.078681927768641 -0.044623491490366
0.117835947427488 -0.077596583902759 -0.044228541168625
0.110623293635656 -0.074894232459259 -0.043683137333873
0.102260404145648 -0.073523075406041 -0.044414442265513
0.098542960354028 -0.070816609970917 -0.046714559758190
0.090963751170305 -0.067752462283657 -0.043612472355844
0.084970062451400 -0.067712111252234 -0.042297875798228
0.074894116625791 -0.062895244497692 -0.044750738347056
0.066265433263620 -0.064323350013363 -0.043281095707895
0.061104008207867 -0.061310093657303 -0.043259610379222
0.053731009897287 -0.057792121817478 -0.044251323267304
0.047713518076548 -0.056610936316837 -0.041689044519745
0.031600160802710 -0.051990155930472 -0.046188707554820
0.023714094003627 -0.051085249914641 -0.045157781804088
0.017179402769828 -0.049130818531904 -0.043741547469778
0.007597317286586 -0.046071617679960 -0.045743098779999
0.004488043758937 -0.045309092679843 -0.045722051823620
-0.006029341484457 -0.043490633892166 -0.043175224295407
-0.010202491061213 -0.039754578985428 -0.044462970664299
-0.018648774966649 -0.041432737619467 -0.042054121220591
-0.026522001527307 -0.038147980094836 -0.044968372929576
-0.033399783791909 -0.034815610617111 -0.044763241653127
-0.041134888206960 -0.035904556207665 -0.044169184887889
-0.049252047195579 -0.030249540692989 -0.047578344548227
-0.054373493985307 -0.030907820001978 -0.045255212224009
-0.061037197365295 -0.029330352310686 -0.045282563603404
-0.068167330675583 -0.025978135886096 -0.044294814312938
-0.076054290506594 -0.024389771211419 -0.043804096636987
-0.083020674296099 -0.023343423554429 -0.044856241722770
-0.090383192547405 -0.020379225676109 -0.045196188811941
-0.095361976234474 -0.020591043920717 -0.046889745915414
0.101675251313198 -0.077229360627670 -0.041104917729381
0.097005673465657 -0.075341719026569 -0.041816381657603
-0.062358194752683 -0.033563858600785 -0.040714613163952
0.129521857605836 -0.003333950851653 -0.033735395634653
0.122784802581826 -0.000277230773870 -0.036645677769664
0.129551895765493 -0.009344250795999 -0.036993908131602
0.124486589906368 -0.006764397922188 -0.036812638168020
0.127328585811627 -0.017674614333202 -0.036528362477306
0.129066788023088 -0.028132447522629 -0.037018339360241
0.126206648267838 -0.022197866829069 -0.038358671391490
0.130218495932965 -0.033432159699300 -0.035523517811778
0.123828299012562 -0.034276760677284 -0.039596044743539
0.127603001267182 -0.039187493474849 -0.037690057957652
0.123012901674995 -0.040686267399967 -0.037969962895397
0.120994228829933 -0.046711458218877 -0.036665516102794
0.122130380586738 -0.053898731768801 -0.035003751957897
0.120257007367982 -0.051154591297727 -0.036888281071666
0.114239188675285 -0.061689935062374 -0.035677950108530
0.109018560602778 -0.060187022012176 -0.037158128941539
-0.081137024013252 -0.009743188657229 -0.037929844105724
-0.085814843307999 -0.005307358062591 -0.038067503178598
-0.098087762361976 -0.006408147455150 -0.039205450261117
-0.102409693840626 -0.001790623346654 -0.036208818093848
-0.106156372436121 -0.000261603521834 -0.035413886591278
0.106215951858574 -0.066603886844558 -0.036419233525279
0.099156911531179 -0.065123820279739 -0.036758375370981
0.094652389767815 -0.066199954922688 -0.037732526982310
-0.075523917081079 -0.018543857474438 -0.038722699050588
-0.080169156006354 -0.015745665428207 -0.037488526229544
-0.088740243997116 -0.016860877464256 -0.039659284794811
-0.096464823799107 -0.012276920631058 -0.037886432215058
-0.103112071284384 -0.007519657853447 -0.034908608067516
0.125785972407400 -0.082224599885064 -0.036463266575816
0.119036475055177 -0.079598421650194 -0.034979124272350
0.109903113666699 -0.074204887678157 -0.038436773503306
0.103466080000512 -0.073510647830550 -0.036096365178112
0.094695170328585 -0.072406224823610 -0.035260900700572
0.090392613553655 -0.068986753792932 -0.035640176658315
0.082695877571848 -0.067388052807069 -0.037934954655650
0.074825973768439 -0.066178541303842 -0.036799554483008
0.067519888814852 -0.063935343095512 -0.037257856572154
0.061743907720355 -0.062036768247212 -0.037555341923715
0.054962319594655 -0.060473326920166 -0.037305438562715
0.048353438716961 -0.058897650047331 -0.036960492337230
0.039128500757087 -0.057913463548256 -0.035286224186900
0.031597368786239 -0.054147496952635 -0.037293078943573
0.024459601969977 -0.053381004332352 -0.035940506184581
0.017472550581430 -0.050222843487711 -0.037962425435069
0.011668063563667 -0.048176752792078 -0.037986026331269
-0.007894270011221 -0.046463472821930 -0.033766843998911
-0.011479997017179 -0.043230532033736 -0.036609412968638
-0.019590536088617 -0.040837222349837 -0.036811939824108
-0.025417101069936 -0.039024610860770 -0.037149490559581
-0.033031750845360 -0.037593027140036 -0.036463894093516
-0.041349248407348 -0.034952246661581 -0.036956379775686
-0.047666754791312 -0.033771300699629 -0.036234832585337
-0.053344344760662 -0.030536203513990 -0.038292440617564
-0.061679010896465 -0.029360749774286 -0.037448614323618
-0.069844660390647 -0.025887100460256 -0.037432750269257
-0.078499697378427 -0.024331683399053 -0.037485442841532
-0.085892423677082 -0.022716921039917 -0.039183602218313
-0.091711604958313 -0.021674716789085 -0.036412619187011
-0.095419483177656 -0.019890674422916 -0.033572942936899
0.126784505931726 -0.085788686796435 -0.035910909855845
0.119467204501280 -0.083722328918856 -0.038245804671927
0.111513024756116 -0.082731097293205 -0.036326330388073
0.101933053843383 -0.081185526590479 -0.035450536931040
0.094217119540652 -0.076651684707524 -0.039369028294566
0.088061756864536 -0.076676469570859 -0.035197846615794
0.079716210699232 -0.073405390164521 -0.036630733057342
0.073944047124768 -0.073034213426003 -0.035030462468150
0.060791088054144 -0.067667656490401 -0.037824540023488
0.051123878012505 -0.065876034763678 -0.036822954380990
0.045158344856522 -0.064978711721247 -0.035581690037731
0.037808135352815 -0.061780596815212 -0.037420484745982
0.021969519777173 -0.058634459828604 -0.035924961674693
0.015168804736765 -0.054535187460510 -0.036325739109995
0.010792568034318 -0.054957576010944 -0.034950786157929
0.003589368248230 -0.052709319002006 -0.037042371953014
-0.006956981261306 -0.049454334444323 -0.037164428914073
-0.012602466826917 -0.047740363953153 -0.038123705876353
-0.027721886382004 -0.044844747989643 -0.036589587732636
-0.035696271847364 -0.042550468490439 -0.036874145710948
-0.044159476468753 -0.041498164446449 -0.035186238174123
-0.049770255295392 -0.037886632488026 -0.038010084355357
-0.052645637392703 -0.036715309960780 -0.038606291020396
-0.063072360453168 -0.034360509852401 -0.038570459568980
-0.071011065562370 -0.032672516575085 -0.037055487972126
-0.079070236931020 -0.030337639497637 -0.036552972996714
-0.085995672293521 -0.028586677604389 -0.037334846699718
-0.091901892645857 -0.027415980628250 -0.036165098938400
-0.096595935225081 -0.025711276237214 -0.038089597905162
0.130568057860771 -0.000644431923723 -0.030151210988048
0.126324544134748 -0.000568190078522 -0.030630523884775
0.133833221852987 -0.012141779205667 -0.027022106755260
0.130155220232017 -0.008813325826054 -0.029656140212697
0.138464240446756 -0.019440640172430 -0.025854074681283
0.133552347960954 -0.018387997522669 -0.030086162770275
0.130272505709058 -0.014443146492104 -0.031796591008187
0.136064835842274 -0.029910258889486 -0.028315477574352
0.132846524981807 -0.025849199834355 -0.028300154889111
0.132017319239016 -0.034473621658841 -0.029225591862681
0.134468981169741 -0.039075131777857 -0.027620332921031
0.128701856621195 -0.038479512585729 -0.031574116592093
0.131196685586470 -0.047606799513158 -0.027239223683361
0.127239027204236 -0.048850516469404 -0.029110313346184
0.123804327751498 -0.055741576339368 -0.027854467118266
0.119237516212029 -0.055923234684634 -0.030743124974254
0.120957852805841 -0.061196967959694 -0.028118265355112
0.116014461128722 -0.061976305905292 -0.030272043431285
-0.088737702702831 -0.006247197270093 -0.030054704392435
-0.091293046869928 -0.001699418413601 -0.028742588246348
-0.104290591395866 -0.003979251902426 -0.030964201176647
-0.108184256779100 -0.001887629173537 -0.030268339360240
0.116048372973957 -0.066596365056646 -0.026797193730356
0.108182674972543 -0.066043693923665 -0.029536813303314
-0.083588834438280 -0.016927282436775 -0.029243667424205
-0.086751002965410 -0.013539283766338 -0.030542612278941
-0.103104131149024 -0.010487083294139 -0.030183228219036
-0.108717919862351 -0.009003598885769 -0.027210756505016
0.102828690615804 -0.071594901472425 -0.027682498317585
0.098495113386222 -0.070342894366932 -0.029936695302013
0.091266931292782 -0.072294283633075 -0.029977582371715
0.024014102371771 -0.055517790369315 -0.033100462162973
-0.072869668956956 -0.028766239768371 -0.031027610981944
-0.076391233790917 -0.026379251333018 -0.028178816044809
-0.082884571748507 -0.020861762851183 -0.029906985486034
-0.097492211372266 -0.019631739731566 -0.029148606609453
0.125022952221405 -0.087565903340283 -0.031099976933482
0.116464810680184 -0.085594156907000 -0.030384708989146
0.110429030190721 -0.081876244434462 -0.027985019886972
0.101923903406174 -0.082297664801786 -0.031178353703501
0.096499031528531 -0.077829161466552 -0.030462973797801
0.088400991834246 -0.076238633361286 -0.028889081013682
0.080695564476356 -0.073077679575133 -0.029391892064098
0.074561139994992 -0.071728245776640 -0.028867380345347
0.065336823926515 -0.069543952591198 -0.030221403325084
0.058932920018803 -0.068882719319513 -0.030220358098033
0.051649647540503 -0.066400340545263 -0.028976637725515
0.046205690773226 -0.064084551391913 -0.028893720829966
0.038906487204553 -0.061329025281405 -0.030331183954559
0.028575982678477 -0.060727152172121 -0.029592511062307
0.025909664825221 -0.057080190204336 -0.031547098362924
0.015286459037187 -0.056558734847176 -0.030156708348278
0.006515762505942 -0.055734337402184 -0.030952445914544
-0.000466222916553 -0.055620369859511 -0.030809707844736
-0.008740098995074 -0.051772730360661 -0.029394706547740
-0.014451246792389 -0.049489380710576 -0.029708094227794
-0.018833256601651 -0.046175165292361 -0.029751966679576
-0.027621400736964 -0.044443003993632 -0.030003217900280
-0.034835834502735 -0.041592156244621 -0.030200573806448
-0.040493852191633 -0.042611123049670 -0.030678417408945
-0.049002383575362 -0.038725655670987 -0.028575782025340
-0.057657159725601 -0.037688072967683 -0.031122956479075
-0.063406799464433 -0.035700152067630 -0.029534506047252
-0.071614359596421 -0.032672818902746 -0.030076675830102
-0.078925806749518 -0.032878214758628 -0.031082641804698
-0.085506873696419 -0.030892428651650 -0.028847877069794
-0.093108652733869 -0.028501872496042 -0.029880844864303
0.124682799763501 -0.091669852520713 -0.027099285328868
0.116789950516515 -0.089518236506820 -0.027914093856497
0.102482051248061 -0.085449116583709 -0.028366975987437
0.096559358759038 -0.083651272533370 -0.029760901972136
0.088400585875626 -0.081798938355341 -0.028914116108898
0.080553608961890 -0.080189721033008 -0.025971140110971
0.073629993659642 -0.077926600604462 -0.026807422841075
0.058471753796436 -0.073152199088511 -0.028255432332043
0.042939113778745 -0.070085419374632 -0.026003187382700
0.025482630846257 -0.065433496920532 -0.025928812230112
0.016555973296859 -0.061822325893773 -0.028460663044933
0.001441443156481 -0.057371533532343 -0.029202863896372
-0.007854441167195 -0.056572131735101 -0.025755850041391
-0.016519464357466 -0.053440019735083 -0.027473541462901
-0.021420246923288 -0.052059626713277 -0.027599987868948
-0.030012184435849 -0.049659355841560 -0.027854341710092
-0.036601347343868 -0.048094986328650 -0.027430673802378
-0.049731740003136 -0.044362879203518 -0.027852945530895
-0.068641515815363 -0.039362746830644 -0.029785009587289
-0.073538715730638 -0.037586323106416 -0.026575970534963
-0.079339500054627 -0.036872327018007 -0.027722861175223
-0.087019046148035 -0.035060527487483 -0.027445467834158
-0.098238878306457 -0.031331561769518 -0.025936380589488
0.132190047247529 -0.003615039631986 -0.022047348225598
0.137407631497823 -0.012307411563738 -0.021434362614635
0.139387330067463 -0.021267181870723 -0.022041130269053
0.135991434213333 -0.019299609500445 -0.023312020504955
0.137865547112647 -0.028835799701990 -0.021619463170054
0.136416856662820 -0.025811916255789 -0.020358343327526
0.136192194622999 -0.035800249718366 -0.021859207992238
0.132908979307184 -0.036536785841948 -0.024939586842540
0.135034866353702 -0.039700166575709 -0.021701360905650
0.131131792011716 -0.042054373960431 -0.024942157948495
0.128803671215165 -0.049922514177024 -0.021581407750132
0.129436726293971 -0.056507805613985 -0.019751571858409
0.126179295982378 -0.053691435801073 -0.022298526013377
0.120638997007771 -0.061841734147213 -0.019673471653941
0.117103656969423 -0.063071151248757 -0.023787676060681
-0.090871108701513 -0.006195718475561 -0.022099743092539
-0.093102996294745 -0.003429823741650 -0.020455898488048
-0.110555897974157 -0.001993878707302 -0.025362932408334
0.114559917785087 -0.067100368312993 -0.022295334701223
-0.086924404307490 -0.016811593938361 -0.021402509892467
-0.092996970846860 -0.010979908920106 -0.021660179341319
-0.105359105039313 -0.009796221141887 -0.023048849308970
-0.111244681286404 -0.007104410323739 -0.019993581339204
-0.114943435460582 -0.004541377135130 -0.020191586379691
-0.124126944801174 -0.000401540968136 -0.023278288090707
-0.132562637831274 -0.001034719876418 -0.019243870938304
0.109719282544693 -0.073056576096689 -0.021907680714609
0.104246669263004 -0.073331409023418 -0.020427880172414
0.097818970556228 -0.075038211940382 -0.020870456898692
-0.083939589634620 -0.023012872170169 -0.022239496434214
-0.089141180024699 -0.019431280485159 -0.021492417220754
-0.099795381691711 -0.021278669950315 -0.021902263844494
-0.103952883833983 -0.017378532453809 -0.021853075866385
-0.108682815687919 -0.013126812421438 -0.020302614415171
0.124447730684042 -0.088212267136986 -0.023584900105480
0.117466440370645 -0.086886950576212 -0.021392082417492
0.109466244082161 -0.084433682048602 -0.022137891972544
0.102161125927953 -0.079275038749753 -0.019574816906931
0.094711153331704 -0.077569869658207 -0.022821264470103
0.087376536881726 -0.077570730486312 -0.021829151356700
0.080297951204783 -0.077179779736337 -0.020548666203501
0.072733425783459 -0.074143274780290 -0.023194059575084
0.063804049289662 -0.072672192902093 -0.020859248682342
0.058874162992962 -0.070835702034691 -0.022046881560965
0.050214516306233 -0.068547827030269 -0.022112337315562
0.043336156568711 -0.066403418722767 -0.022694567883494
0.029731814689996 -0.062971259185161 -0.022269396667166
0.021632333795670 -0.060683383400783 -0.022476478507317
0.015616613052575 -0.059267919107722 -0.022044481480600
0.009183336831254 -0.057736009572090 -0.021570070469859
-0.009302023461423 -0.054015127207809 -0.021540003026011
-0.012575853959650 -0.051750630147824 -0.021867109501842
-0.020248442225096 -0.049306959005544 -0.022955040181164
-0.029427586334006 -0.047057654677903 -0.022422514164928
-0.036427164115135 -0.044830763130206 -0.023215565566702
-0.042001522681694 -0.043592609384923 -0.022563359463695
-0.050277260626264 -0.042050614408205 -0.020973745549204
-0.057318546681796 -0.039620994108371 -0.022227267786346
-0.064243847302586 -0.038266574546599 -0.021073367321971
-0.071599674676724 -0.034775782910980 -0.021982085431102
-0.078734715491714 -0.033286620646965 -0.020874268734934
-0.085981216758787 -0.030255642409740 -0.022031163282533
-0.094636333540208 -0.027916651695540 -0.022069964612010
0.124013978885207 -0.093773675867231 -0.022468911056204
0.114763158554902 -0.091912485796222 -0.020376292749725
0.107592240288443 -0.088982559672539 -0.023181133473400
0.101039394579046 -0.087322270580653 -0.022894618555390
0.094082511326633 -0.086082731929425 -0.022407061779978
0.085912912286962 -0.083370748561605 -0.022881900990489
0.079032358196206 -0.082117540596148 -0.019964428151133
0.070204616403610 -0.078470191229059 -0.023477960789683
0.061569243278481 -0.076673482558098 -0.022185941899301
0.056270443702473 -0.074750442320149 -0.023456352437022
0.050767754765532 -0.074150526552412 -0.021172353947642
0.043158770845119 -0.072183234547281 -0.020916040623667
0.034423585456913 -0.069240338340371 -0.022568876469616
0.028418145746707 -0.067817970067417 -0.022074648106577
0.018863445117746 -0.065893216725929 -0.020309198582651
0.012535923595248 -0.062936398728471 -0.020286576474193
0.006898017267344 -0.062140258937649 -0.021512374127392
0.000752050411092 -0.060490545422611 -0.021695561612132
-0.009274487329409 -0.056722412757560 -0.022108474934579
-0.017859269616936 -0.055347203160282 -0.022244775975231
-0.020606429057407 -0.053913674301209 -0.024015604222301
-0.026201859900028 -0.053902929638929 -0.020062132084848
-0.037105137681835 -0.050992020787339 -0.020010256016735
-0.045187031808979 -0.048104115783726 -0.022072385991100
-0.051808997901212 -0.046025450736632 -0.022857290471080
-0.056765708681295 -0.044097268526353 -0.024307834828378
-0.064078552822085 -0.041788830238719 -0.021228999658905
-0.074699767799191 -0.040649135337647 -0.022798001174611
-0.080245125533590 -0.038103359669407 -0.022013891423228
-0.087728894181765 -0.036360920900853 -0.021827025510684
-0.094245292205842 -0.034425629586408 -0.021173205896698
0.137520343548279 -0.006546031026520 -0.013178474629405
0.133648164575784 -0.001848789240221 -0.015597365900360
0.140881956620219 -0.014186346328009 -0.013908379439992
0.136555657137246 -0.010292499201524 -0.014858623071991
0.139734729402638 -0.021684465056343 -0.013069564386688
0.137660767924123 -0.019353748869508 -0.015945476735119
0.139031644610545 -0.027474524392788 -0.014038176930431
0.137551106531904 -0.036061751359607 -0.014974905217173
0.136306726739264 -0.042945281771827 -0.015421609128001
0.133251374779933 -0.050920880622904 -0.015180371351381
0.131265401904212 -0.055181514897722 -0.016655363286019
0.126377102732609 -0.056628728519809 -0.016690473759655
0.127607250134084 -0.060486777035917 -0.015964229786877
0.122324819843939 -0.063639409150469 -0.015263780034069
-0.094787880444622 -0.004922131863547 -0.015044377720835
-0.112382062526130 -0.001590242648450 -0.017630869114878
0.120664531947533 -0.067582867179773 -0.016684909387909
0.114712937707099 -0.069792748571980 -0.013792331898693
-0.092421995672907 -0.011677139194187 -0.015106065953258
-0.096070806479767 -0.010602049139277 -0.015696488265675
-0.103732215306238 -0.009579064948309 -0.016184005304657
-0.113062704178187 -0.008440175148049 -0.014894762242321
-0.118397060416811 -0.005726805451784 -0.015201533414737
-0.125401507058952 -0.003852553327660 -0.014281040182859
-0.132852429744819 -0.001369626408586 -0.015611006463054
0.109245557174011 -0.074108902890627 -0.016227981134735
0.105324086182283 -0.074670442274496 -0.015006921971324
0.099915770069609 -0.075759029297161 -0.016490232670786
-0.084713832955365 -0.023833444892794 -0.014980967724803
-0.091377279953759 -0.019726822716490 -0.013444536412242
-0.101463194885593 -0.019014866000210 -0.018024309361461
-0.106331151515052 -0.016609003493028 -0.014516112530711
-0.112642059768313 -0.012106629396228 -0.012492445195199
0.101000600011760 -0.079292529257078 -0.014282546564423
0.096352296549381 -0.078686653623687 -0.015616209233287
0.089003321532099 -0.080110188018828 -0.013919067967418
0.063915223606197 -0.073864645649599 -0.017562189305308
0.039243610243453 -0.067232928276259 -0.017646564686778
0.024221458208930 -0.063307086688709 -0.017270395482068
0.010624817543820 -0.059486950721102 -0.017847486699107
-0.024742558983247 -0.050099007036049 -0.017537515843395
-0.031151875930481 -0.048260567061584 -0.017936655247691
-0.044658775051724 -0.044724307325183 -0.017683595860486
-0.074803423132901 -0.035592587809296 -0.017883424962047
-0.079210593727428 -0.032147528868888 -0.015336431706431
-0.083342873805186 -0.030072243869757 -0.016748693669320
-0.093363206364639 -0.030071708935585 -0.015115802332245
-0.099720486178065 -0.025904937499827 -0.013446732797552
-0.103469344699291 -0.022811780524280 -0.013863418782237
0.121352243579241 -0.094379018126218 -0.013946846483915
0.115934447603016 -0.092270816274144 -0.015057420933726
0.107576879484367 -0.091120777962853 -0.013829647903128
0.101081569613801 -0.088402463673072 -0.015712463582042
0.091034135924045 -0.086056027997964 -0.015842356884959
0.085839174448938 -0.082847195563196 -0.013057730804520
0.077410399066371 -0.081712088800124 -0.013768273238821
0.072433807008771 -0.078625857355385 -0.014356189295136
0.064908249334860 -0.076446304406728 -0.014055928297182
0.058652020621888 -0.073140274015928 -0.015006509984019
0.049911193899540 -0.072076167804825 -0.014885978901866
0.043273780073255 -0.069764622108638 -0.011834745610240
0.035150863741006 -0.071888685085291 -0.014496942723278
0.028326176324252 -0.066231616860839 -0.014104722416881
0.022398700135968 -0.067198257287418 -0.014529088223461
0.013292611726886 -0.064312991673633 -0.014309091226171
0.005924211534362 -0.062184401317208 -0.013663961613659
0.001431484580153 -0.063391968503912 -0.011771103108409
-0.008951565632462 -0.059289457049691 -0.014096807682993
-0.014845136362187 -0.056561011760561 -0.014768074715617
-0.023047443598774 -0.053895869912014 -0.014158522332194
-0.028804895441010 -0.050379501619537 -0.012121580327037
-0.036408074418796 -0.050236872243631 -0.014450257186574
-0.041722687621687 -0.047321174163708 -0.013359405448235
-0.049297725771982 -0.044367456151870 -0.014431169713024
-0.057899084275279 -0.042905070497562 -0.014139470621430
-0.064927834875057 -0.041176049203762 -0.014248057091716
-0.073129570880892 -0.040958748935592 -0.014641093543922
-0.079959868388176 -0.039065700485604 -0.013154491246227
-0.087793429281603 -0.037731281915891 -0.014219836247447
-0.094219336173142 -0.035067668456408 -0.013719478174531
0.138830100607034 -0.005716285981396 -0.007589809620860
0.134839291200071 -0.001119994702690 -0.008247835362437
0.141448248785100 -0.014044384900791 -0.009510606968883
0.138491785384247 -0.012729172766436 -0.005317003453258
0.140518706279778 -0.020948055391820 -0.006428941929820
0.139942986899369 -0.028609130442001 -0.006506555760386
0.139635120339004 -0.036178264727159 -0.006724668705943
0.136537903848810 -0.043850472600255 -0.007943524245901
0.133677608973737 -0.049932509044361 -0.006915964329722
0.131422956011138 -0.057970482209985 -0.007046198094372
0.126974083886746 -0.058964386735850 -0.004998617375377
0.129284752850433 -0.061113189615676 -0.005119806492807
0.121831215055607 -0.064659398402708 -0.004847147191050
-0.096208213156389 -0.002832169648891 -0.008751375401499
-0.098855678323087 -0.002039038010189 -0.004121587956433
-0.115894821612534 -0.000656382074876 -0.007835328495982
0.120086940757814 -0.068664927701146 -0.006675487721446
0.115532666539533 -0.069818027213844 -0.005129326069834
-0.091923755902813 -0.012852237142974 -0.010206659520151
-0.097088707668270 -0.009076996603986 -0.005109102452280
-0.113400319805312 -0.009261680150207 -0.003317316258433
-0.116956205615886 -0.005261314438100 -0.005276848996165
-0.122922990799079 -0.002099115647828 -0.009493877614025
-0.134251441070423 -0.000008457161940 -0.007381778538707
0.110562649972880 -0.075941971957018 -0.006826228917125
0.105103943668706 -0.075616350538731 -0.007157084858897
-0.090536176820210 -0.022640855379959 -0.009428476536754
-0.105826172009164 -0.019263349581237 -0.006528073704723
-0.111378437373210 -0.012824598210108 -0.006300299438887
-0.117357004017702 -0.010307174834960 -0.008064857686045
-0.122842806518796 -0.008830181401690 -0.008170473301891
-0.131661084796224 -0.006985979960721 -0.003974783146862
0.102299485465120 -0.078704367550661 -0.008097129207478
0.095848153920212 -0.078652862776518 -0.007711673667229
0.089604347911425 -0.080043855976628 -0.005717901432992
-0.078888911681458 -0.032542587447226 -0.007419845148407
-0.086412281383029 -0.029130751937402 -0.005793991292003
-0.095436510770641 -0.029570089328729 -0.005733091557505
-0.100012963263477 -0.027123288468919 -0.005692121708872
0.122274723670253 -0.094399620934471 -0.006095977350556
0.113728526723700 -0.092654020018713 -0.005858200912161
0.106874336696457 -0.090953089432048 -0.007346650008840
0.100441513855390 -0.089699329650396 -0.006050870144847
0.093411558157818 -0.084813332499919 -0.007251592076305
0.085862958927101 -0.082771419017816 -0.007686549866679
0.079549251876069 -0.080321470579289 -0.005882238591197
0.072056784993878 -0.080574998231904 -0.006692929788911
0.064578111060572 -0.077536702046016 -0.005151364529613
0.057015842152029 -0.075898310825462 -0.007055743897441
0.050290664268970 -0.074223325849690 -0.007404504979137
0.040299113593212 -0.072905201205342 -0.006666998112681
0.034876952662185 -0.072138005829786 -0.005823367131236
0.029484676722710 -0.066806617919941 -0.006541379178049
0.021165627361684 -0.066451373693981 -0.008132338318282
0.013241259503090 -0.063045031511554 -0.007344455286347
0.005433741013442 -0.064013290075993 -0.006262290521943
0.000245215032526 -0.063881907040672 -0.004800260746959
-0.009288419417469 -0.059955737551008 -0.007334997380260
-0.015565334905327 -0.056078127481664 -0.008884631677949
-0.022670017949576 -0.056007566464973 -0.006389285608612
-0.029503406572250 -0.051779287797094 -0.006390336557709
-0.036579454917055 -0.048996187670688 -0.007444832051280
-0.044395632198440 -0.049390269707437 -0.006479939091684
-0.051891582023656 -0.048179356989574 -0.006438055241587
-0.058606839461848 -0.044130575116614 -0.006606428349498
-0.065565239772112 -0.042682336245306 -0.005662912095072
-0.074063922740861 -0.040832616554604 -0.007170203003342
-0.080476792734689 -0.038698550684368 -0.006086989033701
-0.088832797562094 -0.038736387703844 -0.006248457851673
-0.094816195093272 -0.035001500710554 -0.007453412068370
0.117989117843520 -0.096445335643183 -0.004411199772839
0.113005433692475 -0.094965892304550 -0.003531053746225
-0.079235708724519 -0.043418131507715 -0.004437696660044
0.138076483209512 -0.004523358541745 0.000932211809019
0.140634526462849 -0.016275356475171 0.001007519518850
0.138723379509608 -0.010858678988136 0.001241185938832
0.141064257972177 -0.021567677954597 0.000938719137597
0.141566398211322 -0.029064547039471 0.000527704353648
0.139612297762302 -0.035423495127965 -0.001465344155314
0.139060549989640 -0.043227263311493 0.001018460547444
0.133831239036394 -0.050440969209556 0.001854253088948
0.129872487484874 -0.055000376863973 0.002092613017081
0.127855150825240 -0.062725697886141 0.001518775736806
0.124776333040262 -0.061583189161014 -0.000006214821818
-0.095696655030816 -0.001346230140189 0.003810722147940
-0.114678974948702 -0.000193780130901 0.001271161829945
0.122156781172357 -0.067474090920327 0.001156324183461
-0.092470598006355 -0.013207425895803 -0.000089479649545
-0.113066656926711 -0.009542671603161 0.001387591158864
-0.117467876386500 -0.005893213590906 -0.000416955939084
-0.133846159075760 -0.000866970218182 0.000336206233022
0.116547139228527 -0.072967952463499 0.001347139155386
0.111475800115512 -0.073975768988468 -0.000452454960826
0.106319026500415 -0.075316266291046 0.000251619771637
-0.091702656896230 -0.021549566073532 -0.000042261326793
-0.105602610174967 -0.018707517664101 0.000728567737713
-0.112164636777233 -0.013866304722013 0.000759872233388
-0.115937545284077 -0.010818443696718 0.004368060862540
-0.125412023901288 -0.008590524583734 0.000422519957540
-0.134864142377888 -0.006010319512105 0.002151624953268
0.102047241103827 -0.078579909458667 0.002328407561299
0.093931984162301 -0.079291113615922 0.001034377848623
0.090330740589212 -0.080108071773583 0.000778270518300
-0.081283843277167 -0.033328079251907 0.003003722305614
-0.086609314602123 -0.028685094673293 0.002431220805166
-0.093986612830267 -0.030858220395467 0.000386361872669
-0.099712769341954 -0.027094080947757 0.000755072581289
-0.105288344147064 -0.022288490168946 -0.000327298844340
0.121409789175211 -0.094012924862120 0.001291096484181
0.117631211921480 -0.090613964560457 0.001263646876332
0.108287221475554 -0.093216365441741 -0.000853105748180
0.100297280387814 -0.090131182069842 -0.000936687672618
0.093559613954842 -0.084037033080966 -0.000725819155060
0.086539318046620 -0.082171922042498 0.000303857872688
0.079374891603902 -0.082392243083969 0.000402567524091
0.069757417119216 -0.080551944044353 0.002751980387685
0.064086339788098 -0.078689549319694 0.000491480624196
0.055742283318818 -0.075218435968031 0.000329500472065
0.051048974010986 -0.072831693619016 -0.001657079899791
0.040937194269367 -0.071914319537570 0.001555108248708
0.032977800426730 -0.070371481275292 -0.001383011067394
0.028288956659405 -0.068637052399883 -0.000883463871958
0.020836687957627 -0.065879537669715 0.000210806961375
0.012223336857167 -0.064308624869626 0.000086282288549
0.005168589450763 -0.063380710072258 0.001040129776316
-0.009671826058386 -0.060638509742968 0.001253711974141
-0.014975891159251 -0.057458381838382 0.001387076174732
-0.021369843184542 -0.053911847050034 0.001964049374578
-0.029185466102409 -0.052516708737947 -0.000752432072642
-0.036134214288702 -0.049430133289395 0.000110439097401
-0.044211999945919 -0.050773478741269 0.001914311205862
-0.051430679307353 -0.048167851711826 0.001037531840321
-0.058387010641833 -0.044781959927893 0.000821216652595
-0.062981295883641 -0.043511062152837 0.001044475352285
-0.073091176145263 -0.042898292563320 0.001091611659047
-0.080433626746196 -0.039694706464034 0.000528128787624
-0.088150866958017 -0.037192644252043 0.001588894746883
-0.092965809649903 -0.034446919187551 -0.001574775898937
-0.099025321452304 -0.032560515902078 0.000556483383494
0.116575618079958 -0.096079732677667 0.001096425806996
0.092976477696962 -0.089686981378687 0.001200708186148
0.086965181938958 -0.088170915523527 -0.002224390233042
-0.064805723951982 -0.047503265596590 -0.000640422070507
-0.074637385072793 -0.044725569002905 0.001574817454334
-0.079135716749359 -0.043599609096634 0.001732431208610
-0.088755909613620 -0.040984478747511 -0.002190876210215
-0.095780368251510 -0.039185436456580 -0.000677558148387
0.137404614324349 -0.005171386666063 0.008480449950215
0.134371291709459 -0.002179879687442 0.010289361750600
0.141318593376725 -0.014268547134917 0.007785571848868
0.137230666912129 -0.010723929973548 0.009092266515411
0.139299897691160 -0.020917618848994 0.007773778394379
0.140377103297882 -0.028858688505128 0.008092888819692
0.139931120840258 -0.034522277005968 0.006667785822866
0.136600890130272 -0.042423561549301 0.008676650321005
0.132828053826775 -0.050007561168636 0.007935162817953
0.130296412779813 -0.056365094524381 0.006252137934682
0.127845291419750 -0.062361282309998 0.005123235499380
0.123225540550883 -0.063132873124874 0.008466485774036
-0.097501205894963 -0.006364123419711 0.006049653803821
-0.116417756405754 -0.000733124170801 0.010422465693471
0.120410442315031 -0.069739178738769 0.005204626833913
0.116705373432428 -0.067691164858440 0.009416348254202
-0.092456132482092 -0.014628740598041 0.009919519221303
-0.095565616414501 -0.011390977432034 0.007793423131622
-0.104846568459185 -0.010914944151034 0.011424483096120
-0.110428523703025 -0.009885466611311 0.009468642508505
-0.118639356990421 -0.007008742698299 0.008278157167295
-0.125089081687240 -0.004536246846019 0.008807217500789
-0.132767163780516 -0.002125255925187 0.008588991135421
0.112475878898793 -0.074690707649565 0.008529418106395
0.104279942176866 -0.075437163143907 0.007576228892324
-0.086572201845599 -0.022415222872055 0.008770807063102
-0.088479585400422 -0.022130759305133 0.007178809916493
-0.106419633985377 -0.017492981165829 0.008625179850576
-0.112755988584222 -0.012781788564674 0.006616625582691
0.102792149411245 -0.079342387910578 0.008505128657338
0.096423255339336 -0.079548682392542 0.007555567728993
0.087712212338201 -0.079376108886519 0.009781583582875
-0.075002428456366 -0.034622276704882 0.011180558955190
-0.078436742189777 -0.033894652879443 0.008700083529469
-0.085621610557453 -0.027628188125764 0.007547305857656
-0.095125346751466 -0.031107553334266 0.009744777476308
-0.099684405280789 -0.026922356450934 0.008612287318227
0.121456595478871 -0.093291134933701 0.008430203870454
0.115401090018591 -0.091148738519879 0.008002173792836
0.108070483244086 -0.091877945143908 0.009912499796864
0.101526667472762 -0.085664102163909 0.006997681414602
0.092837893020687 -0.085171090307345 0.009664465891834
0.085990382771335 -0.085734147652375 0.007087672984121
0.079436576687352 -0.080216464473241 0.007433858244469
0.072939659759328 -0.078961159291625 0.008556774413106
0.063576471034139 -0.078761957108102 0.008982693945882
0.057363687554740 -0.074729836063578 0.008556712424276
0.049818598115665 -0.072908947679189 0.007564161574362
0.042653279875940 -0.071065518379247 0.007989423821174
0.036487935444666 -0.068589743215081 0.008390731608388
0.029050589298454 -0.065954456387640 0.008651369527496
0.020481147206333 -0.065025217524842 0.008686633315629
0.012865235584575 -0.063679331000280 0.008790329014776
0.006597749033703 -0.061652806830979 0.008279776608464
-0.001055724978146 -0.062355745110790 0.010658535754201
-0.009893315429520 -0.057516048556171 0.007466816699026
-0.016343786087196 -0.053836144442455 0.008199606692311
-0.023109506554578 -0.053802529665598 0.008640847002980
-0.030317000163146 -0.052560418556613 0.007974398886678
-0.037333380363718 -0.050010084261739 0.008370478903767
-0.043429104662133 -0.048415916569626 0.006827286835032
-0.049562995404008 -0.046596934935109 0.008139883156138
-0.056326318480531 -0.044922879604245 0.007267031148591
-0.066841213890153 -0.042498761665193 0.007358945219567
-0.072224404077259 -0.040252866582023 0.007923922248924
-0.080240112914873 -0.038536621521086 0.007866464684211
-0.087529307542721 -0.038746843738342 0.007480282580373
-0.095079333397035 -0.035317531748049 0.007975505353244
0.137073227109266 -0.006293531226554 0.013858168398854
0.131997070246923 -0.001271915266149 0.016964673157054
0.136271446322644 -0.010265421345670 0.015610854899404
0.136803871561947 -0.020817968234736 0.015906482731816
0.138124366611813 -0.025478325359905 0.015195398763336
0.136755254460371 -0.035853618678499 0.014562111378939
0.134034453215833 -0.041015014306818 0.017031982059793
0.132261244066888 -0.049458610029477 0.012927226817129
0.128591324312837 -0.051745881475196 0.016648679530139
0.129662728585229 -0.056313334994919 0.015909374987599
0.126864187806290 -0.056152256305527 0.015724881922719
-0.093496003498778 -0.000600346227816 0.015592339312552
0.123290513212318 -0.062309562918156 0.016926305806158
0.117672748994529 -0.063769585420565 0.018340866839406
-0.090163737645593 -0.009393776625087 0.018435939585683
-0.095303249370710 -0.003998297581454 0.014165671940165
-0.110283766270360 -0.002584687020748 0.017957039153094
0.119062339347534 -0.067791930727141 0.016050893580434
0.114863048321204 -0.068747207002892 0.015220096623418
-0.091151039943224 -0.010807004011391 0.013987873351094
-0.093584654186191 -0.009810669490075 0.018045615628875
-0.106516274366586 -0.011933767802174 0.015811055933949
-0.112143658864631 -0.008071352218118 0.014266793206848
-0.117741678208031 -0.006704231269032 0.013617015158650
-0.124072974934718 -0.006001337363819 0.012297719752308
-0.133408487584069 -0.003472217837872 0.012150474822042
0.104002124571185 -0.074430518623100 0.015832160555837
0.098989358537970 -0.074953730521292 0.017048510825155
-0.087252241166245 -0.024696590120241 0.014514963423727
-0.089302258555612 -0.019367730883000 0.014451740061757
-0.100441161418178 -0.020183970075403 0.015113232409475
-0.105393403088370 -0.017606399205121 0.014855358993529
-0.109416318811173 -0.012643901732676 0.016593036925312
0.124470366039860 -0.089705909889204 0.018154122626302
0.118458795038321 -0.087659957924322 0.016907190755523
0.102332526038526 -0.081970827447579 0.015799310004231
0.096311743072966 -0.076851753391991 0.017025915578521
0.087523685162377 -0.078075621404193 0.015390978746275
0.080444803126823 -0.077211276397870 0.017611173108733
0.072580513778309 -0.075359158419379 0.016940293426830
0.065548261510730 -0.073839173389450 0.016029932772633
0.060685100717508 -0.072144494774939 0.017077310676890
0.051394655391193 -0.069569022939376 0.017319349085805
0.042392225034852 -0.067208137849146 0.017041965758321
0.036752329244840 -0.065713529772090 0.017090948219615
0.031750838361079 -0.063944294030430 0.018255655085562
0.022430191086123 -0.062128003384380 0.016336159502980
0.015826627813532 -0.060835276046780 0.014979851519581
0.010070099486922 -0.058954972455569 0.016022100245473
-0.009334958146387 -0.054149360568703 0.018538452898977
-0.014545993852869 -0.051363937415785 0.018710337117828
-0.022257285140552 -0.050137854027338 0.016359849011418
-0.029261022583000 -0.048633134236481 0.015310627018925
-0.036376189311115 -0.046845298578838 0.014960305487630
-0.043561120094076 -0.044296560591671 0.016821227824209
-0.053519616717958 -0.041467438572179 0.017305754458424
-0.057078303808572 -0.040516797899332 0.017145786082264
-0.064886099723760 -0.038523489576425 0.017340548312184
-0.072068307623046 -0.035635696936052 0.015512296235081
-0.077953555456680 -0.033134179153857 0.016107638394353
-0.085789030728787 -0.031776499860288 0.016569116389271
-0.093127316239806 -0.030450014211291 0.017002932981171
-0.098779266413856 -0.025112479371304 0.015441440855978
0.122037744963717 -0.092819857592007 0.016509944076853
0.114974414272240 -0.092751867554730 0.016767412936209
0.106991291520408 -0.087929486440158 0.017026092326162
0.101228160054025 -0.088051112742244 0.014606847559925
0.094043895213635 -0.086075923314765 0.015414265429494
0.087095294578617 -0.084306474723479 0.015785872574168
0.080132216605609 -0.080256263902794 0.013175842717804
0.071971922613076 -0.080130161959365 0.017238205706594
0.064655193438737 -0.075593086471631 0.014875006472585
0.058484665589624 -0.078052494906169 0.011893485819812
0.050084577611327 -0.075505977136768 0.013078330790518
0.042267050880999 -0.068488407493170 0.013126866137501
0.035648914658950 -0.068996279926203 0.015237165438649
0.030122130001203 -0.068917049331552 0.014817060676163
0.024029580360302 -0.067313369414432 0.017097455298420
0.013699571560802 -0.063440213695259 0.014275202929494
0.004679775039268 -0.062328279554211 0.013298973834033
-0.008644655781193 -0.058650033005885 0.015286398493764
-0.016392346834399 -0.057039666973183 0.015379157340047
-0.019680540604512 -0.053666959292865 0.015192551409719
-0.029778456858591 -0.050815139568531 0.015838553225515
-0.037574056961524 -0.051900639413545 0.013510532176014
-0.042169067644827 -0.049283818209737 0.014048452651022
-0.051192291147102 -0.046616459197617 0.014801736151693
-0.057824901058532 -0.043385674376200 0.015541357314106
-0.065467975484353 -0.042899226627833 0.015019345318793
-0.073956712599538 -0.040710907262597 0.016654985542611
-0.080335495912378 -0.039198190736810 0.015549018126909
-0.088130385261235 -0.036931664292271 0.014273835325844
-0.094006282001899 -0.035010399470755 0.014080038662272
-0.099219223650982 -0.034999693273643 0.012538694178578
0.130843994999483 -0.002880468545109 0.021222499262807
0.136327940782964 -0.013495534691077 0.023981112277028
0.132132538854881 -0.010286462977696 0.023685776984211
0.134477480131315 -0.019257026373559 0.024280973549205
0.137544773088671 -0.027903631605255 0.023089448487279
0.134510072514020 -0.028815777835707 0.022858042037008
0.136930089925294 -0.035716967041203 0.022277445998735
0.132300940573055 -0.033878600746487 0.024316477016129
0.130490452254021 -0.042964635185968 0.022234263966285
0.129754403274849 -0.051789609391645 0.022558992182728
0.127547550743663 -0.048882646543749 0.024747296607015
0.124396662308095 -0.054628677652774 0.023214071017686
0.119662189659512 -0.057167437991657 0.025717843329428
0.121722663877339 -0.061932426960530 0.021227429377553
0.118130314971598 -0.061486992556563 0.023484849607464
-0.089738926144265 -0.007206541450939 0.025160201982177
-0.091976353233141 -0.002965738953267 0.021557706152912
-0.108756966418978 -0.002436892755804 0.023074373240785
0.112761427581555 -0.067654144900529 0.021948440730092
0.106396968208781 -0.067768614562211 0.025289537035939
-0.083947252542222 -0.018255861456419 0.022885510718343
-0.089086746477395 -0.013879065914723 0.024804835593220
-0.104655851452958 -0.011631629449665 0.022635100876806
-0.110070694493540 -0.006656381289563 0.022591846262928
-0.126507519807708 -0.001000135365115 0.020623435770987
0.109275623306516 -0.072136218282397 0.022125544344897
0.103268339701928 -0.073673219638333 0.022451101576803
0.096017815233090 -0.072931049362733 0.023755623518941
0.091397999036598 -0.072832937603455 0.026011200224875
-0.078825634668412 -0.024375906688247 0.024168619270640
-0.083159131892086 -0.022387320621751 0.024101690248168
-0.088121935042740 -0.019562170681743 0.020749005114553
-0.097940168202891 -0.020136796248261 0.021832372653005
-0.104123679513041 -0.014313549367304 0.023739676510808
0.124791901911957 -0.087308261693595 0.023620959635095
0.115563136072448 -0.082450949785566 0.026391879832265
0.110649112523575 -0.082650927488439 0.023518141066548
0.103352621911593 -0.082630241480347 0.019525241648670
0.087220116740085 -0.076883756139145 0.023888487135884
0.080753694814511 -0.075737759365871 0.021384040629383
0.072567791826712 -0.072792160421141 0.022909651632624
0.066078052808512 -0.070946662588201 0.023035178537684
0.058607990923364 -0.068526119059604 0.023801253830907
0.049391482719705 -0.066438017917357 0.023120416120209
0.046500512944314 -0.065404734357577 0.023679494018871
0.039362387138742 -0.063081271479195 0.024511322136240
0.029347087220682 -0.061525025617838 0.022222978484152
0.020770042693193 -0.059001256709492 0.022646944319722
0.013767160858840 -0.057022171919356 0.023273864662167
0.010237902649601 -0.055642870180375 0.023620234286306
-0.002547663348008 -0.055968516234668 0.026860981976505
-0.009122157073743 -0.053356119440629 0.024737686669346
-0.013841228168413 -0.050451913234694 0.021252329623220
-0.020768744535669 -0.047327105589585 0.023713489329335
-0.026155470305698 -0.046101754263287 0.023262110507008
-0.035941758442727 -0.044303332452458 0.021695055281637
-0.040778469213358 -0.041944597703890 0.023799617166835
-0.048859590275606 -0.041349453565141 0.025940051590918
-0.057469695952197 -0.037894947389848 0.022951602375028
-0.062098414001110 -0.036747636032741 0.022751916086194
-0.072786550884481 -0.035660864544566 0.023319778239247
-0.077038575407074 -0.033062503412881 0.023289065089768
-0.086041028665453 -0.030433585711208 0.024260920798299
-0.093044655912242 -0.028258720937337 0.023677872633454
-0.096719988888521 -0.025091986263182 0.023372017657277
0.113034684650177 -0.090210094779101 0.020518743788717
0.108448617467512 -0.088365934666518 0.023332868253706
0.101795130531752 -0.085637778905224 0.024155209874627
0.095318334572825 -0.084527675428450 0.023485423361775
0.077930274431832 -0.079570967404454 0.022572421824452
0.071761500691217 -0.077346069482809 0.023850442921636
0.064989922944876 -0.074536289483632 0.025954671179769
0.057103244626363 -0.072710187775383 0.025386170184133
0.051798594652774 -0.072613489434165 0.022653728520389
0.040929824596425 -0.070277488054956 0.021296238219258
0.032636399867602 -0.068737451872486 0.019676277911185
0.025373660452101 -0.065842066541923 0.021926702296253
0.021854716621065 -0.064194391992229 0.023500793826100
0.012527241031120 -0.062116542748885 0.020693784749029
0.006431660217894 -0.060120030769329 0.023036129843709
-0.003789060008614 -0.058841298214853 0.019977903162954
-0.009699790305196 -0.054988980614961 0.024380392189341
-0.011543945664125 -0.054869757586856 0.024283976351737
-0.020521192393985 -0.053923201739721 0.021045873120940
-0.027447193494374 -0.051130682817441 0.023213190352437
-0.037750824268529 -0.046777995043827 0.026395105635640
-0.045340770326815 -0.046423734386379 0.022964948768931
-0.061472636660806 -0.041289708282113 0.024731359755514
-0.063999675000919 -0.040931311899514 0.022769262825963
-0.073297262279827 -0.039448094006811 0.022463548377671
-0.079320212793790 -0.037883529629575 0.022535428320882
-0.086237961961452 -0.035334944380729 0.023814507228319
-0.094079572412923 -0.032347470765008 0.022660037791250
-0.098089664969712 -0.031699111216558 0.024295257365225
0.128975982665016 -0.004392052021929 0.032659746682165
0.124749497738671 -0.001699408943231 0.030480722730873
0.132418471213091 -0.014082464707135 0.031043862527128
0.129292010290791 -0.010517906570721 0.030220114247766
0.125765608402906 -0.007531903393294 0.032620114480971
0.132674364102492 -0.014825375934119 0.030831492578504
0.128827537162298 -0.016266444743990 0.032244003498074
0.132366667818745 -0.026112162126640 0.029713301074025
0.128481511723936 -0.021851671410347 0.032498522078513
0.130112571818401 -0.032596484420242 0.031235099148271
0.128251005760167 -0.040973128054576 0.029040723133931
0.124881061409751 -0.037850702241332 0.034066562687870
0.125502820805268 -0.046958185862075 0.029838217144724
0.121484714776046 -0.048511179535160 0.031830256646391
0.123510886513531 -0.054842133714430 0.027922473167892
0.117663182910178 -0.054628991183649 0.030720338052032
-0.087176674711879 -0.000245674303301 0.032133597915886
-0.090943926096025 -0.001114323308557 0.028893916880606
0.115604624139963 -0.060155822181333 0.030339783635682
0.109842498768067 -0.061999212551792 0.030589623794474
-0.082448487443413 -0.010321155774630 0.031663404023168
-0.084735019859178 -0.008425001659742 0.031348687803267
-0.102292815279810 -0.003390814678165 0.032036768307803
-0.108994291606434 -0.000138443019537 0.028929451858518
0.111120645781652 -0.063564846902776 0.033151825224874
0.105951273982173 -0.065985784516854 0.030389441532079
-0.077154119787561 -0.019717419422380 0.031362300606339
-0.082509375110186 -0.017831824531256 0.031850583250837
-0.088367742822451 -0.013809870282632 0.031427248552956
-0.097984015570819 -0.013443118116047 0.032162658524033
-0.102065035718953 -0.009593450410790 0.030195685034511
0.127371192050397 -0.082102148020099 0.031580082630630
0.118145526127852 -0.079135247963944 0.032260038411139
0.104034722350374 -0.073757039195207 0.031570360099789
0.095878379653720 -0.071237346924378 0.031055163490292
0.088881048516061 -0.070563525103346 0.030570250933883
0.085247562781380 -0.070095315106008 0.032538219725606
0.074146861571834 -0.067408524065597 0.032155351823089
0.066336458864324 -0.065652905434519 0.031735886847493
0.058567169918456 -0.063098482674829 0.032320566510675
0.054017823042564 -0.062105247809482 0.031983815311906
0.047926766919938 -0.060116469243841 0.032525301253316
0.029090062221508 -0.055282260188690 0.032227426623818
0.023551576464406 -0.053279325547709 0.032837677663084
0.015138000565685 -0.051834533005650 0.032184724819181
-0.007630816971456 -0.044595449542648 0.033280503069876
-0.013771050012430 -0.043923278006851 0.032044606005667
-0.022628366293664 -0.041688981397741 0.031890278851507
-0.025957993172444 -0.041346042776397 0.031148346329001
-0.031773365234493 -0.038231112963463 0.033145561134336
-0.037383385472873 -0.036149276763201 0.033856704667725
-0.049737750310192 -0.034975708321981 0.031129997571823
-0.055793242247501 -0.032335897679322 0.032514312898635
-0.059446627428123 -0.032253238115390 0.033860399758336
-0.069926980520008 -0.028510658774730 0.032491931449888
-0.075525038609489 -0.025064583684117 0.030716528252281
-0.081498905435279 -0.023918677743192 0.030764512454984
-0.090779088043118 -0.021941357549880 0.031518690144536
-0.097517259241210 -0.018159468140784 0.030040682567176
0.123354128108958 -0.087212160766134 0.028684672927377
0.116944187567558 -0.085093250652247 0.030219141458985
0.109272349100299 -0.082408569829853 0.030118218973793
0.102124468964531 -0.079575976327211 0.029679615164069
0.096248397414709 -0.078632763527964 0.030197543942449
0.088267079764499 -0.075593061007102 0.030209210437057
0.077950671526745 -0.074053022054579 0.028110724961277
0.073163250225003 -0.071741127375097 0.028860200798032
0.064541853954387 -0.069259310836403 0.030039633890507
0.057269272219979 -0.064509367225897 0.029975084101676
0.051851942918947 -0.066940968526498 0.028297740554330
0.044968003537342 -0.065093389492767 0.029412186270472
0.037796081056260 -0.062406806031772 0.030947032407440
0.027774992657968 -0.059332718787089 0.032209591781614
0.025323346042818 -0.058835078555380 0.028404507394153
0.015652056000076 -0.056411525873616 0.030266764002559
0.007550499049830 -0.055211883814607 0.030342738289013
0.000106896490902 -0.053882670490452 0.031361500358101
-0.008371910664932 -0.050558991585573 0.031859366213795
-0.013731623583446 -0.048355165805177 0.029866219228027
-0.020006489415417 -0.046612991357209 0.028508303359664
-0.029839219553918 -0.043059814950659 0.027081566369053
-0.034945580286034 -0.043592272078697 0.030611862776229
-0.041477196441268 -0.042951210853373 0.031112851933159
-0.048242523050009 -0.037645274578551 0.029955703234193
-0.057385896847273 -0.036602601385728 0.028535259401319
-0.063160927370160 -0.036176251373101 0.030007711684224
-0.071327511196839 -0.034101760670001 0.028960714476075
-0.078700589757051 -0.032131078907048 0.030123263096329
-0.085995090294472 -0.030825646482379 0.030260430673890
-0.092769407040338 -0.027470815785283 0.030830147927520
-0.097010866804657 -0.026765539617436 0.033201977526661
-0.073983017597962 -0.037496255120859 0.029118080770490
-0.079378384333893 -0.037536252940698 0.029777828609463
-0.094579549413224 -0.032423995008068 0.029813057541368
0.122441061408573 -0.000948085730601 0.035788378393170
0.128158984937650 -0.009587106838024 0.035503534113883
0.122685649997248 -0.008686782072991 0.038079229946452
0.124461933771031 -0.019654933070315 0.037284531390189
0.129269131738353 -0.025683147152903 0.036459777628896
0.126192777254858 -0.023693649244510 0.038871722018239
0.123947225125153 -0.031742362702560 0.038624965524194
0.119131589207086 -0.031840452220229 0.041666284834859
0.126955367187969 -0.039179934899083 0.035911726986882
0.120771817392839 -0.039702727155458 0.038287884100366
0.124823478515893 -0.046174099060822 0.036028337275501
0.120032287610617 -0.045888218022353 0.036634864820737
0.114321672689138 -0.045638767279271 0.040487695872304
0.117306244982001 -0.053086591932399 0.037655496394154
0.112304675622955 -0.050563962799640 0.038973700797078
-0.079563205368268 -0.001251052967545 0.038629648641265
0.113854020875834 -0.060581783837999 0.035583929812429
0.109167103121654 -0.059107332796064 0.036338632687021
0.102478770543430 -0.060591600173950 0.039409731184955
-0.074644984622445 -0.009990977318253 0.040155319010731
-0.080826533958854 -0.008226289390850 0.038654890652018
-0.086626925250236 -0.005927047712966 0.037852509772298
-0.095708526178525 -0.004236565319042 0.038950555870734
-0.101146821077580 -0.001697899168630 0.038459596907613
0.128560189539012 -0.075085173631317 0.040498384272573
0.105783328610363 -0.065603667390473 0.038341786380129
0.098633072414662 -0.063529225723349 0.038078458719114
0.089617453832799 -0.063708151710711 0.039606564795492
0.083692973350005 -0.061366729829126 0.041020944392201
0.069338371994449 -0.059404699407414 0.039399338042257
0.063490062699850 -0.056715173698491 0.040373706614492
0.056748597776754 -0.055279002472072 0.040054879303294
0.047016396577624 -0.052781298814753 0.039966692244526
0.041897093182091 -0.049851616274021 0.041303590571400
0.033098841471238 -0.049696621246401 0.039381484782216
0.030147167096649 -0.046491426076312 0.041452944552419
0.020629290085531 -0.043771774125124 0.041588042056081
0.012479575366016 -0.043767806292959 0.039749415194507
-0.006041708970600 -0.038964782991574 0.039605013644217
-0.009815037546570 -0.037999723688086 0.039576291834827
-0.015282042289389 -0.034377344798446 0.041426063811299
-0.026485946421836 -0.033199638698485 0.039862974917409
-0.034055142070825 -0.029865756974681 0.040994565124827
-0.039562321967946 -0.029417806159872 0.040114828860280
-0.046116241088373 -0.027572551275560 0.040157504832265
-0.054744681552792 -0.025992708735090 0.039535127436637
-0.061358810348512 -0.023567850087463 0.040097942864414
-0.068944792597851 -0.021511130186857 0.039216523158071
-0.075128951531123 -0.018504475573250 0.038917491982185
-0.081872775089549 -0.015605291789804 0.037678247391698
-0.088185825442118 -0.014178937166493 0.040313791866617
-0.094286829826207 -0.012575940592457 0.037962481235978
0.125936457027122 -0.079263733307289 0.039151007925985
0.112877685639149 -0.074313970366997 0.037879334485051
0.101436322687664 -0.074637810158081 0.037187879518189
0.097015668248403 -0.069488110719142 0.036807133471485
0.090178764096332 -0.067869428094453 0.037479048466203
0.084303426529033 -0.067228110552327 0.037281997596739
0.075242847639610 -0.064584611092866 0.038351812815186
0.066980981296877 -0.064769602775569 0.038711195456503
0.063644551986546 -0.062108360443922 0.035161929881092
0.054871004064312 -0.058657767174691 0.037447265739756
0.048928791015937 -0.058088615773806 0.037505056972820
0.041687168083339 -0.053475618812872 0.037981264547028
0.032290030852517 -0.052747592639894 0.037515069090841
0.024867585671938 -0.050970171478149 0.037857597829135
0.016487772751551 -0.049835819177019 0.038142748033520
0.010730609469453 -0.048639252871423 0.037123020445820
0.000343214981582 -0.045481463250855 0.041550778185841
-0.005287963568567 -0.045130286376594 0.037958711421010
-0.011763538258988 -0.042132997267936 0.037206712042806
-0.019544052879540 -0.038336655771535 0.036659228598591
-0.024788047129647 -0.036992950719721 0.036687689101217
-0.032213156396805 -0.035274855381661 0.039045216039337
-0.040976869225080 -0.035364680791256 0.038460060495510
-0.045747752857427 -0.034863626020005 0.038447111721354
-0.054781271683133 -0.029499393374517 0.038086664831159
-0.060694014496915 -0.029506053368421 0.038296102691542
-0.070188486146125 -0.027124369017583 0.040068638757384
-0.076144059047776 -0.024930176977709 0.038437206351277
-0.084398819959384 -0.022086404323003 0.039203080927847
-0.091896493294319 -0.021659836848728 0.038855946704495
0.123359009133926 -0.082845391740780 0.036867122923849
0.119425353750243 -0.082690919790934 0.036601298367498
0.104004147103515 -0.077963755172472 0.037233247553822
0.095983599138184 -0.077688397867581 0.035678710734363
0.087051580712456 -0.073309274879998 0.037086256141977
0.068025718106728 -0.067861668745824 0.037024246012684
0.060291695620040 -0.067083270389801 0.035446858679768
0.037891966490193 -0.059441082761240 0.037419599329944
0.033091576299002 -0.059366014336285 0.036008723055837
0.022482234637798 -0.056422148616446 0.036133727347370
0.015178790674853 -0.054660322000329 0.035523898398397
0.007102828803480 -0.052163751625359 0.036294211661336
0.003792970207305 -0.051663084231315 0.035818481719013
-0.007914967150901 -0.048855541748898 0.035201160227772
-0.012781071329222 -0.046357162510170 0.036849109923360
-0.024669745163723 -0.042767702705113 0.038771133696552
-0.033282087011809 -0.041752864122622 0.039796135699269
-0.042884632296582 -0.039253926489587 0.036962861175852
-0.049589042650441 -0.038007981126334 0.037564476382253
-0.054919249511393 -0.036900752779091 0.038673032462116
-0.061640168053395 -0.034196970210201 0.036791911875721
-0.070965941354403 -0.032441314779166 0.038323035831767
-0.078441212101543 -0.030815991129351 0.036031656538961
-0.088061866118338 -0.028481742354242 0.034695091044423
-0.090973414482511 -0.028394812477296 0.035799136912344
0.141641193627084 -0.000589302403062 0.047214428380644
0.145625630621881 -0.007312276865385 0.046373290335653
0.139920218695312 -0.006075698784809 0.044884632861135
0.131443050394363 -0.001717469282734 0.045768577181813
0.145611852768571 -0.014408163379902 0.048754033839224
0.134945114507115 -0.010557879803978 0.048243996734934
0.128776398822685 -0.009226057945629 0.048410385882376
0.119388170162089 -0.010842748025224 0.044665782725332
0.114115897300567 -0.007346351254248 0.045522092616079
0.107518538835968 -0.002944632664665 0.046763053344117
0.119252103298820 -0.017134414671850 0.045111221491810
0.113181194374142 -0.013694520245195 0.046371272599218
0.106266222578396 -0.010671160115484 0.049263866221424
0.123029834817189 -0.023633719638782 0.043187391077993
0.118069308770463 -0.022771069491796 0.045294875657079
0.113244142016230 -0.020977074548579 0.046783750712392
0.121711702786963 -0.031004658103043 0.044641970908162
0.116301978779794 -0.028902265992895 0.046168448960301
0.117862313298069 -0.040806209752335 0.044129569804188
0.116176606555011 -0.035283627330844 0.044491415456452
0.108376420263544 -0.036959761523836 0.047807258402820
0.116580301866298 -0.045990066356078 0.043087141469635
0.110268677236755 -0.044185325369178 0.045052517687794
0.103120024365625 -0.042770950429597 0.048305981750802
0.113246465648806 -0.055938690693169 0.049340074336048
0.108959231638238 -0.051395962870989 0.043226123034474
0.104720546250524 -0.048909903057510 0.046188988673206
0.096147835151186 -0.048408341766103 0.048233632202464
0.089701538053684 -0.049694045613534 0.049299159800527
0.044937926484711 -0.037667319662691 0.049319501673694
-0.022348129489952 -0.019545567714017 0.049362527644153
-0.048854955718007 -0.012541153186106 0.049335185801504
-0.065945173939618 -0.005717059604442 0.048325446243600
-0.071337280551770 -0.002709393104631 0.047596611137706
-0.077408505237540 -0.002141901065925 0.045119067624725
-0.087025778825334 -0.000836729087519 0.048160207354542
0.126249578502760 -0.066835603495115 0.045342349802969
0.120235922402498 -0.059533263242922 0.048528564249989
0.115485273979888 -0.061495568898341 0.046762204920766
0.105895537988717 -0.057768145511209 0.044951946055410
0.101305066089887 -0.056240389269981 0.047295026576040
0.093831920373608 -0.054823180954749 0.046803478124529
0.085827371712677 -0.052707596040058 0.047251981395855
0.079493852356292 -0.050611690450716 0.047478424059866
0.071012262587920 -0.048554603057749 0.047366067492482
0.062246661838818 -0.045969341183034 0.047505106722827
0.057257371371047 -0.046440785981962 0.046443623935696
0.051694748446807 -0.042852183226656 0.047643448626515
0.046792225339822 -0.041119365312330 0.047885558878897
0.034117427767258 -0.038439465466092 0.047462159907339
0.026150549033007 -0.036280987963521 0.047469243164377
0.020026252804381 -0.036478917270544 0.046692185770986
0.013696045033239 -0.035495607697461 0.047119214172679
-0.002592188162240 -0.028998206421271 0.049144619738576
-0.006621409531773 -0.028098160797015 0.047136169945713
-0.014299739211616 -0.025451886256779 0.047472802276926
-0.024927507277880 -0.023778221949069 0.046837145920116
-0.026958601747124 -0.022234269564178 0.047427240804351
-0.039052002446105 -0.017085230657491 0.048422549998279
-0.044245043456275 -0.019935763221308 0.046092011820790
-0.051005203407903 -0.015964255806854 0.047304865252492
-0.054610720997596 -0.014639301608293 0.047782819544790
-0.067144700543909 -0.012452847450110 0.046149729167935
-0.072889467707980 -0.009649271353181 0.046311440794518
-0.080492463600102 -0.007750816126408 0.047479044393218
-0.086091236277143 -0.007326177663215 0.046059375241914
-0.093687918332153 -0.003075947034580 0.043736648356435
0.128320030817326 -0.071795779601945 0.046895403976756
0.120651172228665 -0.069205500086887 0.044594893570261
0.112671697276906 -0.068548580769109 0.046008055722234
0.106488917091843 -0.067672031864971 0.043879208361624
0.098835619215027 -0.064620266601477 0.045990984077769
0.091576030539023 -0.061856097900041 0.044597448690820
0.084592861964181 -0.058127782812236 0.045449170386312
0.076749228860490 -0.056795046453463 0.044085479215301
0.069766873584768 -0.057940399733603 0.044759284134226
0.061557515628047 -0.053572762392024 0.044437092577932
0.055543880452206 -0.052078835513164 0.044885274683949
0.049019007213277 -0.052028688049310 0.044997255122182
0.043020750916775 -0.045778809246150 0.044533422266957
0.034349471544276 -0.046089083477836 0.046978281008717
0.025567676870364 -0.044878822832499 0.047569261347768
0.019830009424537 -0.042708736655202 0.044591147100445
0.012400210619075 -0.038625007066357 0.046682329451558
0.005932872834969 -0.040010302566871 0.047288713728903
-0.004209763259710 -0.036379936535597 0.045755466803003
-0.009741838746896 -0.033743984589085 0.044681979657443
-0.016508395034649 -0.031789891244466 0.046004439150809
-0.030926159819648 -0.030012921966423 0.044891491686818
-0.037452337334928 -0.027492547035168 0.045075340544698
-0.044526450568076 -0.024658016259166 0.044012437235829
-0.053124323462304 -0.023190734402399 0.046848003756520
-0.058803551893376 -0.019919964427727 0.046193588053701
-0.068542706787312 -0.017861634016479 0.046110231302364
-0.074012164721697 -0.017050956371766 0.046177326586134
-0.082063357443703 -0.015089244181239 0.046714760656672
-0.088939867904400 -0.013170548838009 0.046098109302257
-0.092341074949081 -0.008950891506362 0.041899553095814
0.124780267602825 -0.077091801026070 0.043937298571584
0.120155060819399 -0.076182677088509 0.043219941174504
0.110377944823566 -0.075101666857205 0.042322459971424
0.105204479039322 -0.072115346052534 0.043435031687734
0.097509019427196 -0.070950289916866 0.043354081904408
0.091814653700143 -0.069564008860396 0.042864465748785
0.077590679078933 -0.063684681516400 0.043788806712148
0.061617086605114 -0.060444901552701 0.042881703650472
0.054511703668820 -0.058291974002888 0.043103579953826
0.039134626892843 -0.053883391806776 0.043359051501273
0.032397043362735 -0.051972410997926 0.043453728472706
0.008768506589403 -0.044551292828446 0.042102824961660
0.004475260505356 -0.043717367730432 0.044141204630848
-0.011227502238579 -0.040194111685143 0.043528675511994
-0.024802687201224 -0.037162669217320 0.044248056685444
-0.030731207922751 -0.039891400422006 0.043083118235587
-0.038903061295656 -0.035854808680014 0.043571118151662
-0.047622420206343 -0.034242937775088 0.043673245703695
-0.055500868918865 -0.030297685474578 0.043087911084808
-0.064414701104778 -0.028768591449588 0.042214785372732
-0.069320341563093 -0.025258463967606 0.044037981307027
-0.076862683943736 -0.023012007657538 0.044206467834061
-0.084137025418954 -0.022465584594578 0.043049416179972
-0.091437566479629 -0.018252326457625 0.044667782898264
-0.094066322078878 -0.016929045736026 0.043068813120841
-0.032022162266286 -0.041492699157830 0.043172148501395
-0.044802974344808 -0.040010244732940 0.042615742480277
-0.048252050809301 -0.037203057825335 0.044227361475941
-0.056226856649614 -0.036109579316197 0.043646512782095
-0.061599211179477 -0.032887647287703 0.044359270846365
-0.070403202923124 -0.031116528226725 0.044261519228933
-0.078311911389085 -0.031022453005646 0.042639062678334
-0.094750017884809 -0.024078213764952 0.042559587275502
0.145454145098437 -0.008038108663158 0.050889313971518
0.136748547105944 -0.006419907542291 0.051376814066884
0.130852066348565 -0.001613508024869 0.050274539744376
0.124850942428875 -0.001670142801915 0.051124132906910
0.118590733903584 -0.002940835668732 0.052889344965931
0.142381018405244 -0.013094080145967 0.053659779981292
0.136150853113074 -0.010280626051615 0.052440641676900
0.130582322556607 -0.010663927725585 0.054340162709869
0.121295304945839 -0.010738562512320 0.052605588709828
0.114889365243098 -0.006499115958406 0.051958566462514
0.109041158138030 -0.003126426343085 0.053530144011494
0.099918030619934 -0.003396711383031 0.051844867980000
0.091775285571479 -0.001846625480970 0.052118538176534
0.086429412118037 -0.000091563835311 0.051153461253163
0.142748899627233 -0.019860908951819 0.053334399735448
0.137566012930411 -0.020026210305941 0.054426596438404
0.126038983949539 -0.015557773715777 0.056351731097218
0.121489076627607 -0.015376096429411 0.054098422801016
0.113030514826255 -0.012722371944357 0.052910995757100
0.104759556851854 -0.011216588217755 0.052714890467641
0.099112599667927 -0.009229022718337 0.054871074155487
0.091601605125791 -0.004544100605139 0.050720523631093
0.083670575597746 -0.004832727996507 0.051532163798330
0.077159423646096 -0.004296027101330 0.054353212153432
0.068623243314425 -0.001072711890575 0.053014442785669
0.141408194936296 -0.028764129513903 0.054142571818348
0.132850093118028 -0.026937878336033 0.053702229296683
0.123660906412844 -0.023949916993915 0.053680753504751
0.116324869612124 -0.021169609023176 0.053516322886464
0.109163483457995 -0.021483288403474 0.051762595291453
0.103280036853648 -0.018981314462453 0.053033071587288
0.095083171863871 -0.017866850122399 0.053919291611033
0.089354631491641 -0.013612860115423 0.053446773325918
0.080193978351411 -0.012358762878597 0.053628563995676
0.078273131065865 -0.010119118604915 0.053380740916251
0.067299964204394 -0.010223908857020 0.053841901576041
0.060230882676552 -0.007333528324437 0.053722476120311
0.052713216117482 -0.005647465646279 0.053761619364735
0.042823402534609 -0.005559691085752 0.054158029353140
0.037698004976939 -0.000934352974103 0.053629676615712
0.137140900439713 -0.033514203038803 0.054408611094470
0.131210502979833 -0.035196286814685 0.054571155344960
0.123520387332566 -0.032479074311539 0.054479277089752
0.108284904537055 -0.027460226044260 0.052411428486821
0.101711116848049 -0.025399925613085 0.053935566699026
0.092365892512156 -0.025174869612354 0.054539434229847
0.086027987217542 -0.021730261610246 0.054481405436513
0.072475435214883 -0.019617254460156 0.054559903895377
0.065406301372526 -0.015726084510446 0.054468560969349
0.059288800352750 -0.013659584024908 0.054452826826623
0.044105972464373 -0.013616869915052 0.054567601954457
0.035837146679525 -0.009315527184403 0.054553881442067
0.029124610516523 -0.006045570292018 0.054985364472387
0.021764169204315 -0.006014130758033 0.054621939455983
0.139391344933953 -0.043460474250657 0.054411657130239
0.132279229097728 -0.040595338267573 0.054423494135855
0.119792958523572 -0.036787366961795 0.054459040438649
0.114370505005150 -0.034624947323270 0.054504634654042
0.107528952163169 -0.036200132615075 0.052232889687535
0.100242621901814 -0.031944765460095 0.052623751543148
0.093122119726658 -0.032615081486616 0.054148212706563
0.085126390862840 -0.029221505174680 0.054320951894440
0.077168803952631 -0.028103068366032 0.054204039847371
0.069553918973441 -0.023795808914982 0.054405184860545
0.062438179213892 -0.023384480910960 0.054263553893086
0.050880678947127 -0.020145484500234 0.054282917582508
0.041090779858551 -0.017109435016659 0.054340286324225
0.033793439374444 -0.016421109005091 0.054255196050324
0.026458803099183 -0.013171477027831 0.054440891698516
0.021692894204936 -0.009173822579155 0.054524369990347
0.003569132679259 -0.006009503720705 0.055541211878773
-0.001089963952241 -0.004470436621043 0.054451713358877
-0.008626905398951 -0.003701844264595 0.054335926997182
-0.016768131419354 -0.003965406793335 0.054098321075754
0.135478888124689 -0.048571787766308 0.053782534396169
0.127918515789142 -0.050298805070263 0.052682084834097
0.118775582064686 -0.042146350768982 0.053859882151600
0.111941761431430 -0.045824743370510 0.052746000086782
0.100951117771738 -0.044192608223168 0.052385789668080
0.097513284167622 -0.039718178992251 0.053038618838307
0.089576028289907 -0.038720761164581 0.052969293391224
0.083795748754507 -0.036088207394812 0.053244052411349
0.073962899397250 -0.035391793690660 0.052761759554861
0.066335516042191 -0.033187544341990 0.052835946833607
0.062667506393125 -0.031219877431840 0.052991655528066
0.053470941734219 -0.026132527596152 0.053583167826649
0.045754525645416 -0.027208324620020 0.052897189890859
0.040030054946185 -0.024242611722869 0.053206433093067
0.029792599557235 -0.022236521490255 0.053115326678272
0.025718211692858 -0.021851068611945 0.052900743599253
0.018822613684256 -0.017640832397737 0.053477233683584
0.001265238935170 -0.014605865655006 0.054779393946645
-0.002107977503571 -0.013177636864845 0.053184192454336
-0.010586571645200 -0.011564411260400 0.053015281474111
-0.018738004267623 -0.007262070450994 0.053496172511098
-0.025334688038795 -0.007890424050790 0.052980724767363
-0.030932950874174 -0.003588860084178 0.053588411763825
-0.039614120450579 -0.003308193272252 0.053192158178009
-0.047547259585768 -0.002504286723670 0.052812838351246
0.132293284416418 -0.057580060166138 0.054202464377401
0.124310983864455 -0.055834914061583 0.053039825236317
0.118064956380699 -0.052964342208800 0.054809078830853
0.110256697652973 -0.051007011425394 0.054573824043589
0.102130010803724 -0.048098089392006 0.052239341532704
0.095117929818179 -0.047652133495388 0.052801602420544
0.089605982992755 -0.046124465890930 0.051348815476415
0.081217802885308 -0.042711668596264 0.052353236472127
0.073789052299435 -0.042334210354371 0.053032833849903
0.066488890434002 -0.041317342653006 0.051182460200307
0.059529533225958 -0.037335428500094 0.052412795272416
0.051722569709953 -0.034909166746392 0.053565153872487
0.043315436399108 -0.035108438763274 0.051834603424387
0.039243805377688 -0.031821747328822 0.051714384420801
0.029720296853370 -0.030211598221830 0.051903095042226
0.022279065824454 -0.028096423003329 0.054241339889114
0.015016871811333 -0.025421078900043 0.052847067221093
0.009130699245354 -0.024275820492804 0.055691502844808
0.000316715783460 -0.021914044916197 0.053021857630727
-0.004162636429170 -0.019184600066529 0.053835353648183
-0.012785644870422 -0.018606693553307 0.052869172846791
-0.020280438684968 -0.017030879390725 0.053549475275990
-0.026250972653604 -0.016339650750123 0.052739214217183
-0.035005331655628 -0.012450693493558 0.051829232584951
-0.041789272691342 -0.009916083987437 0.052089869868276
-0.047274782560665 -0.008777959050607 0.051971701609609
-0.055472972138707 -0.008368932006391 0.050627550303456
-0.063552971702712 -0.004960039160008 0.053032464924663
-0.069729080219872 -0.002972505181983 0.053742705550736
0.129479404992461 -0.065845067808604 0.051801663672444
0.123350037790612 -0.064720599659934 0.051522090708730
0.113463094454652 -0.058188357241991 0.053561384951589
0.109106538112844 -0.057981230035635 0.053104358469960
0.100523746749273 -0.057189402262252 0.052989422912914
0.096039897726707 -0.052937735650664 0.051882409846304
0.084053723036161 -0.052866505520624 0.052192049777028
0.080487208976277 -0.049763724446623 0.053200156008718
0.072454351714767 -0.050344814133841 0.051615099567547
0.067347719292064 -0.046825857154209 0.052881360804555
0.057188600790821 -0.045543612696751 0.052078115641592
0.041060406101060 -0.044233678186879 0.050656236445424
0.036227258424760 -0.040807679848572 0.051817806040759
0.020797644171459 -0.035867424313128 0.052132597243306
0.013259441441556 -0.033572615869345 0.051930388565379
0.006899493514379 -0.030969177877811 0.052780852432566
-0.002286800888817 -0.031945747910747 0.050684504305835
-0.006529682208746 -0.030684264071441 0.051106104647633
-0.014938391572585 -0.028101061804316 0.050580102717398
-0.023437258839545 -0.023282618785644 0.052277451629953
-0.031187032977381 -0.022884352809475 0.051517356192586
-0.038883570538778 -0.019037467288845 0.052588562444366
-0.042967844640068 -0.017545803792525 0.052811562811848
-0.047847232649300 -0.017690567926476 0.052119212901114
-0.056904253361113 -0.014045224454547 0.053003387248036
-0.066148350109956 -0.012481725443010 0.052832920961241
-0.072110569369080 -0.010860773957360 0.051942694460866
-0.079077721053364 -0.007018107132989 0.052817051820617
-0.086774726916903 -0.006186232091092 0.052372936427113
0.128839893637093 -0.069310405294443 0.050303782577830
0.124764002764230 -0.068691595695434 0.049435800349234
0.100249763484671 -0.062875217927241 0.049724277293202
0.093537123891718 -0.060870830648609 0.050157928263663
0.077232581103321 -0.054597800671395 0.050253419672963
0.066432322993037 -0.051625021304892 0.049591439997670
0.050446802639171 -0.047327054363005 0.050106040751456
0.026143289573146 -0.041242100189334 0.050061034953115
0.010808777043152 -0.036765221610842 0.050285671030996
0.005113435033183 -0.036155136095459 0.049734769618031
-0.008091582790412 -0.033043003747303 0.049472490107534
-0.026690152490679 -0.028060543027638 0.049473012721059
-0.033021603264494 -0.024983499163347 0.050303151881214
-0.059969669238955 -0.018650455091660 0.050844079768176
-0.075847860377111 -0.013488776176196 0.050699108874318
-0.081732639629680 -0.011758533272779 0.050676973139759
-0.088045138409552 -0.011899057876105 0.050397029673573
0.143466714049345 -0.025245677462421 0.057784520899770
0.125785332024253 -0.018338165399226 0.057345459417024
0.119469549743567 -0.017875921109712 0.057860584055898
0.110464810417117 -0.011492359261793 0.057221652781483
0.102250017099416 -0.013434844277704 0.057394605433463
0.082012735860506 -0.007804770921302 0.057350312983511
0.062122030323585 -0.002980072877317 0.057472988879203
0.140366254865341 -0.028372821294181 0.058647088419911
0.131067803354454 -0.025377218190166 0.058943837916372
0.128625233906446 -0.025256345757260 0.058357515131949
0.114212040467095 -0.022725339374511 0.059371166026111
0.111321338908923 -0.017719187940200 0.058764982020375
0.101360068714134 -0.016129834339707 0.058031146800037
0.098777418944094 -0.016732668903927 0.058251443659780
0.072866804042724 -0.011564013688341 0.058534024989126
0.066772000987720 -0.008543302305932 0.058241084849354
0.058915820986697 -0.009192073118876 0.058712334747629
0.052129016749095 -0.002658110675269 0.057968428408620
0.043997170744814 -0.001797295863466 0.058195803121247
0.039243656325125 -0.001384724895009 0.058365221774099
0.130293361216597 -0.032969236942451 0.059572772988529
0.123049656591144 -0.030355182885138 0.059151625430104
0.115244250896249 -0.029943021490073 0.059626841341970
0.109509642538341 -0.024344697523777 0.059818067347525
0.101216682932297 -0.026607201707416 0.058920480048176
0.094952572353414 -0.023346757473910 0.059024839198110
0.076828762505742 -0.021431530863807 0.059173606669422
0.072567017029525 -0.017273245616580 0.059077013575550
0.063911089136791 -0.013151262519316 0.058968772685049
0.059391873344464 -0.011985332326665 0.058968030726429
0.050370961234397 -0.015723226628124 0.059169229304310
0.044788369316127 -0.010837452748246 0.059076003825185
0.038995151847070 -0.005571212609801 0.058895170008658
0.030280509965868 -0.006487040103561 0.058516242777821
0.021553976306640 -0.004698510174717 0.058707482770600
0.008971903043572 -0.001111302765200 0.059105896746634
0.134188967982003 -0.045081844524293 0.059132062073069
0.129223325416599 -0.040389521556361 0.059461451645213
0.121297777571068 -0.038115784270675 0.059244183814047
0.113680322854794 -0.036393288554461 0.059284426486014
0.106318486899702 -0.037600322965041 0.059607665812488
0.100089294006562 -0.033076407029082 0.058580005987573
0.094812063870770 -0.029791211103811 0.059081731593129
0.076661886359531 -0.026894640836800 0.058902570521352
0.070351993410688 -0.024757464114227 0.058969681536672
0.061167133174664 -0.023712563143217 0.058867414271351
0.050128461936637 -0.021527678693150 0.058769208704946
0.040579678587096 -0.016262358310236 0.058994613444326
0.032573140693550 -0.015209327048973 0.058919846649485
0.027985939354522 -0.012784247333949 0.058532691275594
0.019194733432852 -0.009534916291623 0.058873295580862
0.013430269992726 -0.010872222374544 0.058869003092762
0.003511873667123 -0.006639186803610 0.058508736407279
-0.000031728355990 -0.006638263413639 0.058876203333852
-0.010529475465461 -0.004684676413010 0.058825437978423
-0.015356242680386 -0.002462396606259 0.058940580800689
0.134585767178781 -0.052694255860565 0.057931185837108
0.127003551665367 -0.047957560761027 0.057906027590749
0.116727481616430 -0.046532481468997 0.057870028292653
0.111942414351697 -0.044057416774654 0.058295109545704
0.104851158040117 -0.040096625377800 0.059197000300405
0.097291199609398 -0.040497958926251 0.058146745478628
0.089730031171729 -0.041945197063589 0.056956756388662
0.081797736555141 -0.034438128810227 0.058158764953928
0.074603675907574 -0.037887552832605 0.056961013590808
0.067841447636816 -0.033599651097732 0.057565055644034
0.059368239547901 -0.032977716727693 0.057180944239614
0.053775764317177 -0.028005886140893 0.057972278391834
0.045440351200341 -0.026285170460368 0.057820277964588
0.030784862402850 -0.024176717467415 0.057449097748118
0.029367628417026 -0.018290157475717 0.058504200732229
0.017576693539236 -0.017644667073953 0.057702564036367
0.011998213276572 -0.016418594203657 0.057975618159293
0.003379112136369 -0.013299039732844 0.058181676661488
-0.002867452893109 -0.013892471852111 0.057709593569753
-0.011525296808011 -0.012093786198756 0.057626651560782
-0.015241032173119 -0.009549793191300 0.057965743815420
-0.026954091346386 -0.006851921129133 0.057833319142974
-0.032476291632589 -0.004022888146231 0.058074904556589
-0.037687803248659 -0.006321042285406 0.057343801295279
0.105879226175613 -0.047982992949517 0.057453662669178
0.023305272796868 -0.024436897113459 0.056882915293692
-0.030530410639876 -0.010092550164201 0.056876180445667
-0.062413555570599 -0.002481640194974 0.057579965388297
