[
    {
        "title": "Прогулянка лісами",
        "price": "250",
        "img": "./img/bryson.jpg",
        "id": "1001201",
        "color": "white",
        "isSelected": "false"
    },

    {
        "title": "Тисячоликий герой",
        "price": "380",
        "img": "./img/cempbell.jpg",
        "id": "1001202",
        "color": "colorful",
        "isSelected": "false"
    },

    {
        "title": "Щиголь",
        "price": "410",
        "img": "./img/tartt.jpg",
        "id": "1001203",
        "color": "lightgrey",
        "isSelected": "false"
    },

    {
        "title": "Книга кладовища",
        "price": "220",
        "img": "./img/gaiman.jpg",
        "id": "1001204",
        "color": "blue",
        "isSelected": "false"
    },

    {
        "title": "Людина розумна",
        "price": "250",
        "img": "./img/harari.jpg",
        "id": "1001205",
        "color": "white",
        "isSelected": "false"
    },

    {
        "title": "11.22.63",
        "price": "250",
        "img": "./img/king.jpg",
        "id": "1001206",
        "color": "black",
        "isSelected": "false"
    },

    {
        "title": "Століття змін",
        "price": "250",
        "img": "./img/mortimer2.jpg",
        "id": "1001207",
        "color": "white",
        "isSelected": "false"
    },

    {
        "title": "Пробудження",
        "price": "250",
        "img": "./img/saks2.jpg",
        "id": "1001208",
        "color": "colorful",
        "isSelected": "false"
    },

    {
        "title": "Телеграф-авеню",
        "price": "250",
        "img": "./img/shebon.jpg",
        "id": "1001209",
        "color": "blue",
        "isSelected": "false"
    },

    {
        "title": "Любов та педагогіка",
        "price": "250",
        "img": "./img/unamuno.jpg",
        "id": "10012001",
        "color": "yellow",
        "isSelected": "false"
    },

    {
        "title": "Хроніки Амбера т1",
        "price": "250",
        "img": "./img/zeliazny1.jpg",
        "id": "10012002",
        "color": "green",
        "isSelected": "false"
    },

    {
        "title": "Хроніки Амбера т2",
        "price": "250",
        "img": "./img/zeliazny2.jpg",
        "id": "10012003",
        "color": "brown",
        "isSelected": "false"
    }
]