<?xml version="1.0" encoding="utf-8"?>
<!-- Generator: Adobe Illustrator 16.2.1, SVG Export Plug-In . SVG Version: 6.00 Build 0)  -->
<!DOCTYPE svg PUBLIC "-//W3C//DTD SVG 1.1//EN" "http://www.w3.org/Graphics/SVG/1.1/DTD/svg11.dtd">
<svg version="1.1" id="Layer_1" xmlns="http://www.w3.org/2000/svg" xmlns:xlink="http://www.w3.org/1999/xlink" x="0px" y="0px"
	 width="512px" height="512px" viewBox="0 0 512 512" style="enable-background:new 0 0 512 512;" xml:space="preserve">
<path fill="#19E619" d="M413.1,327.3l-1.8-2.1l-136-156.5c-4.6-5.3-11.5-8.6-19.2-8.6c-7.7,0-14.6,3.4-19.2,8.6L101,324.9l-2.3,2.6
	C97,330,96,333,96,336.2c0,8.7,7.4,15.8,16.6,15.8v0h286.8v0c9.2,0,16.6-7.1,16.6-15.8C416,332.9,414.9,329.8,413.1,327.3z"/>
</svg>
