{
  "project_info": {
    "project_number": "458309242910",
    "project_id": "planner-392009",
    "storage_bucket": "planner-392009.appspot.com"
  },
  "client": [
    {
      "client_info": {
        "mobilesdk_app_id": "1:458309242910:android:e8deeee52b59b7eba49e0f",
        "android_client_info": {
          "package_name": "com.example.planner"
        }
      },
      "oauth_client": [
        {
          "client_id": "458309242910-9rp4ntdehaol9cjc3jlfguaf1s8im5sl.apps.googleusercontent.com",
          "client_type": 3
        }
      ],
      "api_key": [
        {
          "current_key": "AIzaSyA6zn4U2bE5Mc6fNBoxiHK_DtnY77uRXR4"
        }
      ],
      "services": {
        "appinvite_service": {
          "other_platform_oauth_client": [
            {
              "client_id": "458309242910-9rp4ntdehaol9cjc3jlfguaf1s8im5sl.apps.googleusercontent.com",
              "client_type": 3
            },
            {
              "client_id": "458309242910-3f1gm9p4qupgunjv2f5ulg16cjj1bnt9.apps.googleusercontent.com",
              "client_type": 2,
              "ios_info": {
                "bundle_id": "com.tortykh.planner"
              }
            }
          ]
        }
      }
    }
  ],
  "configuration_version": "1"
}