{
    "pointx":{
        "schema_datatypes_folder_path": "src/schemas/column-datatypes",
        "schema_description_folder_path": "src/schemas/column-descriptions"
    },
    "coffee_shop": {
        "schema_datatypes_folder_path": "src/schemas/coffeeshop-datatypes",
        "schema_description_folder_path": "src/schemas/coffeeshop-descriptions"
    },
    "pointx_test":{
        "schema_datatypes_folder_path": "src/schemas/test-datatypes",
        "schema_description_folder_path": "src/schemas/test-descriptions"
    }
}