{
    "schema": [
      {
        "domain": "pointx",
        "sample_qry": [
          "How many unique transaction dates have occurred?",
          "Which day has the most total transactions?"
        ]
      },
      {
        "domain": "coffee_shop",
        "sample_qry": [
          "Which day has the most total sale?",
          "Show me shop and their address",
          "Top 5 shops address are the oldest"
        ]
      },
      {
        "domain": "pointx_test",
        "sample_qry": [
          "How many unique transaction dates have occurred?",
          "Which day has the most total transactions?"
        ]
      }
    ]
}