<svg width="34" height="34" viewBox="0 0 34 34" fill="none" xmlns="http://www.w3.org/2000/svg">
<path d="M7.08334 9.9165H26.9167" stroke="white" stroke-width="2" stroke-linecap="round"/>
<path d="M7.08334 17H21.25" stroke="white" stroke-width="2" stroke-linecap="round"/>
<path d="M7.08334 24.0835H15.5833" stroke="white" stroke-width="2" stroke-linecap="round"/>
</svg>
