<svg width="36" height="36" viewBox="0 0 36 36" fill="none" xmlns="http://www.w3.org/2000/svg">
<ellipse cx="16.5" cy="16.5" rx="10.5" ry="10.5" stroke="#CCD2E3" stroke-width="2"/>
<path d="M30 30L25.5 25.5" stroke="#CCD2E3" stroke-width="2" stroke-linecap="round"/>
</svg>
