{
    "/api/*": {
        "target": {
            "host": "localhost",
            "protocol": "http",
            "port": "7094"
        },
        "secure": "false",
        "changeOrigin": "true",
        "logLevel": "debug"
    },
    "/static/*": {
      "target": {
        "host": "localhost",
        "protocol": "http",
        "port": "7094"
      },
      "secure": false,
      "changeOrigin": true,
      "logLevel": "debug"
    }
}
