Ernst-the-Bicycling-Wizard,CSE331
Ernst-the-Bicycling-Wizard,CSE403
Notkin-of-the-Superhuman-Beard,CSE331
Notkin-of-the-Superhuman-Beard,CSE403
Perkins-the-Magical-Singing-Instructor,CSE331
Perkins-the-Magical-Singing-Instructor,CSE401
Grossman-the-Youngest-of-them-all,CSE331
Grossman-the-Youngest-of-them-all,CSE332
Grossman-the-Youngest-of-them-all,CSE341
Michael,CSE3