%YAML 1.1
%TAG !u! tag:unity3d.com,2011:
--- !u!78 &1
TagManager:
  serializedVersion: 2
  tags:
  - Obstacle
  - GameBoundary
  - SpeedBooster
  - JumpPowerUp
  - SteerBooster
  - SteerDowngrade
  - InvinciblePowerUp
  - MusicPlayer
  - PowerUpSound
  - LevelManager
  - PauseMenu
  - PowerDownSound
  - GearChangeSound
  layers:
  - Default
  - TransparentFX
  - Ignore Raycast
  - 
  - Water
  - UI
  - 
  - 
  - 
  - 
  - 
  - 
  - 
  - 
  - 
  - 
  - 
  - 
  - 
  - 
  - 
  - 
  - 
  - 
  - 
  - 
  - 
  - 
  - 
  - 
  - 
  - 
  m_SortingLayers:
  - name: Default
    uniqueID: 0
    locked: 0
