,cnpj,raiz_cnpj,matriz_filial,razao_social,opcao_pelo_simples,capital_social
0,358376000172,358376,MATRIZ,SARTOR ASSESSORIA E COMERCIO DE INFORMATICA LTDA,SIM,0
1,563375000160,563375,MATRIZ,INDEXX INFORMATICA LTDA,SIM,0
2,586312000129,586312,MATRIZ,DATAMICRO SISTEMAS LTDA,SIM,0
3,587384000190,587384,MATRIZ,INOVATIVA INFORMATICA LTDA,SIM,0
4,841331000154,841331,MATRIZ,SOFTNEW SISTEMAS E CONSULTORIA EM INFORMATICA LTDA,SIM,15000
5,1413885000113,1413885,MATRIZ,SIX TECH DESENVOLVIMENTO SISTEMAS DE INFORMATICA LTDA,SIM,0
6,1493662000103,1493662,MATRIZ,TRIPLICE CONSULTORIA E SERVICOS LTDA,SIM,50000
7,2314840000154,2314840,MATRIZ,UNIDAC CONSULTORIA EM TECNOLOGIA DA INFORMACAO LTDA,SIM,100000
8,2318794000161,2318794,MATRIZ,EVERTON RAMOS DE MORAES EIRELI,SIM,105000
9,2437196000101,2437196,MATRIZ,"LUMINA - INFORMATICA, CONSULTORIA E SERVICOS LTDA",SIM,20000
10,2622879000139,2622879,MATRIZ,C R NET LTDA,SIM,60000
11,3441246000197,3441246,MATRIZ,GOLDEN IT LTDA,SIM,0
12,3456658000109,3456658,MATRIZ,PLANETAWEB INFORMATICA LTDA,SIM,50000
13,3706036000183,3706036,MATRIZ,QUALIDIG LTDA,SIM,1000
14,3801285000158,3801285,MATRIZ,CG SISTEMAS E SERVICOS DE INFORMATICA LTDA,SIM,1000
15,4055839000188,4055839,MATRIZ,TEROS INFORMATICA LTDA,SIM,10000
16,4246459000120,4246459,MATRIZ,BOEIRA TECNOLOGIA DA INFORMACAO LTDA,SIM,0
17,4340744000106,4340744,MATRIZ,TECHNORIVER INFORMATICA LTDA,SIM,10000
18,4410157000146,4410157,MATRIZ,PROSOFTIN CONSULTORIA E SISTEMAS LTDA,SIM,0
19,4516228000190,4516228,MATRIZ,AQUI VANTAGENS.COM ADMINISTRACAO CARTOES DE DESCONTO E TELECOMUNICACOES LTDA,SIM,0
20,5023602000188,5023602,MATRIZ,ASSERTIVA TECH CONSULTORIA EM TI LTDA,SIM,8000
21,5028586000116,5028586,MATRIZ,GLOBAL CASE CONSULTORIA E ASSESSORIA LTDA,SIM,0
22,5042138000177,5042138,MATRIZ,TECJUMP TECNOLOGIA EM INFORMATICA LTDA,SIM,0
23,5339050000111,5339050,MATRIZ,PORTO'S INFORMATICA LTDA,SIM,3000
24,5357530000105,5357530,MATRIZ,GLOBALWIDE TECNOLOGIA E INFORMATICA LTDA,SIM,10000
25,5422311000162,5422311,MATRIZ,KAIZENDO SOLUCOES E SISTEMAS PARA MELHORIA LTDA,SIM,240000
26,5448669000164,5448669,MATRIZ,MAURICIO RIBEIRO INFORMATICA LTDA,SIM,100000
27,5975597000103,5975597,MATRIZ,HLEBANIA & CIA. LTDA,SIM,0
28,5996262000171,5996262,MATRIZ,MASTER&PRO CONSULTORIA E DESENVOLVIMENTO DE PROGRAMAS LTDA,SIM,10000
29,6015379000190,6015379,MATRIZ,FIAPO LABS TECNOLOGIA DA INFORMACAO LTDA,SIM,10000
30,6153856000183,6153856,MATRIZ,ISOLVE - SOLUCOES EM INFORMATICA LTDA,SIM,15000
31,6277224000121,6277224,MATRIZ,EQUIPE DIGITAL TECNOLOGIA LTDA,SIM,70000
32,6290671000110,6290671,MATRIZ,AMBIENTE LIVRE ASSESSORIA EM SISTEMAS DE INFORMATICA LTDA,SIM,120000
33,6867750000141,6867750,MATRIZ,ITECNOLOGYS CONSULTORIA EM SISTEMAS LTDA,SIM,300000
34,6913250000107,6913250,MATRIZ,A. D. TURRI TECNOLOGIA,SIM,12000
35,7731452000192,7731452,MATRIZ,TYTANIO TECNOLOGIA - EIRELI,SIM,110000
36,7854026000146,7854026,MATRIZ,CENTRUM PROCESSAMENTO DE DADOS LTDA,SIM,2000
37,7896865000127,7896865,MATRIZ,DANIEL HENRIQUE ALVES,SIM,30000
38,8150225000136,8150225,MATRIZ,VELITI SOLUCOES LTDA,SIM,25000
39,8637105000168,8637105,MATRIZ,VILLEROY CONSULTORIA E SERVICOS DE INFORMATICA LTDA.,SIM,5000
40,8640367000181,8640367,MATRIZ,DICE INFORMATICA LTDA,SIM,9000
41,8671358000158,8671358,MATRIZ,DIGITAL UP - TECNOLOGIA EM SISTEMAS LTDA,SIM,500000
42,9044119000130,9044119,MATRIZ,AVA TECNOLOGIA LTDA,SIM,100000
43,9200383000116,9200383,MATRIZ,SOUZA CONSULTORIA EM SOFTWARE LTDA,SIM,3000
44,9254750000164,9254750,MATRIZ,EASYBYTE INFORMATICA LTDA.,SIM,30000
45,9336130000174,9336130,MATRIZ,ENGELBERT & CIA. LTDA.,SIM,5000
46,9416343000106,9416343,MATRIZ,L. F. KASPRIK TECNOLOGIA DA INFORMACAO EIRELI,SIM,100000
47,10145201000130,10145201,MATRIZ,VASCO ALVES CONSULTORIA EM INFORMATICA LTDA,SIM,5000
48,10241629000187,10241629,MATRIZ,HABITAO EIRELI,SIM,93700
49,10320392000120,10320392,MATRIZ,ATM SOLUCOES EM TECNOLOGIA LTDA,SIM,10000
50,10472415000111,10472415,MATRIZ,BESTSOFT HARDWARE E LICENCIAMENTO DE SOFTWARE LTDA,SIM,10000
51,10524406000127,10524406,MATRIZ,FLAVIO STEFFENS DE CASTRO,SIM,5000
52,10655518000117,10655518,MATRIZ,ZIESEMER & CIA LTDA,SIM,10000
53,10702854000173,10702854,MATRIZ,UPRIME SOFTWARE LTDA,SIM,5000
54,10732355000129,10732355,MATRIZ,PETRIKOR DESIGN GRAFICO LTDA,SIM,30000
55,10780049000168,10780049,MATRIZ,SOLID CONSULTORIA E PROJETOS LTDA.,SIM,1000
56,10803704000156,10803704,MATRIZ,J. MARCHI ASSESSORIA EM ENGENHARIA E INFORMATICA LTDA,SIM,10000
57,10882234000163,10882234,MATRIZ,ELITE TRADER ASSESSORIA E CONSULTORIA EMPRESARIAL LTDA,SIM,15000
58,11023375000193,11023375,MATRIZ,BUSINESS SOLUTION SISTEMAS DE INFORMATICA LTDA,SIM,2000
59,11030542000123,11030542,MATRIZ,SANTOS & CARLESSO LTDA,SIM,30000
60,11036060000180,11036060,MATRIZ,H. F. CABRAL - EIRELI,SIM,100000
61,11038137000151,11038137,MATRIZ,GODZ GOVERNANCA E CONSULTORIA EMPRESARIAL LTDA,SIM,84400
62,11048655000156,11048655,MATRIZ,INTELLIGENT MARITIME SOLUTIONS CONSULTORIA LTDA,SIM,1000
63,11209861000109,11209861,MATRIZ,GEOINFORMATION TECNOLOGIA LTDA,SIM,5000
64,11247373000188,11247373,MATRIZ,ARROBAINFO SOLUCOES EM INFORMATICA LTDA,SIM,30000
65,11381069000129,11381069,MATRIZ,JOAO ANTUNES RIBEIRO JUNIOR,SIM,10000
66,11527712000180,11527712,MATRIZ,INFOPOR INFORMATICA LTDA,SIM,4000
67,11589018000197,11589018,MATRIZ,INTENTO LTDA,SIM,2000
68,11738958000109,11738958,MATRIZ,DANIEL APARECIDO DE TOLEDO VIANA,SIM,10000
69,12794444000125,12794444,MATRIZ,HAG CONSULTORIA EM INFORMATICA LTDA,SIM,3000
70,12957904000199,12957904,MATRIZ,ZERO OU UM NEGOCIOS DIGITAIS LTDA,SIM,40000
71,13178989000170,13178989,MATRIZ,MULTI CONSULTORIA E TECNOLOGIA EIRELI,SIM,88000
72,13292648000120,13292648,MATRIZ,INCITE TECNOLOGIA DA INFORMACAO LTDA,SIM,30000
73,13612744000109,13612744,MATRIZ,PLIGG CONSULTORIA EM TECNOLOGIA DA INFORMACAO LTDA.,SIM,1000000
74,13963659000195,13963659,MATRIZ,GALAXIA NASCENTE CONSULTORIA LTDA,SIM,10000
75,13994051000128,13994051,MATRIZ,GOLIVE CONSULTORIA LTDA,SIM,13500
76,14056643000161,14056643,MATRIZ,"CUNHA E MIRANDA ESTRATEGIA, GESTAO E TECNOLOGIA DA INFORMACAO LTDA",SIM,2000
77,14136101000107,14136101,MATRIZ,SONNUS ASSESSORIA E CONSULTORIA EM INFORMATICA LTDA,SIM,3000
78,14220191000101,14220191,MATRIZ,NEURON CONSULTORIA LTDA,SIM,60000
79,14470857000180,14470857,MATRIZ,LERMEN SYSTEMS LTDA,SIM,10000
80,14731086000137,14731086,MATRIZ,C E L B TECNOLOGIA DA INFORMACAO LTDA,SIM,2000
81,14808197000102,14808197,MATRIZ,MURATA TECNOLOGIA DA INFORMACAO LTDA,SIM,20000
82,14816976000141,14816976,MATRIZ,JOBYLWARE SISTEMAS LTDA,SIM,10000
83,14822675000120,14822675,MATRIZ,SERVERDO SERVICOS DE INFORMATICA LTDA,SIM,1000
84,14911562000100,14911562,MATRIZ,PRATICA CERTIFICACAO DIGITAL LTDA.,SIM,300000
85,15005247000178,15005247,MATRIZ,RAFAEL FELIPE CAMARGO,SIM,5000
86,15399960000143,15399960,MATRIZ,IST INFORMATICA LTDA,SIM,5000
87,16890793000100,16890793,MATRIZ,GOLLTD TECNOLOGIA DA INFORMACAO LTDA,SIM,1200
88,17011419000141,17011419,MATRIZ,UHLIG & KOROVSKY TECNOLOGIA LTDA.,SIM,65000
89,17283617000164,17283617,MATRIZ,VENERA - SOLUCOES CORPORATIVAS LTDA,SIM,1000
90,17437312000160,17437312,MATRIZ,HGSOFT TECNOLOGIA EIRELI,SIM,104500
91,17915726000157,17915726,MATRIZ,SMARTI CONSULTORIA E SERVICOS DE TI LTDA,SIM,12000
92,17949442000181,17949442,MATRIZ,MALGUEIRO SERVICOS EM TECNOLOGIA DA INFORMACAO LTDA,SIM,10000
93,18173795000103,18173795,MATRIZ,TEXVN INFORMATICA - EIRELI,SIM,70000
94,18796297000109,18796297,MATRIZ,PLANO B CONSULTORIA LTDA,SIM,10000
95,18843171000148,18843171,MATRIZ,BTI ESTRATEGICA CONSULTORIA EM TI LTDA,SIM,10000
96,19122334000166,19122334,MATRIZ,MIDIA CLASS EDITORA LTDA,SIM,10000
97,19301105000109,19301105,MATRIZ,IMPLEMENTTI TECNOLOGIA EIRELI,SIM,95400
98,19440549000125,19440549,MATRIZ,CTX CONSULTORIA LTDA.,SIM,200000
99,19716266000163,19716266,MATRIZ,AQL CONSULTORIA EMPRESARIAL E TECNOLOGIA DA INFORMACAO LTDA,SIM,30000
100,19967832000100,19967832,MATRIZ,WORK OUT CONSULTORIA EM TECNOLOGIA DA INFORMACAO LTDA,SIM,10000
101,20013675000182,20013675,MATRIZ,KEPHA MENTORIA DE PROJETOS TECNOLOGICOS LTDA,SIM,200000
102,20093970000196,20093970,MATRIZ,PLICPLAC DESENVOLVIMENTO WEB LTDA.,SIM,10000
103,21295146000181,21295146,MATRIZ,FLM TECNOLOGIA EIRELI,SIM,100000
104,21388085000105,21388085,MATRIZ,FELICIO CONSULTORIA EIRELI,SIM,98000
105,21491167000172,21491167,MATRIZ,INCA CONSULTORIA DESENVOLVIMENTO E INDUSTRIALIZACAO DE TECNOLOGIAS INOVADORAS EIRELI,SIM,80000
106,21728376000197,21728376,MATRIZ,CSX SOLUCOES LTDA,SIM,30000
107,21884232000120,21884232,MATRIZ,NIMBUS NETWORK TECNOLOGIA DA INFORMACAO LTDA,SIM,30000
108,21916782000183,21916782,MATRIZ,DAYBACK ENERGIA ESTRATEGICA LTDA,SIM,50000
109,21969334000148,21969334,MATRIZ,TRIVIO TECNOLOGIA LTDA,SIM,129000
110,22007582000170,22007582,MATRIZ,ABSOFT SOLUCOES INTELIGENTES LTDA,SIM,10000
111,22370057000115,22370057,MATRIZ,DWU SOLUCOES EM TECNOLOGIA DA INFORMACAO LTDA,SIM,42000
112,22459999000174,22459999,MATRIZ,PUBLIC & PRIVATE TECNOLOGIA E SERVICOS DE INFORMACAO LTDA,SIM,5000
113,22981457000167,22981457,MATRIZ,IDEATOS SOLUCOES EM TECNOLOGIA EIRELI,SIM,99800
114,23065417000138,23065417,MATRIZ,TRUBR TECHNOLOGY LTDA,SIM,10000
115,23068092000147,23068092,MATRIZ,MOURA & MOURA CONSULTORES LTDA,SIM,500
116,23201941000199,23201941,MATRIZ,DOUGLAS CAETANO JEREMIAS,SIM,10000
117,23244090000161,23244090,MATRIZ,THEKLA CONSULTORIA DE SISTEMAS EIRELI,SIM,80000
118,23316396000186,23316396,MATRIZ,BATTISTI & BATTISTI - CONSULTORIA EMPRESARIAL LTDA,SIM,20000
119,23450854000175,23450854,MATRIZ,WS TECH - SOLUCOES EM T I EIRELI,SIM,115000
120,23468855000147,23468855,MATRIZ,ALESSANDRO STEIN,SIM,1000
121,23507330000173,23507330,MATRIZ,DIEGO GAFFORELLI PERFEITO,SIM,10000
122,23720406000144,23720406,MATRIZ,AMEW CONSULTORIA LTDA,SIM,5000
123,23773859000139,23773859,MATRIZ,ATM 2 SOLUCOES EM TECNOLOGIA LTDA,SIM,10000
124,24153353000190,24153353,MATRIZ,SELFLESS PRODUTORA LTDA,SIM,100000
125,24232219000184,24232219,MATRIZ,UP CONTACT CENTER EIRELI,SIM,89000
126,24232254000101,24232254,MATRIZ,BERGHAHN DESENVOLVIMENTO DE NEGOCIOS LTDA,SIM,20000
127,24353595000127,24353595,MATRIZ,EXITUS EMPRESARIAL CONSULTORIA EIRELI,SIM,90000
128,24362619000104,24362619,MATRIZ,CCS NEGOCIOS & ASSESSORIA EIRELI,SIM,88000
129,24608207000101,24608207,MATRIZ,MULTIPLA ARQUITETURA E GERENCIAMENTO DE SERVICOS LTDA,SIM,25000
130,24642661000189,24642661,MATRIZ,4SOLVE SOFTWARES LTDA,SIM,20000
131,24688226000195,24688226,MATRIZ,MV TECH SOLUCOES TECNOLOGICAS LTDA,SIM,10000
132,24762992000152,24762992,MATRIZ,DECOSTORE INFORMACAO E TECNOLOGIA LTDA.,SIM,100000
133,24980717000105,24980717,MATRIZ,R. A. DE ARAUJO ANTONIAZZI GEOPROCESSAMENTO E TOPOGRAFIA,SIM,6000
134,25245543000108,25245543,MATRIZ,UNI ENTERPRISE SOLUCOES INTELIGENTES EIRELI,SIM,110000
135,25275641000180,25275641,MATRIZ,PRISMATECH ASSESSORIA EM SISTEMAS DE INFORMATICA EIRELI,SIM,90000
136,25285557000147,25285557,MATRIZ,ROBOTIMIZE LTDA,SIM,88000
137,25327802000131,25327802,MATRIZ,MEYER CONSULTORIA EM TI LTDA.,SIM,5000
138,25341444000111,25341444,MATRIZ,CORE SOLUTIONS - AUTOMACAO TECNOLOGICA LTDA,SIM,13000
139,25420887000106,25420887,MATRIZ,APAPELME CONSULTORIA EM INFORMATICA LTDA,SIM,5000
140,25533119000150,25533119,MATRIZ,WARP TECNOLOGIA LTDA,SIM,25000
141,26181064000120,26181064,MATRIZ,MAPA SA - CONSULTORIA E ANALISES SOCIOAMBIENTAIS LTDA,SIM,10000
142,26225132000105,26225132,MATRIZ,INTERANET SOLUCOES EM TI LTDA,SIM,500000
143,26263353000178,26263353,MATRIZ,BM SISTEMAS DE ANALISE DE DADOS EIRELI,SIM,93700
144,26294369000148,26294369,MATRIZ,WYTECH SERVICOS DE TECNOLOGIA LTDA,SIM,5000
145,26468924000100,26468924,MATRIZ,X4 AUTOMACOES LTDA,SIM,10000
146,26469808000106,26469808,MATRIZ,INLINE TECNOLOGIA EIRELI,SIM,95400
147,26683997000115,26683997,MATRIZ,WAGNER FERNANDES DOS SANTOS,SIM,2000
148,26686159000103,26686159,MATRIZ,AD SOLUCOES DIGITAIS LTDA,SIM,50000
149,26756002000107,26756002,MATRIZ,ROMARIO ROSA DE ALMEIDA GESTAO EM SAUDE EIRELI,SIM,88000
150,26771369000191,26771369,MATRIZ,DHARMA DIGITAL - CONSULTORIA E ASSESSORIA DE GESTAO COMERCIAL LTDA.,SIM,10000
151,26960108000110,26960108,MATRIZ,OPENCONNECT SISTEMAS DE INFORMACAO E TECNOLOGIA LTDA,SIM,10000
152,27090363000111,27090363,MATRIZ,ZERO TI TECNOLOGIA DA INFORMACAO LTDA,SIM,101010
153,27100089000114,27100089,MATRIZ,DDS CONSULTORIA EM TECNOLOGIA DA INFORMACAO EIRELI,SIM,93700
154,27106994000181,27106994,MATRIZ,ANDREIA APARECIDA DE OLIVEIRA CORDEIRO EIRELI,SIM,93700
155,27112738000105,27112738,MATRIZ,PRADO TECNOLOGIA LTDA,SIM,5000
156,27299019000137,27299019,MATRIZ,ITA INFRA ESTRUTURA DE TELECOM EIRELI,SIM,100000
157,27438836000129,27438836,MATRIZ,GROWTH OFFICE LTDA,SIM,1000
158,27456547000152,27456547,MATRIZ,SEO EXPERTS CONSULTORIA EM TECNOLOGIA DA INFORMATICA EIRELI,SIM,93700
159,27481416000125,27481416,MATRIZ,WLAN REDES SEM FIO SERVICOS EM TECNOLOGIA LTDA,SIM,15000
160,27649569000139,27649569,MATRIZ,H. DE PAULA SOUZA JUNIOR - CONSULTORIA EM INFORMATICA,SIM,10000
161,27702054000155,27702054,MATRIZ,VIBE IT SOLUCOES EM TECNOLOGIA LTDA,SIM,1000
162,27770937000100,27770937,MATRIZ,GO SYSTEM TECNOLOGIA LTDA,SIM,1000
163,27908845000136,27908845,MATRIZ,THIAGO ADOLFO PREIS,SIM,5000
164,27982288000101,27982288,MATRIZ,I. RAMOS & SANTOS CONSULTORIA E ASSESSORIA LTDA,SIM,10000
165,28031071000170,28031071,MATRIZ,DESENVINFO SOLUCOES EM TECNOLOGIA LTDA,SIM,1000
166,28082914000168,28082914,MATRIZ,RAVAGLIO E SAAB TECNOLOGIA E GESTAO LTDA,SIM,10000
167,28232830000163,28232830,MATRIZ,RODRIGO ARDIGO CONSULTORIA,SIM,10000
168,28241746000106,28241746,MATRIZ,WITCRED CONSULTORIA EIRELI,SIM,95000
169,28336299000179,28336299,MATRIZ,PROGRES TECNOLOGIA LTDA,SIM,10000
170,28340957000104,28340957,MATRIZ,SS CONSULTORIA LTDA,SIM,10000
171,28396501000158,28396501,MATRIZ,DYCK & SANTOS LTDA,SIM,7500
172,28517714000190,28517714,MATRIZ,WTIT GESTAO E CONSULTORIA DE INFORMATICA LTDA,SIM,10000
173,28946642000105,28946642,MATRIZ,MCC TECNOLOGIA DA INFORMACAO LTDA,SIM,2000
174,29030375000186,29030375,MATRIZ,INDICE INFORMATICA EIRELI,SIM,95000
175,29116537000101,29116537,MATRIZ,BEXPO TRANSFORMACAO E INOVACAO LTDA,SIM,12000
176,29152144000145,29152144,MATRIZ,DANIELA CUNHA LIMA,SIM,10000
177,29230277000192,29230277,MATRIZ,INFOTECH ASSISTENCIA E SUPORTE EM TI LTDA,SIM,6000
178,29309746000163,29309746,MATRIZ,GO4 TECNOLOGIA DA INFORMACAO LTDA,SIM,960000
179,29432024000100,29432024,MATRIZ,ITRK TECNOLOGIA DA INFORMACAO LTDA,SIM,60000
180,29472136000186,29472136,MATRIZ,IT+ GESTAO E TECNOLOGIA - EIRELI,SIM,93700
181,29488065000100,29488065,MATRIZ,RCFO IT CONSULTING LTDA,SIM,2000
182,29496699000104,29496699,MATRIZ,IBTI INSTITUTO BADAZ - TECNOLOGIA & INOVACAO LTDA,SIM,1000
183,29636554000161,29636554,MATRIZ,GILGRID APLICATIVOS LTDA,SIM,96000
184,29667108000114,29667108,MATRIZ,ALEXANDRE DE LIMA MACHADO CONSULTORIA,SIM,1000
185,29723917000104,29723917,MATRIZ,MARCOS FABIANO MENDES DE SIQUEIRA,SIM,10000
186,29751722000160,29751722,MATRIZ,JADER E AMANDA SISTEMAS DE TECNOLOGIA DA INFORMACAO LTDA,SIM,5000
187,29753819000101,29753819,MATRIZ,JLV ENGENHARIA TECNOLOGIA E SOFTWARE LTDA,SIM,50000
188,29766130000111,29766130,MATRIZ,ARSS TECNOLOGIA DA INFORMACAO LTDA,SIM,1000
189,29814528000186,29814528,MATRIZ,P2P BUSINESS SOLUTIONS - EIRELI,SIM,100000
190,29826123000168,29826123,MATRIZ,REINALDO FREITAS DE CRISTO,SIM,5000
191,29829507000134,29829507,MATRIZ,DIEGO ZAGONEL DE CAMARGO MELLO,SIM,1000
192,29832432000140,29832432,MATRIZ,RAISEHANDS SOLUCOES ONLINE LTDA,SIM,100000
193,29915283000183,29915283,MATRIZ,L&L ASSESSORIA E CONSULTORIA EMPRESARIAL LTDA,SIM,1000
194,29920323000185,29920323,MATRIZ,TOLFO & KRABBE INFORMATICA LTDA,SIM,12000
195,30025695000127,30025695,MATRIZ,IMEDIATUM TECNOLOGIA LTDA,SIM,100000
196,30033125000189,30033125,MATRIZ,HC CONSULTORIA EM TECNOLOGIA LTDA,SIM,10000
197,30043931000138,30043931,MATRIZ,TAX PAYMENTS TECNOLOGIA EM MEIOS DE PAGAMENTOS EIRELI,SIM,100000
198,30120829000199,30120829,MATRIZ,FULL NINE DIGITAL CONSULTORIA LTDA,SIM,1000
199,30280646000130,30280646,MATRIZ,ANGOS STUDIO LTDA,SIM,30000
200,30281605000169,30281605,MATRIZ,RALTEC TECNOLOGIA DA INFORMACAO LTDA,SIM,30000
201,30310764000144,30310764,MATRIZ,INTELPRICE SOLUCOES DE PRECIFICACAO LTDA,SIM,300000
202,30339718000178,30339718,MATRIZ,NEXTHOP SOLUTIONS - CONSULTORIA EM TECNOLOGIA DA INFORMACAO EIRELI,SIM,150000
203,30351627000158,30351627,MATRIZ,RAFAEL DA LUZ VAZ - COMERCIO E CONSULTORIA TECNOLOGIA EIRELI,SIM,95400
204,30517691000166,30517691,MATRIZ,LUCIANO JOHNSON CONSULTORIA EM TI,SIM,10000
205,30537374000101,30537374,MATRIZ,ASTACKS SERVICOS DE TECNOLOGIA LTDA,SIM,1000
206,30568793000100,30568793,MATRIZ,DAVI EMILIO BUSANELLO FERREIRA CONSULTORIA EM TECNOLOGIA,SIM,1000
207,30607379000163,30607379,MATRIZ,MENDEL E ZAMBERLAN CONSULTORIA EM DESENVOLVIMENTO DE SOFTWARE LTDA,SIM,1000
208,30677270000100,30677270,MATRIZ,PAULIN DESIGN E DESENVOLVIMENTO DE SISTEMAS INTERFACES E EXPERIENCIA DO USUARIO LTDA,SIM,1000
209,30750260000145,30750260,MATRIZ,ADVBOX CONSULTORIA E TECNOLOGIA LTDA,SIM,104000
210,30816395000166,30816395,MATRIZ,WA SOLUTIONS CONSULTORIA EIRELI,SIM,95400
211,30935151000100,30935151,MATRIZ,EVERTON SCHIPFER,SIM,1000
212,30974259000102,30974259,MATRIZ,THIAGO BELIZARIO DA SILVA JIMENEZ CONSULTORIA E SERVICOS DE TI,SIM,1000
213,30975075000159,30975075,MATRIZ,PEDRO ERNESTO THEOBALD PRA,SIM,10000
214,31041904000199,31041904,MATRIZ,WILLIAM DE SOUZA ANALIO CONSULTORIA EM TI,SIM,1000
215,31079657000110,31079657,MATRIZ,HI-LAW CONSULTORIA EM TECNOLOGIA DA INFORMACAO LTDA,SIM,10000
216,31111152000195,31111152,MATRIZ,LF TECNOLOGIA E GESTAO DE PESSOAS LTDA,SIM,500
217,31137926000157,31137926,MATRIZ,LAMARQUES E CIA LTDA,SIM,100000
218,31233387000150,31233387,MATRIZ,WORKX IT SOLUCOES E SERVICOS EM TECNOLOGIA DA INFORMACAO LTDA,SIM,20000
219,31452043000131,31452043,MATRIZ,INTELCOMP TECNOLOGIA & GESTAO DE TI LTDA,SIM,25000
220,31615060000142,31615060,MATRIZ,VALDEMIR FERNANDES DE RAMOS,SIM,1000
221,31625732000109,31625732,MATRIZ,HOMEX TECNOLOGIA LTDA,SIM,50000
222,31627865000106,31627865,MATRIZ,CGBHOME CONSULTORIA E ASSESSORIA EMPRESARIAL - EIRELI,SIM,100000
223,31721284000139,31721284,MATRIZ,JUTAY MARCELO FARIAS DE MEDEIROS - KISHRON,SIM,10000
224,31764349000123,31764349,MATRIZ,C. K. SOLANO,SIM,10000
225,31881132000101,31881132,MATRIZ,DIOGO ROMEO SOLUCOES EM TECNOLOGIA E INOVACAO,SIM,30000
226,31974922000123,31974922,MATRIZ,TCHE SOLUTIONS CONSULTORIA EM TECNOLOGIA LTDA,SIM,5000
227,32089832000112,32089832,MATRIZ,THIAGO DE OLIVEIRA FELIX CONSULTORIA EM TI,SIM,1000
228,32161647000191,32161647,MATRIZ,FOBONE TECNOLOGIA DA INFORMACAO LTDA,SIM,2000
229,32214357000169,32214357,MATRIZ,DATABZNESS CONSULTORIA EM TI LTDA,SIM,10000
230,32244389000107,32244389,MATRIZ,R. REOLON - CONSULTORIA EM GESTAO,SIM,10000
231,32333203000196,32333203,MATRIZ,ALESSANDRO CARDOZO BUENO,SIM,1000
232,32416966000109,32416966,MATRIZ,C S I DE ALMEIDA TECNOLOGIA DA INFORMACAO,SIM,250000
233,32477752000134,32477752,MATRIZ,RAFAEL PADILHA DA SILVA & CIA LTDA,SIM,5000
234,32509849000181,32509849,MATRIZ,THIAGO AZEVEDO DE BASSI COMERCIO DE EQUIPAMENTOS DE INFORMATICA,SIM,1000
235,32568380000151,32568380,MATRIZ,UB CONSULTORIA EMPRESARIAL EIRELI,SIM,100000
236,32844773000140,32844773,MATRIZ,RMS CONSULTORIA LTDA,SIM,1000
237,32901739000160,32901739,MATRIZ,TOPSOLUTION SOLUCOES EM TECNOLOGIA EIRELI,SIM,99800
238,33041999000176,33041999,MATRIZ,NETPROJ CONSULTORIA E ASSESSORIA PARA TRANSFORMACAO DIGITAL INTELIGENTE LTDA,SIM,90000
239,33067005000190,33067005,MATRIZ,DALMIR CONSULTORIA EM TECNOLOGIA DA INFORMACAO LTDA,SIM,1100000
240,33079420000164,33079420,MATRIZ,LESSEN TECH CONSULTORIA E MARKETING LTDA,SIM,50000
241,33301348000178,33301348,MATRIZ,LINKMESH TECNOLOGIA DA INFORMACAO LTDA,SIM,100000
242,33454191000110,33454191,MATRIZ,JUAN FRANCO XAVIER DA SILVA,SIM,1000
243,33468050000157,33468050,MATRIZ,PRIVACY TOOLS CONSULTORIA EM TECNOLOGIA LTDA,SIM,6000
244,33639035000124,33639035,MATRIZ,MARIO HENRIQUE ROCHA AZZOLINI & CIA LTDA,SIM,100000
245,33665328000186,33665328,MATRIZ,LUAN RODRIGO PINTO KOTZ TECNOLOGIA DA INFORMACAO,SIM,1000
246,33736420000190,33736420,MATRIZ,E.NEVES CONSULTORIA EM TECNOLOGIA DA INFORMACAO LTDA.,SIM,20000
247,33750232000116,33750232,MATRIZ,2MIT - PROJETOS E SERVICOS DE ENGENHARIA DE SOFTWARE E AUTOMACAO INDUSTRIAL IT & AT LTDA,SIM,20000
248,33759076000154,33759076,MATRIZ,LINCK TECHNOLOGY LTDA,SIM,1000
249,33808438000150,33808438,MATRIZ,METODO IT TREINAMENTOS E SERVICOS DE INFORMATICA LTDA,SIM,20000
250,33899321000129,33899321,MATRIZ,DOMINUS ASSESSORIA E CONSULTORIA EM TI LTDA,SIM,12000
251,34023303000141,34023303,MATRIZ,D R FABER CONSULTORIA E TECNOLOGIA DA INFORMACAO LTDA,SIM,30000
252,34026711000157,34026711,MATRIZ,FLOWDRIVE DESENVOLVIMENTO DE SOLUCOES PARA NEGOCIOS LTDA,SIM,99800
253,34093177000100,34093177,MATRIZ,PEDRO AUGUSTO D BRAZ TECNOOGIA DA INTFORMACAO,SIM,1000
254,34107090000136,34107090,MATRIZ,CUMERLATO DESENVOLVIMENTO DE SOFTWARE LTDA,SIM,1000
255,34121443000152,34121443,MATRIZ,COOGNICAO CONSULTORIA E TREINAMENTO LTDA,SIM,10000
256,34132808000144,34132808,MATRIZ,FLAVIO NONES PROCESSAMENTO DE DADOS EIRELI,SIM,100000
257,34269413000198,34269413,MATRIZ,ALFREDO SCHROEDER NETO CONSULTORIA EM TI,SIM,8000
258,34289648000141,34289648,MATRIZ,SAFE CLOUD CONSULTORIA EM TECNOLOGIA LTDA,SIM,120000
259,34553881000190,34553881,MATRIZ,M99 SISTEMAS E ENGENHARIA LTDA,SIM,49900
260,34554363000190,34554363,MATRIZ,ANELLO TECNOLOGIA LTDA,SIM,50000
261,34595403000142,34595403,MATRIZ,BUTIK INTELIGENCIA APLICADA LTDA,SIM,1000
262,34660346000138,34660346,MATRIZ,DATARUNK SOLUCOES EM TECNOLOGIA DA INFORMACAO LTDA,SIM,40000
263,34719768000131,34719768,MATRIZ,D-LOG TECNOLOGIA DA INFORMACAO EIRELI,SIM,110000
264,34758830000102,34758830,MATRIZ,DANILO CALVO ZENI - ZENI WEB CONSULTORIA EM TECNOLOGIA DA INFORMACAO,SIM,2000
265,34770395000123,34770395,MATRIZ,VFSOFT SOLUCOES EM TECNOLOGIA LTDA,SIM,5000
266,34829222000133,34829222,MATRIZ,SHERPA SOLUCOES EM SISTEMAS DE INFORMACAO LTDA,SIM,15000
267,34914613000156,34914613,MATRIZ,DJEISON ALBERTO KANITZ LTDA,SIM,40000
268,35054380000121,35054380,MATRIZ,OCTIS CONSULTORIA LTDA,SIM,9000
269,35063002000104,35063002,MATRIZ,D2SMART CONSULTORIA EM TECNOLOGIA LTDA,SIM,10000
270,35081130000180,35081130,MATRIZ,F11 TECNOLOGIA LTDA,SIM,1000
271,35118515000175,35118515,MATRIZ,PLYS SERVICOS DE TECNOLOGIA LTDA,SIM,15000
272,35143923000187,35143923,MATRIZ,HEIMDALL TECNOLOGIA DA INFORMACAO LTDA,SIM,2000
273,35259520000106,35259520,MATRIZ,JOINSAP CONSULTORIA LTDA,SIM,60000
274,35324257000183,35324257,MATRIZ,VANZETTO E CAMPOS CONSULTORIA EM SOFTWARE LTDA,SIM,58000
275,35333643000131,35333643,MATRIZ,GORDION CONSULTORIA EMPRESARIAL LTDA,SIM,3000
276,35362926000101,35362926,MATRIZ,ADAC TECNOLOGIA DE INFORMACAO LTDA,SIM,40000
277,35375291000187,35375291,MATRIZ,DARTHPOYO SERVICOS DE CONSULTORIA EM TECNOLOGIA DA INFORMACAO LTDA,SIM,1000
278,35417709000171,35417709,MATRIZ,BINSTORM CONSULTORIA EM TECNOLOGIA DA INFORMACAO LTDA,SIM,30000
279,35458529000138,35458529,MATRIZ,CST IT COMERCIO E SERVICOS LTDA,SIM,1000
280,35486795000174,35486795,MATRIZ,A2CORP CONSULTORIA E EVENTOS EIRELI,SIM,99800
281,35585732000175,35585732,MATRIZ,DEX IT SOLUCOES EM TECNOLOGIA DA INFORMACAO LTDA,SIM,30000
282,35587650000160,35587650,MATRIZ,MEXTECH CONSULTORIA TECNOLOGICA LTDA,SIM,10000
283,35679751000160,35679751,MATRIZ,ARTUR FELIPE WENDLING LTDA,SIM,20000
284,35749625000135,35749625,MATRIZ,CONCAT ALL - SERVICOS EM TECNOLOGIA DA INFORMACAO LTDA,SIM,10000
285,35829508000181,35829508,MATRIZ,INSTITUTO BRASILEIRO DE PROTECAO DE DADOS LTDA,SIM,3000
286,35898518000179,35898518,MATRIZ,SETTTLE TECNOLOGIA LTDA,SIM,1000
287,36005389000105,36005389,MATRIZ,VEIGA CONSULTORIA EM INFORMATICA LTDA,SIM,5000
288,36005539000180,36005539,MATRIZ,MAGNADATA PRESTACAO DE SERVICOS EM TECNOLOGIA DA INFORMACAO LTDA,SIM,10000
289,36058673000140,36058673,MATRIZ,JOAO GUILHERME CORREA HARGER,SIM,20000
290,36260526000158,36260526,MATRIZ,JOY SOLUCOES E TECNOLOGIA LTDA,SIM,50000
291,36348088000184,36348088,MATRIZ,REND - SERVICOS DE TECNOLOGIA DE INFORMACAO LTDA,SIM,10000
292,36353517000101,36353517,MATRIZ,ABRANTECK TI SOLUCOES EMPRESARIAIS LTDA,SIM,10000
293,36371866000156,36371866,MATRIZ,C RUIVO DA SLVA - TECNOLOGIA EM INFORMACAO E NEGOCIOS,SIM,5000
294,36381943000159,36381943,MATRIZ,AV ENGENHARIA E COMERCIO LTDA,SIM,5000
295,36421471000110,36421471,MATRIZ,MARCELO FRANTZ DESENVOLVIMENTO LTDA,SIM,1000
296,36474896000198,36474896,MATRIZ,JONAS TERTULIANO DOS SANTOS EIRELI,SIM,104500
297,36526329000138,36526329,MATRIZ,CXD CONSULTORIA E DESENVOLVIMENTO EM TECNOLOGIA DA INFORMACAO LTDA,SIM,10000
298,36568185000182,36568185,MATRIZ,MBL DESENVOLVIMENTO TECNOLOGICO LTDA,SIM,30000
299,36699438000157,36699438,MATRIZ,GIANO GESTAO DE RISCOS EM SEGURANCA DA INFORMACAO LTDA,SIM,1000
300,36716381000157,36716381,MATRIZ,NASTECH TECNOLOGIA DA INFORMACAO LTDA,SIM,5000
301,36718756000118,36718756,MATRIZ,ALCANCE CONSULTORIA DE MARKETING LTDA,SIM,30000
302,36730259000135,36730259,MATRIZ,RCUBE SERVICOS DE CONSULTORIA EM TECNOLOGIA DA INFORMACAO LTDA,SIM,1000
303,36734254000180,36734254,MATRIZ,COLLISION INTELLIGENCE LABS SERVICOS DE SEGURANCA DA INFORMACAO LTDA,SIM,1200
304,36806175000138,36806175,MATRIZ,SELLER CENTER SISTEMAS DE INTEGRACAO LTDA,SIM,1000
305,36820730000186,36820730,MATRIZ,SAFERA - ASSESSORIA E CONSULTORIA EM PROTECAO DE DADOS LTDA,SIM,100000
306,36949399000107,36949399,MATRIZ,GFISCHER CONSULTORIA E TECNOLOGIA EIRELI,SIM,104500
307,36958093000109,36958093,MATRIZ,"ACE CONSULTORIA E SERVICOS EM TECNOLOGIA DA INFORMACAO, MARKETING E NEGOCIOS DIGITAIS LTDA",SIM,2000
308,36969195000120,36969195,MATRIZ,J E SOLUCOES EM TECNOLOGIA LTDA,SIM,5000
309,37077182000109,37077182,MATRIZ,EMAILVERITAS TECNOLOGIA LTDA,SIM,20000
310,37177621000155,37177621,MATRIZ,E.S.T - SOLUCOES TECNOLOGICAS LTDA,SIM,30000
311,37178108000189,37178108,MATRIZ,LUCAS ELIAS FREIBERGER,SIM,2000
312,37229264000121,37229264,MATRIZ,PRUMO SERVICOS DE CONSULTORIA EM E-COMMERCE LTDA,SIM,10000
313,37531139000171,37531139,MATRIZ,PRESS START SERVICOS DE CONSULTORIA NA INTERNET LTDA,SIM,3500
314,37532711000117,37532711,MATRIZ,ALEXANDRE AUGUSTO DIAS RAMOS HUFFELL VIOLA,SIM,50000
315,37539604000110,37539604,MATRIZ,"HUBALFA+ CONSULTORIA EMPRESARIAL, ENGENHARIA, TECNOLOGIA E EDUCACAO LTDA",SIM,4990
316,37557582000111,37557582,MATRIZ,MOTTA E MOTTA SERVICOS DE TECNOLOGIA E CONSULTORIA LTDA,SIM,228000
317,37612212000130,37612212,MATRIZ,R & A CONSULTORIA LTDA,SIM,10000
318,37658745000152,37658745,MATRIZ,ALFA TECH COMERCIO E SERVICO LTDA,SIM,1000
319,37671084000103,37671084,MATRIZ,IOTRIXX SOLUCOES EM INFORMATICA E COMUNICACAO LTDA,SIM,60000
320,37915955000189,37915955,MATRIZ,TYPHOON HIL (BR) CONSULTORIA E TREINAMENTO DE SOFTWARE LTDA,SIM,10000
321,37989501000152,37989501,MATRIZ,DM CLOUD & DEVOPS SERVICOS DE TECNOLOGIA LTDA,SIM,1000
322,38007294000156,38007294,MATRIZ,G&D TECNOLOGIA DA INFORMACAO LTDA,SIM,10000
323,38026554000130,38026554,MATRIZ,ALVO SYSTEM LTDA,SIM,3000
324,38045543000106,38045543,MATRIZ,MERAKI CONSULTORIA EM TECNOLOGIA DA INFORMACAO LTDA,SIM,10000
325,38143840000186,38143840,MATRIZ,TBMP CONSULTORIA DA INFORMACAO LTDA,SIM,2000
326,38475698000174,38475698,MATRIZ,HOLDING KIND OUTSIDERS LTDA,SIM,1000
327,38535151000117,38535151,MATRIZ,INSIGHT SERVICOS DE CONSULTORIA EM TECNOLOGIA DA INFORMACAO LTDA,SIM,1000
328,38560722000173,38560722,MATRIZ,WR CONSULT LTDA,SIM,10000
329,38597881000142,38597881,MATRIZ,X.DIGITAL BRASIL SEGURANCA DA INFORMACAO LTDA,SIM,250000
330,38731500000176,38731500,MATRIZ,ACTA TECH SERVICOS DE CONSULTORIA EM TECNOLOGIA DA INFORMACAO LTDA,SIM,12000
331,39331535000180,39331535,MATRIZ,PRUX SOLUCOES DIGITAIS LTDA,SIM,1000
332,39355783000161,39355783,MATRIZ,BERGOLD TECH CONSULTORIA EIRELI,SIM,200000
333,39416257000164,39416257,MATRIZ,INTEPEX SOLUCOES LTDA,SIM,25000
334,39456186000123,39456186,MATRIZ,MICHELLI DA SILVA COSTA,SIM,10000
335,39469328000197,39469328,MATRIZ,MIVA TECNOLOGIA LTDA,SIM,20000
336,39473671000105,39473671,MATRIZ,CLARISSA CECCHIN CONSULTORIA EM TECNOLOGIA DA INFORMACAO LTDA,SIM,5000
337,39485326000191,39485326,MATRIZ,R & R ALVES DA SILVA CONSULTORIA LTDA,SIM,30000
338,39565812000110,39565812,MATRIZ,REZENA TI LTDA,SIM,10000
339,39781465000162,39781465,MATRIZ,PORTODEV CONSULTORIA E TECNOLOGIA LTDA,SIM,1000
340,39836609000130,39836609,MATRIZ,BIODATA CONSULTORIA EM AVALIACAO GENETICA E CIENCIA DE DADOS LTDA.,SIM,40000
341,39937682000107,39937682,MATRIZ,PATERA INC TECNOLOGIA DA INFORMACAO LTDA,SIM,1000
342,39951337000110,39951337,MATRIZ,LAB OF CODES SOLUCOES DIGITAIS LTDA,SIM,1000
343,40019793000105,40019793,MATRIZ,MAASLO CONSULTORIA LTDA,SIM,10000
344,40093823000123,40093823,MATRIZ,FRANZONI CONSULTORIA EM TECNOLOGIA DA INFORMACAO LTDA,SIM,1500
345,40188443000172,40188443,MATRIZ,CSMA SERVICOS DE AUTOMACAO LTDA,SIM,0
346,40194256000100,40194256,MATRIZ,ERUTRON TECNOLOGIA LTDA,SIM,50000
347,40240560000138,40240560,MATRIZ,C. GERLING,SIM,15000
348,40279046000106,40279046,MATRIZ,RKPINHEIRO LTDA,SIM,1000
349,40499259000143,40499259,MATRIZ,DOUGLAS MARTINS CONSULTORIA DE TECNOLOGIA DA INFORMACAO LTDA,SIM,1000
350,40510812000100,40510812,MATRIZ,CECHET SOFTWARE SOLUTIONS LTDA,SIM,10000
351,40513322000159,40513322,MATRIZ,BAHDEV SERVICOS DE CONSULTORIA DE TI LTDA,SIM,1000
352,40572288000193,40572288,MATRIZ,VHL CONSULTORIA EM TI LTDA,SIM,10000
353,40589359000160,40589359,MATRIZ,N N SIEMIATKOWSKI CONSULTORIA LTDA,SIM,1000
354,40654924000126,40654924,MATRIZ,DATA POCKET CONSULTORIA INTERDISCIPLINAR LTDA,SIM,3000
355,40672980000193,40672980,MATRIZ,APETIS CONSULTORIA LTDA,SIM,5000
356,40706960000196,40706960,MATRIZ,MONTEIRO CONSULTORIA EM TECNOLOGIA DA INFORMACAO LTDA,SIM,1000
357,40751154000130,40751154,MATRIZ,RUAN GERVASI LTDA,SIM,10000
358,40840011000102,40840011,MATRIZ,PUERARI SEGURANCA DA INFORMACAO LTDA,SIM,1000
359,40879374000143,40879374,MATRIZ,TOOLS CONSULTORIA EM TECNOLOGIA DA INFORMACAO LTDA,SIM,5000
360,40894681000101,40894681,MATRIZ,LLB SOLUCOES EM MULTIMIDIA LTDA,SIM,1000
361,40909361000170,40909361,MATRIZ,C XAVIER DA SILVA - CONSULTORIA,SIM,10000
362,40942231000139,40942231,MATRIZ,VELVET DESENVOLVIMENTO DE SOFTWARE LTDA,SIM,20000
363,40999862000194,40999862,MATRIZ,EVERTON SILVA ROSA CONSULTORIA,SIM,1000
364,41011151000122,41011151,MATRIZ,L&S CONSULTORIA EM TECNOLOGIA DA INFORMACAO LTDA,SIM,10000
365,41013081000141,41013081,MATRIZ,CASSIANO FORMOLO,SIM,100
366,41069952000149,41069952,MATRIZ,HELIX LABORATORIES DESENVOLVIMENTO DE PROGRAMAS DE COMPUTADOR LTDA,SIM,1000
367,41132023000137,41132023,MATRIZ,CYNC TECNOLOGIA LTDA,SIM,1000
368,41138337000147,41138337,MATRIZ,GLA. SOLUTIONS LTDA,SIM,15000
369,41249650000152,41249650,MATRIZ,BIOSAT AGRICULTURA DE PRECISAO LTDA,SIM,1200
370,41273734000121,41273734,MATRIZ,HD DEVFORCE LTDA,SIM,10000
371,41368252000155,41368252,MATRIZ,REVIRAVOLTA LOCAL COMUNICACAO E TECNOLOGIA LTDA.,SIM,10000
372,41400372000192,41400372,MATRIZ,PRESSER CONSULTORIA E DESENVOLVIMENTO DE PROGRAMAS DE COMPUTADOR LTDA,SIM,1000
373,56350820000168,56350820,MATRIZ,VON BARANOW INFORMATICA LTDA,SIM,50000
374,80095243000190,80095243,MATRIZ,COMPCENTER INFORMATICA LTDA,SIM,0
375,80921489000173,80921489,MATRIZ,MAPTRIZ CONSULTORIA E TECNOLOGIA LTDA,SIM,500000
376,81530685000180,81530685,MATRIZ,JEFERSON PINHEIRO BERNARDO E CIA LTDA,SIM,30000
377,85398345000106,85398345,MATRIZ,HOLISTIC - CONSULTORIA LTDA,SIM,0
378,85516912000173,85516912,MATRIZ,VALMELL SISTEMAS E SERVICOS DE INFORMATICA LTDA,SIM,0
379,86861804000109,86861804,MATRIZ,SADI RICARDO DREWS & CIA LTDA,SIM,0
380,86954351000157,86954351,MATRIZ,COMPULOGICA SISTEMAS DE INFORMATICA LTDA,SIM,0
381,91229039000130,91229039,MATRIZ,SERRANA INFORMATICA LTDA,SIM,0
382,95844288000197,95844288,MATRIZ,BOABASE CONSULTORIA E SISTEMAS LTDA,SIM,0
