xof 0303txt 0032

Frame Root {
  FrameTransformMatrix {
     1.000000, 0.000000, 0.000000, 0.000000,
     0.000000,-0.000000, 1.000000, 0.000000,
     0.000000, 1.000000, 0.000000, 0.000000,
     0.000000, 0.000000, 0.000000, 1.000000;;
  }
  Frame Plane {
    FrameTransformMatrix {
       0.002834, 4.999999, 0.000000, 0.000000,
      -1.000000, 0.000567, 0.000000, 0.000000,
       0.000000, 0.000000, 1.000000, 0.000000,
       0.000000, 0.000000, 0.000000, 1.000000;;
    }
    Mesh { // Plane mesh
      36;
      -1.000000; 1.000000; 0.000000;,
       1.000000;-1.000000; 0.000000;,
      -1.000000;-1.000000; 0.000000;,
       1.000000;-1.000000; 0.000000;,
      -1.000000; 1.000000; 0.000000;,
      -1.000000;-1.000000; 0.000000;,
      -1.000000; 1.000000; 0.000000;,
       1.000000; 1.000000; 0.000000;,
       1.000000; 1.000000; 0.000000;,
       1.000000;-1.000000; 0.000000;,
      -1.000000;-1.000000; 0.000000;,
      -1.000000;-1.000000; 0.000000;,
       1.000000; 1.000000; 0.000000;,
       1.000000;-1.000000; 0.000000;,
       1.000000;-1.000000; 0.000000;,
      -1.000000;-1.000000; 0.000000;,
      -1.000000; 1.000000; 0.000000;,
      -1.000000; 1.000000; 0.000000;,
      -1.000000; 1.000000; 0.000000;,
       1.000000; 1.000000; 0.000000;,
       1.000000;-1.000000; 0.000000;,
       1.000000;-1.000000; 0.000000;,
       1.000000; 1.000000; 0.000000;,
      -1.000000; 1.000000; 0.000000;,
      -1.000000; 1.000000; 0.000000;,
      -1.000000; 1.000000; 0.000000;,
       1.000000; 1.000000; 0.000000;,
       1.000000;-1.000000; 0.000000;,
       1.000000;-1.000000; 0.000000;,
      -1.000000;-1.000000; 0.000000;,
       1.000000; 1.000000; 0.000000;,
       1.000000; 1.000000; 0.000000;,
       1.000000;-1.000000; 0.000000;,
      -1.000000;-1.000000; 0.000000;,
      -1.000000;-1.000000; 0.000000;,
      -1.000000; 1.000000; 0.000000;;
      12;
      3;2,1,0;,
      3;5,4,3;,
      3;8,7,6;,
      3;11,10,9;,
      3;14,13,12;,
      3;17,16,15;,
      3;20,19,18;,
      3;23,22,21;,
      3;26,25,24;,
      3;29,28,27;,
      3;32,31,30;,
      3;35,34,33;;
      MeshNormals { // Plane normals
        12;
         0.000000; 0.000000;-1.000000;,
        -0.000000; 0.000000; 1.000000;,
         0.000000; 0.000000; 0.000000;,
         0.000000; 0.000000; 0.000000;,
         0.000000; 0.000000; 0.000000;,
         0.000000; 0.000000; 0.000000;,
         0.000000; 0.000000;-1.000000;,
        -0.000000; 0.000000; 1.000000;,
         0.000000; 0.000000; 0.000000;,
         0.000000; 0.000000; 0.000000;,
         0.000000; 0.000000; 0.000000;,
         0.000000; 0.000000; 0.000000;;
        12;
        3;0,0,0;,
        3;1,1,1;,
        3;2,2,2;,
        3;3,3,3;,
        3;4,4,4;,
        3;5,5,5;,
        3;6,6,6;,
        3;7,7,7;,
        3;8,8,8;,
        3;9,9,9;,
        3;10,10,10;,
        3;11,11,11;;
      } // End of Plane normals
      MeshTextureCoords { // Plane UV coordinates
        36;
         0.000000; 1.000000;,
         1.000000; 1.000000;,
         1.000000; 0.000000;,
         0.000000; 1.000000;,
         1.000000; 0.000000;,
         0.000000; 0.000000;,
         0.000000; 1.000000;,
         1.000000; 1.000000;,
         1.000000; 0.000000;,
         0.000000; 1.000000;,
         1.000000; 1.000000;,
         1.000000; 0.000000;,
         0.000000; 1.000000;,
         1.000000; 1.000000;,
         1.000000; 0.000000;,
         0.000000; 1.000000;,
         1.000000; 1.000000;,
         1.000000; 0.000000;,
         0.000000; 1.000000;,
         1.000000; 1.000000;,
         1.000000; 0.000000;,
         0.000000; 1.000000;,
         1.000000; 1.000000;,
         1.000000; 0.000000;,
         0.000000; 1.000000;,
         1.000000; 1.000000;,
         1.000000; 0.000000;,
         0.000000; 1.000000;,
         1.000000; 1.000000;,
         1.000000; 0.000000;,
         0.000000; 1.000000;,
         1.000000; 1.000000;,
         1.000000; 0.000000;,
         0.000000; 1.000000;,
         1.000000; 1.000000;,
         1.000000; 0.000000;;
      } // End of Plane UV coordinates
      MeshMaterialList { // Plane material list
        1;
        12;
        0,
        0,
        0,
        0,
        0,
        0,
        0,
        0,
        0,
        0,
        0,
        0;
        Material Material_001 {
           0.640000; 0.640000; 0.640000; 1.000000;;
           96.078431;
           0.500000; 0.500000; 0.500000;;
           0.000000; 0.000000; 0.000000;;
          TextureFilename {"resource/texture/BarrettCallorRed.png";}
        }
      } // End of Plane material list
    } // End of Plane mesh
  } // End of Plane
  Frame Plane_001 {
    FrameTransformMatrix {
       0.002834, 4.999999, 0.000000, 0.000000,
       0.000000,-0.000000, 1.000000, 0.000000,
       1.000000,-0.000567,-0.000000, 0.000000,
       0.000000, 0.000000, 0.000000, 1.000000;;
    }
    Mesh { // Plane_001 mesh
      6;
       1.000000;-1.000000; 0.000000;,
      -1.000000; 1.000000; 0.000000;,
      -1.000000;-1.000000; 0.000000;,
       1.000000;-1.000000; 0.000000;,
       1.000000; 1.000000; 0.000000;,
      -1.000000; 1.000000; 0.000000;;
      2;
      3;2,1,0;,
      3;5,4,3;;
      MeshNormals { // Plane_001 normals
        2;
        -0.000000; 0.000000; 1.000000;,
        -0.000000; 0.000000; 1.000000;;
        2;
        3;0,0,0;,
        3;1,1,1;;
      } // End of Plane_001 normals
      MeshTextureCoords { // Plane_001 UV coordinates
        6;
         0.000000; 1.000000;,
         1.000000; 0.000000;,
         0.000000; 0.000000;,
         0.000000; 1.000000;,
         1.000000; 1.000000;,
         1.000000; 0.000000;;
      } // End of Plane_001 UV coordinates
      MeshMaterialList { // Plane_001 material list
        1;
        2;
        0,
        0;
        Material Material_002 {
           0.640000; 0.640000; 0.640000; 1.000000;;
           96.078431;
           0.500000; 0.500000; 0.500000;;
           0.000000; 0.000000; 0.000000;;
          TextureFilename {"resource/texture/BarrettCallorRed.png";}
        }
      } // End of Plane_001 material list
    } // End of Plane_001 mesh
  } // End of Plane_001
  Frame Plane_002 {
    FrameTransformMatrix {
       0.002834, 4.999999, 0.000000, 0.000000,
       0.000000,-0.000000,-1.000000, 0.000000,
      -1.000000, 0.000567,-0.000000, 0.000000,
       0.000000, 0.000000, 0.000000, 1.000000;;
    }
    Mesh { // Plane_002 mesh
      6;
       1.000000;-1.000000; 0.000000;,
      -1.000000; 1.000000; 0.000000;,
      -1.000000;-1.000000; 0.000000;,
       1.000000;-1.000000; 0.000000;,
       1.000000; 1.000000; 0.000000;,
      -1.000000; 1.000000; 0.000000;;
      2;
      3;2,1,0;,
      3;5,4,3;;
      MeshNormals { // Plane_002 normals
        2;
        -0.000000; 0.000000; 1.000000;,
        -0.000000; 0.000000; 1.000000;;
        2;
        3;0,0,0;,
        3;1,1,1;;
      } // End of Plane_002 normals
      MeshTextureCoords { // Plane_002 UV coordinates
        6;
         0.000000; 1.000000;,
         1.000000; 0.000000;,
         0.000000; 0.000000;,
         0.000000; 1.000000;,
         1.000000; 1.000000;,
         1.000000; 0.000000;;
      } // End of Plane_002 UV coordinates
      MeshMaterialList { // Plane_002 material list
        1;
        2;
        0,
        0;
        Material Material_002 {
           0.640000; 0.640000; 0.640000; 1.000000;;
           96.078431;
           0.500000; 0.500000; 0.500000;;
           0.000000; 0.000000; 0.000000;;
          TextureFilename {"resource/texture/BarrettCallorRed.png";}
        }
      } // End of Plane_002 material list
    } // End of Plane_002 mesh
  } // End of Plane_002
  Frame Plane_003 {
    FrameTransformMatrix {
       0.002834, 4.999999, 0.000000, 0.000000,
       1.000000,-0.000567,-0.000000, 0.000000,
      -0.000000, 0.000000,-1.000000, 0.000000,
       0.000000, 0.000000, 0.000000, 1.000000;;
    }
    Mesh { // Plane_003 mesh
      36;
      -1.000000; 1.000000; 0.000000;,
       1.000000;-1.000000; 0.000000;,
      -1.000000;-1.000000; 0.000000;,
       1.000000;-1.000000; 0.000000;,
      -1.000000; 1.000000; 0.000000;,
      -1.000000;-1.000000; 0.000000;,
      -1.000000; 1.000000; 0.000000;,
       1.000000; 1.000000; 0.000000;,
       1.000000; 1.000000; 0.000000;,
       1.000000;-1.000000; 0.000000;,
      -1.000000;-1.000000; 0.000000;,
      -1.000000;-1.000000; 0.000000;,
       1.000000; 1.000000; 0.000000;,
       1.000000;-1.000000; 0.000000;,
       1.000000;-1.000000; 0.000000;,
      -1.000000;-1.000000; 0.000000;,
      -1.000000; 1.000000; 0.000000;,
      -1.000000; 1.000000; 0.000000;,
      -1.000000; 1.000000; 0.000000;,
       1.000000; 1.000000; 0.000000;,
       1.000000;-1.000000; 0.000000;,
       1.000000;-1.000000; 0.000000;,
       1.000000; 1.000000; 0.000000;,
      -1.000000; 1.000000; 0.000000;,
      -1.000000; 1.000000; 0.000000;,
      -1.000000; 1.000000; 0.000000;,
       1.000000; 1.000000; 0.000000;,
       1.000000;-1.000000; 0.000000;,
       1.000000;-1.000000; 0.000000;,
      -1.000000;-1.000000; 0.000000;,
       1.000000; 1.000000; 0.000000;,
       1.000000; 1.000000; 0.000000;,
       1.000000;-1.000000; 0.000000;,
      -1.000000;-1.000000; 0.000000;,
      -1.000000;-1.000000; 0.000000;,
      -1.000000; 1.000000; 0.000000;;
      12;
      3;2,1,0;,
      3;5,4,3;,
      3;8,7,6;,
      3;11,10,9;,
      3;14,13,12;,
      3;17,16,15;,
      3;20,19,18;,
      3;23,22,21;,
      3;26,25,24;,
      3;29,28,27;,
      3;32,31,30;,
      3;35,34,33;;
      MeshNormals { // Plane_003 normals
        12;
         0.000000; 0.000000;-1.000000;,
        -0.000000; 0.000000; 1.000000;,
         0.000000; 0.000000; 0.000000;,
         0.000000; 0.000000; 0.000000;,
         0.000000; 0.000000; 0.000000;,
         0.000000; 0.000000; 0.000000;,
         0.000000; 0.000000;-1.000000;,
        -0.000000; 0.000000; 1.000000;,
         0.000000; 0.000000; 0.000000;,
         0.000000; 0.000000; 0.000000;,
         0.000000; 0.000000; 0.000000;,
         0.000000; 0.000000; 0.000000;;
        12;
        3;0,0,0;,
        3;1,1,1;,
        3;2,2,2;,
        3;3,3,3;,
        3;4,4,4;,
        3;5,5,5;,
        3;6,6,6;,
        3;7,7,7;,
        3;8,8,8;,
        3;9,9,9;,
        3;10,10,10;,
        3;11,11,11;;
      } // End of Plane_003 normals
      MeshTextureCoords { // Plane_003 UV coordinates
        36;
         0.000000; 1.000000;,
         1.000000; 1.000000;,
         1.000000; 0.000000;,
         0.000000; 1.000000;,
         1.000000; 0.000000;,
         0.000000; 0.000000;,
         0.000000; 1.000000;,
         1.000000; 1.000000;,
         1.000000; 0.000000;,
         0.000000; 1.000000;,
         1.000000; 1.000000;,
         1.000000; 0.000000;,
         0.000000; 1.000000;,
         1.000000; 1.000000;,
         1.000000; 0.000000;,
         0.000000; 1.000000;,
         1.000000; 1.000000;,
         1.000000; 0.000000;,
         0.000000; 1.000000;,
         1.000000; 1.000000;,
         1.000000; 0.000000;,
         0.000000; 1.000000;,
         1.000000; 1.000000;,
         1.000000; 0.000000;,
         0.000000; 1.000000;,
         1.000000; 1.000000;,
         1.000000; 0.000000;,
         0.000000; 1.000000;,
         1.000000; 1.000000;,
         1.000000; 0.000000;,
         0.000000; 1.000000;,
         1.000000; 1.000000;,
         1.000000; 0.000000;,
         0.000000; 1.000000;,
         1.000000; 1.000000;,
         1.000000; 0.000000;;
      } // End of Plane_003 UV coordinates
      MeshMaterialList { // Plane_003 material list
        1;
        12;
        0,
        0,
        0,
        0,
        0,
        0,
        0,
        0,
        0,
        0,
        0,
        0;
        Material Material_001 {
           0.640000; 0.640000; 0.640000; 1.000000;;
           96.078431;
           0.500000; 0.500000; 0.500000;;
           0.000000; 0.000000; 0.000000;;
          TextureFilename {"resource/texture/BarrettCallorRed.png";}
        }
      } // End of Plane_003 material list
    } // End of Plane_003 mesh
  } // End of Plane_003
} // End of Root
