xof 0303txt 0032

Frame Root {
  FrameTransformMatrix {
     1.000000, 0.000000, 0.000000, 0.000000,
     0.000000,-0.000000, 1.000000, 0.000000,
     0.000000, 1.000000, 0.000000, 0.000000,
     0.000000, 0.000000, 0.000000, 1.000000;;
  }
  Frame keiro_pCylinder1 {
    FrameTransformMatrix {
       0.010000, 0.000000, 0.000000, 0.000000,
       0.000000,-0.000000, 0.010000, 0.000000,
       0.000000,-0.010000,-0.000000, 0.000000,
       0.000000, 0.000000, 0.000000, 1.000000;;
    }
    Mesh { // keiro_pCylinder1 mesh
      540;
       5.326424; 0.081881;-1.938657;,
       4.342141; 0.081881;-3.643486;,
       5.326424; 1.138244;-1.938657;,
       5.326424; 1.138244;-1.938657;,
       4.342141; 0.081881;-3.643486;,
       4.342141; 1.138244;-3.643486;,
       4.342141; 0.081881;-3.643486;,
       2.834132; 0.081881;-4.908856;,
       4.342141; 1.138244;-3.643486;,
       4.342141; 1.138244;-3.643486;,
       2.834132; 0.081881;-4.908856;,
       2.834132; 1.138244;-4.908856;,
       2.834132; 0.081881;-4.908856;,
       0.984285; 0.081881;-5.582147;,
       2.834132; 1.138244;-4.908856;,
       2.834132; 1.138244;-4.908856;,
       0.984285; 0.081881;-5.582147;,
       0.984285; 1.138244;-5.582147;,
       0.984285; 0.081881;-5.582147;,
      -0.984281; 0.081881;-5.582148;,
       0.984285; 1.138244;-5.582147;,
       0.984285; 1.138244;-5.582147;,
      -0.984281; 0.081881;-5.582148;,
      -0.984281; 1.138244;-5.582148;,
      -0.984281; 0.081881;-5.582148;,
      -2.834129; 0.081881;-4.908858;,
      -0.984281; 1.138244;-5.582148;,
      -0.984281; 1.138244;-5.582148;,
      -2.834129; 0.081881;-4.908858;,
      -2.834129; 1.138244;-4.908858;,
      -2.834129; 0.081881;-4.908858;,
      -4.342139; 0.081881;-3.643489;,
      -2.834129; 1.138244;-4.908858;,
      -2.834129; 1.138244;-4.908858;,
      -4.342139; 0.081881;-3.643489;,
      -4.342139; 1.138244;-3.643489;,
      -4.342139; 0.081881;-3.643489;,
      -5.326422; 0.081881;-1.938660;,
      -4.342139; 1.138244;-3.643489;,
      -4.342139; 1.138244;-3.643489;,
      -5.326422; 0.081881;-1.938660;,
      -5.326422; 1.138244;-1.938660;,
      -5.326422; 0.081881;-1.938660;,
      -5.668261; 0.081881;-0.000001;,
      -5.326422; 1.138244;-1.938660;,
      -5.326422; 1.138244;-1.938660;,
      -5.668261; 0.081881;-0.000001;,
      -5.668261; 1.138244;-0.000001;,
      -5.668261; 0.081881;-0.000001;,
      -5.326423; 0.081881; 1.938658;,
      -5.668261; 1.138244;-0.000001;,
      -5.668261; 1.138244;-0.000001;,
      -5.326423; 0.081881; 1.938658;,
      -5.326423; 1.138244; 1.938658;,
      -5.326423; 0.081881; 1.938658;,
      -4.342140; 0.081881; 3.643487;,
      -5.326423; 1.138244; 1.938658;,
      -5.326423; 1.138244; 1.938658;,
      -4.342140; 0.081881; 3.643487;,
      -4.342140; 1.138244; 3.643487;,
      -4.342140; 0.081881; 3.643487;,
      -2.834131; 0.081881; 4.908856;,
      -4.342140; 1.138244; 3.643487;,
      -4.342140; 1.138244; 3.643487;,
      -2.834131; 0.081881; 4.908856;,
      -2.834131; 1.138244; 4.908856;,
      -2.834131; 0.081881; 4.908856;,
      -0.984284; 0.081881; 5.582147;,
      -2.834131; 1.138244; 4.908856;,
      -2.834131; 1.138244; 4.908856;,
      -0.984284; 0.081881; 5.582147;,
      -0.984284; 1.138244; 5.582147;,
      -0.984284; 0.081881; 5.582147;,
       0.984283; 0.081881; 5.582148;,
      -0.984284; 1.138244; 5.582147;,
      -0.984284; 1.138244; 5.582147;,
       0.984283; 0.081881; 5.582148;,
       0.984283; 1.138244; 5.582148;,
       0.984283; 0.081881; 5.582148;,
       2.834130; 0.081881; 4.908857;,
       0.984283; 1.138244; 5.582148;,
       0.984283; 1.138244; 5.582148;,
       2.834130; 0.081881; 4.908857;,
       2.834130; 1.138244; 4.908857;,
       2.834130; 0.081881; 4.908857;,
       4.342139; 0.081881; 3.643488;,
       2.834130; 1.138244; 4.908857;,
       2.834130; 1.138244; 4.908857;,
       4.342139; 0.081881; 3.643488;,
       4.342139; 1.138244; 3.643488;,
       4.342139; 0.081881; 3.643488;,
       5.326423; 0.081881; 1.938659;,
       4.342139; 1.138244; 3.643488;,
       4.342139; 1.138244; 3.643488;,
       5.326423; 0.081881; 1.938659;,
       5.326423; 1.138244; 1.938659;,
       5.326423; 0.081881; 1.938659;,
       5.668261; 0.081881; 0.000000;,
       5.326423; 1.138244; 1.938659;,
       5.326423; 1.138244; 1.938659;,
       5.668261; 0.081881; 0.000000;,
       5.668261; 1.138244; 0.000000;,
       5.668261; 0.081881; 0.000000;,
       5.326424; 0.081881;-1.938657;,
       5.668261; 1.138244; 0.000000;,
       5.668261; 1.138244; 0.000000;,
       5.326424; 0.081881;-1.938657;,
       5.326424; 1.138244;-1.938657;,
       4.342141; 0.081881;-3.643486;,
       5.326424; 0.081881;-1.938657;,
       0.000000; 0.081881; 0.000000;,
       2.834132; 0.081881;-4.908856;,
       4.342141; 0.081881;-3.643486;,
       0.000000; 0.081881; 0.000000;,
       0.984285; 0.081881;-5.582147;,
       2.834132; 0.081881;-4.908856;,
       0.000000; 0.081881; 0.000000;,
      -0.984281; 0.081881;-5.582148;,
       0.984285; 0.081881;-5.582147;,
       0.000000; 0.081881; 0.000000;,
      -2.834129; 0.081881;-4.908858;,
      -0.984281; 0.081881;-5.582148;,
       0.000000; 0.081881; 0.000000;,
      -4.342139; 0.081881;-3.643489;,
      -2.834129; 0.081881;-4.908858;,
       0.000000; 0.081881; 0.000000;,
      -5.326422; 0.081881;-1.938660;,
      -4.342139; 0.081881;-3.643489;,
       0.000000; 0.081881; 0.000000;,
      -5.668261; 0.081881;-0.000001;,
      -5.326422; 0.081881;-1.938660;,
       0.000000; 0.081881; 0.000000;,
      -5.326423; 0.081881; 1.938658;,
      -5.668261; 0.081881;-0.000001;,
       0.000000; 0.081881; 0.000000;,
      -4.342140; 0.081881; 3.643487;,
      -5.326423; 0.081881; 1.938658;,
       0.000000; 0.081881; 0.000000;,
      -2.834131; 0.081881; 4.908856;,
      -4.342140; 0.081881; 3.643487;,
       0.000000; 0.081881; 0.000000;,
      -0.984284; 0.081881; 5.582147;,
      -2.834131; 0.081881; 4.908856;,
       0.000000; 0.081881; 0.000000;,
       0.984283; 0.081881; 5.582148;,
      -0.984284; 0.081881; 5.582147;,
       0.000000; 0.081881; 0.000000;,
       2.834130; 0.081881; 4.908857;,
       0.984283; 0.081881; 5.582148;,
       0.000000; 0.081881; 0.000000;,
       4.342139; 0.081881; 3.643488;,
       2.834130; 0.081881; 4.908857;,
       0.000000; 0.081881; 0.000000;,
       5.326423; 0.081881; 1.938659;,
       4.342139; 0.081881; 3.643488;,
       0.000000; 0.081881; 0.000000;,
       5.668261; 0.081881; 0.000000;,
       5.326423; 0.081881; 1.938659;,
       0.000000; 0.081881; 0.000000;,
       5.326424; 0.081881;-1.938657;,
       5.668261; 0.081881; 0.000000;,
       0.000000; 0.081881; 0.000000;,
       4.385851; 0.543088;-1.596317;,
       3.575379; 0.543088;-3.000097;,
       0.000000; 0.521067; 0.000000;,
       3.575379; 0.543088;-3.000097;,
       2.333664; 0.543088;-4.042020;,
       0.000000; 0.521067; 0.000000;,
       2.333664; 0.543088;-4.042020;,
       0.810474; 0.543088;-4.596417;,
       0.000000; 0.521067; 0.000000;,
       0.810474; 0.543088;-4.596417;,
      -0.810471; 0.543088;-4.596418;,
       0.000000; 0.521067; 0.000000;,
      -0.810471; 0.543088;-4.596418;,
      -2.333661; 0.543088;-4.042022;,
       0.000000; 0.521067; 0.000000;,
      -2.333661; 0.543088;-4.042022;,
      -3.575377; 0.543088;-3.000099;,
       0.000000; 0.521067; 0.000000;,
      -3.575377; 0.543088;-3.000099;,
      -4.385850; 0.543088;-1.596320;,
       0.000000; 0.521067; 0.000000;,
      -4.385850; 0.543088;-1.596320;,
      -4.667325; 0.543088;-0.000001;,
       0.000000; 0.521067; 0.000000;,
      -4.667325; 0.543088;-0.000001;,
      -4.385851; 0.543088; 1.596318;,
       0.000000; 0.521067; 0.000000;,
      -4.385851; 0.543088; 1.596318;,
      -3.575379; 0.543088; 3.000097;,
       0.000000; 0.521067; 0.000000;,
      -3.575379; 0.543088; 3.000097;,
      -2.333663; 0.543088; 4.042021;,
       0.000000; 0.521067; 0.000000;,
      -2.333663; 0.543088; 4.042021;,
      -0.810473; 0.543088; 4.596417;,
       0.000000; 0.521067; 0.000000;,
      -0.810473; 0.543088; 4.596417;,
       0.810472; 0.543088; 4.596418;,
       0.000000; 0.521067; 0.000000;,
       0.810472; 0.543088; 4.596418;,
       2.333662; 0.543088; 4.042022;,
       0.000000; 0.521067; 0.000000;,
       2.333662; 0.543088; 4.042022;,
       3.575378; 0.543088; 3.000098;,
       0.000000; 0.521067; 0.000000;,
       3.575378; 0.543088; 3.000098;,
       4.385851; 0.543088; 1.596319;,
       0.000000; 0.521067; 0.000000;,
       4.385851; 0.543088; 1.596319;,
       4.667325; 0.543088; 0.000000;,
       0.000000; 0.521067; 0.000000;,
       4.667325; 0.543088; 0.000000;,
       4.385851; 0.543088;-1.596317;,
       0.000000; 0.521067; 0.000000;,
       4.865494; 1.384614;-1.770893;,
       3.966387; 1.384614;-3.328192;,
       4.385851; 1.259568;-1.596317;,
       4.385851; 1.259568;-1.596317;,
       3.966387; 1.384614;-3.328192;,
       3.575379; 1.259568;-3.000097;,
       3.966387; 1.384614;-3.328192;,
       2.588876; 1.384614;-4.484062;,
       3.575379; 1.259568;-3.000097;,
       3.575379; 1.259568;-3.000097;,
       2.588876; 1.384614;-4.484062;,
       2.333664; 1.259568;-4.042020;,
       2.588876; 1.384614;-4.484062;,
       0.899109; 1.384614;-5.099088;,
       2.333664; 1.259568;-4.042020;,
       2.333664; 1.259568;-4.042020;,
       0.899109; 1.384614;-5.099088;,
       0.810474; 1.259568;-4.596417;,
       0.899109; 1.384614;-5.099088;,
      -0.899105; 1.384614;-5.099089;,
       0.810474; 1.259568;-4.596417;,
       0.810474; 1.259568;-4.596417;,
      -0.899105; 1.384614;-5.099089;,
      -0.810471; 1.259568;-4.596418;,
      -0.899105; 1.384614;-5.099089;,
      -2.588874; 1.384614;-4.484063;,
      -0.810471; 1.259568;-4.596418;,
      -0.810471; 1.259568;-4.596418;,
      -2.588874; 1.384614;-4.484063;,
      -2.333661; 1.259568;-4.042022;,
      -2.588874; 1.384614;-4.484063;,
      -3.966386; 1.384614;-3.328194;,
      -2.333661; 1.259568;-4.042022;,
      -2.333661; 1.259568;-4.042022;,
      -3.966386; 1.384614;-3.328194;,
      -3.575377; 1.259568;-3.000099;,
      -3.966386; 1.384614;-3.328194;,
      -4.865493; 1.384614;-1.770896;,
      -3.575377; 1.259568;-3.000099;,
      -3.575377; 1.259568;-3.000099;,
      -4.865493; 1.384614;-1.770896;,
      -4.385850; 1.259568;-1.596320;,
      -4.865493; 1.384614;-1.770896;,
      -5.177750; 1.384614;-0.000001;,
      -4.385850; 1.259568;-1.596320;,
      -4.385850; 1.259568;-1.596320;,
      -5.177750; 1.384614;-0.000001;,
      -4.667325; 1.259568;-0.000001;,
      -5.177750; 1.384614;-0.000001;,
      -4.865494; 1.384614; 1.770894;,
      -4.667325; 1.259568;-0.000001;,
      -4.667325; 1.259568;-0.000001;,
      -4.865494; 1.384614; 1.770894;,
      -4.385851; 1.259568; 1.596318;,
      -4.865494; 1.384614; 1.770894;,
      -3.966387; 1.384614; 3.328193;,
      -4.385851; 1.259568; 1.596318;,
      -4.385851; 1.259568; 1.596318;,
      -3.966387; 1.384614; 3.328193;,
      -3.575379; 1.259568; 3.000097;,
      -3.966387; 1.384614; 3.328193;,
      -2.588876; 1.384614; 4.484062;,
      -3.575379; 1.259568; 3.000097;,
      -3.575379; 1.259568; 3.000097;,
      -2.588876; 1.384614; 4.484062;,
      -2.333663; 1.259568; 4.042021;,
      -2.588876; 1.384614; 4.484062;,
      -0.899108; 1.384614; 5.099089;,
      -2.333663; 1.259568; 4.042021;,
      -2.333663; 1.259568; 4.042021;,
      -0.899108; 1.384614; 5.099089;,
      -0.810473; 1.259568; 4.596417;,
      -0.899108; 1.384614; 5.099089;,
       0.899107; 1.384614; 5.099089;,
      -0.810473; 1.259568; 4.596417;,
      -0.810473; 1.259568; 4.596417;,
       0.899107; 1.384614; 5.099089;,
       0.810472; 1.259568; 4.596418;,
       0.899107; 1.384614; 5.099089;,
       2.588875; 1.384614; 4.484063;,
       0.810472; 1.259568; 4.596418;,
       0.810472; 1.259568; 4.596418;,
       2.588875; 1.384614; 4.484063;,
       2.333662; 1.259568; 4.042022;,
       2.588875; 1.384614; 4.484063;,
       3.966387; 1.384614; 3.328194;,
       2.333662; 1.259568; 4.042022;,
       2.333662; 1.259568; 4.042022;,
       3.966387; 1.384614; 3.328194;,
       3.575378; 1.259568; 3.000098;,
       3.966387; 1.384614; 3.328194;,
       4.865494; 1.384614; 1.770895;,
       3.575378; 1.259568; 3.000098;,
       3.575378; 1.259568; 3.000098;,
       4.865494; 1.384614; 1.770895;,
       4.385851; 1.259568; 1.596319;,
       4.865494; 1.384614; 1.770895;,
       5.177751; 1.384614; 0.000000;,
       4.385851; 1.259568; 1.596319;,
       4.385851; 1.259568; 1.596319;,
       5.177751; 1.384614; 0.000000;,
       4.667325; 1.259568; 0.000000;,
       5.177751; 1.384614; 0.000000;,
       4.865494; 1.384614;-1.770893;,
       4.667325; 1.259568; 0.000000;,
       4.667325; 1.259568; 0.000000;,
       4.865494; 1.384614;-1.770893;,
       4.385851; 1.259568;-1.596317;,
       4.385851; 1.259568;-1.596317;,
       3.575379; 1.259568;-3.000097;,
       4.385851; 0.543088;-1.596317;,
       4.385851; 0.543088;-1.596317;,
       3.575379; 1.259568;-3.000097;,
       3.575379; 0.543088;-3.000097;,
       3.575379; 1.259568;-3.000097;,
       2.333664; 1.259568;-4.042020;,
       3.575379; 0.543088;-3.000097;,
       3.575379; 0.543088;-3.000097;,
       2.333664; 1.259568;-4.042020;,
       2.333664; 0.543088;-4.042020;,
       2.333664; 1.259568;-4.042020;,
       0.810474; 1.259568;-4.596417;,
       2.333664; 0.543088;-4.042020;,
       2.333664; 0.543088;-4.042020;,
       0.810474; 1.259568;-4.596417;,
       0.810474; 0.543088;-4.596417;,
       0.810474; 1.259568;-4.596417;,
      -0.810471; 1.259568;-4.596418;,
       0.810474; 0.543088;-4.596417;,
       0.810474; 0.543088;-4.596417;,
      -0.810471; 1.259568;-4.596418;,
      -0.810471; 0.543088;-4.596418;,
      -0.810471; 1.259568;-4.596418;,
      -2.333661; 1.259568;-4.042022;,
      -0.810471; 0.543088;-4.596418;,
      -0.810471; 0.543088;-4.596418;,
      -2.333661; 1.259568;-4.042022;,
      -2.333661; 0.543088;-4.042022;,
      -2.333661; 1.259568;-4.042022;,
      -3.575377; 1.259568;-3.000099;,
      -2.333661; 0.543088;-4.042022;,
      -2.333661; 0.543088;-4.042022;,
      -3.575377; 1.259568;-3.000099;,
      -3.575377; 0.543088;-3.000099;,
      -3.575377; 1.259568;-3.000099;,
      -4.385850; 1.259568;-1.596320;,
      -3.575377; 0.543088;-3.000099;,
      -3.575377; 0.543088;-3.000099;,
      -4.385850; 1.259568;-1.596320;,
      -4.385850; 0.543088;-1.596320;,
      -4.385850; 1.259568;-1.596320;,
      -4.667325; 1.259568;-0.000001;,
      -4.385850; 0.543088;-1.596320;,
      -4.385850; 0.543088;-1.596320;,
      -4.667325; 1.259568;-0.000001;,
      -4.667325; 0.543088;-0.000001;,
      -4.667325; 1.259568;-0.000001;,
      -4.385851; 1.259568; 1.596318;,
      -4.667325; 0.543088;-0.000001;,
      -4.667325; 0.543088;-0.000001;,
      -4.385851; 1.259568; 1.596318;,
      -4.385851; 0.543088; 1.596318;,
      -4.385851; 1.259568; 1.596318;,
      -3.575379; 1.259568; 3.000097;,
      -4.385851; 0.543088; 1.596318;,
      -4.385851; 0.543088; 1.596318;,
      -3.575379; 1.259568; 3.000097;,
      -3.575379; 0.543088; 3.000097;,
      -3.575379; 1.259568; 3.000097;,
      -2.333663; 1.259568; 4.042021;,
      -3.575379; 0.543088; 3.000097;,
      -3.575379; 0.543088; 3.000097;,
      -2.333663; 1.259568; 4.042021;,
      -2.333663; 0.543088; 4.042021;,
      -2.333663; 1.259568; 4.042021;,
      -0.810473; 1.259568; 4.596417;,
      -2.333663; 0.543088; 4.042021;,
      -2.333663; 0.543088; 4.042021;,
      -0.810473; 1.259568; 4.596417;,
      -0.810473; 0.543088; 4.596417;,
      -0.810473; 1.259568; 4.596417;,
       0.810472; 1.259568; 4.596418;,
      -0.810473; 0.543088; 4.596417;,
      -0.810473; 0.543088; 4.596417;,
       0.810472; 1.259568; 4.596418;,
       0.810472; 0.543088; 4.596418;,
       0.810472; 1.259568; 4.596418;,
       2.333662; 1.259568; 4.042022;,
       0.810472; 0.543088; 4.596418;,
       0.810472; 0.543088; 4.596418;,
       2.333662; 1.259568; 4.042022;,
       2.333662; 0.543088; 4.042022;,
       2.333662; 1.259568; 4.042022;,
       3.575378; 1.259568; 3.000098;,
       2.333662; 0.543088; 4.042022;,
       2.333662; 0.543088; 4.042022;,
       3.575378; 1.259568; 3.000098;,
       3.575378; 0.543088; 3.000098;,
       3.575378; 1.259568; 3.000098;,
       4.385851; 1.259568; 1.596319;,
       3.575378; 0.543088; 3.000098;,
       3.575378; 0.543088; 3.000098;,
       4.385851; 1.259568; 1.596319;,
       4.385851; 0.543088; 1.596319;,
       4.385851; 1.259568; 1.596319;,
       4.667325; 1.259568; 0.000000;,
       4.385851; 0.543088; 1.596319;,
       4.385851; 0.543088; 1.596319;,
       4.667325; 1.259568; 0.000000;,
       4.667325; 0.543088; 0.000000;,
       4.667325; 1.259568; 0.000000;,
       4.385851; 1.259568;-1.596317;,
       4.667325; 0.543088; 0.000000;,
       4.667325; 0.543088; 0.000000;,
       4.385851; 1.259568;-1.596317;,
       4.385851; 0.543088;-1.596317;,
       5.326424; 1.138244;-1.938657;,
       4.342141; 1.138244;-3.643486;,
       4.865494; 1.384614;-1.770893;,
       4.865494; 1.384614;-1.770893;,
       4.342141; 1.138244;-3.643486;,
       3.966387; 1.384614;-3.328192;,
       4.342141; 1.138244;-3.643486;,
       2.834132; 1.138244;-4.908856;,
       3.966387; 1.384614;-3.328192;,
       3.966387; 1.384614;-3.328192;,
       2.834132; 1.138244;-4.908856;,
       2.588876; 1.384614;-4.484062;,
       2.834132; 1.138244;-4.908856;,
       0.984285; 1.138244;-5.582147;,
       2.588876; 1.384614;-4.484062;,
       2.588876; 1.384614;-4.484062;,
       0.984285; 1.138244;-5.582147;,
       0.899109; 1.384614;-5.099088;,
       0.984285; 1.138244;-5.582147;,
      -0.984281; 1.138244;-5.582148;,
       0.899109; 1.384614;-5.099088;,
       0.899109; 1.384614;-5.099088;,
      -0.984281; 1.138244;-5.582148;,
      -0.899105; 1.384614;-5.099089;,
      -0.984281; 1.138244;-5.582148;,
      -2.834129; 1.138244;-4.908858;,
      -0.899105; 1.384614;-5.099089;,
      -0.899105; 1.384614;-5.099089;,
      -2.834129; 1.138244;-4.908858;,
      -2.588874; 1.384614;-4.484063;,
      -2.834129; 1.138244;-4.908858;,
      -4.342139; 1.138244;-3.643489;,
      -2.588874; 1.384614;-4.484063;,
      -2.588874; 1.384614;-4.484063;,
      -4.342139; 1.138244;-3.643489;,
      -3.966386; 1.384614;-3.328194;,
      -4.342139; 1.138244;-3.643489;,
      -5.326422; 1.138244;-1.938660;,
      -3.966386; 1.384614;-3.328194;,
      -3.966386; 1.384614;-3.328194;,
      -5.326422; 1.138244;-1.938660;,
      -4.865493; 1.384614;-1.770896;,
      -5.326422; 1.138244;-1.938660;,
      -5.668261; 1.138244;-0.000001;,
      -4.865493; 1.384614;-1.770896;,
      -4.865493; 1.384614;-1.770896;,
      -5.668261; 1.138244;-0.000001;,
      -5.177750; 1.384614;-0.000001;,
      -5.668261; 1.138244;-0.000001;,
      -5.326423; 1.138244; 1.938658;,
      -5.177750; 1.384614;-0.000001;,
      -5.177750; 1.384614;-0.000001;,
      -5.326423; 1.138244; 1.938658;,
      -4.865494; 1.384614; 1.770894;,
      -5.326423; 1.138244; 1.938658;,
      -4.342140; 1.138244; 3.643487;,
      -4.865494; 1.384614; 1.770894;,
      -4.865494; 1.384614; 1.770894;,
      -4.342140; 1.138244; 3.643487;,
      -3.966387; 1.384614; 3.328193;,
      -4.342140; 1.138244; 3.643487;,
      -2.834131; 1.138244; 4.908856;,
      -3.966387; 1.384614; 3.328193;,
      -3.966387; 1.384614; 3.328193;,
      -2.834131; 1.138244; 4.908856;,
      -2.588876; 1.384614; 4.484062;,
      -2.834131; 1.138244; 4.908856;,
      -0.984284; 1.138244; 5.582147;,
      -2.588876; 1.384614; 4.484062;,
      -2.588876; 1.384614; 4.484062;,
      -0.984284; 1.138244; 5.582147;,
      -0.899108; 1.384614; 5.099089;,
      -0.984284; 1.138244; 5.582147;,
       0.984283; 1.138244; 5.582148;,
      -0.899108; 1.384614; 5.099089;,
      -0.899108; 1.384614; 5.099089;,
       0.984283; 1.138244; 5.582148;,
       0.899107; 1.384614; 5.099089;,
       0.984283; 1.138244; 5.582148;,
       2.834130; 1.138244; 4.908857;,
       0.899107; 1.384614; 5.099089;,
       0.899107; 1.384614; 5.099089;,
       2.834130; 1.138244; 4.908857;,
       2.588875; 1.384614; 4.484063;,
       2.834130; 1.138244; 4.908857;,
       4.342139; 1.138244; 3.643488;,
       2.588875; 1.384614; 4.484063;,
       2.588875; 1.384614; 4.484063;,
       4.342139; 1.138244; 3.643488;,
       3.966387; 1.384614; 3.328194;,
       4.342139; 1.138244; 3.643488;,
       5.326423; 1.138244; 1.938659;,
       3.966387; 1.384614; 3.328194;,
       3.966387; 1.384614; 3.328194;,
       5.326423; 1.138244; 1.938659;,
       4.865494; 1.384614; 1.770895;,
       5.326423; 1.138244; 1.938659;,
       5.668261; 1.138244; 0.000000;,
       4.865494; 1.384614; 1.770895;,
       4.865494; 1.384614; 1.770895;,
       5.668261; 1.138244; 0.000000;,
       5.177751; 1.384614; 0.000000;,
       5.668261; 1.138244; 0.000000;,
       5.326424; 1.138244;-1.938657;,
       5.177751; 1.384614; 0.000000;,
       5.177751; 1.384614; 0.000000;,
       5.326424; 1.138244;-1.938657;,
       4.865494; 1.384614;-1.770893;;
      180;
      3;2,1,0;,
      3;5,4,3;,
      3;8,7,6;,
      3;11,10,9;,
      3;14,13,12;,
      3;17,16,15;,
      3;20,19,18;,
      3;23,22,21;,
      3;26,25,24;,
      3;29,28,27;,
      3;32,31,30;,
      3;35,34,33;,
      3;38,37,36;,
      3;41,40,39;,
      3;44,43,42;,
      3;47,46,45;,
      3;50,49,48;,
      3;53,52,51;,
      3;56,55,54;,
      3;59,58,57;,
      3;62,61,60;,
      3;65,64,63;,
      3;68,67,66;,
      3;71,70,69;,
      3;74,73,72;,
      3;77,76,75;,
      3;80,79,78;,
      3;83,82,81;,
      3;86,85,84;,
      3;89,88,87;,
      3;92,91,90;,
      3;95,94,93;,
      3;98,97,96;,
      3;101,100,99;,
      3;104,103,102;,
      3;107,106,105;,
      3;110,109,108;,
      3;113,112,111;,
      3;116,115,114;,
      3;119,118,117;,
      3;122,121,120;,
      3;125,124,123;,
      3;128,127,126;,
      3;131,130,129;,
      3;134,133,132;,
      3;137,136,135;,
      3;140,139,138;,
      3;143,142,141;,
      3;146,145,144;,
      3;149,148,147;,
      3;152,151,150;,
      3;155,154,153;,
      3;158,157,156;,
      3;161,160,159;,
      3;164,163,162;,
      3;167,166,165;,
      3;170,169,168;,
      3;173,172,171;,
      3;176,175,174;,
      3;179,178,177;,
      3;182,181,180;,
      3;185,184,183;,
      3;188,187,186;,
      3;191,190,189;,
      3;194,193,192;,
      3;197,196,195;,
      3;200,199,198;,
      3;203,202,201;,
      3;206,205,204;,
      3;209,208,207;,
      3;212,211,210;,
      3;215,214,213;,
      3;218,217,216;,
      3;221,220,219;,
      3;224,223,222;,
      3;227,226,225;,
      3;230,229,228;,
      3;233,232,231;,
      3;236,235,234;,
      3;239,238,237;,
      3;242,241,240;,
      3;245,244,243;,
      3;248,247,246;,
      3;251,250,249;,
      3;254,253,252;,
      3;257,256,255;,
      3;260,259,258;,
      3;263,262,261;,
      3;266,265,264;,
      3;269,268,267;,
      3;272,271,270;,
      3;275,274,273;,
      3;278,277,276;,
      3;281,280,279;,
      3;284,283,282;,
      3;287,286,285;,
      3;290,289,288;,
      3;293,292,291;,
      3;296,295,294;,
      3;299,298,297;,
      3;302,301,300;,
      3;305,304,303;,
      3;308,307,306;,
      3;311,310,309;,
      3;314,313,312;,
      3;317,316,315;,
      3;320,319,318;,
      3;323,322,321;,
      3;326,325,324;,
      3;329,328,327;,
      3;332,331,330;,
      3;335,334,333;,
      3;338,337,336;,
      3;341,340,339;,
      3;344,343,342;,
      3;347,346,345;,
      3;350,349,348;,
      3;353,352,351;,
      3;356,355,354;,
      3;359,358,357;,
      3;362,361,360;,
      3;365,364,363;,
      3;368,367,366;,
      3;371,370,369;,
      3;374,373,372;,
      3;377,376,375;,
      3;380,379,378;,
      3;383,382,381;,
      3;386,385,384;,
      3;389,388,387;,
      3;392,391,390;,
      3;395,394,393;,
      3;398,397,396;,
      3;401,400,399;,
      3;404,403,402;,
      3;407,406,405;,
      3;410,409,408;,
      3;413,412,411;,
      3;416,415,414;,
      3;419,418,417;,
      3;422,421,420;,
      3;425,424,423;,
      3;428,427,426;,
      3;431,430,429;,
      3;434,433,432;,
      3;437,436,435;,
      3;440,439,438;,
      3;443,442,441;,
      3;446,445,444;,
      3;449,448,447;,
      3;452,451,450;,
      3;455,454,453;,
      3;458,457,456;,
      3;461,460,459;,
      3;464,463,462;,
      3;467,466,465;,
      3;470,469,468;,
      3;473,472,471;,
      3;476,475,474;,
      3;479,478,477;,
      3;482,481,480;,
      3;485,484,483;,
      3;488,487,486;,
      3;491,490,489;,
      3;494,493,492;,
      3;497,496,495;,
      3;500,499,498;,
      3;503,502,501;,
      3;506,505,504;,
      3;509,508,507;,
      3;512,511,510;,
      3;515,514,513;,
      3;518,517,516;,
      3;521,520,519;,
      3;524,523,522;,
      3;527,526,525;,
      3;530,529,528;,
      3;533,532,531;,
      3;536,535,534;,
      3;539,538,537;;
      MeshNormals { // keiro_pCylinder1 normals
        540;
         0.697562;-0.670003;-0.253883;,
         0.568651;-0.670003;-0.477157;,
         0.813471; 0.500534;-0.296060;,
         0.813471; 0.500534;-0.296060;,
         0.568651;-0.670003;-0.477157;,
         0.663167; 0.500534;-0.556444;,
         0.568651;-0.670003;-0.477157;,
         0.371166;-0.670003;-0.642872;,
         0.663167; 0.500534;-0.556444;,
         0.663167; 0.500534;-0.556444;,
         0.371166;-0.670003;-0.642872;,
         0.432844; 0.500534;-0.749718;,
         0.371166;-0.670003;-0.642872;,
         0.128880;-0.670003;-0.731040;,
         0.432844; 0.500534;-0.749718;,
         0.432844; 0.500534;-0.749718;,
         0.128880;-0.670003;-0.731040;,
         0.150304; 0.500534;-0.852535;,
         0.128880;-0.670003;-0.731040;,
        -0.128880;-0.670003;-0.731040;,
         0.150304; 0.500534;-0.852535;,
         0.150304; 0.500534;-0.852535;,
        -0.128880;-0.670003;-0.731040;,
        -0.150304; 0.500534;-0.852535;,
        -0.128880;-0.670003;-0.731040;,
        -0.371166;-0.670003;-0.642872;,
        -0.150304; 0.500534;-0.852535;,
        -0.150304; 0.500534;-0.852535;,
        -0.371166;-0.670003;-0.642872;,
        -0.432844; 0.500534;-0.749718;,
        -0.371166;-0.670003;-0.642872;,
        -0.568651;-0.670003;-0.477157;,
        -0.432844; 0.500534;-0.749718;,
        -0.432844; 0.500534;-0.749718;,
        -0.568651;-0.670003;-0.477157;,
        -0.663167; 0.500534;-0.556444;,
        -0.568651;-0.670003;-0.477157;,
        -0.697562;-0.670003;-0.253883;,
        -0.663167; 0.500534;-0.556444;,
        -0.663167; 0.500534;-0.556444;,
        -0.697562;-0.670003;-0.253883;,
        -0.813471; 0.500534;-0.296060;,
        -0.697562;-0.670003;-0.253883;,
        -0.742332;-0.670003; 0.000000;,
        -0.813471; 0.500534;-0.296060;,
        -0.813471; 0.500534;-0.296060;,
        -0.742332;-0.670003; 0.000000;,
        -0.865688; 0.500534; 0.000000;,
        -0.742332;-0.670003; 0.000000;,
        -0.697562;-0.670003; 0.253883;,
        -0.865688; 0.500534; 0.000000;,
        -0.865688; 0.500534; 0.000000;,
        -0.697562;-0.670003; 0.253883;,
        -0.813471; 0.500534; 0.296060;,
        -0.697562;-0.670003; 0.253883;,
        -0.568651;-0.670003; 0.477157;,
        -0.813471; 0.500534; 0.296060;,
        -0.813471; 0.500534; 0.296060;,
        -0.568651;-0.670003; 0.477157;,
        -0.663167; 0.500534; 0.556444;,
        -0.568651;-0.670003; 0.477157;,
        -0.371166;-0.670003; 0.642872;,
        -0.663167; 0.500534; 0.556444;,
        -0.663167; 0.500534; 0.556444;,
        -0.371166;-0.670003; 0.642872;,
        -0.432844; 0.500534; 0.749718;,
        -0.371166;-0.670003; 0.642872;,
        -0.128880;-0.670003; 0.731040;,
        -0.432844; 0.500534; 0.749718;,
        -0.432844; 0.500534; 0.749718;,
        -0.128880;-0.670003; 0.731040;,
        -0.150304; 0.500534; 0.852535;,
        -0.128880;-0.670003; 0.731040;,
         0.128880;-0.670003; 0.731040;,
        -0.150304; 0.500534; 0.852535;,
        -0.150304; 0.500534; 0.852535;,
         0.128880;-0.670003; 0.731040;,
         0.150304; 0.500534; 0.852535;,
         0.128880;-0.670003; 0.731040;,
         0.371166;-0.670003; 0.642872;,
         0.150304; 0.500534; 0.852535;,
         0.150304; 0.500534; 0.852535;,
         0.371166;-0.670003; 0.642872;,
         0.432844; 0.500534; 0.749718;,
         0.371166;-0.670003; 0.642872;,
         0.568651;-0.670003; 0.477157;,
         0.432844; 0.500534; 0.749718;,
         0.432844; 0.500534; 0.749718;,
         0.568651;-0.670003; 0.477157;,
         0.663167; 0.500534; 0.556444;,
         0.568651;-0.670003; 0.477157;,
         0.697562;-0.670003; 0.253883;,
         0.663167; 0.500534; 0.556444;,
         0.663167; 0.500534; 0.556444;,
         0.697562;-0.670003; 0.253883;,
         0.813471; 0.500534; 0.296060;,
         0.697562;-0.670003; 0.253883;,
         0.742332;-0.670003; 0.000000;,
         0.813471; 0.500534; 0.296060;,
         0.813471; 0.500534; 0.296060;,
         0.742332;-0.670003; 0.000000;,
         0.865688; 0.500534; 0.000000;,
         0.742332;-0.670003; 0.000000;,
         0.697562;-0.670003;-0.253883;,
         0.865688; 0.500534; 0.000000;,
         0.865688; 0.500534; 0.000000;,
         0.697562;-0.670003;-0.253883;,
         0.813471; 0.500534;-0.296060;,
         0.568651;-0.670003;-0.477157;,
         0.697562;-0.670003;-0.253883;,
         0.000000;-0.999969; 0.000000;,
         0.371166;-0.670003;-0.642872;,
         0.568651;-0.670003;-0.477157;,
         0.000000;-0.999969; 0.000000;,
         0.128880;-0.670003;-0.731040;,
         0.371166;-0.670003;-0.642872;,
         0.000000;-0.999969; 0.000000;,
        -0.128880;-0.670003;-0.731040;,
         0.128880;-0.670003;-0.731040;,
         0.000000;-0.999969; 0.000000;,
        -0.371166;-0.670003;-0.642872;,
        -0.128880;-0.670003;-0.731040;,
         0.000000;-0.999969; 0.000000;,
        -0.568651;-0.670003;-0.477157;,
        -0.371166;-0.670003;-0.642872;,
         0.000000;-0.999969; 0.000000;,
        -0.697562;-0.670003;-0.253883;,
        -0.568651;-0.670003;-0.477157;,
         0.000000;-0.999969; 0.000000;,
        -0.742332;-0.670003; 0.000000;,
        -0.697562;-0.670003;-0.253883;,
         0.000000;-0.999969; 0.000000;,
        -0.697562;-0.670003; 0.253883;,
        -0.742332;-0.670003; 0.000000;,
         0.000000;-0.999969; 0.000000;,
        -0.568651;-0.670003; 0.477157;,
        -0.697562;-0.670003; 0.253883;,
         0.000000;-0.999969; 0.000000;,
        -0.371166;-0.670003; 0.642872;,
        -0.568651;-0.670003; 0.477157;,
         0.000000;-0.999969; 0.000000;,
        -0.128880;-0.670003; 0.731040;,
        -0.371166;-0.670003; 0.642872;,
         0.000000;-0.999969; 0.000000;,
         0.128880;-0.670003; 0.731040;,
        -0.128880;-0.670003; 0.731040;,
         0.000000;-0.999969; 0.000000;,
         0.371166;-0.670003; 0.642872;,
         0.128880;-0.670003; 0.731040;,
         0.000000;-0.999969; 0.000000;,
         0.568651;-0.670003; 0.477157;,
         0.371166;-0.670003; 0.642872;,
         0.000000;-0.999969; 0.000000;,
         0.697562;-0.670003; 0.253883;,
         0.568651;-0.670003; 0.477157;,
         0.000000;-0.999969; 0.000000;,
         0.742332;-0.670003; 0.000000;,
         0.697562;-0.670003; 0.253883;,
         0.000000;-0.999969; 0.000000;,
         0.697562;-0.670003;-0.253883;,
         0.742332;-0.670003; 0.000000;,
         0.000000;-0.999969; 0.000000;,
        -0.698874; 0.668447; 0.254372;,
        -0.569720; 0.668447; 0.478072;,
         0.000000; 1.000000; 0.000000;,
        -0.569720; 0.668447; 0.478072;,
        -0.371868; 0.668447; 0.644093;,
         0.000000; 1.000000; 0.000000;,
        -0.371868; 0.668447; 0.644093;,
        -0.129124; 0.668447; 0.732444;,
         0.000000; 1.000000; 0.000000;,
        -0.129124; 0.668447; 0.732444;,
         0.129124; 0.668447; 0.732444;,
         0.000000; 1.000000; 0.000000;,
         0.129124; 0.668447; 0.732444;,
         0.371868; 0.668447; 0.644093;,
         0.000000; 1.000000; 0.000000;,
         0.371868; 0.668447; 0.644093;,
         0.569720; 0.668447; 0.478072;,
         0.000000; 1.000000; 0.000000;,
         0.569720; 0.668447; 0.478072;,
         0.698874; 0.668447; 0.254372;,
         0.000000; 1.000000; 0.000000;,
         0.698874; 0.668447; 0.254372;,
         0.743736; 0.668447; 0.000000;,
         0.000000; 1.000000; 0.000000;,
         0.743736; 0.668447; 0.000000;,
         0.698874; 0.668447;-0.254372;,
         0.000000; 1.000000; 0.000000;,
         0.698874; 0.668447;-0.254372;,
         0.569720; 0.668447;-0.478072;,
         0.000000; 1.000000; 0.000000;,
         0.569720; 0.668447;-0.478072;,
         0.371868; 0.668447;-0.644093;,
         0.000000; 1.000000; 0.000000;,
         0.371868; 0.668447;-0.644093;,
         0.129124; 0.668447;-0.732444;,
         0.000000; 1.000000; 0.000000;,
         0.129124; 0.668447;-0.732444;,
        -0.129124; 0.668447;-0.732444;,
         0.000000; 1.000000; 0.000000;,
        -0.129124; 0.668447;-0.732444;,
        -0.371868; 0.668447;-0.644093;,
         0.000000; 1.000000; 0.000000;,
        -0.371868; 0.668447;-0.644093;,
        -0.569720; 0.668447;-0.478072;,
         0.000000; 1.000000; 0.000000;,
        -0.569720; 0.668447;-0.478072;,
        -0.698874; 0.668447;-0.254372;,
         0.000000; 1.000000; 0.000000;,
        -0.698874; 0.668447;-0.254372;,
        -0.743736; 0.668447; 0.000000;,
         0.000000; 1.000000; 0.000000;,
        -0.743736; 0.668447; 0.000000;,
        -0.698874; 0.668447; 0.254372;,
         0.000000; 1.000000; 0.000000;,
         0.140843; 0.988678;-0.051271;,
         0.114811; 0.988678;-0.096347;,
        -0.711966; 0.652608; 0.259133;,
        -0.711966; 0.652608; 0.259133;,
         0.114811; 0.988678;-0.096347;,
        -0.580401; 0.652608; 0.487014;,
         0.114811; 0.988678;-0.096347;,
         0.074953; 0.988678;-0.129795;,
        -0.580401; 0.652608; 0.487014;,
        -0.580401; 0.652608; 0.487014;,
         0.074953; 0.988678;-0.129795;,
        -0.378826; 0.652608; 0.656148;,
         0.074953; 0.988678;-0.129795;,
         0.026002; 0.988678;-0.147618;,
        -0.378826; 0.652608; 0.656148;,
        -0.378826; 0.652608; 0.656148;,
         0.026002; 0.988678;-0.147618;,
        -0.131565; 0.652608; 0.746147;,
         0.026002; 0.988678;-0.147618;,
        -0.026002; 0.988678;-0.147618;,
        -0.131565; 0.652608; 0.746147;,
        -0.131565; 0.652608; 0.746147;,
        -0.026002; 0.988678;-0.147618;,
         0.131565; 0.652608; 0.746147;,
        -0.026002; 0.988678;-0.147618;,
        -0.074953; 0.988678;-0.129795;,
         0.131565; 0.652608; 0.746147;,
         0.131565; 0.652608; 0.746147;,
        -0.074953; 0.988678;-0.129795;,
         0.378826; 0.652608; 0.656148;,
        -0.074953; 0.988678;-0.129795;,
        -0.114811; 0.988678;-0.096347;,
         0.378826; 0.652608; 0.656148;,
         0.378826; 0.652608; 0.656148;,
        -0.114811; 0.988678;-0.096347;,
         0.580401; 0.652608; 0.487014;,
        -0.114811; 0.988678;-0.096347;,
        -0.140843; 0.988678;-0.051271;,
         0.580401; 0.652608; 0.487014;,
         0.580401; 0.652608; 0.487014;,
        -0.140843; 0.988678;-0.051271;,
         0.711966; 0.652608; 0.259133;,
        -0.140843; 0.988678;-0.051271;,
        -0.149907; 0.988678; 0.000000;,
         0.711966; 0.652608; 0.259133;,
         0.711966; 0.652608; 0.259133;,
        -0.149907; 0.988678; 0.000000;,
         0.757653; 0.652608; 0.000000;,
        -0.149907; 0.988678; 0.000000;,
        -0.140843; 0.988678; 0.051271;,
         0.757653; 0.652608; 0.000000;,
         0.757653; 0.652608; 0.000000;,
        -0.140843; 0.988678; 0.051271;,
         0.711966; 0.652608;-0.259133;,
        -0.140843; 0.988678; 0.051271;,
        -0.114811; 0.988678; 0.096347;,
         0.711966; 0.652608;-0.259133;,
         0.711966; 0.652608;-0.259133;,
        -0.114811; 0.988678; 0.096347;,
         0.580401; 0.652608;-0.487014;,
        -0.114811; 0.988678; 0.096347;,
        -0.074953; 0.988678; 0.129795;,
         0.580401; 0.652608;-0.487014;,
         0.580401; 0.652608;-0.487014;,
        -0.074953; 0.988678; 0.129795;,
         0.378826; 0.652608;-0.656148;,
        -0.074953; 0.988678; 0.129795;,
        -0.026002; 0.988678; 0.147618;,
         0.378826; 0.652608;-0.656148;,
         0.378826; 0.652608;-0.656148;,
        -0.026002; 0.988678; 0.147618;,
         0.131565; 0.652608;-0.746147;,
        -0.026002; 0.988678; 0.147618;,
         0.026002; 0.988678; 0.147618;,
         0.131565; 0.652608;-0.746147;,
         0.131565; 0.652608;-0.746147;,
         0.026002; 0.988678; 0.147618;,
        -0.131565; 0.652608;-0.746147;,
         0.026002; 0.988678; 0.147618;,
         0.074953; 0.988678; 0.129795;,
        -0.131565; 0.652608;-0.746147;,
        -0.131565; 0.652608;-0.746147;,
         0.074953; 0.988678; 0.129795;,
        -0.378826; 0.652608;-0.656148;,
         0.074953; 0.988678; 0.129795;,
         0.114811; 0.988678; 0.096347;,
        -0.378826; 0.652608;-0.656148;,
        -0.378826; 0.652608;-0.656148;,
         0.114811; 0.988678; 0.096347;,
        -0.580401; 0.652608;-0.487014;,
         0.114811; 0.988678; 0.096347;,
         0.140843; 0.988678; 0.051271;,
        -0.580401; 0.652608;-0.487014;,
        -0.580401; 0.652608;-0.487014;,
         0.140843; 0.988678; 0.051271;,
        -0.711966; 0.652608;-0.259133;,
         0.140843; 0.988678; 0.051271;,
         0.149907; 0.988678; 0.000000;,
        -0.711966; 0.652608;-0.259133;,
        -0.711966; 0.652608;-0.259133;,
         0.149907; 0.988678; 0.000000;,
        -0.757653; 0.652608; 0.000000;,
         0.149907; 0.988678; 0.000000;,
         0.140843; 0.988678;-0.051271;,
        -0.757653; 0.652608; 0.000000;,
        -0.757653; 0.652608; 0.000000;,
         0.140843; 0.988678;-0.051271;,
        -0.711966; 0.652608; 0.259133;,
        -0.711966; 0.652608; 0.259133;,
        -0.580401; 0.652608; 0.487014;,
        -0.698874; 0.668447; 0.254372;,
        -0.698874; 0.668447; 0.254372;,
        -0.580401; 0.652608; 0.487014;,
        -0.569720; 0.668447; 0.478072;,
        -0.580401; 0.652608; 0.487014;,
        -0.378826; 0.652608; 0.656148;,
        -0.569720; 0.668447; 0.478072;,
        -0.569720; 0.668447; 0.478072;,
        -0.378826; 0.652608; 0.656148;,
        -0.371868; 0.668447; 0.644093;,
        -0.378826; 0.652608; 0.656148;,
        -0.131565; 0.652608; 0.746147;,
        -0.371868; 0.668447; 0.644093;,
        -0.371868; 0.668447; 0.644093;,
        -0.131565; 0.652608; 0.746147;,
        -0.129124; 0.668447; 0.732444;,
        -0.131565; 0.652608; 0.746147;,
         0.131565; 0.652608; 0.746147;,
        -0.129124; 0.668447; 0.732444;,
        -0.129124; 0.668447; 0.732444;,
         0.131565; 0.652608; 0.746147;,
         0.129124; 0.668447; 0.732444;,
         0.131565; 0.652608; 0.746147;,
         0.378826; 0.652608; 0.656148;,
         0.129124; 0.668447; 0.732444;,
         0.129124; 0.668447; 0.732444;,
         0.378826; 0.652608; 0.656148;,
         0.371868; 0.668447; 0.644093;,
         0.378826; 0.652608; 0.656148;,
         0.580401; 0.652608; 0.487014;,
         0.371868; 0.668447; 0.644093;,
         0.371868; 0.668447; 0.644093;,
         0.580401; 0.652608; 0.487014;,
         0.569720; 0.668447; 0.478072;,
         0.580401; 0.652608; 0.487014;,
         0.711966; 0.652608; 0.259133;,
         0.569720; 0.668447; 0.478072;,
         0.569720; 0.668447; 0.478072;,
         0.711966; 0.652608; 0.259133;,
         0.698874; 0.668447; 0.254372;,
         0.711966; 0.652608; 0.259133;,
         0.757653; 0.652608; 0.000000;,
         0.698874; 0.668447; 0.254372;,
         0.698874; 0.668447; 0.254372;,
         0.757653; 0.652608; 0.000000;,
         0.743736; 0.668447; 0.000000;,
         0.757653; 0.652608; 0.000000;,
         0.711966; 0.652608;-0.259133;,
         0.743736; 0.668447; 0.000000;,
         0.743736; 0.668447; 0.000000;,
         0.711966; 0.652608;-0.259133;,
         0.698874; 0.668447;-0.254372;,
         0.711966; 0.652608;-0.259133;,
         0.580401; 0.652608;-0.487014;,
         0.698874; 0.668447;-0.254372;,
         0.698874; 0.668447;-0.254372;,
         0.580401; 0.652608;-0.487014;,
         0.569720; 0.668447;-0.478072;,
         0.580401; 0.652608;-0.487014;,
         0.378826; 0.652608;-0.656148;,
         0.569720; 0.668447;-0.478072;,
         0.569720; 0.668447;-0.478072;,
         0.378826; 0.652608;-0.656148;,
         0.371868; 0.668447;-0.644093;,
         0.378826; 0.652608;-0.656148;,
         0.131565; 0.652608;-0.746147;,
         0.371868; 0.668447;-0.644093;,
         0.371868; 0.668447;-0.644093;,
         0.131565; 0.652608;-0.746147;,
         0.129124; 0.668447;-0.732444;,
         0.131565; 0.652608;-0.746147;,
        -0.131565; 0.652608;-0.746147;,
         0.129124; 0.668447;-0.732444;,
         0.129124; 0.668447;-0.732444;,
        -0.131565; 0.652608;-0.746147;,
        -0.129124; 0.668447;-0.732444;,
        -0.131565; 0.652608;-0.746147;,
        -0.378826; 0.652608;-0.656148;,
        -0.129124; 0.668447;-0.732444;,
        -0.129124; 0.668447;-0.732444;,
        -0.378826; 0.652608;-0.656148;,
        -0.371868; 0.668447;-0.644093;,
        -0.378826; 0.652608;-0.656148;,
        -0.580401; 0.652608;-0.487014;,
        -0.371868; 0.668447;-0.644093;,
        -0.371868; 0.668447;-0.644093;,
        -0.580401; 0.652608;-0.487014;,
        -0.569720; 0.668447;-0.478072;,
        -0.580401; 0.652608;-0.487014;,
        -0.711966; 0.652608;-0.259133;,
        -0.569720; 0.668447;-0.478072;,
        -0.569720; 0.668447;-0.478072;,
        -0.711966; 0.652608;-0.259133;,
        -0.698874; 0.668447;-0.254372;,
        -0.711966; 0.652608;-0.259133;,
        -0.757653; 0.652608; 0.000000;,
        -0.698874; 0.668447;-0.254372;,
        -0.698874; 0.668447;-0.254372;,
        -0.757653; 0.652608; 0.000000;,
        -0.743736; 0.668447; 0.000000;,
        -0.757653; 0.652608; 0.000000;,
        -0.711966; 0.652608; 0.259133;,
        -0.743736; 0.668447; 0.000000;,
        -0.743736; 0.668447; 0.000000;,
        -0.711966; 0.652608; 0.259133;,
        -0.698874; 0.668447; 0.254372;,
         0.813471; 0.500534;-0.296060;,
         0.663167; 0.500534;-0.556444;,
         0.140843; 0.988678;-0.051271;,
         0.140843; 0.988678;-0.051271;,
         0.663167; 0.500534;-0.556444;,
         0.114811; 0.988678;-0.096347;,
         0.663167; 0.500534;-0.556444;,
         0.432844; 0.500534;-0.749718;,
         0.114811; 0.988678;-0.096347;,
         0.114811; 0.988678;-0.096347;,
         0.432844; 0.500534;-0.749718;,
         0.074953; 0.988678;-0.129795;,
         0.432844; 0.500534;-0.749718;,
         0.150304; 0.500534;-0.852535;,
         0.074953; 0.988678;-0.129795;,
         0.074953; 0.988678;-0.129795;,
         0.150304; 0.500534;-0.852535;,
         0.026002; 0.988678;-0.147618;,
         0.150304; 0.500534;-0.852535;,
        -0.150304; 0.500534;-0.852535;,
         0.026002; 0.988678;-0.147618;,
         0.026002; 0.988678;-0.147618;,
        -0.150304; 0.500534;-0.852535;,
        -0.026002; 0.988678;-0.147618;,
        -0.150304; 0.500534;-0.852535;,
        -0.432844; 0.500534;-0.749718;,
        -0.026002; 0.988678;-0.147618;,
        -0.026002; 0.988678;-0.147618;,
        -0.432844; 0.500534;-0.749718;,
        -0.074953; 0.988678;-0.129795;,
        -0.432844; 0.500534;-0.749718;,
        -0.663167; 0.500534;-0.556444;,
        -0.074953; 0.988678;-0.129795;,
        -0.074953; 0.988678;-0.129795;,
        -0.663167; 0.500534;-0.556444;,
        -0.114811; 0.988678;-0.096347;,
        -0.663167; 0.500534;-0.556444;,
        -0.813471; 0.500534;-0.296060;,
        -0.114811; 0.988678;-0.096347;,
        -0.114811; 0.988678;-0.096347;,
        -0.813471; 0.500534;-0.296060;,
        -0.140843; 0.988678;-0.051271;,
        -0.813471; 0.500534;-0.296060;,
        -0.865688; 0.500534; 0.000000;,
        -0.140843; 0.988678;-0.051271;,
        -0.140843; 0.988678;-0.051271;,
        -0.865688; 0.500534; 0.000000;,
        -0.149907; 0.988678; 0.000000;,
        -0.865688; 0.500534; 0.000000;,
        -0.813471; 0.500534; 0.296060;,
        -0.149907; 0.988678; 0.000000;,
        -0.149907; 0.988678; 0.000000;,
        -0.813471; 0.500534; 0.296060;,
        -0.140843; 0.988678; 0.051271;,
        -0.813471; 0.500534; 0.296060;,
        -0.663167; 0.500534; 0.556444;,
        -0.140843; 0.988678; 0.051271;,
        -0.140843; 0.988678; 0.051271;,
        -0.663167; 0.500534; 0.556444;,
        -0.114811; 0.988678; 0.096347;,
        -0.663167; 0.500534; 0.556444;,
        -0.432844; 0.500534; 0.749718;,
        -0.114811; 0.988678; 0.096347;,
        -0.114811; 0.988678; 0.096347;,
        -0.432844; 0.500534; 0.749718;,
        -0.074953; 0.988678; 0.129795;,
        -0.432844; 0.500534; 0.749718;,
        -0.150304; 0.500534; 0.852535;,
        -0.074953; 0.988678; 0.129795;,
        -0.074953; 0.988678; 0.129795;,
        -0.150304; 0.500534; 0.852535;,
        -0.026002; 0.988678; 0.147618;,
        -0.150304; 0.500534; 0.852535;,
         0.150304; 0.500534; 0.852535;,
        -0.026002; 0.988678; 0.147618;,
        -0.026002; 0.988678; 0.147618;,
         0.150304; 0.500534; 0.852535;,
         0.026002; 0.988678; 0.147618;,
         0.150304; 0.500534; 0.852535;,
         0.432844; 0.500534; 0.749718;,
         0.026002; 0.988678; 0.147618;,
         0.026002; 0.988678; 0.147618;,
         0.432844; 0.500534; 0.749718;,
         0.074953; 0.988678; 0.129795;,
         0.432844; 0.500534; 0.749718;,
         0.663167; 0.500534; 0.556444;,
         0.074953; 0.988678; 0.129795;,
         0.074953; 0.988678; 0.129795;,
         0.663167; 0.500534; 0.556444;,
         0.114811; 0.988678; 0.096347;,
         0.663167; 0.500534; 0.556444;,
         0.813471; 0.500534; 0.296060;,
         0.114811; 0.988678; 0.096347;,
         0.114811; 0.988678; 0.096347;,
         0.813471; 0.500534; 0.296060;,
         0.140843; 0.988678; 0.051271;,
         0.813471; 0.500534; 0.296060;,
         0.865688; 0.500534; 0.000000;,
         0.140843; 0.988678; 0.051271;,
         0.140843; 0.988678; 0.051271;,
         0.865688; 0.500534; 0.000000;,
         0.149907; 0.988678; 0.000000;,
         0.865688; 0.500534; 0.000000;,
         0.813471; 0.500534;-0.296060;,
         0.149907; 0.988678; 0.000000;,
         0.149907; 0.988678; 0.000000;,
         0.813471; 0.500534;-0.296060;,
         0.140843; 0.988678;-0.051271;;
        180;
        3;2,1,0;,
        3;5,4,3;,
        3;8,7,6;,
        3;11,10,9;,
        3;14,13,12;,
        3;17,16,15;,
        3;20,19,18;,
        3;23,22,21;,
        3;26,25,24;,
        3;29,28,27;,
        3;32,31,30;,
        3;35,34,33;,
        3;38,37,36;,
        3;41,40,39;,
        3;44,43,42;,
        3;47,46,45;,
        3;50,49,48;,
        3;53,52,51;,
        3;56,55,54;,
        3;59,58,57;,
        3;62,61,60;,
        3;65,64,63;,
        3;68,67,66;,
        3;71,70,69;,
        3;74,73,72;,
        3;77,76,75;,
        3;80,79,78;,
        3;83,82,81;,
        3;86,85,84;,
        3;89,88,87;,
        3;92,91,90;,
        3;95,94,93;,
        3;98,97,96;,
        3;101,100,99;,
        3;104,103,102;,
        3;107,106,105;,
        3;110,109,108;,
        3;113,112,111;,
        3;116,115,114;,
        3;119,118,117;,
        3;122,121,120;,
        3;125,124,123;,
        3;128,127,126;,
        3;131,130,129;,
        3;134,133,132;,
        3;137,136,135;,
        3;140,139,138;,
        3;143,142,141;,
        3;146,145,144;,
        3;149,148,147;,
        3;152,151,150;,
        3;155,154,153;,
        3;158,157,156;,
        3;161,160,159;,
        3;164,163,162;,
        3;167,166,165;,
        3;170,169,168;,
        3;173,172,171;,
        3;176,175,174;,
        3;179,178,177;,
        3;182,181,180;,
        3;185,184,183;,
        3;188,187,186;,
        3;191,190,189;,
        3;194,193,192;,
        3;197,196,195;,
        3;200,199,198;,
        3;203,202,201;,
        3;206,205,204;,
        3;209,208,207;,
        3;212,211,210;,
        3;215,214,213;,
        3;218,217,216;,
        3;221,220,219;,
        3;224,223,222;,
        3;227,226,225;,
        3;230,229,228;,
        3;233,232,231;,
        3;236,235,234;,
        3;239,238,237;,
        3;242,241,240;,
        3;245,244,243;,
        3;248,247,246;,
        3;251,250,249;,
        3;254,253,252;,
        3;257,256,255;,
        3;260,259,258;,
        3;263,262,261;,
        3;266,265,264;,
        3;269,268,267;,
        3;272,271,270;,
        3;275,274,273;,
        3;278,277,276;,
        3;281,280,279;,
        3;284,283,282;,
        3;287,286,285;,
        3;290,289,288;,
        3;293,292,291;,
        3;296,295,294;,
        3;299,298,297;,
        3;302,301,300;,
        3;305,304,303;,
        3;308,307,306;,
        3;311,310,309;,
        3;314,313,312;,
        3;317,316,315;,
        3;320,319,318;,
        3;323,322,321;,
        3;326,325,324;,
        3;329,328,327;,
        3;332,331,330;,
        3;335,334,333;,
        3;338,337,336;,
        3;341,340,339;,
        3;344,343,342;,
        3;347,346,345;,
        3;350,349,348;,
        3;353,352,351;,
        3;356,355,354;,
        3;359,358,357;,
        3;362,361,360;,
        3;365,364,363;,
        3;368,367,366;,
        3;371,370,369;,
        3;374,373,372;,
        3;377,376,375;,
        3;380,379,378;,
        3;383,382,381;,
        3;386,385,384;,
        3;389,388,387;,
        3;392,391,390;,
        3;395,394,393;,
        3;398,397,396;,
        3;401,400,399;,
        3;404,403,402;,
        3;407,406,405;,
        3;410,409,408;,
        3;413,412,411;,
        3;416,415,414;,
        3;419,418,417;,
        3;422,421,420;,
        3;425,424,423;,
        3;428,427,426;,
        3;431,430,429;,
        3;434,433,432;,
        3;437,436,435;,
        3;440,439,438;,
        3;443,442,441;,
        3;446,445,444;,
        3;449,448,447;,
        3;452,451,450;,
        3;455,454,453;,
        3;458,457,456;,
        3;461,460,459;,
        3;464,463,462;,
        3;467,466,465;,
        3;470,469,468;,
        3;473,472,471;,
        3;476,475,474;,
        3;479,478,477;,
        3;482,481,480;,
        3;485,484,483;,
        3;488,487,486;,
        3;491,490,489;,
        3;494,493,492;,
        3;497,496,495;,
        3;500,499,498;,
        3;503,502,501;,
        3;506,505,504;,
        3;509,508,507;,
        3;512,511,510;,
        3;515,514,513;,
        3;518,517,516;,
        3;521,520,519;,
        3;524,523,522;,
        3;527,526,525;,
        3;530,529,528;,
        3;533,532,531;,
        3;536,535,534;,
        3;539,538,537;;
      } // End of keiro_pCylinder1 normals
      MeshTextureCoords { // keiro_pCylinder1 UV coordinates
        540;
         0.375000; 0.687500;,
         0.388889; 0.687500;,
         0.375000; 0.311560;,
         0.375000; 0.311560;,
         0.388889; 0.687500;,
         0.388889; 0.311560;,
         0.388889; 0.687500;,
         0.402778; 0.687500;,
         0.388889; 0.311560;,
         0.388889; 0.311560;,
         0.402778; 0.687500;,
         0.402778; 0.311560;,
         0.402778; 0.687500;,
         0.416667; 0.687500;,
         0.402778; 0.311560;,
         0.402778; 0.311560;,
         0.416667; 0.687500;,
         0.416667; 0.311560;,
         0.416667; 0.687500;,
         0.430556; 0.687500;,
         0.416667; 0.311560;,
         0.416667; 0.311560;,
         0.430556; 0.687500;,
         0.430556; 0.311560;,
         0.430556; 0.687500;,
         0.444444; 0.687500;,
         0.430556; 0.311560;,
         0.430556; 0.311560;,
         0.444444; 0.687500;,
         0.444444; 0.311560;,
         0.444444; 0.687500;,
         0.458333; 0.687500;,
         0.444444; 0.311560;,
         0.444444; 0.311560;,
         0.458333; 0.687500;,
         0.458333; 0.311560;,
         0.458333; 0.687500;,
         0.472222; 0.687500;,
         0.458333; 0.311560;,
         0.458333; 0.311560;,
         0.472222; 0.687500;,
         0.472222; 0.311560;,
         0.472222; 0.687500;,
         0.486111; 0.687500;,
         0.472222; 0.311560;,
         0.472222; 0.311560;,
         0.486111; 0.687500;,
         0.486111; 0.311560;,
         0.486111; 0.687500;,
         0.500000; 0.687500;,
         0.486111; 0.311560;,
         0.486111; 0.311560;,
         0.500000; 0.687500;,
         0.500000; 0.311560;,
         0.500000; 0.687500;,
         0.513889; 0.687500;,
         0.500000; 0.311560;,
         0.500000; 0.311560;,
         0.513889; 0.687500;,
         0.513889; 0.311560;,
         0.513889; 0.687500;,
         0.527778; 0.687500;,
         0.513889; 0.311560;,
         0.513889; 0.311560;,
         0.527778; 0.687500;,
         0.527778; 0.311560;,
         0.527778; 0.687500;,
         0.541667; 0.687500;,
         0.527778; 0.311560;,
         0.527778; 0.311560;,
         0.541667; 0.687500;,
         0.541667; 0.311560;,
         0.541667; 0.687500;,
         0.555556; 0.687500;,
         0.541667; 0.311560;,
         0.541667; 0.311560;,
         0.555556; 0.687500;,
         0.555556; 0.311560;,
         0.555556; 0.687500;,
         0.569445; 0.687500;,
         0.555556; 0.311560;,
         0.555556; 0.311560;,
         0.569445; 0.687500;,
         0.569445; 0.311560;,
         0.569445; 0.687500;,
         0.583333; 0.687500;,
         0.569445; 0.311560;,
         0.569445; 0.311560;,
         0.583333; 0.687500;,
         0.583333; 0.311560;,
         0.583333; 0.687500;,
         0.597222; 0.687500;,
         0.583333; 0.311560;,
         0.583333; 0.311560;,
         0.597222; 0.687500;,
         0.597222; 0.311560;,
         0.597222; 0.687500;,
         0.611111; 0.687500;,
         0.597222; 0.311560;,
         0.597222; 0.311560;,
         0.611111; 0.687500;,
         0.611111; 0.311560;,
         0.611111; 0.687500;,
         0.625000; 0.687500;,
         0.611111; 0.311560;,
         0.611111; 0.311560;,
         0.625000; 0.687500;,
         0.625000; 0.311560;,
         0.619694; 0.944186;,
         0.646827; 0.897191;,
         0.500000; 0.850000;,
         0.578125; 0.979066;,
         0.619694; 0.944186;,
         0.500000; 0.850000;,
         0.527133; 0.997626;,
         0.578125; 0.979066;,
         0.500000; 0.850000;,
         0.472867; 0.997626;,
         0.527133; 0.997626;,
         0.500000; 0.850000;,
         0.421875; 0.979066;,
         0.472867; 0.997626;,
         0.500000; 0.850000;,
         0.380306; 0.944186;,
         0.421875; 0.979066;,
         0.500000; 0.850000;,
         0.353173; 0.897191;,
         0.380306; 0.944186;,
         0.500000; 0.850000;,
         0.343750; 0.843750;,
         0.353173; 0.897191;,
         0.500000; 0.850000;,
         0.353173; 0.790309;,
         0.343750; 0.843750;,
         0.500000; 0.850000;,
         0.380306; 0.743314;,
         0.353173; 0.790309;,
         0.500000; 0.850000;,
         0.421875; 0.708434;,
         0.380306; 0.743314;,
         0.500000; 0.850000;,
         0.472867; 0.689874;,
         0.421875; 0.708434;,
         0.500000; 0.850000;,
         0.527133; 0.689874;,
         0.472867; 0.689874;,
         0.500000; 0.850000;,
         0.578125; 0.708434;,
         0.527133; 0.689874;,
         0.500000; 0.850000;,
         0.619694; 0.743314;,
         0.578125; 0.708434;,
         0.500000; 0.850000;,
         0.646827; 0.790309;,
         0.619694; 0.743314;,
         0.500000; 0.850000;,
         0.656250; 0.843750;,
         0.646827; 0.790309;,
         0.500000; 0.850000;,
         0.646827; 0.897191;,
         0.656250; 0.843750;,
         0.500000; 0.850000;,
         0.646827; 0.102809;,
         0.619694; 0.055814;,
         0.500000; 0.162500;,
         0.619694; 0.055814;,
         0.578125; 0.020934;,
         0.500000; 0.162500;,
         0.578125; 0.020934;,
         0.527133; 0.002374;,
         0.500000; 0.162500;,
         0.527133; 0.002374;,
         0.472867; 0.002374;,
         0.500000; 0.162500;,
         0.472867; 0.002374;,
         0.421875; 0.020934;,
         0.500000; 0.162500;,
         0.421875; 0.020934;,
         0.380306; 0.055814;,
         0.500000; 0.162500;,
         0.380306; 0.055814;,
         0.353173; 0.102809;,
         0.500000; 0.162500;,
         0.353173; 0.102809;,
         0.343750; 0.156250;,
         0.500000; 0.162500;,
         0.343750; 0.156250;,
         0.353173; 0.209691;,
         0.500000; 0.162500;,
         0.353173; 0.209691;,
         0.380306; 0.256686;,
         0.500000; 0.162500;,
         0.380306; 0.256686;,
         0.421875; 0.291566;,
         0.500000; 0.162500;,
         0.421875; 0.291566;,
         0.472867; 0.310126;,
         0.500000; 0.162500;,
         0.472867; 0.310126;,
         0.527133; 0.310126;,
         0.500000; 0.162500;,
         0.527133; 0.310126;,
         0.578125; 0.291566;,
         0.500000; 0.162500;,
         0.578125; 0.291566;,
         0.619694; 0.256686;,
         0.500000; 0.162500;,
         0.619694; 0.256686;,
         0.646827; 0.209691;,
         0.500000; 0.162500;,
         0.646827; 0.209691;,
         0.656250; 0.156250;,
         0.500000; 0.162500;,
         0.656250; 0.156250;,
         0.646827; 0.102809;,
         0.500000; 0.162500;,
         0.646827; 0.102809;,
         0.619694; 0.055814;,
         0.646827; 0.102809;,
         0.646827; 0.102809;,
         0.619694; 0.055814;,
         0.619694; 0.055814;,
         0.619694; 0.055814;,
         0.578125; 0.020934;,
         0.619694; 0.055814;,
         0.619694; 0.055814;,
         0.578125; 0.020934;,
         0.578125; 0.020934;,
         0.578125; 0.020934;,
         0.527133; 0.002374;,
         0.578125; 0.020934;,
         0.578125; 0.020934;,
         0.527133; 0.002374;,
         0.527133; 0.002374;,
         0.527133; 0.002374;,
         0.472867; 0.002374;,
         0.527133; 0.002374;,
         0.527133; 0.002374;,
         0.472867; 0.002374;,
         0.472867; 0.002374;,
         0.472867; 0.002374;,
         0.421875; 0.020934;,
         0.472867; 0.002374;,
         0.472867; 0.002374;,
         0.421875; 0.020934;,
         0.421875; 0.020934;,
         0.421875; 0.020934;,
         0.380306; 0.055814;,
         0.421875; 0.020934;,
         0.421875; 0.020934;,
         0.380306; 0.055814;,
         0.380306; 0.055814;,
         0.380306; 0.055814;,
         0.353173; 0.102809;,
         0.380306; 0.055814;,
         0.380306; 0.055814;,
         0.353173; 0.102809;,
         0.353173; 0.102809;,
         0.353173; 0.102809;,
         0.343750; 0.156250;,
         0.353173; 0.102809;,
         0.353173; 0.102809;,
         0.343750; 0.156250;,
         0.343750; 0.156250;,
         0.343750; 0.156250;,
         0.353173; 0.209691;,
         0.343750; 0.156250;,
         0.343750; 0.156250;,
         0.353173; 0.209691;,
         0.353173; 0.209691;,
         0.353173; 0.209691;,
         0.380306; 0.256686;,
         0.353173; 0.209691;,
         0.353173; 0.209691;,
         0.380306; 0.256686;,
         0.380306; 0.256686;,
         0.380306; 0.256686;,
         0.421875; 0.291566;,
         0.380306; 0.256686;,
         0.380306; 0.256686;,
         0.421875; 0.291566;,
         0.421875; 0.291566;,
         0.421875; 0.291566;,
         0.472867; 0.310126;,
         0.421875; 0.291566;,
         0.421875; 0.291566;,
         0.472867; 0.310126;,
         0.472867; 0.310126;,
         0.472867; 0.310126;,
         0.527133; 0.310126;,
         0.472867; 0.310126;,
         0.472867; 0.310126;,
         0.527133; 0.310126;,
         0.527133; 0.310126;,
         0.527133; 0.310126;,
         0.578125; 0.291566;,
         0.527133; 0.310126;,
         0.527133; 0.310126;,
         0.578125; 0.291566;,
         0.578125; 0.291566;,
         0.578125; 0.291566;,
         0.619694; 0.256686;,
         0.578125; 0.291566;,
         0.578125; 0.291566;,
         0.619694; 0.256686;,
         0.619694; 0.256686;,
         0.619694; 0.256686;,
         0.646827; 0.209691;,
         0.619694; 0.256686;,
         0.619694; 0.256686;,
         0.646827; 0.209691;,
         0.646827; 0.209691;,
         0.646827; 0.209691;,
         0.656250; 0.156250;,
         0.646827; 0.209691;,
         0.646827; 0.209691;,
         0.656250; 0.156250;,
         0.656250; 0.156250;,
         0.656250; 0.156250;,
         0.646827; 0.102809;,
         0.656250; 0.156250;,
         0.656250; 0.156250;,
         0.646827; 0.102809;,
         0.646827; 0.102809;,
         0.646827; 0.102809;,
         0.619694; 0.055814;,
         0.646827; 0.102809;,
         0.646827; 0.102809;,
         0.619694; 0.055814;,
         0.619694; 0.055814;,
         0.619694; 0.055814;,
         0.578125; 0.020934;,
         0.619694; 0.055814;,
         0.619694; 0.055814;,
         0.578125; 0.020934;,
         0.578125; 0.020934;,
         0.578125; 0.020934;,
         0.527133; 0.002374;,
         0.578125; 0.020934;,
         0.578125; 0.020934;,
         0.527133; 0.002374;,
         0.527133; 0.002374;,
         0.527133; 0.002374;,
         0.472867; 0.002374;,
         0.527133; 0.002374;,
         0.527133; 0.002374;,
         0.472867; 0.002374;,
         0.472867; 0.002374;,
         0.472867; 0.002374;,
         0.421875; 0.020934;,
         0.472867; 0.002374;,
         0.472867; 0.002374;,
         0.421875; 0.020934;,
         0.421875; 0.020934;,
         0.421875; 0.020934;,
         0.380306; 0.055814;,
         0.421875; 0.020934;,
         0.421875; 0.020934;,
         0.380306; 0.055814;,
         0.380306; 0.055814;,
         0.380306; 0.055814;,
         0.353173; 0.102809;,
         0.380306; 0.055814;,
         0.380306; 0.055814;,
         0.353173; 0.102809;,
         0.353173; 0.102809;,
         0.353173; 0.102809;,
         0.343750; 0.156250;,
         0.353173; 0.102809;,
         0.353173; 0.102809;,
         0.343750; 0.156250;,
         0.343750; 0.156250;,
         0.343750; 0.156250;,
         0.353173; 0.209691;,
         0.343750; 0.156250;,
         0.343750; 0.156250;,
         0.353173; 0.209691;,
         0.353173; 0.209691;,
         0.353173; 0.209691;,
         0.380306; 0.256686;,
         0.353173; 0.209691;,
         0.353173; 0.209691;,
         0.380306; 0.256686;,
         0.380306; 0.256686;,
         0.380306; 0.256686;,
         0.421875; 0.291566;,
         0.380306; 0.256686;,
         0.380306; 0.256686;,
         0.421875; 0.291566;,
         0.421875; 0.291566;,
         0.421875; 0.291566;,
         0.472867; 0.310126;,
         0.421875; 0.291566;,
         0.421875; 0.291566;,
         0.472867; 0.310126;,
         0.472867; 0.310126;,
         0.472867; 0.310126;,
         0.527133; 0.310126;,
         0.472867; 0.310126;,
         0.472867; 0.310126;,
         0.527133; 0.310126;,
         0.527133; 0.310126;,
         0.527133; 0.310126;,
         0.578125; 0.291566;,
         0.527133; 0.310126;,
         0.527133; 0.310126;,
         0.578125; 0.291566;,
         0.578125; 0.291566;,
         0.578125; 0.291566;,
         0.619694; 0.256686;,
         0.578125; 0.291566;,
         0.578125; 0.291566;,
         0.619694; 0.256686;,
         0.619694; 0.256686;,
         0.619694; 0.256686;,
         0.646827; 0.209691;,
         0.619694; 0.256686;,
         0.619694; 0.256686;,
         0.646827; 0.209691;,
         0.646827; 0.209691;,
         0.646827; 0.209691;,
         0.656250; 0.156250;,
         0.646827; 0.209691;,
         0.646827; 0.209691;,
         0.656250; 0.156250;,
         0.656250; 0.156250;,
         0.656250; 0.156250;,
         0.646827; 0.102809;,
         0.656250; 0.156250;,
         0.656250; 0.156250;,
         0.646827; 0.102809;,
         0.646827; 0.102809;,
         0.646827; 0.102809;,
         0.619694; 0.055814;,
         0.646827; 0.102809;,
         0.646827; 0.102809;,
         0.619694; 0.055814;,
         0.619694; 0.055814;,
         0.619694; 0.055814;,
         0.578125; 0.020934;,
         0.619694; 0.055814;,
         0.619694; 0.055814;,
         0.578125; 0.020934;,
         0.578125; 0.020934;,
         0.578125; 0.020934;,
         0.527133; 0.002374;,
         0.578125; 0.020934;,
         0.578125; 0.020934;,
         0.527133; 0.002374;,
         0.527133; 0.002374;,
         0.527133; 0.002374;,
         0.472867; 0.002374;,
         0.527133; 0.002374;,
         0.527133; 0.002374;,
         0.472867; 0.002374;,
         0.472867; 0.002374;,
         0.472867; 0.002374;,
         0.421875; 0.020934;,
         0.472867; 0.002374;,
         0.472867; 0.002374;,
         0.421875; 0.020934;,
         0.421875; 0.020934;,
         0.421875; 0.020934;,
         0.380306; 0.055814;,
         0.421875; 0.020934;,
         0.421875; 0.020934;,
         0.380306; 0.055814;,
         0.380306; 0.055814;,
         0.380306; 0.055814;,
         0.353173; 0.102809;,
         0.380306; 0.055814;,
         0.380306; 0.055814;,
         0.353173; 0.102809;,
         0.353173; 0.102809;,
         0.353173; 0.102809;,
         0.343750; 0.156250;,
         0.353173; 0.102809;,
         0.353173; 0.102809;,
         0.343750; 0.156250;,
         0.343750; 0.156250;,
         0.343750; 0.156250;,
         0.353173; 0.209691;,
         0.343750; 0.156250;,
         0.343750; 0.156250;,
         0.353173; 0.209691;,
         0.353173; 0.209691;,
         0.353173; 0.209691;,
         0.380306; 0.256686;,
         0.353173; 0.209691;,
         0.353173; 0.209691;,
         0.380306; 0.256686;,
         0.380306; 0.256686;,
         0.380306; 0.256686;,
         0.421875; 0.291566;,
         0.380306; 0.256686;,
         0.380306; 0.256686;,
         0.421875; 0.291566;,
         0.421875; 0.291566;,
         0.421875; 0.291566;,
         0.472867; 0.310126;,
         0.421875; 0.291566;,
         0.421875; 0.291566;,
         0.472867; 0.310126;,
         0.472867; 0.310126;,
         0.472867; 0.310126;,
         0.527133; 0.310126;,
         0.472867; 0.310126;,
         0.472867; 0.310126;,
         0.527133; 0.310126;,
         0.527133; 0.310126;,
         0.527133; 0.310126;,
         0.578125; 0.291566;,
         0.527133; 0.310126;,
         0.527133; 0.310126;,
         0.578125; 0.291566;,
         0.578125; 0.291566;,
         0.578125; 0.291566;,
         0.619694; 0.256686;,
         0.578125; 0.291566;,
         0.578125; 0.291566;,
         0.619694; 0.256686;,
         0.619694; 0.256686;,
         0.619694; 0.256686;,
         0.646827; 0.209691;,
         0.619694; 0.256686;,
         0.619694; 0.256686;,
         0.646827; 0.209691;,
         0.646827; 0.209691;,
         0.646827; 0.209691;,
         0.656250; 0.156250;,
         0.646827; 0.209691;,
         0.646827; 0.209691;,
         0.656250; 0.156250;,
         0.656250; 0.156250;,
         0.656250; 0.156250;,
         0.646827; 0.102809;,
         0.656250; 0.156250;,
         0.656250; 0.156250;,
         0.646827; 0.102809;,
         0.646827; 0.102809;;
      } // End of keiro_pCylinder1 UV coordinates
      MeshMaterialList { // keiro_pCylinder1 material list
        2;
        180;
        0,
        0,
        0,
        0,
        0,
        0,
        0,
        0,
        0,
        0,
        0,
        0,
        0,
        0,
        0,
        0,
        0,
        0,
        0,
        0,
        0,
        0,
        0,
        0,
        0,
        0,
        0,
        0,
        0,
        0,
        0,
        0,
        0,
        0,
        0,
        0,
        0,
        0,
        0,
        0,
        0,
        0,
        0,
        0,
        0,
        0,
        0,
        0,
        0,
        0,
        0,
        0,
        0,
        0,
        1,
        1,
        1,
        1,
        1,
        1,
        1,
        1,
        1,
        1,
        1,
        1,
        1,
        1,
        1,
        1,
        1,
        1,
        0,
        0,
        0,
        0,
        0,
        0,
        0,
        0,
        0,
        0,
        0,
        0,
        0,
        0,
        0,
        0,
        0,
        0,
        0,
        0,
        0,
        0,
        0,
        0,
        0,
        0,
        0,
        0,
        0,
        0,
        0,
        0,
        0,
        0,
        0,
        0,
        0,
        0,
        0,
        0,
        0,
        0,
        0,
        0,
        0,
        0,
        0,
        0,
        0,
        0,
        0,
        0,
        0,
        0,
        0,
        0,
        0,
        0,
        0,
        0,
        0,
        0,
        0,
        0,
        0,
        0,
        0,
        0,
        0,
        0,
        0,
        0,
        0,
        0,
        0,
        0,
        0,
        0,
        0,
        0,
        0,
        0,
        0,
        0,
        0,
        0,
        0,
        0,
        0,
        0,
        0,
        0,
        0,
        0,
        0,
        0,
        0,
        0,
        0,
        0,
        0,
        0,
        0,
        0,
        0,
        0,
        0,
        0;
        Material keiro_lambert3_001 {
           0.730640; 0.329360; 0.000000; 1.000000;;
           94.117647;
           0.500000; 0.500000; 0.500000;;
           0.000000; 0.000000; 0.000000;;
        }
        Material keiro_lambert2_001 {
           0.443680; 0.000000; 0.000000; 1.000000;;
           94.117647;
           0.500000; 0.500000; 0.500000;;
           0.000000; 0.000000; 0.000000;;
        }
      } // End of keiro_pCylinder1 material list
    } // End of keiro_pCylinder1 mesh
  } // End of keiro_pCylinder1
} // End of Root
