xof 0303txt 0032

Frame Root {
  FrameTransformMatrix {
     1.000000, 0.000000, 0.000000, 0.000000,
     0.000000,-0.000000, 1.000000, 0.000000,
     0.000000, 1.000000, 0.000000, 0.000000,
     0.000000, 0.000000, 0.000000, 1.000000;;
  }
  Frame weapon {
    FrameTransformMatrix {
      -0.000000,-0.010000, 0.000000, 0.000000,
       0.010000,-0.000000, 0.000000, 0.000000,
      -0.000000, 0.000000, 1.000000, 0.000000,
       0.000000, 0.000000, 0.000000, 1.000000;;
    }
    Mesh { // weapon mesh
      64;
       0.000000; 1.000000;-0.500000;,
      -0.000000; 0.999998; 0.500000;,
       0.195090; 0.980785;-0.500000;,
       0.195090; 0.980783; 0.500000;,
       0.382683; 0.923880;-0.500000;,
       0.382683; 0.923878; 0.500000;,
       0.555570; 0.831470;-0.500000;,
       0.555570; 0.831468; 0.500000;,
       0.707107; 0.707107;-0.500000;,
       0.707107; 0.707105; 0.500000;,
       0.831470; 0.555570;-0.500000;,
       0.831470; 0.555568; 0.500000;,
       0.923880; 0.382683;-0.500000;,
       0.923880; 0.382681; 0.500000;,
       0.980785; 0.195090;-0.500000;,
       0.980785; 0.195088; 0.500000;,
       1.000000; 0.000000;-0.500000;,
       1.000000;-0.000002; 0.500000;,
       0.980785;-0.195090;-0.500000;,
       0.980785;-0.195092; 0.500000;,
       0.923880;-0.382683;-0.500000;,
       0.923880;-0.382685; 0.500000;,
       0.831470;-0.555570;-0.500000;,
       0.831470;-0.555572; 0.500000;,
       0.707107;-0.707107;-0.500000;,
       0.707107;-0.707109; 0.500000;,
       0.555570;-0.831470;-0.500000;,
       0.555570;-0.831472; 0.500000;,
       0.382683;-0.923880;-0.500000;,
       0.382683;-0.923882; 0.500000;,
       0.195090;-0.980785;-0.500000;,
       0.195090;-0.980787; 0.500000;,
      -0.000000;-1.000000;-0.500000;,
      -0.000000;-1.000002; 0.500000;,
      -0.195091;-0.980785;-0.500000;,
      -0.195091;-0.980787; 0.500000;,
      -0.382684;-0.923879;-0.500000;,
      -0.382684;-0.923881; 0.500000;,
      -0.555571;-0.831469;-0.500000;,
      -0.555571;-0.831471; 0.500000;,
      -0.707107;-0.707106;-0.500000;,
      -0.707107;-0.707108; 0.500000;,
      -0.831470;-0.555570;-0.500000;,
      -0.831470;-0.555572; 0.500000;,
      -0.923880;-0.382683;-0.500000;,
      -0.923880;-0.382685; 0.500000;,
      -0.980785;-0.195089;-0.500000;,
      -0.980785;-0.195091; 0.500000;,
      -1.000000; 0.000001;-0.500000;,
      -1.000000;-0.000001; 0.500000;,
      -0.980785; 0.195091;-0.500000;,
      -0.980785; 0.195089; 0.500000;,
      -0.923879; 0.382684;-0.500000;,
      -0.923879; 0.382682; 0.500000;,
      -0.831469; 0.555571;-0.500000;,
      -0.831469; 0.555569; 0.500000;,
      -0.707106; 0.707108;-0.500000;,
      -0.707106; 0.707106; 0.500000;,
      -0.555569; 0.831470;-0.500000;,
      -0.555569; 0.831468; 0.500000;,
      -0.382682; 0.923880;-0.500000;,
      -0.382682; 0.923878; 0.500000;,
      -0.195089; 0.980786;-0.500000;,
      -0.195089; 0.980784; 0.500000;;
      34;
      4;2,3,1,0;,
      4;4,5,3,2;,
      4;6,7,5,4;,
      4;8,9,7,6;,
      4;10,11,9,8;,
      4;12,13,11,10;,
      4;14,15,13,12;,
      4;16,17,15,14;,
      4;18,19,17,16;,
      4;20,21,19,18;,
      4;22,23,21,20;,
      4;24,25,23,22;,
      4;26,27,25,24;,
      4;28,29,27,26;,
      4;30,31,29,28;,
      4;32,33,31,30;,
      4;34,35,33,32;,
      4;36,37,35,34;,
      4;38,39,37,36;,
      4;40,41,39,38;,
      4;42,43,41,40;,
      4;44,45,43,42;,
      4;46,47,45,44;,
      4;48,49,47,46;,
      4;50,51,49,48;,
      4;52,53,51,50;,
      4;54,55,53,52;,
      4;56,57,55,54;,
      4;58,59,57,56;,
      4;60,61,59,58;,
      32;5,7,9,11,13,15,17,19,21,23,25,27,29,31,33,35,37,39,41,43,45,47,49,51,53,55,57,59,61,63,1,3;,
      4;62,63,61,60;,
      4;0,1,63,62;,
      32;62,60,58,56,54,52,50,48,46,44,42,40,38,36,34,32,30,28,26,24,22,20,18,16,14,12,10,8,6,4,2,0;;
      MeshNormals { // weapon normals
        34;
         0.098017; 0.995185; 0.000002;,
         0.290285; 0.956940; 0.000002;,
         0.471397; 0.881921; 0.000002;,
         0.634393; 0.773010; 0.000002;,
         0.773010; 0.634393; 0.000001;,
         0.881921; 0.471397; 0.000001;,
         0.956940; 0.290285; 0.000001;,
         0.995185; 0.098017; 0.000000;,
         0.995185;-0.098017;-0.000000;,
         0.956940;-0.290285;-0.000001;,
         0.881921;-0.471397;-0.000001;,
         0.773010;-0.634393;-0.000001;,
         0.634393;-0.773010;-0.000002;,
         0.471397;-0.881921;-0.000002;,
         0.290284;-0.956940;-0.000002;,
         0.098017;-0.995185;-0.000002;,
        -0.098018;-0.995185;-0.000002;,
        -0.290285;-0.956940;-0.000002;,
        -0.471397;-0.881921;-0.000002;,
        -0.634394;-0.773010;-0.000002;,
        -0.773011;-0.634393;-0.000001;,
        -0.881922;-0.471396;-0.000001;,
        -0.956941;-0.290284;-0.000001;,
        -0.995185;-0.098016;-0.000000;,
        -0.995185; 0.098018; 0.000000;,
        -0.956940; 0.290286; 0.000001;,
        -0.881921; 0.471398; 0.000001;,
        -0.773010; 0.634394; 0.000001;,
        -0.634392; 0.773011; 0.000002;,
        -0.471395; 0.881922; 0.000002;,
         0.000000; 0.000000; 1.000000;,
        -0.290283; 0.956941; 0.000002;,
        -0.098017; 0.995185; 0.000002;,
         0.000000; 0.000000;-1.000000;;
        34;
        4;0,0,0,0;,
        4;1,1,1,1;,
        4;2,2,2,2;,
        4;3,3,3,3;,
        4;4,4,4,4;,
        4;5,5,5,5;,
        4;6,6,6,6;,
        4;7,7,7,7;,
        4;8,8,8,8;,
        4;9,9,9,9;,
        4;10,10,10,10;,
        4;11,11,11,11;,
        4;12,12,12,12;,
        4;13,13,13,13;,
        4;14,14,14,14;,
        4;15,15,15,15;,
        4;16,16,16,16;,
        4;17,17,17,17;,
        4;18,18,18,18;,
        4;19,19,19,19;,
        4;20,20,20,20;,
        4;21,21,21,21;,
        4;22,22,22,22;,
        4;23,23,23,23;,
        4;24,24,24,24;,
        4;25,25,25,25;,
        4;26,26,26,26;,
        4;27,27,27,27;,
        4;28,28,28,28;,
        4;29,29,29,29;,
        32;30,30,30,30,30,30,30,30,30,30,30,30,30,30,30,30,30,30,30,30,30,30,30,30,30,30,30,30,30,30,30,30;,
        4;31,31,31,31;,
        4;32,32,32,32;,
        32;33,33,33,33,33,33,33,33,33,33,33,33,33,33,33,33,33,33,33,33,33,33,33,33,33,33,33,33,33,33,33,33;;
      } // End of weapon normals
      MeshMaterialList { // weapon material list
        1;
        34;
        0,
        0,
        0,
        0,
        0,
        0,
        0,
        0,
        0,
        0,
        0,
        0,
        0,
        0,
        0,
        0,
        0,
        0,
        0,
        0,
        0,
        0,
        0,
        0,
        0,
        0,
        0,
        0,
        0,
        0,
        0,
        0,
        0,
        0;
        Material Material_042 {
           0.068360; 0.158449; 0.640000; 1.000000;;
           96.078431;
           0.500000; 0.500000; 0.500000;;
           0.000000; 0.000000; 0.000000;;
        }
      } // End of weapon material list
    } // End of weapon mesh
    Frame link {
      FrameTransformMatrix {
        -0.000000, 2.500000,-0.000000, 0.000000,
        -9.500000,-0.000001, 0.000000, 0.000000,
         0.000002, 0.000008, 0.250000, 0.000000,
         3.287922, 0.000022, 0.656745, 1.000000;;
      }
      Mesh { // link mesh
        8;
        -1.000000;-1.000000;-1.000000;,
        -1.000000;-1.000000; 1.000000;,
        -1.000000; 1.000000;-1.000000;,
        -1.000000; 1.000000; 1.000000;,
         1.000000;-1.000000;-1.000000;,
         1.000000;-1.000000; 1.000000;,
         1.000000; 1.000000;-1.000000;,
         1.000000; 1.000000; 1.000000;;
        6;
        4;2,3,1,0;,
        4;6,7,3,2;,
        4;4,5,7,6;,
        4;0,1,5,4;,
        4;0,4,6,2;,
        4;5,1,3,7;;
        MeshNormals { // link normals
          6;
          -1.000000;-0.000000; 0.000000;,
           0.000000; 1.000000; 0.000000;,
           1.000000;-0.000000; 0.000000;,
           0.000000;-1.000000; 0.000000;,
           0.000000; 0.000000;-1.000000;,
           0.000000;-0.000000; 1.000000;;
          6;
          4;0,0,0,0;,
          4;1,1,1,1;,
          4;2,2,2,2;,
          4;3,3,3,3;,
          4;4,4,4,4;,
          4;5,5,5,5;;
        } // End of link normals
        MeshMaterialList { // link material list
          1;
          6;
          0,
          0,
          0,
          0,
          0,
          0;
          Material Material_042 {
             0.068360; 0.158449; 0.640000; 1.000000;;
             96.078431;
             0.500000; 0.500000; 0.500000;;
             0.000000; 0.000000; 0.000000;;
          }
        } // End of link material list
      } // End of link mesh
      Frame blade1 {
        FrameTransformMatrix {
          -40.000000,-0.000001,-0.000000, 0.000000,
          -0.000000, 0.000001,-4.000000, 0.000000,
           0.000003,-10.526316,-0.000000, 0.000000,
           0.000000, 0.642505,-0.059516, 1.000000;;
        }
        Mesh { // blade1 mesh
          8;
          -0.010000;-1.000000; 0.000000;,
          -0.010000;-1.000000; 0.137303;,
          -0.010000; 0.000000; 0.000000;,
          -0.010000; 0.000000; 0.137303;,
           0.010000;-1.000000; 0.000000;,
           0.010000;-1.000000; 0.137303;,
           0.010000; 0.000000; 0.000000;,
           0.010000; 0.000000; 0.137303;;
          6;
          4;2,3,1,0;,
          4;6,7,3,2;,
          4;4,5,7,6;,
          4;0,1,5,4;,
          4;0,4,6,2;,
          4;5,1,3,7;;
          MeshNormals { // blade1 normals
            6;
            -1.000000;-0.000000; 0.000000;,
             0.000000; 1.000000; 0.000000;,
             1.000000;-0.000000; 0.000000;,
             0.000000;-1.000000; 0.000000;,
             0.000000; 0.000000;-1.000000;,
             0.000000;-0.000000; 1.000000;;
            6;
            4;0,0,0,0;,
            4;1,1,1,1;,
            4;2,2,2,2;,
            4;3,3,3,3;,
            4;4,4,4,4;,
            4;5,5,5,5;;
          } // End of blade1 normals
          MeshMaterialList { // blade1 material list
            1;
            6;
            0,
            0,
            0,
            0,
            0,
            0;
            Material Material_042 {
               0.068360; 0.158449; 0.640000; 1.000000;;
               96.078431;
               0.500000; 0.500000; 0.500000;;
               0.000000; 0.000000; 0.000000;;
            }
          } // End of blade1 material list
        } // End of blade1 mesh
        Frame blade2 {
          FrameTransformMatrix {
             1.000000, 0.000000, 0.000000, 0.000000,
            -0.000000, 1.000000, 0.000000, 0.000000,
             0.000000, 0.000000, 1.000000, 0.000000,
            -0.000000,-0.780190,-0.000000, 1.000000;;
          }
          Mesh { // blade2 mesh
            8;
            -0.010000;-1.000000; 0.010017;,
            -0.010000;-1.000000; 0.126276;,
            -0.010000; 0.000000; 0.010017;,
            -0.010000; 0.000000; 0.126276;,
             0.010000;-1.000000; 0.010017;,
             0.010000;-1.000000; 0.126276;,
             0.010000; 0.000000; 0.010017;,
             0.010000; 0.000000; 0.126276;;
            6;
            4;2,3,1,0;,
            4;6,7,3,2;,
            4;4,5,7,6;,
            4;0,1,5,4;,
            4;0,4,6,2;,
            4;5,1,3,7;;
            MeshNormals { // blade2 normals
              6;
              -1.000000;-0.000000; 0.000000;,
               0.000000; 1.000000; 0.000000;,
               1.000000;-0.000000; 0.000000;,
               0.000000;-1.000000; 0.000000;,
               0.000000; 0.000000;-1.000000;,
               0.000000;-0.000000; 1.000000;;
              6;
              4;0,0,0,0;,
              4;1,1,1,1;,
              4;2,2,2,2;,
              4;3,3,3,3;,
              4;4,4,4,4;,
              4;5,5,5,5;;
            } // End of blade2 normals
            MeshMaterialList { // blade2 material list
              1;
              6;
              0,
              0,
              0,
              0,
              0,
              0;
              Material Material_042 {
                 0.068360; 0.158449; 0.640000; 1.000000;;
                 96.078431;
                 0.500000; 0.500000; 0.500000;;
                 0.000000; 0.000000; 0.000000;;
              }
            } // End of blade2 material list
          } // End of blade2 mesh
        } // End of blade2
      } // End of blade1
    } // End of link
  } // End of weapon
} // End of Root
