xof 0303txt 0032

Frame Root {
  FrameTransformMatrix {
     1.000000, 0.000000, 0.000000, 0.000000,
     0.000000,-0.000000, 1.000000, 0.000000,
     0.000000, 1.000000, 0.000000, 0.000000,
     0.000000, 0.000000, 0.000000, 1.000000;;
  }
  Frame Calf_R {
    FrameTransformMatrix {
       0.122369, 0.000000, 0.000000, 0.000000,
       0.000000,-0.000000,-0.122369, 0.000000,
       0.000000, 0.122369,-0.000000, 0.000000,
       0.000000, 0.000000, 0.000000, 1.000000;;
    }
    Mesh { // Calf_R mesh
      24;
      -0.800000;-0.314254;-2.851092;,
      -0.800000;-0.314254;-0.185746;,
      -0.285934; 1.077223;-2.822772;,
      -0.285934; 1.077223;-0.214066;,
       0.800000;-0.314254;-2.851092;,
       0.800000;-0.314254;-0.185746;,
       0.285934; 1.077223;-2.822772;,
       0.285934; 1.077223;-0.214066;,
      -0.800000; 0.314254;-0.185746;,
      -0.800000; 0.314254;-2.851092;,
       0.800000; 0.314254;-2.851092;,
       0.800000; 0.314254;-0.185746;,
      -0.500000; 0.500000;-3.036838;,
      -0.327498;-0.923998;-2.864336;,
      -0.327498;-0.923998;-0.172502;,
      -0.500000; 0.500000; 0.000000;,
       0.500000; 0.500000; 0.000000;,
       0.500000; 0.500000;-3.036838;,
       0.327498;-0.923998;-2.864336;,
       0.327498;-0.923998;-0.172502;,
      -0.500000;-0.500000;-3.036838;,
      -0.500000;-0.500000; 0.000000;,
       0.500000;-0.500000; 0.000000;,
       0.500000;-0.500000;-3.036838;;
      22;
      4;9,8,1,0;,
      4;6,7,3,2;,
      4;4,5,11,10;,
      4;13,14,19,18;,
      4;20,23,17,12;,
      4;22,21,15,16;,
      4;15,12,2,3;,
      4;12,17,6,2;,
      4;16,15,3,7;,
      4;17,16,7,6;,
      4;20,12,9,0;,
      4;21,20,0,1;,
      4;15,21,1,8;,
      4;12,15,8,9;,
      4;16,17,10,11;,
      4;17,23,4,10;,
      4;22,16,11,5;,
      4;23,22,5,4;,
      4;20,21,14,13;,
      4;22,23,18,19;,
      4;23,20,13,18;,
      4;21,22,19,14;;
      MeshNormals { // Calf_R normals
        22;
        -1.000000;-0.000000; 0.000000;,
         0.000000; 1.000000; 0.000000;,
         1.000000;-0.000000; 0.000000;,
         0.000000;-1.000000; 0.000000;,
         0.000000; 0.000000;-1.000000;,
         0.000000;-0.000000; 1.000000;,
        -0.937601; 0.347714; 0.000000;,
         0.000000; 0.347714;-0.937601;,
         0.000000; 0.347714; 0.937601;,
         0.937601; 0.347714; 0.000000;,
        -0.526419; 0.000000;-0.850225;,
        -0.526419;-0.850225; 0.000000;,
        -0.526419; 0.000000; 0.850225;,
        -0.526419; 0.850225; 0.000000;,
         0.526419; 0.850225; 0.000000;,
         0.526419; 0.000000;-0.850225;,
         0.526419; 0.000000; 0.850225;,
         0.526419;-0.850225; 0.000000;,
        -0.926274;-0.376850; 0.000000;,
         0.926274;-0.376850; 0.000000;,
         0.000000;-0.376850;-0.926274;,
         0.000000;-0.376850; 0.926274;;
        22;
        4;0,0,0,0;,
        4;1,1,1,1;,
        4;2,2,2,2;,
        4;3,3,3,3;,
        4;4,4,4,4;,
        4;5,5,5,5;,
        4;6,6,6,6;,
        4;7,7,7,7;,
        4;8,8,8,8;,
        4;9,9,9,9;,
        4;10,10,10,10;,
        4;11,11,11,11;,
        4;12,12,12,12;,
        4;13,13,13,13;,
        4;14,14,14,14;,
        4;15,15,15,15;,
        4;16,16,16,16;,
        4;17,17,17,17;,
        4;18,18,18,18;,
        4;19,19,19,19;,
        4;20,20,20,20;,
        4;21,21,21,21;;
      } // End of Calf_R normals
      MeshMaterialList { // Calf_R material list
        1;
        22;
        0,
        0,
        0,
        0,
        0,
        0,
        0,
        0,
        0,
        0,
        0,
        0,
        0,
        0,
        0,
        0,
        0,
        0,
        0,
        0,
        0,
        0;
        Material Material_022 {
           0.072673; 0.356161; 0.800000; 1.000000;;
           96.078431;
           0.500000; 0.500000; 0.500000;;
           0.000000; 0.000000; 0.000000;;
        }
      } // End of Calf_R material list
    } // End of Calf_R mesh
  } // End of Calf_R
} // End of Root
