xof 0303txt 0032

Frame Root {
  FrameTransformMatrix {
     1.000000, 0.000000, 0.000000, 0.000000,
     0.000000,-0.000000, 1.000000, 0.000000,
     0.000000, 1.000000, 0.000000, 0.000000,
     0.000000, 0.000000, 0.000000, 1.000000;;
  }
  Frame Foot_L {
    FrameTransformMatrix {
       0.122369, 0.000000, 0.000000, 0.000000,
       0.000000, 0.122369, 0.000000, 0.000000,
       0.000000, 0.000000, 0.122369, 0.000000,
       0.000000, 0.000000, 0.000000, 1.000000;;
    }
    Mesh { // Foot_L mesh
      36;
      -0.380000;-3.016059;-0.005000;,
      -0.101408;-2.943752; 0.235860;,
      -0.700000; 1.986225; 0.050000;,
      -0.500000; 1.437474; 0.449110;,
       0.383000;-3.016059;-0.005000;,
       0.102158;-2.943752; 0.235860;,
       0.700000; 1.986225; 0.050000;,
       0.500000; 1.437474; 0.449110;,
      -1.100000;-2.046357; 0.175329;,
      -0.418217;-1.846059; 0.420000;,
       0.418217;-1.846059; 0.420000;,
       1.100000;-2.046357; 0.175329;,
       1.100000;-1.601648; 0.556997;,
      -1.100000;-1.601648; 0.556997;,
       0.374134;-3.007652; 0.238883;,
      -0.375634;-3.007652; 0.238883;,
      -1.100000; 1.252695; 0.742300;,
      -1.100000; 1.649509; 0.175329;,
       1.100000; 1.649509; 0.175329;,
       1.100000; 1.252695; 0.742300;,
      -1.000000; 1.986225; 0.000000;,
      -0.993253;-2.519857; 0.000000;,
      -0.784915;-1.511018; 0.415752;,
      -0.371316; 1.174543; 0.584248;,
       0.371316; 1.174543; 0.584248;,
       1.000000; 1.986225; 0.000000;,
       0.999252;-2.519857; 0.000000;,
       0.784915;-1.511018; 0.415752;,
      -0.993253;-1.673949; 0.725994;,
      -0.500000; 1.337474; 0.926939;,
       0.500000; 1.337474; 0.926939;,
       0.993253;-1.673949; 0.725994;,
      -0.797639;-1.520969; 0.741228;,
      -0.379175; 1.184494; 0.911705;,
       0.379175; 1.184494; 0.911705;,
       0.797639;-1.520969; 0.741228;;
      34;
      4;17,16,13,8;,
      4;6,7,3,2;,
      4;11,12,19,18;,
      4;0,15,14,4;,
      4;21,26,25,20;,
      4;27,22,23,24;,
      4;21,28,15,0;,
      4;31,26,4,14;,
      4;26,21,0,4;,
      4;9,10,5,1;,
      4;28,31,10,9;,
      4;14,15,1,5;,
      4;15,28,9,1;,
      4;31,14,5,10;,
      4;29,20,2,3;,
      4;20,25,6,2;,
      4;30,29,3,7;,
      4;25,30,7,6;,
      4;21,20,17,8;,
      4;28,21,8,13;,
      4;29,28,13,16;,
      4;20,29,16,17;,
      4;30,25,18,19;,
      4;25,26,11,18;,
      4;31,30,19,12;,
      4;26,31,12,11;,
      4;28,29,33,32;,
      4;29,30,34,33;,
      4;30,31,35,34;,
      4;31,28,32,35;,
      4;32,33,23,22;,
      4;33,34,24,23;,
      4;34,35,27,24;,
      4;35,32,22,27;;
      MeshNormals { // Foot_L normals
        34;
        -1.000000;-0.000000; 0.000000;,
         0.000000; 0.588189; 0.808724;,
         1.000000;-0.000000; 0.000000;,
         0.000000;-0.999406; 0.034452;,
         0.000000; 0.000000;-1.000000;,
         0.000000;-0.062618; 0.998038;,
        -0.646608;-0.570973; 0.505853;,
         0.641347;-0.570841; 0.512655;,
         0.000000; 0.010076;-0.999949;,
         0.000000;-0.165440; 0.986220;,
         0.000000;-0.871589; 0.490238;,
         0.000000; 0.047253; 0.998883;,
         0.323700;-0.134169; 0.936598;,
        -0.324541;-0.133685; 0.936377;,
         0.420703; 0.772551; 0.475578;,
         0.000000; 1.000000;-0.000000;,
         0.000000; 0.978795; 0.204842;,
        -0.420703; 0.772551; 0.475578;,
        -0.861542;-0.000709;-0.507686;,
        -0.854144;-0.338686; 0.394627;,
        -0.447077;-0.021289; 0.894242;,
        -0.414356; 0.674653; 0.610862;,
         0.414356; 0.674653; 0.610862;,
         0.867860;-0.000079;-0.496808;,
         0.447077;-0.021289; 0.894242;,
         0.859025;-0.331103; 0.390445;,
         0.000000;-0.064833; 0.997896;,
         0.000000;-0.099092; 0.995078;,
         0.000000;-0.064833; 0.997896;,
         0.000000;-0.099092; 0.995078;,
         0.987522;-0.154374; 0.031131;,
         0.000000;-0.999539; 0.030374;,
        -0.987522;-0.154374; 0.031131;,
         0.000000; 0.999533; 0.030559;;
        34;
        4;0,0,0,0;,
        4;1,1,1,1;,
        4;2,2,2,2;,
        4;3,3,3,3;,
        4;4,4,4,4;,
        4;5,5,5,5;,
        4;6,6,6,6;,
        4;7,7,7,7;,
        4;8,8,8,8;,
        4;9,9,9,9;,
        4;10,10,10,10;,
        4;11,11,11,11;,
        4;12,12,12,12;,
        4;13,13,13,13;,
        4;14,14,14,14;,
        4;15,15,15,15;,
        4;16,16,16,16;,
        4;17,17,17,17;,
        4;18,18,18,18;,
        4;19,19,19,19;,
        4;20,20,20,20;,
        4;21,21,21,21;,
        4;22,22,22,22;,
        4;23,23,23,23;,
        4;24,24,24,24;,
        4;25,25,25,25;,
        4;26,26,26,26;,
        4;27,27,27,27;,
        4;28,28,28,28;,
        4;29,29,29,29;,
        4;30,30,30,30;,
        4;31,31,31,31;,
        4;32,32,32,32;,
        4;33,33,33,33;;
      } // End of Foot_L normals
      MeshMaterialList { // Foot_L material list
        1;
        34;
        0,
        0,
        0,
        0,
        0,
        0,
        0,
        0,
        0,
        0,
        0,
        0,
        0,
        0,
        0,
        0,
        0,
        0,
        0,
        0,
        0,
        0,
        0,
        0,
        0,
        0,
        0,
        0,
        0,
        0,
        0,
        0,
        0,
        0;
        Material Material_020 {
           0.072673; 0.356161; 0.800000; 1.000000;;
           96.078431;
           0.500000; 0.500000; 0.500000;;
           0.000000; 0.000000; 0.000000;;
        }
      } // End of Foot_L material list
    } // End of Foot_L mesh
    Frame Connection_002 {
      FrameTransformMatrix {
         1.000000, 0.000000, 0.000000, 0.000000,
         0.000000, 1.000000, 0.000000, 0.000000,
         0.000000, 0.000000, 1.000000, 0.000000,
         0.000000, 0.000000, 0.810553, 1.000000;;
      }
      Mesh { // Connection_002 mesh
        16;
        -0.590666;-1.351385; 0.320017;,
        -0.228304; 1.001483; 0.467639;,
         0.228304; 1.001483; 0.467639;,
         0.590666;-1.351385; 0.320017;,
        -0.993253;-1.680662;-0.145257;,
        -0.500000; 1.330760; 0.055688;,
         0.500000; 1.330760; 0.055688;,
         0.993253;-1.680662;-0.145257;,
        -0.797639;-1.527682;-0.130023;,
        -0.379175; 1.177780; 0.040454;,
         0.379175; 1.177780; 0.040454;,
         0.797639;-1.527682;-0.130023;,
        -0.784915;-1.517731; 0.031540;,
        -0.371316; 1.167830; 0.200035;,
         0.371316; 1.167830; 0.200035;,
         0.784915;-1.517731; 0.031540;;
        13;
        4;3,0,1,2;,
        4;4,5,9,8;,
        4;5,6,10,9;,
        4;6,7,11,10;,
        4;7,4,8,11;,
        4;8,9,13,12;,
        4;9,10,14,13;,
        4;10,11,15,14;,
        4;11,8,12,15;,
        4;12,13,1,0;,
        4;13,14,2,1;,
        4;14,15,3,2;,
        4;15,12,0,3;;
        MeshNormals { // Connection_002 normals
          13;
           0.000000;-0.062618; 0.998038;,
           0.000000;-0.064833; 0.997896;,
           0.000000;-0.099092; 0.995078;,
           0.000000;-0.064833; 0.997896;,
           0.000000;-0.099092; 0.995078;,
          -0.986911; 0.148345; 0.063254;,
          -0.000000; 0.998062; 0.062235;,
           0.986911; 0.148345; 0.063254;,
           0.000000;-0.998109; 0.061475;,
          -0.850861; 0.098663; 0.516044;,
          -0.000000; 0.849288; 0.527929;,
           0.850861; 0.098663; 0.516044;,
          -0.000000;-0.866293; 0.499535;;
          13;
          4;0,0,0,0;,
          4;1,1,1,1;,
          4;2,2,2,2;,
          4;3,3,3,3;,
          4;4,4,4,4;,
          4;5,5,5,5;,
          4;6,6,6,6;,
          4;7,7,7,7;,
          4;8,8,8,8;,
          4;9,9,9,9;,
          4;10,10,10,10;,
          4;11,11,11,11;,
          4;12,12,12,12;;
        } // End of Connection_002 normals
        MeshMaterialList { // Connection_002 material list
          1;
          13;
          0,
          0,
          0,
          0,
          0,
          0,
          0,
          0,
          0,
          0,
          0,
          0,
          0;
          Material Material_018 {
             0.072673; 0.356161; 0.800000; 1.000000;;
             96.078431;
             0.500000; 0.500000; 0.500000;;
             0.000000; 0.000000; 0.000000;;
          }
        } // End of Connection_002 material list
      } // End of Connection_002 mesh
    } // End of Connection_002
  } // End of Foot_L
} // End of Root
