xof 0303txt 0032

Frame Root {
  FrameTransformMatrix {
     1.000000, 0.000000, 0.000000, 0.000000,
     0.000000,-0.000000, 1.000000, 0.000000,
     0.000000, 1.000000, 0.000000, 0.000000,
     0.000000, 0.000000, 0.000000, 1.000000;;
  }
  Frame Torchka {
    FrameTransformMatrix {
       1.000000, 0.000000, 0.000000, 0.000000,
       0.000000, 1.000000, 0.000000, 0.000000,
       0.000000, 0.000000, 1.000000, 0.000000,
       0.000000, 0.000000, 0.000000, 1.000000;;
    }
    Mesh { // Torchka mesh
      0;
      0;
      MeshNormals { // Torchka normals
        0;
        0;
      } // End of Torchka normals
    } // End of Torchka mesh
    Frame Cube {
      FrameTransformMatrix {
         0.200000, 0.000000, 0.000000, 0.000000,
         0.000000, 0.200000, 0.000000, 0.000000,
         0.000000, 0.000000, 0.200000, 0.000000,
         0.000000, 0.000000, 0.196285, 1.000000;;
      }
      Mesh { // Cube mesh
        8;
        -1.000000;-1.000000;-1.000000;,
        -1.000000;-1.000000; 1.000000;,
        -1.000000; 1.000000;-1.000000;,
        -1.000000; 1.000000; 1.000000;,
         1.000000;-1.000000;-1.000000;,
         1.000000;-1.000000; 1.000000;,
         1.000000; 1.000000;-1.000000;,
         1.000000; 1.000000; 1.000000;;
        6;
        4;2,3,1,0;,
        4;6,7,3,2;,
        4;4,5,7,6;,
        4;0,1,5,4;,
        4;0,4,6,2;,
        4;5,1,3,7;;
        MeshNormals { // Cube normals
          6;
          -1.000000;-0.000000; 0.000000;,
           0.000000; 1.000000; 0.000000;,
           1.000000;-0.000000; 0.000000;,
           0.000000;-1.000000; 0.000000;,
           0.000000; 0.000000;-1.000000;,
           0.000000;-0.000000; 1.000000;;
          6;
          4;0,0,0,0;,
          4;1,1,1,1;,
          4;2,2,2,2;,
          4;3,3,3,3;,
          4;4,4,4,4;,
          4;5,5,5,5;;
        } // End of Cube normals
        MeshMaterialList { // Cube material list
          1;
          6;
          0,
          0,
          0,
          0,
          0,
          0;
          Material Material_027 {
             0.800000; 0.106295; 0.085618; 1.000000;;
             96.078431;
             0.500000; 0.500000; 0.500000;;
             0.000000; 0.000000; 0.000000;;
          }
        } // End of Cube material list
      } // End of Cube mesh
    } // End of Cube
    Frame Cube_001 {
      FrameTransformMatrix {
         0.300000, 0.000000, 0.000000, 0.000000,
         0.000000, 0.300000, 0.000000, 0.000000,
         0.000000, 0.000000, 1.000000, 0.000000,
         0.000000, 0.000000, 1.118992, 1.000000;;
      }
      Mesh { // Cube_001 mesh
        8;
        -1.000000;-1.000000;-1.000000;,
        -1.000000;-1.000000; 1.000000;,
        -1.000000; 1.000000;-1.000000;,
        -1.000000; 1.000000; 1.000000;,
         1.000000;-1.000000;-1.000000;,
         1.000000;-1.000000; 1.000000;,
         1.000000; 1.000000;-1.000000;,
         1.000000; 1.000000; 1.000000;;
        6;
        4;2,3,1,0;,
        4;6,7,3,2;,
        4;4,5,7,6;,
        4;0,1,5,4;,
        4;0,4,6,2;,
        4;5,1,3,7;;
        MeshNormals { // Cube_001 normals
          6;
          -1.000000;-0.000000; 0.000000;,
           0.000000; 1.000000; 0.000000;,
           1.000000;-0.000000; 0.000000;,
           0.000000;-1.000000; 0.000000;,
           0.000000; 0.000000;-1.000000;,
           0.000000;-0.000000; 1.000000;;
          6;
          4;0,0,0,0;,
          4;1,1,1,1;,
          4;2,2,2,2;,
          4;3,3,3,3;,
          4;4,4,4,4;,
          4;5,5,5,5;;
        } // End of Cube_001 normals
        MeshMaterialList { // Cube_001 material list
          1;
          6;
          0,
          0,
          0,
          0,
          0,
          0;
          Material Material_026 {
             0.800000; 0.106295; 0.085618; 1.000000;;
             96.078431;
             0.500000; 0.500000; 0.500000;;
             0.000000; 0.000000; 0.000000;;
          }
        } // End of Cube_001 material list
      } // End of Cube_001 mesh
    } // End of Cube_001
    Frame Cube_002 {
      FrameTransformMatrix {
         0.310000, 0.000000, 0.000000, 0.000000,
         0.000000, 0.310000, 0.000000, 0.000000,
         0.000000, 0.000000, 0.010000, 0.000000,
         0.000000, 0.000000, 1.632700, 1.000000;;
      }
      Mesh { // Cube_002 mesh
        8;
        -1.000000;-1.000000;-1.000000;,
        -1.000000;-1.000000; 1.000000;,
        -1.000000; 1.000000;-1.000000;,
        -1.000000; 1.000000; 1.000000;,
         1.000000;-1.000000;-1.000000;,
         1.000000;-1.000000; 1.000000;,
         1.000000; 1.000000;-1.000000;,
         1.000000; 1.000000; 1.000000;;
        6;
        4;2,3,1,0;,
        4;6,7,3,2;,
        4;4,5,7,6;,
        4;0,1,5,4;,
        4;0,4,6,2;,
        4;5,1,3,7;;
        MeshNormals { // Cube_002 normals
          6;
          -1.000000;-0.000000; 0.000000;,
           0.000000; 1.000000; 0.000000;,
           1.000000;-0.000000; 0.000000;,
           0.000000;-1.000000; 0.000000;,
           0.000000; 0.000000;-1.000000;,
           0.000000;-0.000000; 1.000000;;
          6;
          4;0,0,0,0;,
          4;1,1,1,1;,
          4;2,2,2,2;,
          4;3,3,3,3;,
          4;4,4,4,4;,
          4;5,5,5,5;;
        } // End of Cube_002 normals
        MeshMaterialList { // Cube_002 material list
          1;
          6;
          0,
          0,
          0,
          0,
          0,
          0;
          Material Material_028 {
             0.049104; 0.106265; 0.640000; 1.000000;;
             96.078431;
             0.500000; 0.500000; 0.500000;;
             0.000000; 0.000000; 0.000000;;
          }
        } // End of Cube_002 material list
      } // End of Cube_002 mesh
    } // End of Cube_002
    Frame Cube_003 {
      FrameTransformMatrix {
         0.310000, 0.000000, 0.000000, 0.000000,
         0.000000, 0.310000, 0.000000, 0.000000,
         0.000000, 0.000000, 0.010000, 0.000000,
         0.000000, 0.000000, 1.673001, 1.000000;;
      }
      Mesh { // Cube_003 mesh
        8;
        -1.000000;-1.000000;-1.000000;,
        -1.000000;-1.000000; 1.000000;,
        -1.000000; 1.000000;-1.000000;,
        -1.000000; 1.000000; 1.000000;,
         1.000000;-1.000000;-1.000000;,
         1.000000;-1.000000; 1.000000;,
         1.000000; 1.000000;-1.000000;,
         1.000000; 1.000000; 1.000000;;
        6;
        4;2,3,1,0;,
        4;6,7,3,2;,
        4;4,5,7,6;,
        4;0,1,5,4;,
        4;0,4,6,2;,
        4;5,1,3,7;;
        MeshNormals { // Cube_003 normals
          6;
          -1.000000;-0.000000; 0.000000;,
           0.000000; 1.000000; 0.000000;,
           1.000000;-0.000000; 0.000000;,
           0.000000;-1.000000; 0.000000;,
           0.000000; 0.000000;-1.000000;,
           0.000000;-0.000000; 1.000000;;
          6;
          4;0,0,0,0;,
          4;1,1,1,1;,
          4;2,2,2,2;,
          4;3,3,3,3;,
          4;4,4,4,4;,
          4;5,5,5,5;;
        } // End of Cube_003 normals
        MeshMaterialList { // Cube_003 material list
          1;
          6;
          0,
          0,
          0,
          0,
          0,
          0;
          Material Material_028 {
             0.049104; 0.106265; 0.640000; 1.000000;;
             96.078431;
             0.500000; 0.500000; 0.500000;;
             0.000000; 0.000000; 0.000000;;
          }
        } // End of Cube_003 material list
      } // End of Cube_003 mesh
    } // End of Cube_003
    Frame Cube_004 {
      FrameTransformMatrix {
         0.310000, 0.000000, 0.000000, 0.000000,
         0.000000, 0.310000, 0.000000, 0.000000,
         0.000000, 0.000000, 0.010000, 0.000000,
         0.000000, 0.000000, 1.653592, 1.000000;;
      }
      Mesh { // Cube_004 mesh
        8;
        -1.000000;-1.000000;-1.000000;,
        -1.000000;-1.000000; 1.000000;,
        -1.000000; 1.000000;-1.000000;,
        -1.000000; 1.000000; 1.000000;,
         1.000000;-1.000000;-1.000000;,
         1.000000;-1.000000; 1.000000;,
         1.000000; 1.000000;-1.000000;,
         1.000000; 1.000000; 1.000000;;
        6;
        4;2,3,1,0;,
        4;6,7,3,2;,
        4;4,5,7,6;,
        4;0,1,5,4;,
        4;0,4,6,2;,
        4;5,1,3,7;;
        MeshNormals { // Cube_004 normals
          6;
          -1.000000;-0.000000; 0.000000;,
           0.000000; 1.000000; 0.000000;,
           1.000000;-0.000000; 0.000000;,
           0.000000;-1.000000; 0.000000;,
           0.000000; 0.000000;-1.000000;,
           0.000000;-0.000000; 1.000000;;
          6;
          4;0,0,0,0;,
          4;1,1,1,1;,
          4;2,2,2,2;,
          4;3,3,3,3;,
          4;4,4,4,4;,
          4;5,5,5,5;;
        } // End of Cube_004 normals
        MeshMaterialList { // Cube_004 material list
          1;
          6;
          0,
          0,
          0,
          0,
          0,
          0;
          Material Material_029 {
             0.000000; 0.000000; 0.000000; 1.000000;;
             96.078431;
             0.500000; 0.500000; 0.500000;;
             0.000000; 0.000000; 0.000000;;
          }
        } // End of Cube_004 material list
      } // End of Cube_004 mesh
    } // End of Cube_004
  } // End of Torchka
} // End of Root
