xof 0303txt 0032

Frame Root {
  FrameTransformMatrix {
     1.000000, 0.000000, 0.000000, 0.000000,
     0.000000,-0.000000, 1.000000, 0.000000,
     0.000000, 1.000000, 0.000000, 0.000000,
     0.000000, 0.000000, 0.000000, 1.000000;;
  }
  Frame Arms_Child_R {
    FrameTransformMatrix {
       0.122369, 0.000000, 0.000000, 0.000000,
       0.000000,-0.000000,-0.122369, 0.000000,
       0.000000, 0.122369,-0.000000, 0.000000,
       0.000000, 0.000000, 0.000000, 1.000000;;
    }
    Mesh { // Arms_Child_R mesh
      20;
       0.015211;-0.772090;-1.816066;,
      -0.249858;-0.772090;-0.183934;,
       0.015211; 0.779355;-1.816066;,
      -0.249858; 0.779355;-0.183934;,
       0.316066;-0.772090;-1.816066;,
       0.316066;-0.772090;-0.183934;,
       0.316066; 0.779355;-1.816066;,
       0.316066; 0.779355;-0.183934;,
      -0.302647;-0.359565;-1.875206;,
      -0.567716;-0.359565;-0.124794;,
      -0.567716; 0.390847;-0.124794;,
      -0.302647; 0.390847;-1.875206;,
       0.500000; 0.515641;-2.000000;,
       0.500000; 0.515641; 0.000000;,
       0.500000;-0.484359; 0.000000;,
       0.500000;-0.484359;-2.000000;,
      -0.168723; 0.515641;-2.000000;,
      -0.168723;-0.484359;-2.000000;,
      -0.433792;-0.484359; 0.000000;,
      -0.433792; 0.515641; 0.000000;;
      18;
      4;11,10,9,8;,
      4;6,7,3,2;,
      4;15,14,13,12;,
      4;0,1,5,4;,
      4;17,15,12,16;,
      4;14,18,19,13;,
      4;17,18,1,0;,
      4;19,16,2,3;,
      4;16,12,6,2;,
      4;13,19,3,7;,
      4;12,13,7,6;,
      4;14,15,4,5;,
      4;15,17,0,4;,
      4;18,14,5,1;,
      4;17,16,11,8;,
      4;18,17,8,9;,
      4;19,18,9,10;,
      4;16,19,10,11;;
      MeshNormals { // Arms_Child_R normals
        18;
        -0.988728; 0.000000;-0.149726;,
         0.000000; 1.000000; 0.000000;,
         1.000000;-0.000000; 0.000000;,
         0.000000;-1.000000; 0.000000;,
         0.000000; 0.000000;-1.000000;,
         0.000000;-0.000000; 1.000000;,
        -0.836256;-0.534581;-0.122058;,
        -0.814389; 0.568015;-0.118867;,
         0.000000; 0.572071;-0.820204;,
         0.000000; 0.572071; 0.820204;,
         0.820204; 0.572071; 0.000000;,
         0.842556;-0.538608; 0.000000;,
         0.000000;-0.538608;-0.842556;,
         0.000000;-0.538608; 0.842556;,
        -0.681729; 0.000000;-0.731605;,
        -0.678585;-0.728231;-0.095921;,
        -0.681729; 0.000000; 0.731605;,
        -0.678585; 0.728231;-0.095921;;
        18;
        4;0,0,0,0;,
        4;1,1,1,1;,
        4;2,2,2,2;,
        4;3,3,3,3;,
        4;4,4,4,4;,
        4;5,5,5,5;,
        4;6,6,6,6;,
        4;7,7,7,7;,
        4;8,8,8,8;,
        4;9,9,9,9;,
        4;10,10,10,10;,
        4;11,11,11,11;,
        4;12,12,12,12;,
        4;13,13,13,13;,
        4;14,14,14,14;,
        4;15,15,15,15;,
        4;16,16,16,16;,
        4;17,17,17,17;;
      } // End of Arms_Child_R normals
      MeshMaterialList { // Arms_Child_R material list
        1;
        18;
        0,
        0,
        0,
        0,
        0,
        0,
        0,
        0,
        0,
        0,
        0,
        0,
        0,
        0,
        0,
        0,
        0,
        0;
        Material Material_013 {
           0.072673; 0.356161; 0.800000; 1.000000;;
           96.078431;
           0.500000; 0.500000; 0.500000;;
           0.000000; 0.000000; 0.000000;;
        }
      } // End of Arms_Child_R material list
    } // End of Arms_Child_R mesh
  } // End of Arms_Child_R
} // End of Root
