xof 0303txt 0032

Frame Root {
  FrameTransformMatrix {
     1.000000, 0.000000, 0.000000, 0.000000,
     0.000000,-0.000000, 1.000000, 0.000000,
     0.000000, 1.000000, 0.000000, 0.000000,
     0.000000, 0.000000, 0.000000, 1.000000;;
  }
  Frame Arms_Parent_R {
    FrameTransformMatrix {
       0.122369, 0.000000, 0.000000, 0.000000,
       0.000000,-0.000000,-0.122369, 0.000000,
       0.000000, 0.122369,-0.000000, 0.000000,
       0.000000, 0.000000, 0.000000, 1.000000;;
    }
    Mesh { // Arms_Parent_R mesh
      20;
      -0.267983;-0.772090;-2.124474;,
      -0.316066;-0.772090; 0.218751;,
      -0.267983; 0.779355;-2.124474;,
      -0.316066; 0.779355; 0.218751;,
       0.316066;-0.772090;-2.124474;,
       0.316066;-0.772090; 0.218751;,
       0.316066; 0.779355;-2.124474;,
       0.316066; 0.779355; 0.218751;,
      -0.585841;-0.359565;-2.183613;,
      -0.633924;-0.359565; 0.277891;,
      -0.633924; 0.390847; 0.277891;,
      -0.585841; 0.390847;-2.183613;,
       0.500000; 0.515641;-2.308407;,
       0.500000; 0.515641; 0.402685;,
       0.500000;-0.484359; 0.402685;,
       0.500000;-0.484359;-2.308407;,
      -0.451917; 0.515641;-2.308407;,
      -0.451917;-0.484359;-2.308407;,
      -0.500000;-0.484359; 0.402685;,
      -0.500000; 0.515641; 0.402685;;
      18;
      4;11,10,9,8;,
      4;6,7,3,2;,
      4;15,14,13,12;,
      4;0,1,5,4;,
      4;17,15,12,16;,
      4;14,18,19,13;,
      4;17,18,1,0;,
      4;19,16,2,3;,
      4;16,12,6,2;,
      4;13,19,3,7;,
      4;12,13,7,6;,
      4;14,15,4,5;,
      4;15,17,0,4;,
      4;18,14,5,1;,
      4;17,16,11,8;,
      4;18,17,8,9;,
      4;19,18,9,10;,
      4;16,19,10,11;;
      MeshNormals { // Arms_Parent_R normals
        18;
        -0.999809; 0.000000;-0.019530;,
         0.000000; 1.000000; 0.000000;,
         1.000000;-0.000000; 0.000000;,
         0.000000;-1.000000; 0.000000;,
         0.000000; 0.000000;-1.000000;,
         0.000000;-0.000000; 1.000000;,
        -0.842448;-0.538539;-0.016029;,
        -0.820104; 0.572001;-0.015604;,
         0.000000; 0.572071;-0.820204;,
         0.000000; 0.572071; 0.820204;,
         0.820204; 0.572071; 0.000000;,
         0.842556;-0.538608; 0.000000;,
         0.000000;-0.538608;-0.842556;,
         0.000000;-0.538608; 0.842556;,
        -0.681729; 0.000000;-0.731605;,
        -0.681674;-0.731546;-0.012673;,
        -0.681729; 0.000000; 0.731605;,
        -0.681674; 0.731546;-0.012673;;
        18;
        4;0,0,0,0;,
        4;1,1,1,1;,
        4;2,2,2,2;,
        4;3,3,3,3;,
        4;4,4,4,4;,
        4;5,5,5,5;,
        4;6,6,6,6;,
        4;7,7,7,7;,
        4;8,8,8,8;,
        4;9,9,9,9;,
        4;10,10,10,10;,
        4;11,11,11,11;,
        4;12,12,12,12;,
        4;13,13,13,13;,
        4;14,14,14,14;,
        4;15,15,15,15;,
        4;16,16,16,16;,
        4;17,17,17,17;;
      } // End of Arms_Parent_R normals
      MeshMaterialList { // Arms_Parent_R material list
        1;
        18;
        0,
        0,
        0,
        0,
        0,
        0,
        0,
        0,
        0,
        0,
        0,
        0,
        0,
        0,
        0,
        0,
        0,
        0;
        Material Material_012 {
           0.072673; 0.356161; 0.800000; 1.000000;;
           96.078431;
           0.500000; 0.500000; 0.500000;;
           0.000000; 0.000000; 0.000000;;
        }
      } // End of Arms_Parent_R material list
    } // End of Arms_Parent_R mesh
  } // End of Arms_Parent_R
} // End of Root
