xof 0303txt 0032

Frame Root {
  FrameTransformMatrix {
     1.000000, 0.000000, 0.000000, 0.000000,
     0.000000,-0.000000, 1.000000, 0.000000,
     0.000000, 1.000000, 0.000000, 0.000000,
     0.000000, 0.000000, 0.000000, 1.000000;;
  }
  Frame Hand_L {
    FrameTransformMatrix {
      -0.122369,-0.000000, 0.000000, 0.000000,
      -0.000000, 0.000000, 0.122369, 0.000000,
      -0.000000, 0.122369,-0.000000, 0.000000,
       0.000000, 0.000000, 0.000000, 1.000000;;
    }
    Mesh { // Hand_L mesh
      20;
       0.042858;-0.505052;-0.956911;,
       0.042858;-0.783895;-0.173059;,
       0.042858; 0.492576;-0.956911;,
       0.042858; 0.767551;-0.173059;,
       0.085732;-0.505052;-0.956911;,
       0.085732;-0.783895;-0.173059;,
       0.085732; 0.492576;-0.956911;,
       0.085732; 0.767551;-0.173059;,
      -0.016740;-0.092527;-1.016051;,
      -0.510756;-0.371369;-0.113920;,
      -0.510756; 0.379043;-0.113920;,
      -0.016740; 0.104068;-1.016051;,
       0.187957; 0.228862;-1.140845;,
       0.187957; 0.503837; 0.010874;,
       0.187957;-0.496163; 0.010874;,
       0.187957;-0.217321;-1.140845;,
       0.117184; 0.228862;-1.140845;,
       0.117184;-0.217321;-1.140845;,
      -0.222784;-0.496163; 0.010874;,
      -0.222784; 0.503837; 0.010874;;
      18;
      4;11,10,9,8;,
      4;6,7,3,2;,
      4;15,14,13,12;,
      4;0,1,5,4;,
      4;17,15,12,16;,
      4;14,18,19,13;,
      4;17,18,1,0;,
      4;19,16,2,3;,
      4;16,12,6,2;,
      4;13,19,3,7;,
      4;12,13,7,6;,
      4;14,15,4,5;,
      4;15,17,0,4;,
      4;18,14,5,1;,
      4;17,16,11,8;,
      4;18,17,8,9;,
      4;19,18,9,10;,
      4;16,19,10,11;;
      MeshNormals { // Hand_L normals
        18;
        -0.877100; 0.000000;-0.480308;,
         0.000000; 0.943623;-0.331023;,
         1.000000;-0.000000; 0.000000;,
         0.000000;-0.942162;-0.335159;,
         0.000000; 0.000000;-1.000000;,
         0.000000;-0.000000; 1.000000;,
        -0.918940;-0.305508;-0.249429;,
        -0.909371; 0.329861;-0.253447;,
         0.000000; 0.572071;-0.820204;,
         0.000000; 0.572071; 0.820204;,
         0.927521; 0.359541;-0.102156;,
         0.937944;-0.333232;-0.096012;,
         0.000000;-0.538608;-0.842556;,
         0.000000;-0.538608; 0.842556;,
        -0.681729; 0.000000;-0.731605;,
        -0.465966;-0.787655;-0.403083;,
        -0.397624; 0.000000; 0.917548;,
        -0.466522; 0.788595;-0.400594;;
        18;
        4;0,0,0,0;,
        4;1,1,1,1;,
        4;2,2,2,2;,
        4;3,3,3,3;,
        4;4,4,4,4;,
        4;5,5,5,5;,
        4;6,6,6,6;,
        4;7,7,7,7;,
        4;8,8,8,8;,
        4;9,9,9,9;,
        4;10,10,10,10;,
        4;11,11,11,11;,
        4;12,12,12,12;,
        4;13,13,13,13;,
        4;14,14,14,14;,
        4;15,15,15,15;,
        4;16,16,16,16;,
        4;17,17,17,17;;
      } // End of Hand_L normals
      MeshMaterialList { // Hand_L material list
        1;
        18;
        0,
        0,
        0,
        0,
        0,
        0,
        0,
        0,
        0,
        0,
        0,
        0,
        0,
        0,
        0,
        0,
        0,
        0;
        Material Material_016 {
           0.072673; 0.356161; 0.800000; 1.000000;;
           96.078431;
           0.500000; 0.500000; 0.500000;;
           0.000000; 0.000000; 0.000000;;
        }
      } // End of Hand_L material list
    } // End of Hand_L mesh
  } // End of Hand_L
} // End of Root
