xof 0303txt 0032

Frame Root {
  FrameTransformMatrix {
     1.000000, 0.000000, 0.000000, 0.000000,
     0.000000,-0.000000, 1.000000, 0.000000,
     0.000000, 1.000000, 0.000000, 0.000000,
     0.000000, 0.000000, 0.000000, 1.000000;;
  }
  Frame leg {
    FrameTransformMatrix {
       1.000000, 0.000000, 0.000000, 0.000000,
       0.000000, 1.000000, 0.000000, 0.000000,
       0.000000, 0.000000, 1.000000, 0.000000,
       0.000000, 0.000000, 0.000000, 1.000000;;
    }
    Mesh { // leg mesh
      10;
      -0.200000;-0.200000;-1.000000;,
      -0.200000;-0.200000; 0.000000;,
      -0.200000; 0.200000;-1.000000;,
      -0.200000; 0.200000; 0.000000;,
       0.000000;-0.200000;-1.000000;,
       0.200000;-0.200000; 0.000000;,
       0.000000; 0.200000;-1.000000;,
       0.200000; 0.200000; 0.000000;,
       0.200000; 0.200000;-0.800000;,
       0.200000;-0.200000;-0.800000;;
      7;
      4;2,3,1,0;,
      5;6,8,7,3,2;,
      4;9,5,7,8;,
      5;0,1,5,9,4;,
      4;0,4,6,2;,
      4;5,1,3,7;,
      4;4,9,8,6;;
      MeshNormals { // leg normals
        7;
        -1.000000;-0.000000; 0.000000;,
         0.000000; 1.000000; 0.000000;,
         1.000000;-0.000000; 0.000000;,
         0.000000;-1.000000; 0.000000;,
         0.000000; 0.000000;-1.000000;,
         0.000000;-0.000000; 1.000000;,
         0.707107; 0.000000;-0.707107;;
        7;
        4;0,0,0,0;,
        5;1,1,1,1,1;,
        4;2,2,2,2;,
        5;3,3,3,3,3;,
        4;4,4,4,4;,
        4;5,5,5,5;,
        4;6,6,6,6;;
      } // End of leg normals
      MeshMaterialList { // leg material list
        1;
        7;
        0,
        0,
        0,
        0,
        0,
        0,
        0;
        Material Material_034 {
           0.800000; 0.106295; 0.085618; 1.000000;;
           96.078431;
           0.500000; 0.500000; 0.500000;;
           0.000000; 0.000000; 0.000000;;
        }
      } // End of leg material list
    } // End of leg mesh
    Frame Cube_005 {
      FrameTransformMatrix {
         0.320000, 0.000000, 0.000000, 0.000000,
         0.000000, 0.040000, 0.000000, 0.000000,
         0.000000, 0.000000, 0.200000, 0.000000,
         0.119871, 0.220000,-0.800131, 1.000000;;
      }
      Mesh { // Cube_005 mesh
        8;
        -1.000000;-1.000000;-1.000000;,
        -1.000000;-1.000000; 1.000000;,
        -1.000000; 1.000000;-1.000000;,
        -1.000000; 1.000000; 1.000000;,
         1.000000;-1.000000;-1.000000;,
         1.000000;-1.000000; 1.000000;,
         1.000000; 1.000000;-1.000000;,
         1.000000; 1.000000; 1.000000;;
        6;
        4;2,3,1,0;,
        4;6,7,3,2;,
        4;4,5,7,6;,
        4;0,1,5,4;,
        4;0,4,6,2;,
        4;5,1,3,7;;
        MeshNormals { // Cube_005 normals
          6;
          -1.000000;-0.000000; 0.000000;,
           0.000000; 1.000000; 0.000000;,
           1.000000;-0.000000; 0.000000;,
           0.000000;-1.000000; 0.000000;,
           0.000000; 0.000000;-1.000000;,
           0.000000;-0.000000; 1.000000;;
          6;
          4;0,0,0,0;,
          4;1,1,1,1;,
          4;2,2,2,2;,
          4;3,3,3,3;,
          4;4,4,4,4;,
          4;5,5,5,5;;
        } // End of Cube_005 normals
        MeshMaterialList { // Cube_005 material list
          1;
          6;
          0,
          0,
          0,
          0,
          0,
          0;
          Material Material_032 {
             0.639282; 0.014114; 0.011555; 1.000000;;
             96.078431;
             0.500000; 0.500000; 0.500000;;
             0.000000; 0.000000; 0.000000;;
          }
        } // End of Cube_005 material list
      } // End of Cube_005 mesh
    } // End of Cube_005
    Frame Cube_007 {
      FrameTransformMatrix {
         0.320000, 0.000000, 0.000000, 0.000000,
         0.000000, 0.040000, 0.000000, 0.000000,
         0.000000, 0.000000, 0.200000, 0.000000,
         0.119871,-0.220000,-0.800131, 1.000000;;
      }
      Mesh { // Cube_007 mesh
        8;
        -1.000000;-1.000000;-1.000000;,
        -1.000000;-1.000000; 1.000000;,
        -1.000000; 1.000000;-1.000000;,
        -1.000000; 1.000000; 1.000000;,
         1.000000;-1.000000;-1.000000;,
         1.000000;-1.000000; 1.000000;,
         1.000000; 1.000000;-1.000000;,
         1.000000; 1.000000; 1.000000;;
        6;
        4;2,3,1,0;,
        4;6,7,3,2;,
        4;4,5,7,6;,
        4;0,1,5,4;,
        4;0,4,6,2;,
        4;5,1,3,7;;
        MeshNormals { // Cube_007 normals
          6;
          -1.000000;-0.000000; 0.000000;,
           0.000000; 1.000000; 0.000000;,
           1.000000;-0.000000; 0.000000;,
           0.000000;-1.000000; 0.000000;,
           0.000000; 0.000000;-1.000000;,
           0.000000;-0.000000; 1.000000;;
          6;
          4;0,0,0,0;,
          4;1,1,1,1;,
          4;2,2,2,2;,
          4;3,3,3,3;,
          4;4,4,4,4;,
          4;5,5,5,5;;
        } // End of Cube_007 normals
        MeshMaterialList { // Cube_007 material list
          1;
          6;
          0,
          0,
          0,
          0,
          0,
          0;
          Material Material_033 {
             0.639282; 0.014114; 0.011555; 1.000000;;
             96.078431;
             0.500000; 0.500000; 0.500000;;
             0.000000; 0.000000; 0.000000;;
          }
        } // End of Cube_007 material list
      } // End of Cube_007 mesh
    } // End of Cube_007
    Frame Cylinder {
      FrameTransformMatrix {
         0.050000, 0.000000, 0.000000, 0.000000,
         0.000000,-0.000000, 0.050000, 0.000000,
         0.000000,-0.250000,-0.000000, 0.000000,
         0.181711, 0.000000,-0.889536, 1.000000;;
      }
      Mesh { // Cylinder mesh
        64;
         0.000000; 1.000000;-1.000000;,
         0.000000; 1.000000; 1.000000;,
         0.195090; 0.980785;-1.000000;,
         0.195090; 0.980785; 1.000000;,
         0.382683; 0.923880;-1.000000;,
         0.382683; 0.923880; 1.000000;,
         0.555570; 0.831470;-1.000000;,
         0.555570; 0.831470; 1.000000;,
         0.707107; 0.707107;-1.000000;,
         0.707107; 0.707107; 1.000000;,
         0.831470; 0.555570;-1.000000;,
         0.831470; 0.555570; 1.000000;,
         0.923880; 0.382683;-1.000000;,
         0.923880; 0.382683; 1.000000;,
         0.980785; 0.195090;-1.000000;,
         0.980785; 0.195090; 1.000000;,
         1.000000; 0.000000;-1.000000;,
         1.000000; 0.000000; 1.000000;,
         0.980785;-0.195090;-1.000000;,
         0.980785;-0.195090; 1.000000;,
         0.923880;-0.382683;-1.000000;,
         0.923880;-0.382683; 1.000000;,
         0.831470;-0.555570;-1.000000;,
         0.831470;-0.555570; 1.000000;,
         0.707107;-0.707107;-1.000000;,
         0.707107;-0.707107; 1.000000;,
         0.555570;-0.831470;-1.000000;,
         0.555570;-0.831470; 1.000000;,
         0.382683;-0.923880;-1.000000;,
         0.382683;-0.923880; 1.000000;,
         0.195090;-0.980785;-1.000000;,
         0.195090;-0.980785; 1.000000;,
        -0.000000;-1.000000;-1.000000;,
        -0.000000;-1.000000; 1.000000;,
        -0.195091;-0.980785;-1.000000;,
        -0.195091;-0.980785; 1.000000;,
        -0.382684;-0.923879;-1.000000;,
        -0.382684;-0.923879; 1.000000;,
        -0.555571;-0.831469;-1.000000;,
        -0.555571;-0.831469; 1.000000;,
        -0.707107;-0.707106;-1.000000;,
        -0.707107;-0.707106; 1.000000;,
        -0.831470;-0.555570;-1.000000;,
        -0.831470;-0.555570; 1.000000;,
        -0.923880;-0.382683;-1.000000;,
        -0.923880;-0.382683; 1.000000;,
        -0.980785;-0.195089;-1.000000;,
        -0.980785;-0.195089; 1.000000;,
        -1.000000; 0.000001;-1.000000;,
        -1.000000; 0.000001; 1.000000;,
        -0.980785; 0.195091;-1.000000;,
        -0.980785; 0.195091; 1.000000;,
        -0.923879; 0.382684;-1.000000;,
        -0.923879; 0.382684; 1.000000;,
        -0.831469; 0.555571;-1.000000;,
        -0.831469; 0.555571; 1.000000;,
        -0.707106; 0.707108;-1.000000;,
        -0.707106; 0.707108; 1.000000;,
        -0.555569; 0.831470;-1.000000;,
        -0.555569; 0.831470; 1.000000;,
        -0.382682; 0.923880;-1.000000;,
        -0.382682; 0.923880; 1.000000;,
        -0.195089; 0.980786;-1.000000;,
        -0.195089; 0.980786; 1.000000;;
        34;
        4;2,3,1,0;,
        4;4,5,3,2;,
        4;6,7,5,4;,
        4;8,9,7,6;,
        4;10,11,9,8;,
        4;12,13,11,10;,
        4;14,15,13,12;,
        4;16,17,15,14;,
        4;18,19,17,16;,
        4;20,21,19,18;,
        4;22,23,21,20;,
        4;24,25,23,22;,
        4;26,27,25,24;,
        4;28,29,27,26;,
        4;30,31,29,28;,
        4;32,33,31,30;,
        4;34,35,33,32;,
        4;36,37,35,34;,
        4;38,39,37,36;,
        4;40,41,39,38;,
        4;42,43,41,40;,
        4;44,45,43,42;,
        4;46,47,45,44;,
        4;48,49,47,46;,
        4;50,51,49,48;,
        4;52,53,51,50;,
        4;54,55,53,52;,
        4;56,57,55,54;,
        4;58,59,57,56;,
        4;60,61,59,58;,
        32;5,7,9,11,13,15,17,19,21,23,25,27,29,31,33,35,37,39,41,43,45,47,49,51,53,55,57,59,61,63,1,3;,
        4;62,63,61,60;,
        4;0,1,63,62;,
        32;62,60,58,56,54,52,50,48,46,44,42,40,38,36,34,32,30,28,26,24,22,20,18,16,14,12,10,8,6,4,2,0;;
        MeshNormals { // Cylinder normals
          34;
           0.098017; 0.995185; 0.000000;,
           0.290285; 0.956940; 0.000000;,
           0.471397; 0.881921; 0.000000;,
           0.634393; 0.773010; 0.000000;,
           0.773010; 0.634393; 0.000000;,
           0.881921; 0.471397; 0.000000;,
           0.956940; 0.290285; 0.000000;,
           0.995185; 0.098017; 0.000000;,
           0.995185;-0.098017; 0.000000;,
           0.956940;-0.290285; 0.000000;,
           0.881921;-0.471396; 0.000000;,
           0.773010;-0.634393; 0.000000;,
           0.634393;-0.773010; 0.000000;,
           0.471397;-0.881921; 0.000000;,
           0.290284;-0.956940; 0.000000;,
           0.098017;-0.995185; 0.000000;,
          -0.098018;-0.995185; 0.000000;,
          -0.290285;-0.956940; 0.000000;,
          -0.471397;-0.881921; 0.000000;,
          -0.634394;-0.773010; 0.000000;,
          -0.773011;-0.634393; 0.000000;,
          -0.881922;-0.471396; 0.000000;,
          -0.956941;-0.290284; 0.000000;,
          -0.995185;-0.098016; 0.000000;,
          -0.995185; 0.098018; 0.000000;,
          -0.956940; 0.290286; 0.000000;,
          -0.881921; 0.471398; 0.000000;,
          -0.773010; 0.634394; 0.000000;,
          -0.634392; 0.773011; 0.000000;,
          -0.471395; 0.881922; 0.000000;,
          -0.000000; 0.000000; 1.000000;,
          -0.290283; 0.956941; 0.000000;,
          -0.098017; 0.995185; 0.000000;,
           0.000000; 0.000000;-1.000000;;
          34;
          4;0,0,0,0;,
          4;1,1,1,1;,
          4;2,2,2,2;,
          4;3,3,3,3;,
          4;4,4,4,4;,
          4;5,5,5,5;,
          4;6,6,6,6;,
          4;7,7,7,7;,
          4;8,8,8,8;,
          4;9,9,9,9;,
          4;10,10,10,10;,
          4;11,11,11,11;,
          4;12,12,12,12;,
          4;13,13,13,13;,
          4;14,14,14,14;,
          4;15,15,15,15;,
          4;16,16,16,16;,
          4;17,17,17,17;,
          4;18,18,18,18;,
          4;19,19,19,19;,
          4;20,20,20,20;,
          4;21,21,21,21;,
          4;22,22,22,22;,
          4;23,23,23,23;,
          4;24,24,24,24;,
          4;25,25,25,25;,
          4;26,26,26,26;,
          4;27,27,27,27;,
          4;28,28,28,28;,
          4;29,29,29,29;,
          32;30,30,30,30,30,30,30,30,30,30,30,30,30,30,30,30,30,30,30,30,30,30,30,30,30,30,30,30,30,30,30,30;,
          4;31,31,31,31;,
          4;32,32,32,32;,
          32;33,33,33,33,33,33,33,33,33,33,33,33,33,33,33,33,33,33,33,33,33,33,33,33,33,33,33,33,33,33,33,33;;
        } // End of Cylinder normals
        MeshMaterialList { // Cylinder material list
          1;
          34;
          0,
          0,
          0,
          0,
          0,
          0,
          0,
          0,
          0,
          0,
          0,
          0,
          0,
          0,
          0,
          0,
          0,
          0,
          0,
          0,
          0,
          0,
          0,
          0,
          0,
          0,
          0,
          0,
          0,
          0,
          0,
          0,
          0,
          0;
          Material Material_031 {
             0.639282; 0.014114; 0.011555; 1.000000;;
             96.078431;
             0.500000; 0.500000; 0.500000;;
             0.000000; 0.000000; 0.000000;;
          }
        } // End of Cylinder material list
      } // End of Cylinder mesh
    } // End of Cylinder
    Frame wheel {
      FrameTransformMatrix {
        -0.141421, 0.000000,-0.141421, 0.000000,
         0.000000, 0.200000, 0.000000, 0.000000,
         0.141421, 0.000000,-0.141421, 0.000000,
         0.200000, 0.000000,-0.890868, 1.000000;;
      }
      Mesh { // wheel mesh
        10;
        -0.032350;-1.000000; 0.000000;,
        -0.032350;-1.000000; 2.000000;,
        -0.032350; 1.000000; 0.000000;,
        -0.032350; 1.000000; 2.000000;,
         1.967650;-1.000000; 0.000000;,
         1.967650;-1.000000; 0.000000;,
         1.967650; 1.000000; 0.000000;,
         1.967650; 1.000000; 0.000000;,
         0.465670; 1.000000; 0.501980;,
         0.469630;-1.000000; 0.498020;;
        7;
        4;2,3,1,0;,
        5;6,7,8,3,2;,
        4;4,5,7,6;,
        5;0,1,9,5,4;,
        4;0,4,6,2;,
        4;9,1,3,8;,
        4;5,9,8,7;;
        MeshNormals { // wheel normals
          7;
          -1.000000;-0.000000; 0.000000;,
           0.000000; 1.000000; 0.000000;,
          -1.000000; 0.000000; 0.000000;,
           0.000000;-1.000000; 0.000000;,
           0.000000; 0.000000;-1.000000;,
           0.948683; 0.000626; 0.316228;,
           0.316228;-0.000626; 0.948683;;
          7;
          4;0,0,0,0;,
          5;1,1,1,1,1;,
          4;2,2,2,2;,
          5;3,3,3,3,3;,
          4;4,4,4,4;,
          4;5,5,5,5;,
          4;6,6,6,6;;
        } // End of wheel normals
        MeshMaterialList { // wheel material list
          1;
          7;
          0,
          0,
          0,
          0,
          0,
          0,
          0;
          Material Material_030 {
             0.800000; 0.106295; 0.085618; 1.000000;;
             96.078431;
             0.500000; 0.500000; 0.500000;;
             0.000000; 0.000000; 0.000000;;
          }
        } // End of wheel material list
      } // End of wheel mesh
    } // End of wheel
  } // End of leg
} // End of Root
