xof 0303txt 0032

Frame Root {
  FrameTransformMatrix {
     1.000000, 0.000000, 0.000000, 0.000000,
     0.000000,-0.000000, 1.000000, 0.000000,
     0.000000, 1.000000, 0.000000, 0.000000,
     0.000000, 0.000000, 0.000000, 1.000000;;
  }
  Frame Head {
    FrameTransformMatrix {
       0.122369, 0.000000, 0.000000, 0.000000,
       0.000000, 0.122369, 0.000000, 0.000000,
       0.000000, 0.000000, 0.122369, 0.000000,
       0.000000, 0.000000, 0.000000, 1.000000;;
    }
    Mesh { // Head mesh
      24;
      -0.346167;-0.971128; 0.153834;,
      -0.346167;-0.971128; 1.962588;,
      -0.346167; 0.758412; 0.153834;,
      -0.346167; 0.758412; 1.962588;,
       0.346167;-0.971128; 0.153834;,
       0.346167;-0.971128; 1.962588;,
       0.346167; 0.758412; 0.153834;,
       0.346167; 0.758412; 1.962588;,
      -1.000000;-0.391092; 0.108909;,
      -1.000000;-0.391092; 2.007513;,
      -1.000000; 0.391092; 2.007513;,
      -1.000000; 0.391092; 0.108909;,
       1.000000; 0.391092; 0.108909;,
       1.000000; 0.391092; 2.007513;,
       1.000000;-0.391092; 2.007513;,
       1.000000;-0.391092; 0.108909;,
      -0.500000; 0.500000; 0.000000;,
      -0.500000;-0.500000; 0.000000;,
      -0.500000;-0.500000; 2.116421;,
      -0.500000; 0.500000; 2.116421;,
       0.500000; 0.500000; 2.116421;,
       0.500000; 0.500000; 0.000000;,
       0.500000;-0.500000; 0.000000;,
       0.500000;-0.500000; 2.116421;;
      22;
      4;11,10,9,8;,
      4;6,7,3,2;,
      4;15,14,13,12;,
      4;0,1,5,4;,
      4;17,22,21,16;,
      4;23,18,19,20;,
      4;17,18,1,0;,
      4;19,16,2,3;,
      4;16,21,6,2;,
      4;20,19,3,7;,
      4;21,20,7,6;,
      4;23,22,4,5;,
      4;22,17,0,4;,
      4;18,23,5,1;,
      4;17,16,11,8;,
      4;18,17,8,9;,
      4;19,18,9,10;,
      4;16,19,10,11;,
      4;20,21,12,13;,
      4;21,22,15,12;,
      4;23,20,13,14;,
      4;22,23,14,15;;
      MeshNormals { // Head normals
        22;
        -1.000000;-0.000000; 0.000000;,
         0.000000; 1.000000; 0.000000;,
         1.000000;-0.000000; 0.000000;,
         0.000000;-1.000000; 0.000000;,
         0.000000; 0.000000;-1.000000;,
         0.000000;-0.000000; 1.000000;,
        -0.950608;-0.310394; 0.000000;,
        -0.859268; 0.511525; 0.000000;,
         0.000000; 0.511525;-0.859268;,
         0.000000; 0.511525; 0.859268;,
         0.859268; 0.511525; 0.000000;,
         0.950608;-0.310394; 0.000000;,
         0.000000;-0.310394;-0.950608;,
         0.000000;-0.310394; 0.950608;,
        -0.212826; 0.000000;-0.977090;,
        -0.212826;-0.977090; 0.000000;,
        -0.212827; 0.000000; 0.977090;,
        -0.212826; 0.977090; 0.000000;,
         0.212826; 0.977090; 0.000000;,
         0.212826; 0.000000;-0.977090;,
         0.212827; 0.000000; 0.977090;,
         0.212826;-0.977090; 0.000000;;
        22;
        4;0,0,0,0;,
        4;1,1,1,1;,
        4;2,2,2,2;,
        4;3,3,3,3;,
        4;4,4,4,4;,
        4;5,5,5,5;,
        4;6,6,6,6;,
        4;7,7,7,7;,
        4;8,8,8,8;,
        4;9,9,9,9;,
        4;10,10,10,10;,
        4;11,11,11,11;,
        4;12,12,12,12;,
        4;13,13,13,13;,
        4;14,14,14,14;,
        4;15,15,15,15;,
        4;16,16,16,16;,
        4;17,17,17,17;,
        4;18,18,18,18;,
        4;19,19,19,19;,
        4;20,20,20,20;,
        4;21,21,21,21;;
      } // End of Head normals
      MeshMaterialList { // Head material list
        1;
        22;
        0,
        0,
        0,
        0,
        0,
        0,
        0,
        0,
        0,
        0,
        0,
        0,
        0,
        0,
        0,
        0,
        0,
        0,
        0,
        0,
        0,
        0;
        Material Material_008 {
           0.090842; 0.445201; 1.000000; 1.000000;;
           96.078431;
           0.500000; 0.500000; 0.500000;;
           0.000000; 0.000000; 0.000000;;
        }
      } // End of Head material list
    } // End of Head mesh
    Frame eye {
      FrameTransformMatrix {
         1.000001, 0.000000, 0.000000, 0.000000,
         0.000000, 1.000001, 0.000000, 0.000000,
         0.000000, 0.000000, 0.008172, 0.000000,
         0.000000,-0.014433, 1.494268, 1.000000;;
      }
      Mesh { // eye mesh
        24;
        -0.346167;-0.971128; 0.153834;,
        -0.346167;-0.971128; 1.962588;,
        -0.346167; 0.758412; 0.153834;,
        -0.346167; 0.758412; 1.962588;,
         0.346167;-0.971128; 0.153834;,
         0.346167;-0.971128; 1.962588;,
         0.346167; 0.758412; 0.153834;,
         0.346167; 0.758412; 1.962588;,
        -0.954080;-0.391092; 0.108909;,
        -0.954080;-0.391092; 2.007513;,
        -0.954080; 0.391092; 2.007513;,
        -0.954080; 0.391092; 0.108909;,
         0.964741; 0.391092; 0.108909;,
         0.964741; 0.391092; 2.007513;,
         0.964741;-0.391092; 2.007513;,
         0.964741;-0.391092; 0.108909;,
        -0.500000; 0.500000; 0.000000;,
        -0.500000;-0.500000; 0.000000;,
        -0.500000;-0.500000; 2.116421;,
        -0.500000; 0.500000; 2.116421;,
         0.500000; 0.500000; 2.116421;,
         0.500000; 0.500000; 0.000000;,
         0.500000;-0.500000; 0.000000;,
         0.500000;-0.500000; 2.116421;;
        22;
        4;11,10,9,8;,
        4;6,7,3,2;,
        4;15,14,13,12;,
        4;0,1,5,4;,
        4;17,22,21,16;,
        4;23,18,19,20;,
        4;17,18,1,0;,
        4;19,16,2,3;,
        4;16,21,6,2;,
        4;20,19,3,7;,
        4;21,20,7,6;,
        4;23,22,4,5;,
        4;22,17,0,4;,
        4;18,23,5,1;,
        4;17,16,11,8;,
        4;18,17,8,9;,
        4;19,18,9,10;,
        4;16,19,10,11;,
        4;20,21,12,13;,
        4;21,22,15,12;,
        4;23,20,13,14;,
        4;22,23,14,15;;
        MeshNormals { // eye normals
          22;
          -1.000000;-0.000000; 0.000000;,
           0.000000; 1.000000; 0.000000;,
           1.000000;-0.000000; 0.000000;,
           0.000000;-1.000000; 0.000000;,
           0.000000; 0.000000;-1.000000;,
           0.000000;-0.000000; 1.000000;,
          -0.950608;-0.310394; 0.000000;,
          -0.859268; 0.511525; 0.000000;,
           0.000000; 0.511525;-0.859268;,
           0.000000; 0.511525; 0.859268;,
           0.859268; 0.511525; 0.000000;,
           0.950608;-0.310394; 0.000000;,
           0.000000;-0.310394;-0.950608;,
           0.000000;-0.310394; 0.950608;,
          -0.233229; 0.000000;-0.972422;,
          -0.233229;-0.972422; 0.000000;,
          -0.233230; 0.000000; 0.972422;,
          -0.233229; 0.972422; 0.000000;,
           0.228161; 0.973624; 0.000000;,
           0.228161; 0.000000;-0.973623;,
           0.228161; 0.000000; 0.973623;,
           0.228161;-0.973624; 0.000000;;
          22;
          4;0,0,0,0;,
          4;1,1,1,1;,
          4;2,2,2,2;,
          4;3,3,3,3;,
          4;4,4,4,4;,
          4;5,5,5,5;,
          4;6,6,6,6;,
          4;7,7,7,7;,
          4;8,8,8,8;,
          4;9,9,9,9;,
          4;10,10,10,10;,
          4;11,11,11,11;,
          4;12,12,12,12;,
          4;13,13,13,13;,
          4;14,14,14,14;,
          4;15,15,15,15;,
          4;16,16,16,16;,
          4;17,17,17,17;,
          4;18,18,18,18;,
          4;19,19,19,19;,
          4;20,20,20,20;,
          4;21,21,21,21;;
        } // End of eye normals
        MeshMaterialList { // eye material list
          1;
          22;
          0,
          0,
          0,
          0,
          0,
          0,
          0,
          0,
          0,
          0,
          0,
          0,
          0,
          0,
          0,
          0,
          0,
          0,
          0,
          0,
          0,
          0;
          Material Material_025 {
             0.640000; 0.000000; 0.002717; 1.000000;;
             96.078431;
             0.500000; 0.500000; 0.500000;;
             0.000000; 0.000000; 0.000000;;
          }
        } // End of eye material list
      } // End of eye mesh
    } // End of eye
  } // End of Head
} // End of Root
