xof 0303txt 0032

Frame Root {
  FrameTransformMatrix {
     1.000000, 0.000000, 0.000000, 0.000000,
     0.000000,-0.000000, 1.000000, 0.000000,
     0.000000, 1.000000, 0.000000, 0.000000,
     0.000000, 0.000000, 0.000000, 1.000000;;
  }
  Frame Body {
    FrameTransformMatrix {
       0.122369, 0.000000, 0.000000, 0.000000,
       0.000000, 0.122369, 0.000000, 0.000000,
       0.000000, 0.000000, 0.122369, 0.000000,
       0.000000, 0.000000, 0.000000, 1.000000;;
    }
    Mesh { // Body mesh
      32;
      -0.627524;-1.236481; 0.372476;,
      -0.627524;-1.883103; 4.795066;,
      -0.627524; 1.000000; 0.372476;,
      -0.627524; 1.435279; 4.795066;,
       0.627524;-1.236481; 0.372476;,
       0.627524;-1.883103; 4.795066;,
       0.627524; 1.000000; 0.372476;,
       0.627524; 1.435279; 4.795066;,
      -0.540029;-0.540029;-0.349207;,
      -2.000000;-0.723168; 4.890711;,
      -2.000000; 0.723168; 4.890711;,
      -0.540029; 0.540029;-0.349207;,
       0.540029; 0.540029;-0.349207;,
       2.000000; 0.723168; 4.890711;,
       2.000000;-0.723168; 4.890711;,
       0.540029;-0.540029;-0.349207;,
      -1.000000; 0.723168; 0.276832;,
      -1.000000;-0.723168; 0.276832;,
       1.000000; 0.723168; 0.276832;,
       1.000000;-0.723168; 0.276832;,
      -1.000000; 1.000000; 0.000000;,
      -1.000000;-1.000000; 0.000000;,
      -0.564220;-0.564220; 5.516850;,
      -0.564220; 0.564220; 5.516850;,
       0.564220; 0.564220; 5.516850;,
       1.000000; 1.000000; 0.000000;,
       1.000000;-1.000000; 0.000000;,
       0.564220;-0.564220; 5.516850;,
      -1.000000;-1.000000; 5.167542;,
      -1.000000; 1.000000; 5.167542;,
       1.000000; 1.000000; 5.167542;,
       1.000000;-1.000000; 5.167542;;
      30;
      4;16,10,9,17;,
      4;6,7,3,2;,
      4;19,14,13,18;,
      4;0,1,5,4;,
      4;8,15,12,11;,
      4;27,22,23,24;,
      4;21,28,1,0;,
      4;29,20,2,3;,
      4;20,25,6,2;,
      4;30,29,3,7;,
      4;25,30,7,6;,
      4;31,26,4,5;,
      4;26,21,0,4;,
      4;28,31,5,1;,
      4;20,21,8,11;,
      4;25,20,11,12;,
      4;26,25,12,15;,
      4;21,26,15,8;,
      4;21,20,16,17;,
      4;28,21,17,9;,
      4;29,28,9,10;,
      4;20,29,10,16;,
      4;30,25,18,13;,
      4;25,26,19,18;,
      4;31,30,13,14;,
      4;26,31,14,19;,
      4;28,29,23,22;,
      4;29,30,24,23;,
      4;30,31,27,24;,
      4;31,28,22,27;;
      MeshNormals { // Body normals
        30;
        -0.977309; 0.000000;-0.211819;,
         0.000000; 0.995192;-0.097949;,
         0.977309; 0.000000;-0.211819;,
         0.000000;-0.989480;-0.144671;,
         0.000000; 0.000000;-1.000000;,
         0.000000;-0.000000; 1.000000;,
        -0.831963;-0.553574;-0.037325;,
        -0.504110; 0.862751;-0.039159;,
         0.000000; 1.000000;-0.000000;,
         0.000000; 0.650167; 0.759791;,
         0.504110; 0.862751;-0.039159;,
         0.831963;-0.553574;-0.037325;,
         0.000000;-0.844225;-0.535989;,
         0.000000;-0.388627; 0.921395;,
        -0.604676; 0.000000;-0.796471;,
         0.000000; 0.604676;-0.796471;,
         0.604676; 0.000000;-0.796471;,
         0.000000;-0.604676;-0.796471;,
        -1.000000; 0.000000; 0.000000;,
        -0.483785;-0.873788;-0.049460;,
        -0.266797; 0.000000; 0.963753;,
        -0.483785; 0.873788;-0.049460;,
         0.483785; 0.873788;-0.049460;,
         1.000000; 0.000000;-0.000000;,
         0.266797; 0.000000; 0.963753;,
         0.483785;-0.873788;-0.049460;,
        -0.625440; 0.000000; 0.780272;,
         0.000000; 0.625440; 0.780272;,
         0.625440; 0.000000; 0.780272;,
         0.000000;-0.625440; 0.780272;;
        30;
        4;0,0,0,0;,
        4;1,1,1,1;,
        4;2,2,2,2;,
        4;3,3,3,3;,
        4;4,4,4,4;,
        4;5,5,5,5;,
        4;6,6,6,6;,
        4;7,7,7,7;,
        4;8,8,8,8;,
        4;9,9,9,9;,
        4;10,10,10,10;,
        4;11,11,11,11;,
        4;12,12,12,12;,
        4;13,13,13,13;,
        4;14,14,14,14;,
        4;15,15,15,15;,
        4;16,16,16,16;,
        4;17,17,17,17;,
        4;18,18,18,18;,
        4;19,19,19,19;,
        4;20,20,20,20;,
        4;21,21,21,21;,
        4;22,22,22,22;,
        4;23,23,23,23;,
        4;24,24,24,24;,
        4;25,25,25,25;,
        4;26,26,26,26;,
        4;27,27,27,27;,
        4;28,28,28,28;,
        4;29,29,29,29;;
      } // End of Body normals
      MeshMaterialList { // Body material list
        1;
        30;
        0,
        0,
        0,
        0,
        0,
        0,
        0,
        0,
        0,
        0,
        0,
        0,
        0,
        0,
        0,
        0,
        0,
        0,
        0,
        0,
        0,
        0,
        0,
        0,
        0,
        0,
        0,
        0,
        0,
        0;
        Material Material_011 {
           0.072673; 0.356161; 0.800000; 1.000000;;
           96.078431;
           0.500000; 0.500000; 0.500000;;
           0.000000; 0.000000; 0.000000;;
        }
      } // End of Body material list
    } // End of Body mesh
  } // End of Body
} // End of Root
