\relax 
\providecommand*\new@tpo@label[2]{}
\babel@aux{english}{}
\@writefile{toc}{\contentsline {section}{\nonumberline Objective}{1}\protected@file@percent }
\@writefile{toc}{\contentsline {section}{\nonumberline Education}{1}\protected@file@percent }
\@writefile{toc}{\contentsline {section}{\nonumberline Previous work experiences.}{1}\protected@file@percent }
\@writefile{toc}{\contentsline {section}{\nonumberline Volunteer work.}{1}\protected@file@percent }
\@writefile{toc}{\contentsline {subsection}{\nonumberline \relax \let \reserved@d =[\def {\@@par }}{1}\protected@file@percent }
\@writefile{toc}{\contentsline {subsection}{\nonumberline \relax \let \reserved@d =[\def {\@@par }}{2}\protected@file@percent }
\@writefile{toc}{\contentsline {subsection}{\nonumberline \relax \let \reserved@d =[\def {\@@par }}{2}\protected@file@percent }
\@writefile{toc}{\contentsline {subsection}{\nonumberline \relax \let \reserved@d =[\def {\@@par }}{2}\protected@file@percent }
\@writefile{toc}{\contentsline {section}{\nonumberline Skills}{2}\protected@file@percent }
\@writefile{toc}{\contentsline {section}{\nonumberline References}{2}\protected@file@percent }
\@writefile{toc}{\contentsline {subsection}{\nonumberline \relax \let \reserved@d =[\def {\@@par }}{2}\protected@file@percent }
\@writefile{toc}{\contentsline {subsection}{\nonumberline \relax \let \reserved@d =[\def {\@@par }}{2}\protected@file@percent }
