0.1999999999999999	0.4999999999999997	
0.2	0.5	

0.1999999999999999	0.4999999999999997	
0.19999590757798064	0.49950167453678945	

0.2	0.5	
0.1999999999999999	0.4999999999999997	

0.2	0.5	
0.1999999999999999	0.4999999999999998	

0.19999590757798064	0.49950167453678945	
0.1999999999999999	0.4999999999999998	

0.19999590757798064	0.49950167453678945	
0.1999999999999999	0.4999999999999997	

0.1999999999999999	0.4999999999999998	
0.19999590757798064	0.49950167453678945	

0.1999999999999999	0.4999999999999998	
0.2	0.5	

0.10770503283934676	0.5611763607828095	
0.11061081276035903	0.5885179097023946	

0.10770503283934676	0.5611763607828095	
0.144503732593225	0.5566696833151988	

0.11061081276035903	0.5885179097023946	
0.10770503283934676	0.5611763607828095	

0.11061081276035903	0.5885179097023946	
0.18548803270052813	0.5949722811335811	

0.144503732593225	0.5566696833151988	
0.18548803270052813	0.5949722811335811	

0.144503732593225	0.5566696833151988	
0.10770503283934676	0.5611763607828095	

0.18548803270052813	0.5949722811335811	
0.144503732593225	0.5566696833151988	

0.18548803270052813	0.5949722811335811	
0.11061081276035903	0.5885179097023946	

0.16697422679701926	0.12764507078707835	
0.12528812696458896	0.18863906772226066	

0.16697422679701926	0.12764507078707835	
0.09992070047878815	0.10463450682681004	

0.12528812696458896	0.18863906772226066	
0.16697422679701926	0.12764507078707835	

0.12528812696458896	0.18863906772226066	
0.029251651775314292	0.11541984695640345	

0.09992070047878815	0.10463450682681004	
0.029251651775314292	0.11541984695640345	

0.09992070047878815	0.10463450682681004	
0.16697422679701926	0.12764507078707835	

0.029251651775314292	0.11541984695640345	
0.09992070047878815	0.10463450682681004	

0.029251651775314292	0.11541984695640345	
0.12528812696458896	0.18863906772226066	

0.802301793774212	0.791143487015243	
0.8576932548073539	0.8585663358064352	

0.802301793774212	0.791143487015243	
0.744933679610174	0.7160433437567647	

0.8576932548073539	0.8585663358064352	
0.802301793774212	0.791143487015243	

0.8576932548073539	0.8585663358064352	
0.875557250682143	0.7977028683432309	

0.744933679610174	0.7160433437567647	
0.875557250682143	0.7977028683432309	

0.744933679610174	0.7160433437567647	
0.802301793774212	0.791143487015243	

0.875557250682143	0.7977028683432309	
0.744933679610174	0.7160433437567647	

0.875557250682143	0.7977028683432309	
0.8576932548073539	0.8585663358064352	

