0.1999956628751377	0.4995741474678203	
0.2	0.5	

0.1999956628751377	0.4995741474678203	
0.19972861461177754	0.46695398259198706	

0.2	0.5	
0.1999956628751377	0.4995741474678203	

0.2	0.5	
0.1999562382655499	0.4997767026230506	

0.19972861461177754	0.46695398259198706	
0.1999562382655499	0.4997767026230506	

0.19972861461177754	0.46695398259198706	
0.1999956628751377	0.4995741474678203	

0.1999562382655499	0.4997767026230506	
0.19972861461177754	0.46695398259198706	

0.1999562382655499	0.4997767026230506	
0.2	0.5	

0.10065801550233104	0.5689117026573727	
0.10303932240319258	0.5963774372192936	

0.10065801550233104	0.5689117026573727	
0.13555849674626128	0.5537811025515179	

0.10303932240319258	0.5963774372192936	
0.10065801550233104	0.5689117026573727	

0.10303932240319258	0.5963774372192936	
0.1769145038348407	0.5918719242043496	

0.13555849674626128	0.5537811025515179	
0.1769145038348407	0.5918719242043496	

0.13555849674626128	0.5537811025515179	
0.10065801550233104	0.5689117026573727	

0.1769145038348407	0.5918719242043496	
0.13555849674626128	0.5537811025515179	

0.1769145038348407	0.5918719242043496	
0.10303932240319258	0.5963774372192936	

0.15645628036175635	0.14033149476155277	
0.10763011149713711	0.18074298952546872	

0.15645628036175635	0.14033149476155277	
0.0985164336281212	0.10612412380216975	

0.10763011149713711	0.18074298952546872	
0.15645628036175635	0.14033149476155277	

0.10763011149713711	0.18074298952546872	
0.01608640657315521	0.10725016071484518	

0.0985164336281212	0.10612412380216975	
0.01608640657315521	0.10725016071484518	

0.0985164336281212	0.10612412380216975	
0.15645628036175635	0.14033149476155277	

0.01608640657315521	0.10725016071484518	
0.0985164336281212	0.10612412380216975	

0.01608640657315521	0.10725016071484518	
0.10763011149713711	0.18074298952546872	

0.8037396326818795	0.7928637930985462	
0.8641571435915019	0.884973195030084	

0.8037396326818795	0.7928637930985462	
0.767792751661863	0.7196456979212362	

0.8641571435915019	0.884973195030084	
0.8037396326818795	0.7928637930985462	

0.8641571435915019	0.884973195030084	
0.8738958242281831	0.8046621739579235	

0.767792751661863	0.7196456979212362	
0.8738958242281831	0.8046621739579235	

0.767792751661863	0.7196456979212362	
0.8037396326818795	0.7928637930985462	

0.8738958242281831	0.8046621739579235	
0.767792751661863	0.7196456979212362	

0.8738958242281831	0.8046621739579235	
0.8641571435915019	0.884973195030084	

