0.19959810932860308	0.4605392591850081	
0.19999999999999948	0.5	

0.19959810932860308	0.4605392591850081	
0.1995134781581829	0.44075727746664745	

0.19999999999999948	0.5	
0.19959810932860308	0.4605392591850081	

0.19999999999999948	0.5	
0.19594490972752776	0.4793086121353587	

0.1995134781581829	0.44075727746664745	
0.19594490972752776	0.4793086121353587	

0.1995134781581829	0.44075727746664745	
0.19959810932860308	0.4605392591850081	

0.19594490972752776	0.4793086121353587	
0.1995134781581829	0.44075727746664745	

0.19594490972752776	0.4793086121353587	
0.19999999999999948	0.5	

0.10086123801359961	0.5659244476600623	
0.10950373183375865	0.5902703050134407	

0.10086123801359961	0.5659244476600623	
0.1408184262616857	0.5579771916749332	

0.10950373183375865	0.5902703050134407	
0.10086123801359961	0.5659244476600623	

0.10950373183375865	0.5902703050134407	
0.19115181293905278	0.5973377813985273	

0.1408184262616857	0.5579771916749332	
0.19115181293905278	0.5973377813985273	

0.1408184262616857	0.5579771916749332	
0.10086123801359961	0.5659244476600623	

0.19115181293905278	0.5973377813985273	
0.1408184262616857	0.5579771916749332	

0.19115181293905278	0.5973377813985273	
0.10950373183375865	0.5902703050134407	

0.17701673365193415	0.11065221898864358	
0.10742338007974724	0.17852686809589416	

0.17701673365193415	0.11065221898864358	
0.09988931322612603	0.10178601150459447	

0.10742338007974724	0.17852686809589416	
0.17701673365193415	0.11065221898864358	

0.10742338007974724	0.17852686809589416	
0.02080363392416926	0.10650065049648771	

0.09988931322612603	0.10178601150459447	
0.02080363392416926	0.10650065049648771	

0.09988931322612603	0.10178601150459447	
0.17701673365193415	0.11065221898864358	

0.02080363392416926	0.10650065049648771	
0.09988931322612603	0.10178601150459447	

0.02080363392416926	0.10650065049648771	
0.10742338007974724	0.17852686809589416	

0.7833458294472189	0.7296840860842663	
0.8552229087485135	0.8699055520547057	

0.7833458294472189	0.7296840860842663	
0.7196499076504063	0.70831221629893	

0.8552229087485135	0.8699055520547057	
0.7833458294472189	0.7296840860842663	

0.8552229087485135	0.8699055520547057	
0.8682237111126226	0.8038706428103684	

0.7196499076504063	0.70831221629893	
0.8682237111126226	0.8038706428103684	

0.7196499076504063	0.70831221629893	
0.7833458294472189	0.7296840860842663	

0.8682237111126226	0.8038706428103684	
0.7196499076504063	0.70831221629893	

0.8682237111126226	0.8038706428103684	
0.8552229087485135	0.8699055520547057	

