0.19999999999998902	0.4999999999989193	
0.2	0.5	

0.19999999999998902	0.4999999999989193	
0.19997890624201467	0.49743145827361457	

0.2	0.5	
0.19999999999998902	0.4999999999989193	

0.2	0.5	
0.19999999999988896	0.49999999999943334	

0.19997890624201467	0.49743145827361457	
0.19999999999988896	0.49999999999943334	

0.19997890624201467	0.49743145827361457	
0.19999999999998902	0.4999999999989193	

0.19999999999988896	0.49999999999943334	
0.19997890624201467	0.49743145827361457	

0.19999999999988896	0.49999999999943334	
0.2	0.5	

0.10686599306476398	0.5551316300200321	
0.10192440013509539	0.5877221795225704	

0.10686599306476398	0.5551316300200321	
0.14256067362556493	0.5533107580173686	

0.10192440013509539	0.5877221795225704	
0.10686599306476398	0.5551316300200321	

0.10192440013509539	0.5877221795225704	
0.17132004379379012	0.5908466738048282	

0.14256067362556493	0.5533107580173686	
0.17132004379379012	0.5908466738048282	

0.14256067362556493	0.5533107580173686	
0.10686599306476398	0.5551316300200321	

0.17132004379379012	0.5908466738048282	
0.14256067362556493	0.5533107580173686	

0.17132004379379012	0.5908466738048282	
0.10192440013509539	0.5877221795225704	

0.17094541482247877	0.12349996357863911	
0.11864234322827907	0.1846837307690702	

0.17094541482247877	0.12349996357863911	
0.09845698812264632	0.10385853779058621	

0.11864234322827907	0.1846837307690702	
0.17094541482247877	0.12349996357863911	

0.11864234322827907	0.1846837307690702	
0.036323480665514815	0.11902959996084243	

0.09845698812264632	0.10385853779058621	
0.036323480665514815	0.11902959996084243	

0.09845698812264632	0.10385853779058621	
0.17094541482247877	0.12349996357863911	

0.036323480665514815	0.11902959996084243	
0.09845698812264632	0.10385853779058621	

0.036323480665514815	0.11902959996084243	
0.11864234322827907	0.1846837307690702	

0.8026012561356973	0.792650038513058	
0.8580853119247945	0.8564759892415799	

0.8026012561356973	0.792650038513058	
0.735406061187226	0.7126360353990534	

0.8580853119247945	0.8564759892415799	
0.8026012561356973	0.792650038513058	

0.8580853119247945	0.8564759892415799	
0.8736127945043176	0.7939193665520888	

0.735406061187226	0.7126360353990534	
0.8736127945043176	0.7939193665520888	

0.735406061187226	0.7126360353990534	
0.8026012561356973	0.792650038513058	

0.8736127945043176	0.7939193665520888	
0.735406061187226	0.7126360353990534	

0.8736127945043176	0.7939193665520888	
0.8580853119247945	0.8564759892415799	

