0.1999999999999999	0.4999999999999997	
0.2	0.5	

0.1999999999999999	0.4999999999999997	
0.19999989280705183	0.499986947344314	

0.2	0.5	
0.1999999999999999	0.4999999999999997	

0.2	0.5	
0.1999999999999999	0.4999999999999998	

0.19999989280705183	0.499986947344314	
0.1999999999999999	0.4999999999999998	

0.19999989280705183	0.499986947344314	
0.1999999999999999	0.4999999999999997	

0.1999999999999999	0.4999999999999998	
0.19999989280705183	0.499986947344314	

0.1999999999999999	0.4999999999999998	
0.2	0.5	

0.11139504036078357	0.5569695439570723	
0.10846344189363703	0.5872759245580756	

0.11139504036078357	0.5569695439570723	
0.14418170929525273	0.5548804307555423	

0.10846344189363703	0.5872759245580756	
0.11139504036078357	0.5569695439570723	

0.10846344189363703	0.5872759245580756	
0.18080264937792742	0.5926649030600745	

0.14418170929525273	0.5548804307555423	
0.18080264937792742	0.5926649030600745	

0.14418170929525273	0.5548804307555423	
0.11139504036078357	0.5569695439570723	

0.18080264937792742	0.5926649030600745	
0.14418170929525273	0.5548804307555423	

0.18080264937792742	0.5926649030600745	
0.10846344189363703	0.5872759245580756	

0.16787213755328725	0.12743700036478145	
0.1255274768216646	0.18609841703668226	

0.16787213755328725	0.12743700036478145	
0.10276535626231711	0.10504853859919004	

0.1255274768216646	0.18609841703668226	
0.16787213755328725	0.12743700036478145	

0.1255274768216646	0.18609841703668226	
0.040713157970544436	0.12067833948845008	

0.10276535626231711	0.10504853859919004	
0.040713157970544436	0.12067833948845008	

0.10276535626231711	0.10504853859919004	
0.16787213755328725	0.12743700036478145	

0.040713157970544436	0.12067833948845008	
0.10276535626231711	0.10504853859919004	

0.040713157970544436	0.12067833948845008	
0.1255274768216646	0.18609841703668226	

0.8032444333124618	0.7932638260353925	
0.8624686134535183	0.8749622272736794	

0.8032444333124618	0.7932638260353925	
0.7446998275278691	0.7173406444526318	

0.8624686134535183	0.8749622272736794	
0.8032444333124618	0.7932638260353925	

0.8624686134535183	0.8749622272736794	
0.8729413951006948	0.8011353417575207	

0.7446998275278691	0.7173406444526318	
0.8729413951006948	0.8011353417575207	

0.7446998275278691	0.7173406444526318	
0.8032444333124618	0.7932638260353925	

0.8729413951006948	0.8011353417575207	
0.7446998275278691	0.7173406444526318	

0.8729413951006948	0.8011353417575207	
0.8624686134535183	0.8749622272736794	

