x	p(x)
-10	-9765.5
-9.98	-9653.73
-9.96	-9543.04
-9.94	-9433.4
-9.92	-9324.82
-9.9	-9217.29
-9.88	-9110.8
-9.86	-9005.33
-9.84	-8900.89
-9.82	-8797.46
-9.8	-8695.04
-9.78	-8593.62
-9.76	-8493.18
-9.74	-8393.73
-9.72	-8295.26
-9.7	-8197.75
-9.68	-8101.2
-9.66	-8005.6
-9.64	-7910.95
-9.62	-7817.24
-9.6	-7724.45
-9.58	-7632.59
-9.56	-7541.64
-9.54	-7451.6
-9.52	-7362.46
-9.5	-7274.21
-9.48	-7186.85
-9.46	-7100.37
-9.44	-7014.76
-9.42	-6930.01
-9.4	-6846.12
-9.38	-6763.08
-9.36	-6680.89
-9.34	-6599.53
-9.32	-6519
-9.3	-6439.3
-9.28	-6360.41
-9.26	-6282.33
-9.24	-6205.05
-9.22	-6128.57
-9.2	-6052.88
-9.18	-5977.98
-9.16	-5903.85
-9.14	-5830.49
-9.12	-5757.89
-9.1	-5686.05
-9.08	-5614.96
-9.06	-5544.62
-9.04	-5475.01
-9.02	-5406.14
-9	-5337.99
-8.98	-5270.56
-8.96	-5203.85
-8.94	-5137.85
-8.92	-5072.54
-8.9	-5007.93
-8.88	-4944.01
-8.86	-4880.78
-8.84	-4818.22
-8.82	-4756.33
-8.8	-4695.11
-8.78	-4634.56
-8.76	-4574.65
-8.74	-4515.4
-8.72	-4456.78
-8.7	-4398.81
-8.68	-4341.47
-8.66	-4284.75
-8.64	-4228.66
-8.62	-4173.18
-8.6	-4118.31
-8.58	-4064.05
-8.56	-4010.38
-8.54	-3957.31
-8.52	-3904.83
-8.5	-3852.94
-8.48	-3801.62
-8.46	-3750.87
-8.44	-3700.69
-8.42	-3651.08
-8.4	-3602.02
-8.38	-3553.52
-8.36	-3505.56
-8.34	-3458.15
-8.32	-3411.27
-8.3	-3364.93
-8.28	-3319.11
-8.26	-3273.82
-8.24	-3229.05
-8.22	-3184.79
-8.2	-3141.04
-8.18	-3097.79
-8.16	-3055.04
-8.14	-3012.79
-8.12	-2971.03
-8.1	-2929.75
-8.08	-2888.96
-8.06	-2848.64
-8.04	-2808.79
-8.02	-2769.42
-8	-2730.5
-7.98	-2692.04
-7.96	-2654.04
-7.94	-2616.49
-7.92	-2579.38
-7.9	-2542.72
-7.88	-2506.49
-7.86	-2470.7
-7.84	-2435.34
-7.82	-2400.4
-7.8	-2365.88
-7.78	-2331.78
-7.76	-2298.09
-7.74	-2264.81
-7.72	-2231.93
-7.7	-2199.46
-7.68	-2167.38
-7.66	-2135.69
-7.64	-2104.4
-7.62	-2073.49
-7.6	-2042.96
-7.58	-2012.8
-7.56	-1983.03
-7.54	-1953.62
-7.52	-1924.58
-7.5	-1895.9
-7.48	-1867.58
-7.46	-1839.61
-7.44	-1812
-7.42	-1784.73
-7.4	-1757.81
-7.38	-1731.23
-7.36	-1704.99
-7.34	-1679.09
-7.32	-1653.51
-7.3	-1628.26
-7.28	-1603.34
-7.26	-1578.73
-7.24	-1554.45
-7.22	-1530.47
-7.2	-1506.81
-7.18	-1483.46
-7.16	-1460.41
-7.14	-1437.66
-7.12	-1415.21
-7.1	-1393.05
-7.08	-1371.19
-7.06	-1349.61
-7.04	-1328.32
-7.02	-1307.31
-7	-1286.59
-6.98	-1266.13
-6.96	-1245.96
-6.94	-1226.05
-6.92	-1206.41
-6.9	-1187.03
-6.88	-1167.92
-6.86	-1149.07
-6.84	-1130.47
-6.82	-1112.12
-6.8	-1094.03
-6.78	-1076.18
-6.76	-1058.58
-6.74	-1041.22
-6.72	-1024.1
-6.7	-1007.22
-6.68	-990.571
-6.66	-974.155
-6.64	-957.968
-6.62	-942.007
-6.6	-926.27
-6.58	-910.755
-6.56	-895.459
-6.54	-880.379
-6.52	-865.513
-6.5	-850.859
-6.48	-836.414
-6.46	-822.175
-6.44	-808.141
-6.42	-794.309
-6.4	-780.676
-6.38	-767.24
-6.36	-754
-6.34	-740.952
-6.32	-728.095
-6.3	-715.425
-6.28	-702.942
-6.26	-690.642
-6.24	-678.524
-6.22	-666.586
-6.2	-654.824
-6.18	-643.238
-6.16	-631.825
-6.14	-620.582
-6.12	-609.509
-6.1	-598.602
-6.08	-587.86
-6.06	-577.281
-6.04	-566.862
-6.02	-556.603
-6	-546.5
-5.98	-536.552
-5.96	-526.757
-5.94	-517.113
-5.92	-507.619
-5.9	-498.272
-5.88	-489.07
-5.86	-480.012
-5.84	-471.095
-5.82	-462.319
-5.8	-453.681
-5.78	-445.179
-5.76	-436.813
-5.74	-428.579
-5.72	-420.477
-5.7	-412.504
-5.68	-404.659
-5.66	-396.94
-5.64	-389.346
-5.62	-381.875
-5.6	-374.526
-5.58	-367.296
-5.56	-360.184
-5.54	-353.19
-5.52	-346.31
-5.5	-339.544
-5.48	-332.889
-5.46	-326.346
-5.44	-319.911
-5.42	-313.584
-5.4	-307.363
-5.38	-301.247
-5.36	-295.234
-5.34	-289.323
-5.32	-283.513
-5.3	-277.801
-5.28	-272.187
-5.26	-266.67
-5.24	-261.247
-5.22	-255.918
-5.2	-250.682
-5.18	-245.536
-5.16	-240.48
-5.14	-235.513
-5.12	-230.633
-5.1	-225.839
-5.08	-221.13
-5.06	-216.505
-5.04	-211.961
-5.02	-207.499
-5	-203.117
-4.98	-198.814
-4.96	-194.588
-4.94	-190.439
-4.92	-186.366
-4.9	-182.366
-4.88	-178.44
-4.86	-174.586
-4.84	-170.803
-4.82	-167.09
-4.8	-163.445
-4.78	-159.869
-4.76	-156.36
-4.74	-152.916
-4.72	-149.537
-4.7	-146.222
-4.68	-142.97
-4.66	-139.779
-4.64	-136.65
-4.62	-133.581
-4.6	-130.57
-4.58	-127.618
-4.56	-124.723
-4.54	-121.884
-4.52	-119.101
-4.5	-116.372
-4.48	-113.696
-4.46	-111.074
-4.44	-108.503
-4.42	-105.984
-4.4	-103.515
-4.38	-101.095
-4.36	-98.7242
-4.34	-96.4009
-4.32	-94.1248
-4.3	-91.8949
-4.28	-89.7105
-4.26	-87.5709
-4.24	-85.4753
-4.22	-83.4229
-4.2	-81.4131
-4.18	-79.4451
-4.16	-77.5182
-4.14	-75.6317
-4.12	-73.7848
-4.1	-71.977
-4.08	-70.2076
-4.06	-68.4758
-4.04	-66.781
-4.02	-65.1227
-4	-63.5
-3.98	-61.9124
-3.96	-60.3594
-3.94	-58.8402
-3.92	-57.3542
-3.9	-55.9009
-3.88	-54.4797
-3.86	-53.0899
-3.84	-51.7311
-3.82	-50.4027
-3.8	-49.104
-3.78	-47.8346
-3.76	-46.5938
-3.74	-45.3813
-3.72	-44.1963
-3.7	-43.0385
-3.68	-41.9074
-3.66	-40.8023
-3.64	-39.7228
-3.62	-38.6685
-3.6	-37.6388
-3.58	-36.6332
-3.56	-35.6514
-3.54	-34.6927
-3.52	-33.7569
-3.5	-32.8434
-3.48	-31.9518
-3.46	-31.0816
-3.44	-30.2325
-3.42	-29.4039
-3.4	-28.5956
-3.38	-27.8071
-3.36	-27.0379
-3.34	-26.2877
-3.32	-25.5562
-3.3	-24.8428
-3.28	-24.1473
-3.26	-23.4692
-3.24	-22.8083
-3.22	-22.1641
-3.2	-21.5363
-3.18	-20.9245
-3.16	-20.3285
-3.14	-19.7477
-3.12	-19.1821
-3.1	-18.6311
-3.08	-18.0945
-3.06	-17.572
-3.04	-17.0633
-3.02	-16.568
-3	-16.0859
-2.98	-15.6167
-2.96	-15.16
-2.94	-14.7157
-2.92	-14.2833
-2.9	-13.8627
-2.88	-13.4536
-2.86	-13.0557
-2.84	-12.6688
-2.82	-12.2925
-2.8	-11.9267
-2.78	-11.5711
-2.76	-11.2254
-2.74	-10.8895
-2.72	-10.5631
-2.7	-10.2459
-2.68	-9.93781
-2.66	-9.63851
-2.64	-9.34782
-2.62	-9.06553
-2.6	-8.79142
-2.58	-8.5253
-2.56	-8.26696
-2.54	-8.01622
-2.52	-7.77288
-2.5	-7.53674
-2.48	-7.30764
-2.46	-7.08538
-2.44	-6.8698
-2.42	-6.66071
-2.4	-6.45795
-2.38	-6.26136
-2.36	-6.07076
-2.34	-5.88601
-2.32	-5.70694
-2.3	-5.5334
-2.28	-5.36525
-2.26	-5.20233
-2.24	-5.04451
-2.22	-4.89164
-2.2	-4.74359
-2.18	-4.60022
-2.16	-4.4614
-2.14	-4.32701
-2.12	-4.19692
-2.1	-4.071
-2.08	-3.94915
-2.06	-3.83123
-2.04	-3.71714
-2.02	-3.60677
-2	-3.5
-1.98	-3.39673
-1.96	-3.29686
-1.94	-3.20029
-1.92	-3.10691
-1.9	-3.01663
-1.88	-2.92935
-1.86	-2.84499
-1.84	-2.76346
-1.82	-2.68466
-1.8	-2.60852
-1.78	-2.53494
-1.76	-2.46385
-1.74	-2.39517
-1.72	-2.32883
-1.7	-2.26474
-1.68	-2.20284
-1.66	-2.14306
-1.64	-2.08532
-1.62	-2.02956
-1.6	-1.97571
-1.58	-1.92372
-1.56	-1.87351
-1.54	-1.82503
-1.52	-1.77823
-1.5	-1.73303
-1.48	-1.6894
-1.46	-1.64727
-1.44	-1.6066
-1.42	-1.56733
-1.4	-1.52941
-1.38	-1.4928
-1.36	-1.45745
-1.34	-1.42332
-1.32	-1.39037
-1.3	-1.35854
-1.28	-1.3278
-1.26	-1.29812
-1.24	-1.26945
-1.22	-1.24176
-1.2	-1.21501
-1.18	-1.18916
-1.16	-1.16419
-1.14	-1.14006
-1.12	-1.11674
-1.1	-1.0942
-1.08	-1.0724
-1.06	-1.05133
-1.04	-1.03096
-1.02	-1.01125
-1	-0.992188
-0.98	-0.973743
-0.96	-0.955894
-0.94	-0.938617
-0.92	-0.921891
-0.9	-0.905694
-0.88	-0.890006
-0.86	-0.874809
-0.84	-0.860082
-0.82	-0.845807
-0.8	-0.831968
-0.78	-0.818547
-0.76	-0.805529
-0.74	-0.792897
-0.72	-0.780638
-0.7	-0.768736
-0.68	-0.757178
-0.66	-0.745951
-0.64	-0.735041
-0.62	-0.724438
-0.6	-0.714129
-0.58	-0.704104
-0.56	-0.694351
-0.54	-0.68486
-0.52	-0.675621
-0.5	-0.666626
-0.48	-0.657865
-0.46	-0.649329
-0.44	-0.64101
-0.42	-0.6329
-0.4	-0.624992
-0.38	-0.617278
-0.36	-0.609752
-0.34	-0.602407
-0.32	-0.595236
-0.3	-0.588234
-0.28	-0.581395
-0.26	-0.574712
-0.24	-0.568182
-0.22	-0.561798
-0.2	-0.555555
-0.18	-0.549451
-0.16	-0.543478
-0.14	-0.537634
-0.12	-0.531915
-0.1	-0.526316
-0.08	-0.520833
-0.06	-0.515464
-0.04	-0.510204
-0.02	-0.505051
0	-0.5
0.02	-0.49505
0.04	-0.490196
0.06	-0.485437
0.08	-0.480769
0.1	-0.47619
0.12	-0.471698
0.14	-0.46729
0.16	-0.462963
0.18	-0.458716
0.2	-0.454545
0.22	-0.450451
0.24	-0.446429
0.26	-0.442478
0.28	-0.438597
0.3	-0.434783
0.32	-0.431036
0.34	-0.427352
0.36	-0.423731
0.38	-0.420172
0.4	-0.416672
0.42	-0.413231
0.44	-0.409846
0.46	-0.406518
0.48	-0.403244
0.5	-0.400024
0.52	-0.396857
0.54	-0.393742
0.56	-0.390678
0.58	-0.387664
0.6	-0.3847
0.62	-0.381784
0.64	-0.378918
0.66	-0.3761
0.68	-0.37333
0.7	-0.370609
0.72	-0.367935
0.74	-0.36531
0.76	-0.362733
0.78	-0.360206
0.8	-0.357728
0.82	-0.355301
0.84	-0.352924
0.86	-0.350601
0.88	-0.348331
0.9	-0.346116
0.92	-0.343958
0.94	-0.341859
0.96	-0.339821
0.98	-0.337846
1	-0.335938
1.02	-0.334097
1.04	-0.332329
1.06	-0.330636
1.08	-0.329022
1.1	-0.327492
1.12	-0.326048
1.14	-0.324697
1.16	-0.323443
1.18	-0.322291
1.2	-0.321248
1.22	-0.320319
1.24	-0.319511
1.26	-0.318831
1.28	-0.318287
1.3	-0.317886
1.32	-0.317636
1.34	-0.317547
1.36	-0.317628
1.38	-0.317889
1.4	-0.31834
1.42	-0.318992
1.44	-0.319856
1.46	-0.320946
1.48	-0.322274
1.5	-0.323853
1.52	-0.325697
1.54	-0.327821
1.56	-0.33024
1.58	-0.332972
1.6	-0.336032
1.62	-0.339439
1.64	-0.34321
1.66	-0.347366
1.68	-0.351927
1.7	-0.356913
1.72	-0.362346
1.74	-0.36825
1.76	-0.374648
1.78	-0.381564
1.8	-0.389026
1.82	-0.397058
1.84	-0.405689
1.86	-0.414948
1.88	-0.424865
1.9	-0.435471
1.92	-0.446798
1.94	-0.458879
1.96	-0.471749
1.98	-0.485444
2	-0.5
2.02	-0.515457
2.04	-0.531853
2.06	-0.54923
2.08	-0.56763
2.1	-0.587098
2.12	-0.607677
2.14	-0.629416
2.16	-0.652362
2.18	-0.676564
2.2	-0.702076
2.22	-0.728948
2.24	-0.757236
2.26	-0.786997
2.28	-0.818287
2.3	-0.851167
2.32	-0.885699
2.34	-0.921945
2.36	-0.959971
2.38	-0.999844
2.4	-1.04163
2.42	-1.08541
2.44	-1.13124
2.46	-1.17921
2.48	-1.22939
2.5	-1.28186
2.52	-1.3367
2.54	-1.394
2.56	-1.45384
2.58	-1.5163
2.6	-1.58149
2.62	-1.64949
2.64	-1.72039
2.66	-1.7943
2.68	-1.87131
2.7	-1.95152
2.72	-2.03505
2.74	-2.12199
2.76	-2.21246
2.78	-2.30658
2.8	-2.40445
2.82	-2.50619
2.84	-2.61193
2.86	-2.72179
2.88	-2.8359
2.9	-2.95438
2.92	-3.07737
2.94	-3.20501
2.96	-3.33743
2.98	-3.47477
3	-3.61719
3.02	-3.76482
3.04	-3.91783
3.06	-4.07636
3.08	-4.24057
3.1	-4.41063
3.12	-4.5867
3.14	-4.76896
3.16	-4.95756
3.18	-5.15269
3.2	-5.35453
3.22	-5.56326
3.24	-5.77906
3.26	-6.00214
3.28	-6.23268
3.3	-6.47088
3.32	-6.71694
3.34	-6.97108
3.36	-7.2335
3.38	-7.50442
3.4	-7.78405
3.42	-8.07262
3.44	-8.37036
3.46	-8.6775
3.48	-8.99427
3.5	-9.32092
3.52	-9.65769
3.54	-10.0048
3.56	-10.3626
3.58	-10.7313
3.6	-11.1111
3.62	-11.5023
3.64	-11.9052
3.66	-12.3201
3.68	-12.7472
3.7	-13.1869
3.72	-13.6395
3.74	-14.1051
3.76	-14.5842
3.78	-15.0771
3.8	-15.584
3.82	-16.1053
3.84	-16.6413
3.86	-17.1924
3.88	-17.7588
3.9	-18.341
3.92	-18.9392
3.94	-19.5539
3.96	-20.1853
3.98	-20.8339
4	-21.5
4.02	-22.184
4.04	-22.8863
4.06	-23.6073
4.08	-24.3473
4.1	-25.1068
4.12	-25.8863
4.14	-26.686
4.16	-27.5064
4.18	-28.3479
4.2	-29.2111
4.22	-30.0963
4.24	-31.004
4.26	-31.9345
4.28	-32.8885
4.3	-33.8664
4.32	-34.8686
4.34	-35.8956
4.36	-36.948
4.38	-38.0261
4.4	-39.1306
4.42	-40.2619
4.44	-41.4206
4.46	-42.6071
4.48	-43.8221
4.5	-45.066
4.52	-46.3395
4.54	-47.643
4.56	-48.9772
4.58	-50.3426
4.6	-51.7398
4.62	-53.1694
4.64	-54.6319
4.66	-56.1281
4.68	-57.6585
4.7	-59.2238
4.72	-60.8245
4.74	-62.4613
4.76	-64.135
4.78	-65.846
4.8	-67.5952
4.82	-69.3831
4.84	-71.2105
4.86	-73.0781
4.88	-74.9865
4.9	-76.9365
4.92	-78.9288
4.94	-80.9642
4.96	-83.0433
4.98	-85.167
5	-87.3359
5.02	-89.551
5.04	-91.8129
5.06	-94.1224
5.08	-96.4804
5.1	-98.8876
5.12	-101.345
5.14	-103.853
5.16	-106.413
5.18	-109.026
5.2	-111.692
5.22	-114.412
5.24	-117.188
5.26	-120.02
5.28	-122.908
5.3	-125.855
5.32	-128.861
5.34	-131.926
5.36	-135.053
5.38	-138.241
5.4	-141.491
5.42	-144.806
5.44	-148.185
5.46	-151.63
5.48	-155.141
5.5	-158.72
5.52	-162.368
5.54	-166.086
5.56	-169.875
5.58	-173.736
5.6	-177.67
5.62	-181.678
5.64	-185.762
5.66	-189.922
5.68	-194.159
5.7	-198.476
5.72	-202.872
5.74	-207.35
5.76	-211.909
5.78	-216.552
5.8	-221.28
5.82	-226.094
5.84	-230.996
5.86	-235.985
5.88	-241.065
5.9	-246.235
5.92	-251.498
5.94	-256.855
5.96	-262.306
5.98	-267.854
6	-273.5
6.02	-279.245
6.04	-285.09
6.06	-291.037
6.08	-297.088
6.1	-303.243
6.12	-309.504
6.14	-315.873
6.16	-322.352
6.18	-328.941
6.2	-335.642
6.22	-342.456
6.24	-349.386
6.26	-356.433
6.28	-363.598
6.3	-370.883
6.32	-378.289
6.34	-385.819
6.36	-393.474
6.38	-401.255
6.4	-409.164
6.42	-417.202
6.44	-425.373
6.46	-433.676
6.48	-442.115
6.5	-450.69
6.52	-459.404
6.54	-468.258
6.56	-477.254
6.58	-486.394
6.6	-495.68
6.62	-505.113
6.64	-514.696
6.66	-524.43
6.68	-534.317
6.7	-544.36
6.72	-554.56
6.74	-564.919
6.76	-575.439
6.78	-586.122
6.8	-596.97
6.82	-607.985
6.84	-619.17
6.86	-630.526
6.88	-642.055
6.9	-653.76
6.92	-665.642
6.94	-677.705
6.96	-689.949
6.98	-702.377
7	-714.992
7.02	-727.796
7.04	-740.79
7.06	-753.977
7.08	-767.36
7.1	-780.941
7.12	-794.722
7.14	-808.705
7.16	-822.893
7.18	-837.288
7.2	-851.893
7.22	-866.71
7.24	-881.742
7.26	-896.99
7.28	-912.458
7.3	-928.148
7.32	-944.063
7.34	-960.205
7.36	-976.577
7.38	-993.181
7.4	-1010.02
7.42	-1027.1
7.44	-1044.41
7.46	-1061.97
7.48	-1079.78
7.5	-1097.83
7.52	-1116.14
7.54	-1134.7
7.56	-1153.52
7.58	-1172.59
7.6	-1191.93
7.62	-1211.54
7.64	-1231.41
7.66	-1251.56
7.68	-1271.97
7.7	-1292.67
7.72	-1313.65
7.74	-1334.91
7.76	-1356.45
7.78	-1378.29
7.8	-1400.42
7.82	-1422.84
7.84	-1445.57
7.86	-1468.59
7.88	-1491.92
7.9	-1515.56
7.92	-1539.51
7.94	-1563.78
7.96	-1588.36
7.98	-1613.27
8	-1638.5
8.02	-1664.06
8.04	-1689.95
8.06	-1716.18
8.08	-1742.74
8.1	-1769.65
8.12	-1796.91
8.14	-1824.51
8.16	-1852.47
8.18	-1880.78
8.2	-1909.45
8.22	-1938.49
8.24	-1967.9
8.26	-1997.67
8.28	-2027.82
8.3	-2058.35
8.32	-2089.27
8.34	-2120.57
8.36	-2152.25
8.38	-2184.34
8.4	-2216.82
8.42	-2249.7
8.44	-2282.99
8.46	-2316.69
8.48	-2350.81
8.5	-2385.34
8.52	-2420.3
8.54	-2455.68
8.56	-2491.49
8.58	-2527.74
8.6	-2564.42
8.62	-2601.55
8.64	-2639.13
8.66	-2677.15
8.68	-2715.64
8.7	-2754.58
8.72	-2793.99
8.74	-2833.87
8.76	-2874.22
8.78	-2915.05
8.8	-2956.37
8.82	-2998.17
8.84	-3040.46
8.86	-3083.25
8.88	-3126.54
8.9	-3170.34
8.92	-3214.65
8.94	-3259.47
8.96	-3304.82
8.98	-3350.69
9	-3397.09
9.02	-3444.02
9.04	-3491.49
9.06	-3539.51
9.08	-3588.08
9.1	-3637.2
9.12	-3686.89
9.14	-3737.13
9.16	-3787.95
9.18	-3839.34
9.2	-3891.32
9.22	-3943.88
9.24	-3997.03
9.26	-4050.77
9.28	-4105.12
9.3	-4160.08
9.32	-4215.65
9.34	-4271.83
9.36	-4328.64
9.38	-4386.08
9.4	-4444.15
9.42	-4502.86
9.44	-4562.22
9.46	-4622.23
9.48	-4682.9
9.5	-4744.23
9.52	-4806.22
9.54	-4868.9
9.56	-4932.25
9.58	-4996.29
9.6	-5061.02
9.62	-5126.45
9.64	-5192.58
9.66	-5259.43
9.68	-5326.99
9.7	-5395.27
9.72	-5464.28
9.74	-5534.03
9.76	-5604.51
9.78	-5675.75
9.8	-5747.74
9.82	-5820.49
9.84	-5894
9.86	-5968.29
9.88	-6043.36
9.9	-6119.21
9.92	-6195.86
9.94	-6273.3
9.96	-6351.55
9.98	-6430.62
10	-6510.5
