x	p(x)
-10	123.541
-9.98	126.739
-9.96	129.862
-9.94	132.91
-9.92	135.886
-9.9	138.789
-9.88	141.62
-9.86	144.381
-9.84	147.072
-9.82	149.694
-9.8	152.247
-9.78	154.734
-9.76	157.154
-9.74	159.508
-9.72	161.797
-9.7	164.022
-9.68	166.184
-9.66	168.284
-9.64	170.322
-9.62	172.299
-9.6	174.215
-9.58	176.073
-9.56	177.871
-9.54	179.612
-9.52	181.296
-9.5	182.924
-9.48	184.496
-9.46	186.013
-9.44	187.475
-9.42	188.885
-9.4	190.241
-9.38	191.546
-9.36	192.8
-9.34	194.002
-9.32	195.155
-9.3	196.259
-9.28	197.314
-9.26	198.321
-9.24	199.281
-9.22	200.195
-9.2	201.063
-9.18	201.885
-9.16	202.663
-9.14	203.397
-9.12	204.088
-9.1	204.736
-9.08	205.342
-9.06	205.907
-9.04	206.431
-9.02	206.914
-9	207.358
-8.98	207.764
-8.96	208.131
-8.94	208.46
-8.92	208.752
-8.9	209.007
-8.88	209.226
-8.86	209.41
-8.84	209.559
-8.82	209.674
-8.8	209.755
-8.78	209.802
-8.76	209.817
-8.74	209.8
-8.72	209.752
-8.7	209.672
-8.68	209.562
-8.66	209.421
-8.64	209.251
-8.62	209.053
-8.6	208.825
-8.58	208.57
-8.56	208.287
-8.54	207.978
-8.52	207.641
-8.5	207.279
-8.48	206.892
-8.46	206.479
-8.44	206.041
-8.42	205.58
-8.4	205.095
-8.38	204.587
-8.36	204.055
-8.34	203.502
-8.32	202.927
-8.3	202.33
-8.28	201.713
-8.26	201.075
-8.24	200.417
-8.22	199.739
-8.2	199.041
-8.18	198.325
-8.16	197.591
-8.14	196.838
-8.12	196.068
-8.1	195.281
-8.08	194.477
-8.06	193.656
-8.04	192.819
-8.02	191.967
-8	191.099
-7.98	190.216
-7.96	189.319
-7.94	188.408
-7.92	187.482
-7.9	186.543
-7.88	185.591
-7.86	184.627
-7.84	183.65
-7.82	182.66
-7.8	181.659
-7.78	180.647
-7.76	179.624
-7.74	178.589
-7.72	177.545
-7.7	176.49
-7.68	175.425
-7.66	174.351
-7.64	173.268
-7.62	172.176
-7.6	171.075
-7.58	169.966
-7.56	168.849
-7.54	167.725
-7.52	166.593
-7.5	165.454
-7.48	164.308
-7.46	163.155
-7.44	161.996
-7.42	160.832
-7.4	159.661
-7.38	158.485
-7.36	157.304
-7.34	156.118
-7.32	154.927
-7.3	153.732
-7.28	152.532
-7.26	151.329
-7.24	150.122
-7.22	148.911
-7.2	147.697
-7.18	146.481
-7.16	145.261
-7.14	144.039
-7.12	142.814
-7.1	141.588
-7.08	140.359
-7.06	139.129
-7.04	137.897
-7.02	136.665
-7	135.431
-6.98	134.196
-6.96	132.961
-6.94	131.725
-6.92	130.489
-6.9	129.253
-6.88	128.017
-6.86	126.781
-6.84	125.546
-6.82	124.311
-6.8	123.077
-6.78	121.845
-6.76	120.613
-6.74	119.383
-6.72	118.154
-6.7	116.928
-6.68	115.703
-6.66	114.479
-6.64	113.259
-6.62	112.04
-6.6	110.824
-6.58	109.611
-6.56	108.4
-6.54	107.192
-6.52	105.988
-6.5	104.786
-6.48	103.588
-6.46	102.393
-6.44	101.202
-6.42	100.015
-6.4	98.8311
-6.38	97.6516
-6.36	96.4761
-6.34	95.3048
-6.32	94.1379
-6.3	92.9754
-6.28	91.8175
-6.26	90.6642
-6.24	89.5157
-6.22	88.3721
-6.2	87.2335
-6.18	86.1
-6.16	84.9717
-6.14	83.8486
-6.12	82.731
-6.1	81.6188
-6.08	80.5121
-6.06	79.4112
-6.04	78.3159
-6.02	77.2265
-6	76.143
-5.98	75.0655
-5.96	73.9941
-5.94	72.9288
-5.92	71.8697
-5.9	70.817
-5.88	69.7705
-5.86	68.7306
-5.84	67.6971
-5.82	66.6702
-5.8	65.6499
-5.78	64.6364
-5.76	63.6296
-5.74	62.6296
-5.72	61.6364
-5.7	60.6502
-5.68	59.671
-5.66	58.6988
-5.64	57.7337
-5.62	56.7757
-5.6	55.8249
-5.58	54.8813
-5.56	53.9449
-5.54	53.0159
-5.52	52.0942
-5.5	51.1799
-5.48	50.273
-5.46	49.3736
-5.44	48.4816
-5.42	47.5972
-5.4	46.7203
-5.38	45.851
-5.36	44.9893
-5.34	44.1353
-5.32	43.2888
-5.3	42.4501
-5.28	41.6191
-5.26	40.7958
-5.24	39.9802
-5.22	39.1724
-5.2	38.3723
-5.18	37.5801
-5.16	36.7956
-5.14	36.019
-5.12	35.2502
-5.1	34.4892
-5.08	33.736
-5.06	32.9908
-5.04	32.2533
-5.02	31.5237
-5	30.802
-4.98	30.0882
-4.96	29.3822
-4.94	28.684
-4.92	27.9938
-4.9	27.3114
-4.88	26.6368
-4.86	25.9701
-4.84	25.3112
-4.82	24.6602
-4.8	24.017
-4.78	23.3816
-4.76	22.7541
-4.74	22.1343
-4.72	21.5223
-4.7	20.9181
-4.68	20.3216
-4.66	19.7329
-4.64	19.1519
-4.62	18.5786
-4.6	18.013
-4.58	17.455
-4.56	16.9047
-4.54	16.3621
-4.52	15.827
-4.5	15.2995
-4.48	14.7796
-4.46	14.2672
-4.44	13.7623
-4.42	13.2649
-4.4	12.7749
-4.38	12.2924
-4.36	11.8172
-4.34	11.3494
-4.32	10.889
-4.3	10.4358
-4.28	9.98996
-4.26	9.55132
-4.24	9.11988
-4.22	8.69561
-4.2	8.27847
-4.18	7.86843
-4.16	7.46545
-4.14	7.06949
-4.12	6.68052
-4.1	6.2985
-4.08	5.92338
-4.06	5.55514
-4.04	5.19372
-4.02	4.83909
-4	4.49121
-3.98	4.15002
-3.96	3.8155
-3.94	3.4876
-3.92	3.16627
-3.9	2.85147
-3.88	2.54315
-3.86	2.24127
-3.84	1.94579
-3.82	1.65665
-3.8	1.3738
-3.78	1.09722
-3.76	0.826829
-3.74	0.562598
-3.72	0.304474
-3.7	0.052407
-3.68	-0.193653
-3.66	-0.433755
-3.64	-0.66795
-3.62	-0.89629
-3.6	-1.11882
-3.58	-1.33561
-3.56	-1.54669
-3.54	-1.75212
-3.52	-1.95196
-3.5	-2.14625
-3.48	-2.33505
-3.46	-2.51842
-3.44	-2.69641
-3.42	-2.86907
-3.4	-3.03645
-3.38	-3.19862
-3.36	-3.35563
-3.34	-3.50753
-3.32	-3.65438
-3.3	-3.79623
-3.28	-3.93314
-3.26	-4.06517
-3.24	-4.19237
-3.22	-4.31481
-3.2	-4.43253
-3.18	-4.54559
-3.16	-4.65406
-3.14	-4.75799
-3.12	-4.85743
-3.1	-4.95245
-3.08	-5.0431
-3.06	-5.12944
-3.04	-5.21153
-3.02	-5.28943
-3	-5.3632
-2.98	-5.43289
-2.96	-5.49856
-2.94	-5.56028
-2.92	-5.61809
-2.9	-5.67207
-2.88	-5.72227
-2.86	-5.76874
-2.84	-5.81155
-2.82	-5.85076
-2.8	-5.88642
-2.78	-5.9186
-2.76	-5.94735
-2.74	-5.97274
-2.72	-5.99482
-2.7	-6.01364
-2.68	-6.02928
-2.66	-6.04179
-2.64	-6.05123
-2.62	-6.05766
-2.6	-6.06114
-2.58	-6.06172
-2.56	-6.05946
-2.54	-6.05444
-2.52	-6.04669
-2.5	-6.03629
-2.48	-6.02328
-2.46	-6.00774
-2.44	-5.98972
-2.42	-5.96927
-2.4	-5.94645
-2.38	-5.92133
-2.36	-5.89396
-2.34	-5.8644
-2.32	-5.8327
-2.3	-5.79893
-2.28	-5.76314
-2.26	-5.72539
-2.24	-5.68574
-2.22	-5.64424
-2.2	-5.60095
-2.18	-5.55593
-2.16	-5.50923
-2.14	-5.46091
-2.12	-5.41103
-2.1	-5.35964
-2.08	-5.30679
-2.06	-5.25255
-2.04	-5.19697
-2.02	-5.1401
-2	-5.082
-1.98	-5.02273
-1.96	-4.96233
-1.94	-4.90086
-1.92	-4.83838
-1.9	-4.77494
-1.88	-4.71059
-1.86	-4.64539
-1.84	-4.57938
-1.82	-4.51263
-1.8	-4.44518
-1.78	-4.37708
-1.76	-4.3084
-1.74	-4.23917
-1.72	-4.16945
-1.7	-4.09929
-1.68	-4.02875
-1.66	-3.95786
-1.64	-3.88669
-1.62	-3.81528
-1.6	-3.74367
-1.58	-3.67193
-1.56	-3.6001
-1.54	-3.52822
-1.52	-3.45635
-1.5	-3.38453
-1.48	-3.31281
-1.46	-3.24123
-1.44	-3.16985
-1.42	-3.09871
-1.4	-3.02785
-1.38	-2.95732
-1.36	-2.88717
-1.34	-2.81744
-1.32	-2.74817
-1.3	-2.67941
-1.28	-2.61121
-1.26	-2.5436
-1.24	-2.47663
-1.22	-2.41034
-1.2	-2.34477
-1.18	-2.27997
-1.16	-2.21598
-1.14	-2.15283
-1.12	-2.09057
-1.1	-2.02924
-1.08	-1.96888
-1.06	-1.90952
-1.04	-1.85121
-1.02	-1.79398
-1	-1.73787
-0.98	-1.68293
-0.96	-1.62918
-0.94	-1.57666
-0.92	-1.52542
-0.9	-1.47548
-0.88	-1.42688
-0.86	-1.37966
-0.84	-1.33385
-0.82	-1.28948
-0.8	-1.2466
-0.78	-1.20522
-0.76	-1.16539
-0.74	-1.12714
-0.72	-1.0905
-0.7	-1.0555
-0.68	-1.02217
-0.66	-0.990543
-0.64	-0.960648
-0.62	-0.932517
-0.6	-0.906176
-0.58	-0.881657
-0.56	-0.858986
-0.54	-0.838191
-0.52	-0.819301
-0.5	-0.802341
-0.48	-0.787339
-0.46	-0.774321
-0.44	-0.763311
-0.42	-0.754336
-0.4	-0.74742
-0.38	-0.742586
-0.36	-0.739859
-0.34	-0.739262
-0.32	-0.740818
-0.3	-0.744549
-0.28	-0.750477
-0.26	-0.758623
-0.24	-0.769008
-0.22	-0.781653
-0.2	-0.796577
-0.18	-0.813801
-0.16	-0.833342
-0.14	-0.855221
-0.12	-0.879454
-0.1	-0.90606
-0.08	-0.935055
-0.06	-0.966457
-0.04	-1.00028
-0.02	-1.03654
0	-1.07526
0.02	-1.11645
0.04	-1.16011
0.06	-1.20628
0.08	-1.25496
0.1	-1.30615
0.12	-1.35989
0.14	-1.41617
0.16	-1.47501
0.18	-1.53643
0.2	-1.60042
0.22	-1.66701
0.24	-1.7362
0.26	-1.808
0.28	-1.88242
0.3	-1.95946
0.32	-2.03915
0.34	-2.12147
0.36	-2.20645
0.38	-2.29409
0.4	-2.38439
0.42	-2.47736
0.44	-2.573
0.46	-2.67133
0.48	-2.77234
0.5	-2.87604
0.52	-2.98243
0.54	-3.09151
0.56	-3.20329
0.58	-3.31778
0.6	-3.43496
0.62	-3.55485
0.64	-3.67745
0.66	-3.80275
0.68	-3.93075
0.7	-4.06146
0.72	-4.19488
0.74	-4.331
0.76	-4.46982
0.78	-4.61135
0.8	-4.75557
0.82	-4.90249
0.84	-5.0521
0.86	-5.20441
0.88	-5.35939
0.9	-5.51707
0.92	-5.67741
0.94	-5.84044
0.96	-6.00612
0.98	-6.17448
1	-6.34548
1.02	-6.51914
1.04	-6.69544
1.06	-6.87438
1.08	-7.05594
1.1	-7.24013
1.12	-7.42693
1.14	-7.61633
1.16	-7.80833
1.18	-8.00291
1.2	-8.20008
1.22	-8.39981
1.24	-8.6021
1.26	-8.80693
1.28	-9.0143
1.3	-9.2242
1.32	-9.43662
1.34	-9.65153
1.36	-9.86894
1.38	-10.0888
1.4	-10.3112
1.42	-10.536
1.44	-10.7632
1.46	-10.9929
1.48	-11.225
1.5	-11.4595
1.52	-11.6964
1.54	-11.9356
1.56	-12.1772
1.58	-12.4212
1.6	-12.6674
1.62	-12.916
1.64	-13.1669
1.66	-13.4201
1.68	-13.6755
1.7	-13.9332
1.72	-14.1931
1.74	-14.4552
1.76	-14.7196
1.78	-14.9861
1.8	-15.2548
1.82	-15.5256
1.84	-15.7986
1.86	-16.0736
1.88	-16.3508
1.9	-16.6301
1.92	-16.9114
1.94	-17.1947
1.96	-17.4801
1.98	-17.7675
2	-18.0569
2.02	-18.3482
2.04	-18.6415
2.06	-18.9368
2.08	-19.2339
2.1	-19.5329
2.12	-19.8339
2.14	-20.1366
2.16	-20.4412
2.18	-20.7476
2.2	-21.0559
2.22	-21.3659
2.24	-21.6776
2.26	-21.9911
2.28	-22.3063
2.3	-22.6233
2.32	-22.9419
2.34	-23.2621
2.36	-23.5841
2.38	-23.9076
2.4	-24.2327
2.42	-24.5595
2.44	-24.8877
2.46	-25.2176
2.48	-25.5489
2.5	-25.8818
2.52	-26.2162
2.54	-26.552
2.56	-26.8893
2.58	-27.228
2.6	-27.5681
2.62	-27.9097
2.64	-28.2526
2.66	-28.5968
2.68	-28.9424
2.7	-29.2894
2.72	-29.6376
2.74	-29.9871
2.76	-30.3379
2.78	-30.6899
2.8	-31.0432
2.82	-31.3977
2.84	-31.7534
2.86	-32.1102
2.88	-32.4683
2.9	-32.8275
2.92	-33.1878
2.94	-33.5492
2.96	-33.9118
2.98	-34.2754
3	-34.6401
3.02	-35.0059
3.04	-35.3727
3.06	-35.7406
3.08	-36.1095
3.1	-36.4793
3.12	-36.8502
3.14	-37.222
3.16	-37.5948
3.18	-37.9686
3.2	-38.3433
3.22	-38.7189
3.24	-39.0955
3.26	-39.473
3.28	-39.8513
3.3	-40.2306
3.32	-40.6107
3.34	-40.9917
3.36	-41.3736
3.38	-41.7563
3.4	-42.1399
3.42	-42.5243
3.44	-42.9096
3.46	-43.2957
3.48	-43.6826
3.5	-44.0703
3.52	-44.4589
3.54	-44.8483
3.56	-45.2384
3.58	-45.6294
3.6	-46.0212
3.62	-46.4138
3.64	-46.8072
3.66	-47.2014
3.68	-47.5964
3.7	-47.9922
3.72	-48.3888
3.74	-48.7862
3.76	-49.1845
3.78	-49.5835
3.8	-49.9834
3.82	-50.3841
3.84	-50.7856
3.86	-51.188
3.88	-51.5912
3.9	-51.9952
3.92	-52.4001
3.94	-52.8059
3.96	-53.2126
3.98	-53.6202
4	-54.0286
4.02	-54.438
4.04	-54.8484
4.06	-55.2596
4.08	-55.6719
4.1	-56.0851
4.12	-56.4993
4.14	-56.9145
4.16	-57.3308
4.18	-57.7481
4.2	-58.1665
4.22	-58.5859
4.24	-59.0065
4.26	-59.4283
4.28	-59.8512
4.3	-60.2753
4.32	-60.7006
4.34	-61.1272
4.36	-61.555
4.38	-61.9842
4.4	-62.4147
4.42	-62.8466
4.44	-63.2798
4.46	-63.7145
4.48	-64.1507
4.5	-64.5884
4.52	-65.0277
4.54	-65.4685
4.56	-65.911
4.58	-66.3551
4.6	-66.8009
4.62	-67.2485
4.64	-67.6979
4.66	-68.1491
4.68	-68.6023
4.7	-69.0574
4.72	-69.5144
4.74	-69.9735
4.76	-70.4348
4.78	-70.8981
4.8	-71.3637
4.82	-71.8315
4.84	-72.3017
4.86	-72.7742
4.88	-73.2492
4.9	-73.7267
4.92	-74.2067
4.94	-74.6894
4.96	-75.1748
4.98	-75.663
5	-76.154
5.02	-76.6479
5.04	-77.1448
5.06	-77.6447
5.08	-78.1478
5.1	-78.6541
5.12	-79.1637
5.14	-79.6767
5.16	-80.1931
5.18	-80.713
5.2	-81.2366
5.22	-81.7639
5.24	-82.295
5.26	-82.83
5.28	-83.3689
5.3	-83.912
5.32	-84.4592
5.34	-85.0106
5.36	-85.5665
5.38	-86.1268
5.4	-86.6917
5.42	-87.2613
5.44	-87.8357
5.46	-88.4149
5.48	-88.9992
5.5	-89.5886
5.52	-90.1832
5.54	-90.7832
5.56	-91.3886
5.58	-91.9996
5.6	-92.6163
5.62	-93.2389
5.64	-93.8674
5.66	-94.5021
5.68	-95.1429
5.7	-95.7901
5.72	-96.4437
5.74	-97.104
5.76	-97.7711
5.78	-98.4451
5.8	-99.1261
5.82	-99.8143
5.84	-100.51
5.86	-101.213
5.88	-101.923
5.9	-102.642
5.92	-103.368
5.94	-104.103
5.96	-104.846
5.98	-105.597
6	-106.357
6.02	-107.125
6.04	-107.903
6.06	-108.689
6.08	-109.485
6.1	-110.291
6.12	-111.106
6.14	-111.93
6.16	-112.765
6.18	-113.61
6.2	-114.466
6.22	-115.332
6.24	-116.209
6.26	-117.096
6.28	-117.995
6.3	-118.906
6.32	-119.827
6.34	-120.761
6.36	-121.707
6.38	-122.665
6.4	-123.635
6.42	-124.618
6.44	-125.614
6.46	-126.623
6.48	-127.645
6.5	-128.681
6.52	-129.73
6.54	-130.794
6.56	-131.872
6.58	-132.964
6.6	-134.071
6.62	-135.193
6.64	-136.33
6.66	-137.483
6.68	-138.652
6.7	-139.836
6.72	-141.037
6.74	-142.255
6.76	-143.489
6.78	-144.74
6.8	-146.009
6.82	-147.295
6.84	-148.599
6.86	-149.921
6.88	-151.262
6.9	-152.622
6.92	-154
6.94	-155.398
6.96	-156.816
6.98	-158.254
7	-159.712
7.02	-161.19
7.04	-162.69
7.06	-164.21
7.08	-165.752
7.1	-167.316
7.12	-168.902
7.14	-170.511
7.16	-172.143
7.18	-173.797
7.2	-175.476
7.22	-177.178
7.24	-178.904
7.26	-180.655
7.28	-182.431
7.3	-184.232
7.32	-186.059
7.34	-187.911
7.36	-189.79
7.38	-191.696
7.4	-193.629
7.42	-195.59
7.44	-197.578
7.46	-199.595
7.48	-201.641
7.5	-203.715
7.52	-205.819
7.54	-207.953
7.56	-210.117
7.58	-212.312
7.6	-214.538
7.62	-216.795
7.64	-219.085
7.66	-221.407
7.68	-223.761
7.7	-226.149
7.72	-228.571
7.74	-231.027
7.76	-233.517
7.78	-236.043
7.8	-238.604
7.82	-241.201
7.84	-243.834
7.86	-246.504
7.88	-249.212
7.9	-251.957
7.92	-254.741
7.94	-257.564
7.96	-260.426
7.98	-263.327
8	-266.27
8.02	-269.252
8.04	-272.277
8.06	-275.343
8.08	-278.451
8.1	-281.603
8.12	-284.797
8.14	-288.036
8.16	-291.319
8.18	-294.647
8.2	-298.021
8.22	-301.441
8.24	-304.907
8.26	-308.421
8.28	-311.983
8.3	-315.593
8.32	-319.252
8.34	-322.96
8.36	-326.718
8.38	-330.528
8.4	-334.388
8.42	-338.301
8.44	-342.266
8.46	-346.284
8.48	-350.355
8.5	-354.481
8.52	-358.662
8.54	-362.899
8.56	-367.192
8.58	-371.542
8.6	-375.949
8.62	-380.414
8.64	-384.938
8.66	-389.522
8.68	-394.166
8.7	-398.871
8.72	-403.637
8.74	-408.465
8.76	-413.356
8.78	-418.311
8.8	-423.33
8.82	-428.414
8.84	-433.564
8.86	-438.78
8.88	-444.063
8.9	-449.414
8.92	-454.834
8.94	-460.322
8.96	-465.881
8.98	-471.511
9	-477.212
9.02	-482.986
9.04	-488.832
9.06	-494.753
9.08	-500.748
9.1	-506.818
9.12	-512.965
9.14	-519.189
9.16	-525.49
9.18	-531.87
9.2	-538.329
9.22	-544.869
9.24	-551.49
9.26	-558.192
9.28	-564.978
9.3	-571.847
9.32	-578.8
9.34	-585.838
9.36	-592.963
9.38	-600.175
9.4	-607.474
9.42	-614.863
9.44	-622.341
9.46	-629.909
9.48	-637.569
9.5	-645.322
9.52	-653.167
9.54	-661.107
9.56	-669.142
9.58	-677.272
9.6	-685.5
9.62	-693.826
9.64	-702.25
9.66	-710.775
9.68	-719.4
9.7	-728.127
9.72	-736.957
9.74	-745.89
9.76	-754.928
9.78	-764.072
9.8	-773.323
9.82	-782.681
9.84	-792.148
9.86	-801.725
9.88	-811.412
9.9	-821.212
9.92	-831.124
9.94	-841.15
9.96	-851.292
9.98	-861.549
10	-871.924
