x	g(x)
-10	-2.19908
-9.98	-2.18783
-9.96	-2.17659
-9.94	-2.16534
-9.92	-2.1541
-9.9	-2.14285
-9.88	-2.13161
-9.86	-2.12036
-9.84	-2.10912
-9.82	-2.09787
-9.8	-2.08662
-9.78	-2.07538
-9.76	-2.06413
-9.74	-2.05289
-9.72	-2.04164
-9.7	-2.0304
-9.68	-2.01915
-9.66	-2.00791
-9.64	-1.99666
-9.62	-1.98542
-9.6	-1.97417
-9.58	-1.96293
-9.56	-1.95168
-9.54	-1.94043
-9.52	-1.92919
-9.5	-1.91794
-9.48	-1.90645
-9.46	-1.89496
-9.44	-1.88347
-9.42	-1.87198
-9.4	-1.86049
-9.38	-1.849
-9.36	-1.8375
-9.34	-1.82601
-9.32	-1.81452
-9.3	-1.80303
-9.28	-1.79154
-9.26	-1.78005
-9.24	-1.76856
-9.22	-1.75706
-9.2	-1.74557
-9.18	-1.73408
-9.16	-1.72259
-9.14	-1.7111
-9.12	-1.69961
-9.1	-1.68812
-9.08	-1.67662
-9.06	-1.66513
-9.04	-1.65364
-9.02	-1.64215
-9	-1.63066
-8.98	-1.61858
-8.96	-1.60649
-8.94	-1.59441
-8.92	-1.58233
-8.9	-1.57025
-8.88	-1.55816
-8.86	-1.54608
-8.84	-1.534
-8.82	-1.52192
-8.8	-1.50983
-8.78	-1.49775
-8.76	-1.48567
-8.74	-1.47359
-8.72	-1.4615
-8.7	-1.44942
-8.68	-1.43734
-8.66	-1.42526
-8.64	-1.41317
-8.62	-1.40109
-8.6	-1.38901
-8.58	-1.37693
-8.56	-1.36484
-8.54	-1.35276
-8.52	-1.34068
-8.5	-1.32859
-8.48	-1.3165
-8.46	-1.3044
-8.44	-1.2923
-8.42	-1.2802
-8.4	-1.2681
-8.38	-1.256
-8.36	-1.2439
-8.34	-1.2318
-8.32	-1.2197
-8.3	-1.2076
-8.28	-1.1955
-8.26	-1.1834
-8.24	-1.1713
-8.22	-1.1592
-8.2	-1.1471
-8.18	-1.135
-8.16	-1.1229
-8.14	-1.1108
-8.12	-1.0987
-8.1	-1.0866
-8.08	-1.0745
-8.06	-1.0624
-8.04	-1.0503
-8.02	-1.0382
-8	-1.0261
-7.98	-1.01424
-7.96	-1.00239
-7.94	-0.990531
-7.92	-0.978675
-7.9	-0.966819
-7.88	-0.954963
-7.86	-0.943107
-7.84	-0.931251
-7.82	-0.919395
-7.8	-0.90754
-7.78	-0.895684
-7.76	-0.883828
-7.74	-0.871972
-7.72	-0.860116
-7.7	-0.84826
-7.68	-0.836404
-7.66	-0.824548
-7.64	-0.812692
-7.62	-0.800836
-7.6	-0.78898
-7.58	-0.777124
-7.56	-0.765268
-7.54	-0.753412
-7.52	-0.741556
-7.5	-0.7297
-7.48	-0.717312
-7.46	-0.704923
-7.44	-0.692534
-7.42	-0.680145
-7.4	-0.667756
-7.38	-0.655368
-7.36	-0.642979
-7.34	-0.63059
-7.32	-0.618201
-7.3	-0.605813
-7.28	-0.593424
-7.26	-0.581035
-7.24	-0.568646
-7.22	-0.556257
-7.2	-0.543869
-7.18	-0.53148
-7.16	-0.519091
-7.14	-0.506702
-7.12	-0.494313
-7.1	-0.481925
-7.08	-0.469536
-7.06	-0.457147
-7.04	-0.444758
-7.02	-0.43237
-7	-0.419981
-6.98	-0.408066
-6.96	-0.396151
-6.94	-0.384235
-6.92	-0.37232
-6.9	-0.360405
-6.88	-0.34849
-6.86	-0.336575
-6.84	-0.32466
-6.82	-0.312745
-6.8	-0.30083
-6.78	-0.288915
-6.76	-0.277
-6.74	-0.265085
-6.72	-0.253169
-6.7	-0.241254
-6.68	-0.229339
-6.66	-0.217424
-6.64	-0.205509
-6.62	-0.193594
-6.6	-0.181679
-6.58	-0.169764
-6.56	-0.157849
-6.54	-0.145934
-6.52	-0.134019
-6.5	-0.122103
-6.48	-0.110475
-6.46	-0.0988459
-6.44	-0.0872172
-6.42	-0.0755884
-6.4	-0.0639597
-6.38	-0.0523309
-6.36	-0.0407022
-6.34	-0.0290735
-6.32	-0.0174447
-6.3	-0.00581595
-6.28	0.0058128
-6.26	0.0174415
-6.24	0.0290703
-6.22	0.040699
-6.2	0.0523278
-6.18	0.0639565
-6.16	0.0755853
-6.14	0.087214
-6.12	0.0988428
-6.1	0.110472
-6.08	0.1221
-6.06	0.133729
-6.04	0.145358
-6.02	0.156987
-6	0.168615
-5.98	0.179853
-5.96	0.191091
-5.94	0.202329
-5.92	0.213566
-5.9	0.224804
-5.88	0.236042
-5.86	0.24728
-5.84	0.258518
-5.82	0.269755
-5.8	0.280993
-5.78	0.292231
-5.76	0.303469
-5.74	0.314707
-5.72	0.325944
-5.7	0.337182
-5.68	0.34842
-5.66	0.359658
-5.64	0.370896
-5.62	0.382133
-5.6	0.393371
-5.58	0.404609
-5.56	0.415847
-5.54	0.427085
-5.52	0.438322
-5.5	0.44956
-5.48	0.46031
-5.46	0.47106
-5.44	0.481811
-5.42	0.492561
-5.4	0.503311
-5.38	0.514061
-5.36	0.524811
-5.34	0.535561
-5.32	0.546311
-5.3	0.557061
-5.28	0.567812
-5.26	0.578562
-5.24	0.589312
-5.22	0.600062
-5.2	0.610812
-5.18	0.621562
-5.16	0.632312
-5.14	0.643062
-5.12	0.653812
-5.1	0.664563
-5.08	0.675313
-5.06	0.686063
-5.04	0.696813
-5.02	0.707563
-5	0.718313
-4.98	0.72849
-4.96	0.738666
-4.94	0.748843
-4.92	0.759019
-4.9	0.769196
-4.88	0.779373
-4.86	0.789549
-4.84	0.799726
-4.82	0.809902
-4.8	0.820079
-4.78	0.830256
-4.76	0.840432
-4.74	0.850609
-4.72	0.860785
-4.7	0.870962
-4.68	0.881138
-4.66	0.891315
-4.64	0.901492
-4.62	0.911668
-4.6	0.921845
-4.58	0.932021
-4.56	0.942198
-4.54	0.952374
-4.52	0.962551
-4.5	0.972728
-4.48	0.98226
-4.46	0.991792
-4.44	1.00132
-4.42	1.01086
-4.4	1.02039
-4.38	1.02992
-4.36	1.03945
-4.34	1.04899
-4.32	1.05852
-4.3	1.06805
-4.28	1.07758
-4.26	1.08712
-4.24	1.09665
-4.22	1.10618
-4.2	1.11571
-4.18	1.12524
-4.16	1.13478
-4.14	1.14431
-4.12	1.15384
-4.1	1.16337
-4.08	1.17291
-4.06	1.18244
-4.04	1.19197
-4.02	1.2015
-4	1.21104
-3.98	1.22013
-3.96	1.22922
-3.94	1.23831
-3.92	1.24741
-3.9	1.2565
-3.88	1.26559
-3.86	1.27468
-3.84	1.28378
-3.82	1.29287
-3.8	1.30196
-3.78	1.31105
-3.76	1.32015
-3.74	1.32924
-3.72	1.33833
-3.7	1.34742
-3.68	1.35652
-3.66	1.36561
-3.64	1.3747
-3.62	1.38379
-3.6	1.39289
-3.58	1.40198
-3.56	1.41107
-3.54	1.42016
-3.52	1.42926
-3.5	1.43835
-3.48	1.44448
-3.46	1.45061
-3.44	1.45674
-3.42	1.46287
-3.4	1.469
-3.38	1.47514
-3.36	1.48127
-3.34	1.4874
-3.32	1.49353
-3.3	1.49966
-3.28	1.50579
-3.26	1.51192
-3.24	1.51806
-3.22	1.52419
-3.2	1.53032
-3.18	1.53645
-3.16	1.54258
-3.14	1.54871
-3.12	1.55484
-3.1	1.56098
-3.08	1.56711
-3.06	1.57324
-3.04	1.57937
-3.02	1.5855
-3	1.59163
-2.98	1.60554
-2.96	1.61945
-2.94	1.63336
-2.92	1.64726
-2.9	1.66117
-2.88	1.67508
-2.86	1.68899
-2.84	1.7029
-2.82	1.7168
-2.8	1.73071
-2.78	1.74462
-2.76	1.75853
-2.74	1.77244
-2.72	1.78634
-2.7	1.80025
-2.68	1.81416
-2.66	1.82807
-2.64	1.84197
-2.62	1.85588
-2.6	1.86979
-2.58	1.8837
-2.56	1.89761
-2.54	1.91151
-2.52	1.92542
-2.5	1.93933
-2.48	1.93483
-2.46	1.93033
-2.44	1.92583
-2.42	1.92132
-2.4	1.91682
-2.38	1.91232
-2.36	1.90782
-2.34	1.90332
-2.32	1.89882
-2.3	1.89432
-2.28	1.88981
-2.26	1.88531
-2.24	1.88081
-2.22	1.87631
-2.2	1.87181
-2.18	1.86731
-2.16	1.8628
-2.14	1.8583
-2.12	1.8538
-2.1	1.8493
-2.08	1.8448
-2.06	1.8403
-2.04	1.8358
-2.02	1.83129
-2	1.82679
-1.98	1.85058
-1.96	1.87437
-1.94	1.89815
-1.92	1.92194
-1.9	1.94573
-1.88	1.96951
-1.86	1.9933
-1.84	2.01709
-1.82	2.04088
-1.8	2.06466
-1.78	2.08845
-1.76	2.11224
-1.74	2.13602
-1.72	2.15981
-1.7	2.1836
-1.68	2.20739
-1.66	2.23117
-1.64	2.25496
-1.62	2.27875
-1.6	2.30253
-1.58	2.32632
-1.56	2.35011
-1.54	2.3739
-1.52	2.39768
-1.5	2.42147
-1.48	2.40409
-1.46	2.3867
-1.44	2.36932
-1.42	2.35194
-1.4	2.33455
-1.38	2.31717
-1.36	2.29979
-1.34	2.2824
-1.32	2.26502
-1.3	2.24764
-1.28	2.23025
-1.26	2.21287
-1.24	2.19549
-1.22	2.17811
-1.2	2.16072
-1.18	2.14334
-1.16	2.12596
-1.14	2.10857
-1.12	2.09119
-1.1	2.07381
-1.08	2.05642
-1.06	2.03904
-1.04	2.02166
-1.02	2.00427
-1	1.98689
-0.98	2.03774
-0.96	2.08859
-0.94	2.13944
-0.92	2.19029
-0.9	2.24114
-0.88	2.29199
-0.86	2.34284
-0.84	2.39369
-0.82	2.44454
-0.8	2.49539
-0.78	2.54624
-0.76	2.59709
-0.74	2.64794
-0.72	2.69879
-0.7	2.74964
-0.68	2.80049
-0.66	2.85134
-0.64	2.90219
-0.62	2.95304
-0.6	3.00389
-0.58	3.05474
-0.56	3.10559
-0.54	3.15644
-0.52	3.20729
-0.5	3.25814
-0.48	3.20719
-0.46	3.15624
-0.44	3.10529
-0.42	3.05435
-0.4	3.0034
-0.38	2.95245
-0.36	2.9015
-0.34	2.85055
-0.32	2.7996
-0.3	2.74866
-0.28	2.69771
-0.26	2.64676
-0.24	2.59581
-0.22	2.54486
-0.2	2.49392
-0.18	2.44297
-0.16	2.39202
-0.14	2.34107
-0.12	2.29012
-0.1	2.23918
-0.08	2.18823
-0.06	2.13728
-0.04	2.08633
-0.02	2.03538
0	1.98444
0.02	2.03523
0.04	2.08602
0.06	2.13681
0.08	2.1876
0.1	2.23839
0.12	2.28918
0.14	2.33998
0.16	2.39077
0.18	2.44156
0.2	2.49235
0.22	2.54314
0.24	2.59393
0.26	2.64472
0.28	2.69551
0.3	2.74631
0.32	2.7971
0.34	2.84789
0.36	2.89868
0.38	2.94947
0.4	3.00026
0.42	3.05105
0.44	3.10185
0.46	3.15264
0.48	3.20343
0.5	3.25422
0.52	3.2035
0.54	3.15279
0.56	3.10207
0.58	3.05136
0.6	3.00064
0.62	2.94993
0.64	2.89921
0.66	2.8485
0.68	2.79778
0.7	2.74707
0.72	2.69635
0.74	2.64564
0.76	2.59492
0.78	2.54421
0.8	2.49349
0.82	2.44278
0.84	2.39206
0.86	2.34135
0.88	2.29063
0.9	2.23991
0.92	2.1892
0.94	2.13848
0.96	2.08777
0.98	2.03705
1	1.98634
1.02	2.00366
1.04	2.02098
1.06	2.0383
1.08	2.05563
1.1	2.07295
1.12	2.09027
1.14	2.10759
1.16	2.12491
1.18	2.14224
1.2	2.15956
1.22	2.17688
1.24	2.1942
1.26	2.21152
1.28	2.22885
1.3	2.24617
1.32	2.26349
1.34	2.28081
1.36	2.29813
1.38	2.31546
1.4	2.33278
1.42	2.3501
1.44	2.36742
1.46	2.38474
1.48	2.40207
1.5	2.41939
1.52	2.39559
1.54	2.37179
1.56	2.34798
1.58	2.32418
1.6	2.30038
1.62	2.27658
1.64	2.25278
1.66	2.22898
1.68	2.20518
1.7	2.18137
1.72	2.15757
1.74	2.13377
1.76	2.10997
1.78	2.08617
1.8	2.06237
1.82	2.03857
1.84	2.01476
1.86	1.99096
1.88	1.96716
1.9	1.94336
1.92	1.91956
1.94	1.89576
1.96	1.87196
1.98	1.84815
2	1.82435
2.02	1.829
2.04	1.83365
2.06	1.83829
2.08	1.84294
2.1	1.84759
2.12	1.85223
2.14	1.85688
2.16	1.86153
2.18	1.86617
2.2	1.87082
2.22	1.87547
2.24	1.88011
2.26	1.88476
2.28	1.88941
2.3	1.89405
2.32	1.8987
2.34	1.90335
2.36	1.908
2.38	1.91264
2.4	1.91729
2.42	1.92194
2.44	1.92658
2.46	1.93123
2.48	1.93588
2.5	1.94052
2.52	1.92658
2.54	1.91263
2.56	1.89868
2.58	1.88473
2.6	1.87079
2.62	1.85684
2.64	1.84289
2.66	1.82895
2.68	1.815
2.7	1.80105
2.72	1.7871
2.74	1.77316
2.76	1.75921
2.78	1.74526
2.8	1.73132
2.82	1.71737
2.84	1.70342
2.86	1.68947
2.88	1.67553
2.9	1.66158
2.92	1.64763
2.94	1.63369
2.96	1.61974
2.98	1.60579
3	1.59184
3.02	1.58656
3.04	1.58127
3.06	1.57598
3.08	1.57069
3.1	1.56541
3.12	1.56012
3.14	1.55483
3.16	1.54954
3.18	1.54425
3.2	1.53897
3.22	1.53368
3.24	1.52839
3.26	1.5231
3.28	1.51781
3.3	1.51253
3.32	1.50724
3.34	1.50195
3.36	1.49666
3.38	1.49138
3.4	1.48609
3.42	1.4808
3.44	1.47551
3.46	1.47022
3.48	1.46494
3.5	1.45965
3.52	1.4497
3.54	1.43976
3.56	1.42981
3.58	1.41987
3.6	1.40993
3.62	1.39998
3.64	1.39004
3.66	1.38009
3.68	1.37015
3.7	1.3602
3.72	1.35026
3.74	1.34031
3.76	1.33037
3.78	1.32043
3.8	1.31048
3.82	1.30054
3.84	1.29059
3.86	1.28065
3.88	1.2707
3.9	1.26076
3.92	1.25081
3.94	1.24087
3.96	1.23092
3.98	1.22098
4	1.21104
4.02	1.2015
4.04	1.19197
4.06	1.18244
4.08	1.17291
4.1	1.16337
4.12	1.15384
4.14	1.14431
4.16	1.13478
4.18	1.12524
4.2	1.11571
4.22	1.10618
4.24	1.09665
4.26	1.08712
4.28	1.07758
4.3	1.06805
4.32	1.05852
4.34	1.04899
4.36	1.03945
4.38	1.02992
4.4	1.02039
4.42	1.01086
4.44	1.00132
4.46	0.991792
4.48	0.98226
4.5	0.972728
4.52	0.962551
4.54	0.952374
4.56	0.942198
4.58	0.932021
4.6	0.921845
4.62	0.911668
4.64	0.901492
4.66	0.891315
4.68	0.881138
4.7	0.870962
4.72	0.860785
4.74	0.850609
4.76	0.840432
4.78	0.830256
4.8	0.820079
4.82	0.809902
4.84	0.799726
4.86	0.789549
4.88	0.779373
4.9	0.769196
4.92	0.759019
4.94	0.748843
4.96	0.738666
4.98	0.72849
5	0.718313
5.02	0.707563
5.04	0.696813
5.06	0.686063
5.08	0.675313
5.1	0.664563
5.12	0.653812
5.14	0.643062
5.16	0.632312
5.18	0.621562
5.2	0.610812
5.22	0.600062
5.24	0.589312
5.26	0.578562
5.28	0.567812
5.3	0.557061
5.32	0.546311
5.34	0.535561
5.36	0.524811
5.38	0.514061
5.4	0.503311
5.42	0.492561
5.44	0.481811
5.46	0.47106
5.48	0.46031
5.5	0.44956
5.52	0.438049
5.54	0.426538
5.56	0.415027
5.58	0.403515
5.6	0.392004
5.62	0.380493
5.64	0.368982
5.66	0.35747
5.68	0.345959
5.7	0.334448
5.72	0.322937
5.74	0.311425
5.76	0.299914
5.78	0.288403
5.8	0.276892
5.82	0.26538
5.84	0.253869
5.86	0.242358
5.88	0.230847
5.9	0.219335
5.92	0.207824
5.94	0.196313
5.96	0.184802
5.98	0.17329
6	0.161779
6.02	0.150719
6.04	0.139658
6.06	0.128598
6.08	0.117537
6.1	0.106477
6.12	0.0954166
6.14	0.0843561
6.16	0.0732957
6.18	0.0622353
6.2	0.0511749
6.22	0.0401145
6.24	0.029054
6.26	0.0179936
6.28	0.00693319
6.3	-0.00412723
6.32	-0.0151877
6.34	-0.0262481
6.36	-0.0373085
6.38	-0.0483689
6.4	-0.0594293
6.42	-0.0704898
6.44	-0.0815502
6.46	-0.0926106
6.48	-0.103671
6.5	-0.114731
6.52	-0.127335
6.54	-0.139939
6.56	-0.152544
6.58	-0.165148
6.6	-0.177752
6.62	-0.190356
6.64	-0.20296
6.66	-0.215564
6.68	-0.228168
6.7	-0.240772
6.72	-0.253376
6.74	-0.26598
6.76	-0.278584
6.78	-0.291188
6.8	-0.303792
6.82	-0.316396
6.84	-0.329
6.86	-0.341604
6.88	-0.354208
6.9	-0.366812
6.92	-0.379416
6.94	-0.39202
6.96	-0.404624
6.98	-0.417228
7	-0.429832
7.02	-0.441529
7.04	-0.453226
7.06	-0.464924
7.08	-0.476621
7.1	-0.488318
7.12	-0.500015
7.14	-0.511712
7.16	-0.52341
7.18	-0.535107
7.2	-0.546804
7.22	-0.558501
7.24	-0.570198
7.26	-0.581895
7.28	-0.593593
7.3	-0.60529
7.32	-0.616987
7.34	-0.628684
7.36	-0.640381
7.38	-0.652079
7.4	-0.663776
7.42	-0.675473
7.44	-0.68717
7.46	-0.698867
7.48	-0.710564
7.5	-0.722262
7.52	-0.734415
7.54	-0.746569
7.56	-0.758722
7.58	-0.770876
7.6	-0.783029
7.62	-0.795183
7.64	-0.807336
7.66	-0.81949
7.68	-0.831643
7.7	-0.843797
7.72	-0.85595
7.74	-0.868104
7.76	-0.880257
7.78	-0.892411
7.8	-0.904564
7.82	-0.916717
7.84	-0.928871
7.86	-0.941024
7.88	-0.953178
7.9	-0.965331
7.92	-0.977485
7.94	-0.989638
7.96	-1.00179
7.98	-1.01395
8	-1.0261
8.02	-1.0382
8.04	-1.0503
8.06	-1.0624
8.08	-1.0745
8.1	-1.0866
8.12	-1.0987
8.14	-1.1108
8.16	-1.1229
8.18	-1.135
8.2	-1.1471
8.22	-1.1592
8.24	-1.1713
8.26	-1.1834
8.28	-1.1955
8.3	-1.2076
8.32	-1.2197
8.34	-1.2318
8.36	-1.2439
8.38	-1.256
8.4	-1.2681
8.42	-1.2802
8.44	-1.2923
8.46	-1.3044
8.48	-1.3165
8.5	-1.32859
8.52	-1.34051
8.54	-1.35242
8.56	-1.36434
8.58	-1.37625
8.6	-1.38817
8.62	-1.40008
8.64	-1.412
8.66	-1.42391
8.68	-1.43583
8.7	-1.44774
8.72	-1.45966
8.74	-1.47157
8.76	-1.48349
8.78	-1.4954
8.8	-1.50732
8.82	-1.51923
8.84	-1.53114
8.86	-1.54306
8.88	-1.55497
8.9	-1.56689
8.92	-1.5788
8.94	-1.59072
8.96	-1.60263
8.98	-1.61455
9	-1.62646
9.02	-1.63812
9.04	-1.64978
9.06	-1.66144
9.08	-1.6731
9.1	-1.68476
9.12	-1.69642
9.14	-1.70808
9.16	-1.71974
9.18	-1.7314
9.2	-1.74305
9.22	-1.75471
9.24	-1.76637
9.26	-1.77803
9.28	-1.78969
9.3	-1.80135
9.32	-1.81301
9.34	-1.82467
9.36	-1.83633
9.38	-1.84799
9.4	-1.85965
9.42	-1.87131
9.44	-1.88297
9.46	-1.89463
9.48	-1.90628
9.5	-1.91794
9.52	-1.92919
9.54	-1.94043
9.56	-1.95168
9.58	-1.96293
9.6	-1.97417
9.62	-1.98542
9.64	-1.99666
9.66	-2.00791
9.68	-2.01915
9.7	-2.0304
9.72	-2.04164
9.74	-2.05289
9.76	-2.06413
9.78	-2.07538
9.8	-2.08662
9.82	-2.09787
9.84	-2.10912
9.86	-2.12036
9.88	-2.13161
9.9	-2.14285
9.92	-2.1541
9.94	-2.16534
9.96	-2.17659
9.98	-2.18783
10	-2.19908
