<svg width="266" height="194" viewBox="0 0 266 194" fill="none" xmlns="http://www.w3.org/2000/svg">
<mask id="mask0_166_43" style="mask-type:luminance" maskUnits="userSpaceOnUse" x="31" y="0" width="235" height="194">
<path d="M204.522 36.7828L203.817 36.8572L203.513 36.2156C193.68 15.4083 172.458 1 147.852 1C116.848 1 91.2186 23.8682 86.9794 53.6001L86.8162 54.7445L85.7072 54.4183C82.2662 53.4059 78.6339 52.8528 74.8664 52.8528C53.7599 52.8528 36.657 69.9079 36.657 90.9387C36.657 97.3768 38.267 103.435 41.0935 108.749L41.4576 109.433L40.8855 109.956C35.4329 114.942 32 122.075 32 130.022C32 145.066 44.2365 157.268 59.3343 157.268C61.6481 157.268 63.8822 156.954 66.042 156.407L66.8243 156.209L67.1831 156.932C75.5794 173.846 94.8469 185.755 117.375 185.755C132.163 185.755 145.555 180.611 155.39 172.292L156.238 171.574L156.863 172.493C165.269 184.865 179.482 193 195.602 193C221.425 193 242.353 172.135 242.353 146.404C242.353 143.026 241.986 139.74 241.301 136.566L241.161 135.917L241.705 135.536C255.787 125.683 265 109.383 265 90.9387C265 60.8566 240.537 36.4735 210.352 36.4735C208.385 36.4735 206.443 36.5804 204.522 36.7828Z" stroke="white" stroke-width="2"/>
</mask>
<g mask="url(#mask0_166_43)">
<path d="M204.522 36.7828L203.817 36.8572L203.513 36.2156C193.68 15.4083 172.458 1 147.852 1C116.848 1 91.2186 23.8682 86.9794 53.6001L86.8162 54.7445L85.7072 54.4183C82.2662 53.4059 78.6339 52.8528 74.8664 52.8528C53.7599 52.8528 36.657 69.9079 36.657 90.9387C36.657 97.3768 38.267 103.435 41.0935 108.749L41.4576 109.433L40.8855 109.956C35.4329 114.942 32 122.075 32 130.022C32 145.066 44.2365 157.268 59.3343 157.268C61.6481 157.268 63.8822 156.954 66.042 156.407L66.8243 156.209L67.1831 156.932C75.5794 173.846 94.8469 185.755 117.375 185.755C132.163 185.755 145.555 180.611 155.39 172.292L156.238 171.574L156.863 172.493C165.269 184.865 179.482 193 195.602 193C221.425 193 242.353 172.135 242.353 146.404C242.353 143.026 241.986 139.74 241.301 136.566L241.161 135.917L241.705 135.536C255.787 125.683 265 109.383 265 90.9387C265 60.8566 240.537 36.4735 210.352 36.4735C208.385 36.4735 206.443 36.5804 204.522 36.7828Z" stroke="#D1F0F6" stroke-width="2"/>
</g>
<mask id="mask1_166_43" style="mask-type:luminance" maskUnits="userSpaceOnUse" x="5" y="152" width="20" height="17">
<path d="M15 168C20.1282 168 24 164.496 24 160.499C24 156.503 20.1285 153 15 153C9.86887 153 6 156.503 6 160.499C6 164.496 9.86922 168 15 168Z" stroke="white" stroke-width="2"/>
</mask>
<g mask="url(#mask1_166_43)">
<path d="M15 168C20.1282 168 24 164.496 24 160.499C24 156.503 20.1285 153 15 153C9.86887 153 6 156.503 6 160.499C6 164.496 9.86922 168 15 168Z" stroke="#D1F0F6" stroke-width="2"/>
</g>
<mask id="mask2_166_43" style="mask-type:luminance" maskUnits="userSpaceOnUse" x="0" y="173" width="11" height="10">
<path d="M5.31209 181.209C7.91756 181.209 9.62569 179.56 9.62569 177.973C9.62569 176.385 7.91733 174.736 5.31209 174.736C2.70726 174.736 1 176.385 1 177.973C1 179.561 2.70703 181.209 5.31209 181.209Z" fill="white" stroke="white" stroke-width="2"/>
</mask>
<g mask="url(#mask2_166_43)">
<path d="M4.99929 181C7.42861 181 9 179.46 9 178.001C9 176.54 7.42838 175 4.99929 175C2.5706 175 1 176.54 1 178.001C1 179.46 2.57037 181 4.99929 181Z" stroke="#D1F0F6" stroke-width="2"/>
</g>
</svg>
