2012-11-02
2013-09-16
2013-09-20
2014-04-11
2014-04-15
2015-08-04
2015-08-11
2015-10-30
2015-11-10
2015-12-03
2016-07-29
2016-08-02
2017-09-22
2018-01-29
2018-03-23
2018-03-28
2018-04-03
2018-04-20
2018-11-19
2019-05-13
2019-05-20
2020-03-18
2020-03-23
2020-04-01
2021-05-12
2021-05-17
2021-05-21
2021-05-28
2022-05-11
2022-05-16
2022-05-18
2022-09-29
2022-10-26
2022-11-02
