[
  {
    "inner": true,
    "original": true,
    "name": "Berkshire Hathaway B",
    "currency": "EUR",
    "ticker": "BRYN.F",
    "isin": "US0846707026",
    "sector": "Sonstiges",
    "id": 16,
    "market_cap": 656643454720,
    "geopac": 0.126211,
    "gain_consistency": 0.927731,
    "loss_ratio": 1.37695,
    "latest_price": 295.0,
    "latest_ma_200": 287.96,
    "months": 120
  },
  {
    "inner": true,
    "original": true,
    "name": "BlackRock",
    "currency": "EUR",
    "ticker": "BLQA.F",
    "isin": "US09247X1019",
    "sector": "Finanzen",
    "id": 17,
    "market_cap": 89403340888,
    "geopac": 0.109913,
    "gain_consistency": 0.906863,
    "loss_ratio": 2.4945,
    "latest_price": 596.4,
    "latest_ma_200": 652.966,
    "months": 120
  },
  {
    "inner": true,
    "original": true,
    "name": "Booking",
    "currency": "EUR",
    "ticker": "PCE1.F",
    "isin": "US09857L1089",
    "sector": "Sonstiges",
    "id": 18,
    "market_cap": 87288129600,
    "geopac": 0.121721,
    "gain_consistency": 0.873249,
    "loss_ratio": 2.62151,
    "latest_price": 2352.0,
    "latest_ma_200": 2038.38,
    "months": 120
  },
  {
    "inner": true,
    "original": true,
    "name": "Bunzl",
    "currency": "EUR",
    "ticker": "BUZ1.F",
    "isin": "GB00B0744B38",
    "sector": "Handel & Konsum",
    "id": 19,
    "market_cap": 12105565881,
    "geopac": 0.0764041,
    "gain_consistency": 0.770588,
    "loss_ratio": 2.23779,
    "latest_price": 35.6,
    "latest_ma_200": 33.9444,
    "months": 120
  },
  {
    "inner": true,
    "original": true,
    "name": "Canadian National Railway",
    "currency": "EUR",
    "ticker": "CY2.F",
    "isin": "CA1363751027",
    "sector": "Maschinenbau, Verkehr",
    "id": 20,
    "market_cap": 71208000000,
    "geopac": 0.108139,
    "gain_consistency": 0.923529,
    "loss_ratio": 1.94335,
    "latest_price": 107.5,
    "latest_ma_200": 115.103,
    "months": 120
  },
  {
    "inner": true,
    "original": true,
    "name": "Carl Zeiss Meditec",
    "currency": "EUR",
    "ticker": "AFX.F",
    "isin": "DE0005313704",
    "sector": "Chemie, Pharma",
    "id": 21,
    "market_cap": 10982954464,
    "geopac": 0.182864,
    "gain_consistency": 0.918768,
    "loss_ratio": 2.7822,
    "latest_price": 121.45,
    "latest_ma_200": 126.912,
    "months": 120
  },
  {
    "inner": true,
    "original": true,
    "name": "Church & Dwight",
    "currency": "EUR",
    "ticker": "CXU.F",
    "isin": "US1713401024",
    "sector": "Handel & Konsum",
    "id": 22,
    "market_cap": 20441187589,
    "geopac": 0.13033,
    "gain_consistency": 0.913585,
    "loss_ratio": 1.7925,
    "latest_price": 83.1,
    "latest_ma_200": 78.9258,
    "months": 120
  },
  {
    "inner": true,
    "original": true,
    "name": "Cintas",
    "currency": "EUR",
    "ticker": "CIT.F",
    "isin": "US1729081059",
    "sector": "Handel & Konsum",
    "id": 23,
    "market_cap": 40416374179,
    "geopac": 0.270853,
    "gain_consistency": 0.973669,
    "loss_ratio": 1.60787,
    "latest_price": 397.4,
    "latest_ma_200": 414.989,
    "months": 120
  },
  {
    "inner": true,
    "original": true,
    "name": "Colgate-Palmolive",
    "currency": "EUR",
    "ticker": "CPA.F",
    "isin": "US1941621039",
    "sector": "Handel & Konsum",
    "id": 24,
    "market_cap": 58249658880,
    "geopac": 0.0423805,
    "gain_consistency": 0.802521,
    "loss_ratio": 1.46297,
    "latest_price": 70.0,
    "latest_ma_200": 73.0779,
    "months": 120
  },
  {
    "inner": true,
    "original": true,
    "name": "Coloplast",
    "currency": "EUR",
    "ticker": "CBHD.F",
    "isin": "DK0060448595",
    "sector": "Chemie, Pharma",
    "id": 25,
    "market_cap": 27385149342,
    "geopac": 0.0977769,
    "gain_consistency": 0.858543,
    "loss_ratio": 2.1092,
    "latest_price": 130.05,
    "latest_ma_200": 113.418,
    "months": 120
  },
  {
    "inner": true,
    "original": true,
    "name": "Compass Group",
    "currency": "EUR",
    "ticker": "XGR2.F",
    "isin": "GB00BD6K4575",
    "sector": "Nahrungs- & Genussmittel",
    "id": 26,
    "market_cap": 41331389800,
    "geopac": 0.0764514,
    "gain_consistency": 0.792857,
    "loss_ratio": 2.34475,
    "latest_price": 23.6,
    "latest_ma_200": 21.804,
    "months": 120
  },
  {
    "inner": true,
    "original": true,
    "name": "Constellation Brands",
    "currency": "EUR",
    "ticker": "CB1A.F",
    "isin": "US21036P1084",
    "sector": "Nahrungs- & Genussmittel",
    "id": 27,
    "market_cap": 37717920759,
    "geopac": 0.159184,
    "gain_consistency": 0.879412,
    "loss_ratio": 1.92603,
    "latest_price": 203.6,
    "latest_ma_200": 225.62,
    "months": 120
  },
  {
    "inner": true,
    "original": true,
    "name": "Cooper Companies",
    "currency": "EUR",
    "ticker": "CP6.F",
    "isin": "US2166484020",
    "sector": "Chemie, Pharma",
    "id": 28,
    "market_cap": 16814938000,
    "geopac": 0.137316,
    "gain_consistency": 0.914006,
    "loss_ratio": 2.19725,
    "latest_price": 340.0,
    "latest_ma_200": 306.46,
    "months": 120
  },
  {
    "inner": true,
    "original": true,
    "name": "CTS Eventim",
    "currency": "EUR",
    "ticker": "EVD.F",
    "isin": "DE0005470306",
    "sector": "Sonstiges",
    "id": 29,
    "market_cap": 5581894008,
    "geopac": 0.122566,
    "gain_consistency": 0.890616,
    "loss_ratio": 3.04692,
    "latest_price": 58.15,
    "latest_ma_200": 56.3043,
    "months": 120
  },
  {
    "inner": true,
    "original": true,
    "name": "Danaher",
    "currency": "EUR",
    "ticker": "DAP.F",
    "isin": "US2358511028",
    "sector": "Sonstiges",
    "id": 30,
    "market_cap": 155585806677,
    "geopac": 0.191852,
    "gain_consistency": 0.957283,
    "loss_ratio": 1.56017,
    "latest_price": 209.2,
    "latest_ma_200": 254.448,
    "months": 120
  },
  {
    "inner": true,
    "original": true,
    "name": "Diageo",
    "currency": "EUR",
    "ticker": "GUI.F",
    "isin": "GB0002374006",
    "sector": "Nahrungs- & Genussmittel",
    "id": 31,
    "market_cap": 96091572301,
    "geopac": 0.0599127,
    "gain_consistency": 0.888515,
    "loss_ratio": 1.78775,
    "latest_price": 42.58,
    "latest_ma_200": 42.7736,
    "months": 120
  },
  {
    "inner": true,
    "original": true,
    "name": "Disney",
    "currency": "EUR",
    "ticker": "WDP.F",
    "isin": "US2546871060",
    "sector": "Sonstiges",
    "id": 32,
    "market_cap": 165107081336,
    "geopac": 0.0597985,
    "gain_consistency": 0.771709,
    "loss_ratio": 2.84925,
    "latest_price": 90.38,
    "latest_ma_200": 97.6447,
    "months": 120
  },
  {
    "inner": true,
    "original": true,
    "name": "Domino's",
    "currency": "EUR",
    "ticker": "EZV.F",
    "isin": "US25754A2015",
    "sector": "Nahrungs- & Genussmittel",
    "id": 33,
    "market_cap": 11147941400,
    "geopac": 0.198295,
    "gain_consistency": 0.930672,
    "loss_ratio": 2.44889,
    "latest_price": 314.75,
    "latest_ma_200": 336.819,
    "months": 120
  },
  {
    "inner": true,
    "original": true,
    "name": "Ecolab",
    "currency": "EUR",
    "ticker": "ECJ.F",
    "isin": "US2788651006",
    "sector": "Handel & Konsum",
    "id": 34,
    "market_cap": 42558167392,
    "geopac": 0.076101,
    "gain_consistency": 0.866947,
    "loss_ratio": 2.0507,
    "latest_price": 149.5,
    "latest_ma_200": 149.798,
    "months": 120
  },
  {
    "inner": true,
    "original": true,
    "name": "EssilorLuxottica",
    "currency": "EUR",
    "ticker": "ESL.F",
    "isin": "FR0000121667",
    "sector": "Handel & Konsum",
    "id": 36,
    "market_cap": 80443756273,
    "geopac": 0.0762886,
    "gain_consistency": 0.827591,
    "loss_ratio": 2.14851,
    "latest_price": 180.6,
    "latest_ma_200": 164.1,
    "months": 120
  },
  {
    "inner": true,
    "original": true,
    "name": "Estée Lauder",
    "currency": "EUR",
    "ticker": "ELAA.F",
    "isin": "US5184391044",
    "sector": "Handel & Konsum",
    "id": 37,
    "market_cap": 78116365152,
    "geopac": 0.160051,
    "gain_consistency": 0.92479,
    "loss_ratio": 2.12498,
    "latest_price": 217.8,
    "latest_ma_200": 234.778,
    "months": 120
  },
  {
    "inner": true,
    "original": true,
    "name": "Fiserv",
    "currency": "EUR",
    "ticker": "FIV.F",
    "isin": "US3377381088",
    "sector": "Technologie",
    "id": 38,
    "market_cap": 67300091136,
    "geopac": 0.18492,
    "gain_consistency": 0.926471,
    "loss_ratio": 1.88227,
    "latest_price": 108.0,
    "latest_ma_200": 100.889,
    "months": 120
  },
  {
    "inner": true,
    "original": true,
    "name": "Geberit",
    "currency": "CHF",
    "ticker": "GEBN.SW",
    "isin": "CH0030170408",
    "sector": "Sonstiges",
    "id": 39,
    "market_cap": 16825440482,
    "geopac": 0.0717209,
    "gain_consistency": 0.867787,
    "loss_ratio": 1.94222,
    "latest_price": 495.9,
    "latest_ma_200": 473.776,
    "months": 120
  },
  {
    "inner": true,
    "original": true,
    "name": "Givaudan",
    "currency": "CHF",
    "ticker": "GIVN.SW",
    "isin": "CH0010645932",
    "sector": "Chemie, Pharma",
    "id": 40,
    "market_cap": 28593884190,
    "geopac": 0.0873095,
    "gain_consistency": 0.914006,
    "loss_ratio": 1.6722,
    "latest_price": 3099.0,
    "latest_ma_200": 3033.65,
    "months": 120
  },
  {
    "inner": true,
    "original": true,
    "name": "Graco",
    "currency": "EUR",
    "ticker": "GA8.F",
    "isin": "US3841091040",
    "sector": "Maschinenbau, Verkehr",
    "id": 41,
    "market_cap": 10392171297,
    "geopac": 0.140623,
    "gain_consistency": 0.939636,
    "loss_ratio": 1.62291,
    "latest_price": 61.86,
    "latest_ma_200": 64.2643,
    "months": 120
  },
  {
    "inner": true,
    "original": true,
    "name": "Hannover Rück",
    "currency": "EUR",
    "ticker": "HNR1.F",
    "isin": "DE0008402215",
    "sector": "Finanzen",
    "id": 42,
    "market_cap": 22913523163,
    "geopac": 0.118606,
    "gain_consistency": 0.910644,
    "loss_ratio": 1.6485,
    "latest_price": 189.9,
    "latest_ma_200": 169.377,
    "months": 120
  },
  {
    "inner": true,
    "original": true,
    "name": "Heinken",
    "currency": "EUR",
    "ticker": "HNK1.F",
    "isin": "NL0000009165",
    "sector": "Nahrungs- & Genussmittel",
    "id": 43,
    "market_cap": 60062479079,
    "geopac": 0.0693942,
    "gain_consistency": 0.812465,
    "loss_ratio": 1.88935,
    "latest_price": 103.85,
    "latest_ma_200": 92.1869,
    "months": 120
  },
  {
    "inner": true,
    "original": true,
    "name": "Henry Schein",
    "currency": "EUR",
    "ticker": "HS2.F",
    "isin": "US8064071025",
    "sector": "Chemie, Pharma",
    "id": 44,
    "market_cap": 9713677920,
    "geopac": 0.0644542,
    "gain_consistency": 0.638095,
    "loss_ratio": 2.44337,
    "latest_price": 74.04,
    "latest_ma_200": 74.5848,
    "months": 120
  },
  {
    "inner": true,
    "original": true,
    "name": "Home Depot",
    "currency": "EUR",
    "ticker": "HDI.F",
    "isin": "US4370761029",
    "sector": "Handel & Konsum",
    "id": 45,
    "market_cap": 270217804016,
    "geopac": 0.163925,
    "gain_consistency": 0.94888,
    "loss_ratio": 1.84116,
    "latest_price": 264.8,
    "latest_ma_200": 291.241,
    "months": 120
  },
  {
    "inner": true,
    "original": true,
    "name": "Hormel Foods",
    "currency": "EUR",
    "ticker": "HO7.MU",
    "isin": "US4404521001",
    "sector": "Nahrungs- & Genussmittel",
    "id": 46,
    "market_cap": 21872250000,
    "geopac": 0.0841596,
    "gain_consistency": 0.857703,
    "loss_ratio": 2.01836,
    "latest_price": 36.15,
    "latest_ma_200": 43.9385,
    "months": 120
  },
  {
    "inner": true,
    "original": true,
    "name": "Intuit",
    "currency": "EUR",
    "ticker": "ITU.F",
    "isin": "US4612021034",
    "sector": "Technologie",
    "id": 48,
    "market_cap": 108571295808,
    "geopac": 0.231681,
    "gain_consistency": 0.954622,
    "loss_ratio": 1.78743,
    "latest_price": 387.0,
    "latest_ma_200": 399.99,
    "months": 120
  },
  {
    "inner": true,
    "original": true,
    "name": "ITW",
    "currency": "EUR",
    "ticker": "ILT.F",
    "isin": "US4523081093",
    "sector": "Sonstiges",
    "id": 49,
    "market_cap": 63738071287,
    "geopac": 0.145755,
    "gain_consistency": 0.937675,
    "loss_ratio": 1.54119,
    "latest_price": 209.1,
    "latest_ma_200": 209.057,
    "months": 120
  },
  {
    "inner": true,
    "original": true,
    "name": "Lindt Sprüngli",
    "currency": "CHF",
    "ticker": "LISP.SW",
    "isin": "CH0010570767",
    "sector": "Nahrungs- & Genussmittel",
    "id": 50,
    "market_cap": 25464422400,
    "geopac": 0.108393,
    "gain_consistency": 0.919188,
    "loss_ratio": 1.86157,
    "latest_price": 10880.0,
    "latest_ma_200": 10076.5,
    "months": 120
  },
  {
    "inner": true,
    "original": true,
    "name": "LSE Group",
    "currency": "EUR",
    "ticker": "LS4C.F",
    "isin": "GB00B0SWJX34",
    "sector": "Finanzen",
    "id": 51,
    "market_cap": 50845727232,
    "geopac": 0.173816,
    "gain_consistency": 0.902521,
    "loss_ratio": 2.05122,
    "latest_price": 91.5,
    "latest_ma_200": 88.6975,
    "months": 120
  },
  {
    "inner": true,
    "original": true,
    "name": "L'Oréal",
    "currency": "EUR",
    "ticker": "LOR.F",
    "isin": "FR0000120321",
    "sector": "Handel & Konsum",
    "id": 52,
    "market_cap": 233531115032,
    "geopac": 0.125997,
    "gain_consistency": 0.928852,
    "loss_ratio": 1.55664,
    "latest_price": 430.3,
    "latest_ma_200": 361.141,
    "months": 120
  },
  {
    "inner": true,
    "original": true,
    "name": "Mastercard",
    "currency": "EUR",
    "ticker": "M4I.F",
    "isin": "US57636Q1040",
    "sector": "Finanzen",
    "id": 53,
    "market_cap": 320550918399,
    "geopac": 0.206915,
    "gain_consistency": 0.960084,
    "loss_ratio": 1.75927,
    "latest_price": 337.4,
    "latest_ma_200": 330.935,
    "months": 120
  },
  {
    "inner": true,
    "original": true,
    "name": "McCormick",
    "currency": "EUR",
    "ticker": "MCX.F",
    "isin": "US5797802064",
    "sector": "Nahrungs- & Genussmittel",
    "id": 54,
    "market_cap": 20893923120,
    "geopac": 0.111766,
    "gain_consistency": 0.893978,
    "loss_ratio": 1.99423,
    "latest_price": 77.5,
    "latest_ma_200": 77.6075,
    "months": 120
  },
  {
    "inner": true,
    "original": true,
    "name": "McDonald's",
    "currency": "EUR",
    "ticker": "MDO.F",
    "isin": "US5801351017",
    "sector": "Nahrungs- & Genussmittel",
    "id": 55,
    "market_cap": 194699543311,
    "geopac": 0.135475,
    "gain_consistency": 0.937675,
    "loss_ratio": 1.51119,
    "latest_price": 266.7,
    "latest_ma_200": 255.014,
    "months": 120
  },
  {
    "inner": true,
    "original": true,
    "name": "Microsoft",
    "currency": "EUR",
    "ticker": "MSF.F",
    "isin": "US5949181045",
    "sector": "Technologie",
    "id": 56,
    "market_cap": 2064829927545,
    "geopac": 0.25849,
    "gain_consistency": 0.963305,
    "loss_ratio": 1.58548,
    "latest_price": 276.2,
    "latest_ma_200": 245.592,
    "months": 120
  },
  {
    "inner": true,
    "original": true,
    "name": "Mondelez",
    "currency": "EUR",
    "ticker": "KTF.F",
    "isin": "US6092071058",
    "sector": "Nahrungs- & Genussmittel",
    "id": 57,
    "market_cap": 90907408362,
    "geopac": 0.103224,
    "gain_consistency": 0.87479,
    "loss_ratio": 1.56744,
    "latest_price": 66.38,
    "latest_ma_200": 62.0019,
    "months": 120
  },
  {
    "inner": true,
    "original": true,
    "name": "MSCI Inc.",
    "currency": "EUR",
    "ticker": "3HM.F",
    "isin": "US55354G1004",
    "sector": "Finanzen",
    "id": 58,
    "market_cap": 33874771289,
    "geopac": 0.329781,
    "gain_consistency": 0.966527,
    "loss_ratio": 1.6018,
    "latest_price": 422.6,
    "latest_ma_200": 470.726,
    "months": 120
  },
  {
    "inner": true,
    "original": true,
    "name": "MTU Aero Engines",
    "currency": "EUR",
    "ticker": "MTX.F",
    "isin": "DE000A0D9PT0",
    "sector": "Maschinenbau, Verkehr",
    "id": 59,
    "market_cap": 12713546142,
    "geopac": 0.126531,
    "gain_consistency": 0.85056,
    "loss_ratio": 2.64262,
    "latest_price": 236.9,
    "latest_ma_200": 200.894,
    "months": 120
  },
  {
    "inner": true,
    "original": true,
    "name": "Nemetschek",
    "currency": "EUR",
    "ticker": "NEM.F",
    "isin": "DE0006452907",
    "sector": "Technologie",
    "id": 60,
    "market_cap": 7963544089,
    "geopac": 0.315734,
    "gain_consistency": 0.92381,
    "loss_ratio": 3.22296,
    "latest_price": 68.64,
    "latest_ma_200": 54.151,
    "months": 120
  },
  {
    "inner": true,
    "original": true,
    "name": "Nestlé",
    "currency": "CHF",
    "ticker": "NESN.SW",
    "isin": "CH0038863350",
    "sector": "Nahrungs- & Genussmittel",
    "id": 61,
    "market_cap": 303362972772,
    "geopac": 0.0561215,
    "gain_consistency": 0.906303,
    "loss_ratio": 1.44406,
    "latest_price": 113.7,
    "latest_ma_200": 110.745,
    "months": 120
  },
  {
    "inner": true,
    "original": true,
    "name": "NextEra Energy",
    "currency": "EUR",
    "ticker": "FP3.F",
    "isin": "US65339F1012",
    "sector": "Sonstiges",
    "id": 62,
    "market_cap": 140422572866,
    "geopac": 0.162384,
    "gain_consistency": 0.966667,
    "loss_ratio": 1.68115,
    "latest_price": 69.4,
    "latest_ma_200": 77.8669,
    "months": 120
  },
  {
    "inner": true,
    "original": true,
    "name": "Nike",
    "currency": "EUR",
    "ticker": "NKE.F",
    "isin": "US6541061031",
    "sector": "Handel & Konsum",
    "id": 63,
    "market_cap": 174777860459,
    "geopac": 0.154444,
    "gain_consistency": 0.90098,
    "loss_ratio": 2.29288,
    "latest_price": 112.64,
    "latest_ma_200": 107.299,
    "months": 120
  },
  {
    "inner": true,
    "original": true,
    "name": "Novo Nordisk",
    "currency": "EUR",
    "ticker": "NOVC.F",
    "isin": "DK0060534915",
    "sector": "Chemie, Pharma",
    "id": 64,
    "market_cap": 337278735225,
    "geopac": 0.184572,
    "gain_consistency": 0.847619,
    "loss_ratio": 1.7461,
    "latest_price": 150.76,
    "latest_ma_200": 120.934,
    "months": 120
  },
  {
    "inner": true,
    "original": true,
    "name": "Novozymes",
    "currency": "EUR",
    "ticker": "NZM2.F",
    "isin": "DK0060336014",
    "sector": "Chemie, Pharma",
    "id": 65,
    "market_cap": 13105767238,
    "geopac": 0.049971,
    "gain_consistency": 0.820728,
    "loss_ratio": 2.57815,
    "latest_price": 47.04,
    "latest_ma_200": 51.3338,
    "months": 120
  },
  {
    "inner": true,
    "original": true,
    "name": "O'Reilly Automotive",
    "currency": "EUR",
    "ticker": "OM6.F",
    "isin": "US67103H1077",
    "sector": "Handel & Konsum",
    "id": 66,
    "market_cap": 50962924194,
    "geopac": 0.236551,
    "gain_consistency": 0.920168,
    "loss_ratio": 1.59046,
    "latest_price": 824.2,
    "latest_ma_200": 759.323,
    "months": 120
  },
  {
    "inner": true,
    "original": true,
    "name": "PepsiCo",
    "currency": "EUR",
    "ticker": "PEP.F",
    "isin": "US7134481081",
    "sector": "Nahrungs- & Genussmittel",
    "id": 67,
    "market_cap": 238745576492,
    "geopac": 0.105955,
    "gain_consistency": 0.912325,
    "loss_ratio": 1.34818,
    "latest_price": 171.94,
    "latest_ma_200": 169.676,
    "months": 120
  },
  {
    "inner": true,
    "original": true,
    "name": "Pernod Ricard",
    "currency": "EUR",
    "ticker": "PER.F",
    "isin": "FR0000120693",
    "sector": "Nahrungs- & Genussmittel",
    "id": 68,
    "market_cap": 55566208086,
    "geopac": 0.0908765,
    "gain_consistency": 0.903221,
    "loss_ratio": 1.71406,
    "latest_price": 216.2,
    "latest_ma_200": 190.813,
    "months": 120
  },
  {
    "inner": true,
    "original": true,
    "name": "Apple",
    "currency": "EUR",
    "ticker": "APC.F",
    "isin": "US0378331005",
    "sector": "Technologie",
    "id": 1,
    "market_cap": 2424765253710,
    "geopac": 0.277791,
    "gain_consistency": 0.939216,
    "loss_ratio": 2.45981,
    "latest_price": 152.34,
    "latest_ma_200": 144.974,
    "months": 120
  },
  {
    "inner": true,
    "original": true,
    "name": "Adidas",
    "currency": "EUR",
    "ticker": "ADS.F",
    "isin": "DE000A1EWWW0",
    "sector": "Handel & Konsum",
    "id": 3,
    "market_cap": 28904201779,
    "geopac": 0.0681955,
    "gain_consistency": 0.782913,
    "loss_ratio": 3.09519,
    "latest_price": 159.78,
    "latest_ma_200": 140.614,
    "months": 120
  },
  {
    "inner": true,
    "original": true,
    "name": "Adobe",
    "currency": "EUR",
    "ticker": "ADB.F",
    "isin": "US00724F1012",
    "sector": "Technologie",
    "id": 4,
    "market_cap": 156276043977,
    "geopac": 0.243887,
    "gain_consistency": 0.936835,
    "loss_ratio": 2.30062,
    "latest_price": 337.9,
    "latest_ma_200": 338.712,
    "months": 120
  },
  {
    "inner": true,
    "original": true,
    "name": "Alphabet",
    "currency": "EUR",
    "ticker": "ABEA.F",
    "isin": "US02079K3059",
    "sector": "Technologie",
    "id": 5,
    "market_cap": 1257722152960,
    "geopac": 0.179216,
    "gain_consistency": 0.947759,
    "loss_ratio": 2.02796,
    "latest_price": 98.0,
    "latest_ma_200": 96.7051,
    "months": 120
  },
  {
    "inner": true,
    "original": true,
    "name": "Amazon",
    "currency": "EUR",
    "ticker": "AMZ.F",
    "isin": "US0231351067",
    "sector": "Technologie",
    "id": 6,
    "market_cap": 1026942504557,
    "geopac": 0.228718,
    "gain_consistency": 0.916947,
    "loss_ratio": 2.73229,
    "latest_price": 99.77,
    "latest_ma_200": 103.075,
    "months": 120
  },
  {
    "inner": true,
    "original": true,
    "name": "Ametek",
    "currency": "EUR",
    "ticker": "AK1.F",
    "isin": "US0311001004",
    "sector": "Technologie",
    "id": 8,
    "market_cap": 27864000032,
    "geopac": 0.140852,
    "gain_consistency": 0.939916,
    "loss_ratio": 1.86184,
    "latest_price": 121.0,
    "latest_ma_200": 127.295,
    "months": 120
  },
  {
    "inner": true,
    "original": true,
    "name": "ASML",
    "currency": "EUR",
    "ticker": "ASME.F",
    "isin": "NL0010273215",
    "sector": "Technologie",
    "id": 9,
    "market_cap": 230127270432,
    "geopac": 0.252768,
    "gain_consistency": 0.935714,
    "loss_ratio": 2.46228,
    "latest_price": 571.0,
    "latest_ma_200": 544.588,
    "months": 120
  },
  {
    "inner": true,
    "original": true,
    "name": "Atoss Software",
    "currency": "EUR",
    "ticker": "AOF.F",
    "isin": "DE0005104400",
    "sector": "Technologie",
    "id": 10,
    "market_cap": 1439800023,
    "geopac": 0.282184,
    "gain_consistency": 0.936134,
    "loss_ratio": 2.77282,
    "latest_price": 178.6,
    "latest_ma_200": 145.715,
    "months": 120
  },
  {
    "inner": true,
    "original": true,
    "name": "Tencent",
    "currency": "EUR",
    "ticker": "NNND.F",
    "isin": "KYG875721634",
    "sector": "Technologie",
    "id": 228,
    "market_cap": 389330181750,
    "geopac": 0.187706,
    "gain_consistency": 0.858683,
    "loss_ratio": 2.85205,
    "latest_price": 40.2,
    "latest_ma_200": 39.182,
    "months": 120
  },
  {
    "inner": true,
    "original": true,
    "name": "AutoZone",
    "currency": "EUR",
    "ticker": "AZ5.F",
    "isin": "US0533321024",
    "sector": "Handel & Konsum",
    "id": 11,
    "market_cap": 43860116800,
    "geopac": 0.209279,
    "gain_consistency": 0.888235,
    "loss_ratio": 1.79055,
    "latest_price": 2384.0,
    "latest_ma_200": 2282.8,
    "months": 120
  },
  {
    "inner": true,
    "original": true,
    "name": "Ball",
    "currency": "EUR",
    "ticker": "BL8.F",
    "isin": "US0584981064",
    "sector": "Handel & Konsum",
    "id": 13,
    "market_cap": 14525049609,
    "geopac": 0.108467,
    "gain_consistency": 0.872969,
    "loss_ratio": 2.41129,
    "latest_price": 46.2,
    "latest_ma_200": 53.1377,
    "months": 120
  },
  {
    "inner": true,
    "original": true,
    "name": "Barry Callebaut",
    "currency": "CHF",
    "ticker": "BARN.SW",
    "isin": "CH0009002962",
    "sector": "Nahrungs- & Genussmittel",
    "id": 14,
    "market_cap": 10271356520,
    "geopac": 0.0701654,
    "gain_consistency": 0.866106,
    "loss_ratio": 1.81808,
    "latest_price": 1874.0,
    "latest_ma_200": 1921.77,
    "months": 120
  },
  {
    "inner": true,
    "original": true,
    "name": "Bechtle",
    "currency": "EUR",
    "ticker": "BC8.F",
    "isin": "DE0005158703",
    "sector": "Technologie",
    "id": 15,
    "market_cap": 5315661015,
    "geopac": 0.194074,
    "gain_consistency": 0.910084,
    "loss_ratio": 2.50898,
    "latest_price": 41.88,
    "latest_ma_200": 38.6688,
    "months": 120
  },
  {
    "inner": true,
    "original": true,
    "name": "IDEXX Laboratories, Inc.",
    "currency": "EUR",
    "ticker": "IX1.F",
    "isin": "US45168D1046",
    "sector": "Chemie, Pharma",
    "id": 89,
    "market_cap": 35988366446,
    "geopac": 0.280094,
    "gain_consistency": 0.940896,
    "loss_ratio": 2.18726,
    "latest_price": 434.1,
    "latest_ma_200": 399.669,
    "months": 120
  },
  {
    "inner": true,
    "original": true,
    "name": "Recordati Industria Chimica e Farmaceutica S.p.A.",
    "currency": "EUR",
    "ticker": "RER1.F",
    "isin": "IT0003828271",
    "sector": "null",
    "id": 248,
    "market_cap": 8320081527,
    "geopac": 0.145893,
    "gain_consistency": 0.891317,
    "loss_ratio": 1.96364,
    "latest_price": 39.41,
    "latest_ma_200": 39.2627,
    "months": 120
  },
  {
    "inner": true,
    "original": true,
    "name": "Hermès International Société en commandite par actions",
    "currency": "EUR",
    "ticker": "HMI.F",
    "isin": "FR0000052292",
    "sector": "null",
    "id": 277,
    "market_cap": 211436391398,
    "geopac": 0.221878,
    "gain_consistency": 0.948179,
    "loss_ratio": 1.9106,
    "latest_price": 1986.4,
    "latest_ma_200": 1513.06,
    "months": 120
  },
  {
    "inner": true,
    "original": true,
    "name": "Samsung",
    "currency": "EUR",
    "ticker": "SSUN.F",
    "isin": "US7960502018",
    "sector": "Technologie",
    "id": 70,
    "market_cap": 296533500544,
    "geopac": 0.112733,
    "gain_consistency": 0.876331,
    "loss_ratio": 2.3409,
    "latest_price": 932.0,
    "latest_ma_200": 979.63,
    "months": 120
  },
  {
    "inner": true,
    "original": true,
    "name": "Sartorius",
    "currency": "EUR",
    "ticker": "SRT.F",
    "isin": "DE0007165631",
    "sector": "Chemie, Pharma",
    "id": 71,
    "market_cap": 21597390000,
    "geopac": 0.308589,
    "gain_consistency": 0.931092,
    "loss_ratio": 2.92659,
    "latest_price": 279.0,
    "latest_ma_200": 335.78,
    "months": 120
  },
  {
    "inner": true,
    "original": true,
    "name": "SBA Communications",
    "currency": "EUR",
    "ticker": "4SB.F",
    "isin": "US78410G1040",
    "sector": "Technologie",
    "id": 72,
    "market_cap": 24361913462,
    "geopac": 0.145156,
    "gain_consistency": 0.920588,
    "loss_ratio": 2.16632,
    "latest_price": 224.6,
    "latest_ma_200": 276.894,
    "months": 120
  },
  {
    "inner": true,
    "original": true,
    "name": "Sherwin-Williams",
    "currency": "EUR",
    "ticker": "SJ3.F",
    "isin": "US8243481061",
    "sector": "Chemie, Pharma",
    "id": 73,
    "market_cap": 53073762787,
    "geopac": 0.157816,
    "gain_consistency": 0.934454,
    "loss_ratio": 2.27086,
    "latest_price": 205.8,
    "latest_ma_200": 221.879,
    "months": 120
  },
  {
    "inner": true,
    "original": true,
    "name": "Shimano",
    "currency": "EUR",
    "ticker": "SHM.F",
    "isin": "JP3358000002",
    "sector": "Handel & Konsum",
    "id": 74,
    "market_cap": 12985928400,
    "geopac": 0.0918977,
    "gain_consistency": 0.797619,
    "loss_ratio": 2.53968,
    "latest_price": 142.0,
    "latest_ma_200": 161.355,
    "months": 120
  },
  {
    "inner": true,
    "original": true,
    "name": "Sika",
    "currency": "CHF",
    "ticker": "SIKA.SW",
    "isin": "CH0418792922",
    "sector": "Chemie, Pharma",
    "id": 75,
    "market_cap": 36942509385,
    "geopac": 0.185049,
    "gain_consistency": 0.929412,
    "loss_ratio": 1.9693,
    "latest_price": 240.4,
    "latest_ma_200": 237.481,
    "months": 120
  },
  {
    "inner": true,
    "original": true,
    "name": "Sixt",
    "currency": "EUR",
    "ticker": "SIX2.F",
    "isin": "DE0007231334",
    "sector": "Maschinenbau, Verkehr",
    "id": 76,
    "market_cap": 4571053696,
    "geopac": 0.191465,
    "gain_consistency": 0.880112,
    "loss_ratio": 3.5996,
    "latest_price": 110.6,
    "latest_ma_200": 104.298,
    "months": 120
  },
  {
    "inner": true,
    "original": true,
    "name": "Starbucks",
    "currency": "EUR",
    "ticker": "SRB.F",
    "isin": "US8552441094",
    "sector": "Nahrungs- & Genussmittel",
    "id": 77,
    "market_cap": 116309153254,
    "geopac": 0.135176,
    "gain_consistency": 0.863866,
    "loss_ratio": 1.91933,
    "latest_price": 101.2,
    "latest_ma_200": 92.4283,
    "months": 120
  },
  {
    "inner": true,
    "original": true,
    "name": "Stryker",
    "currency": "EUR",
    "ticker": "SYK.F",
    "isin": "US8636671013",
    "sector": "Chemie, Pharma",
    "id": 78,
    "market_cap": 102423525666,
    "geopac": 0.170824,
    "gain_consistency": 0.95056,
    "loss_ratio": 1.82057,
    "latest_price": 267.9,
    "latest_ma_200": 230.461,
    "months": 120
  },
  {
    "inner": true,
    "original": true,
    "name": "Symrise",
    "currency": "EUR",
    "ticker": "SY1.F",
    "isin": "DE000SYM9999",
    "sector": "Chemie, Pharma",
    "id": 79,
    "market_cap": 15018500973,
    "geopac": 0.117799,
    "gain_consistency": 0.914006,
    "loss_ratio": 2.04959,
    "latest_price": 107.45,
    "latest_ma_200": 103.19,
    "months": 120
  },
  {
    "inner": true,
    "original": true,
    "name": "Thermo Fisher",
    "currency": "EUR",
    "ticker": "TN8.F",
    "isin": "US8835561023",
    "sector": "Chemie, Pharma",
    "id": 80,
    "market_cap": 188540416181,
    "geopac": 0.217146,
    "gain_consistency": 0.969048,
    "loss_ratio": 1.42608,
    "latest_price": 488.8,
    "latest_ma_200": 532.388,
    "months": 120
  },
  {
    "inner": true,
    "original": true,
    "name": "Union Pacific",
    "currency": "EUR",
    "ticker": "UNP.F",
    "isin": "US9078181081",
    "sector": "Maschinenbau, Verkehr",
    "id": 82,
    "market_cap": 106292287471,
    "geopac": 0.117079,
    "gain_consistency": 0.913445,
    "loss_ratio": 2.14217,
    "latest_price": 173.4,
    "latest_ma_200": 201.232,
    "months": 120
  },
  {
    "inner": true,
    "original": true,
    "name": "UnitedHealth Group",
    "currency": "EUR",
    "ticker": "UNH.F",
    "isin": "US91324P1021",
    "sector": "Chemie, Pharma",
    "id": 83,
    "market_cap": 412653056000,
    "geopac": 0.234772,
    "gain_consistency": 0.966106,
    "loss_ratio": 1.48168,
    "latest_price": 438.5,
    "latest_ma_200": 493.383,
    "months": 120
  },
  {
    "inner": true,
    "original": true,
    "name": "Verisign",
    "currency": "EUR",
    "ticker": "VRS.F",
    "isin": "US92343E1029",
    "sector": "Technologie",
    "id": 84,
    "market_cap": 20166602718,
    "geopac": 0.17334,
    "gain_consistency": 0.914566,
    "loss_ratio": 2.12478,
    "latest_price": 193.3,
    "latest_ma_200": 188.698,
    "months": 120
  },
  {
    "inner": true,
    "original": true,
    "name": "Visa",
    "currency": "EUR",
    "ticker": "3V64.F",
    "isin": "US92826C8394",
    "sector": "Finanzen",
    "id": 85,
    "market_cap": 434552749938,
    "geopac": 0.189643,
    "gain_consistency": 0.961064,
    "loss_ratio": 1.57855,
    "latest_price": 207.4,
    "latest_ma_200": 202.882,
    "months": 120
  },
  {
    "inner": true,
    "original": true,
    "name": "Yum! Brands",
    "currency": "EUR",
    "ticker": "TGR.MU",
    "isin": "US9884981013",
    "sector": "Nahrungs- & Genussmittel",
    "id": 86,
    "market_cap": 38586798000,
    "geopac": 0.121662,
    "gain_consistency": 0.930812,
    "loss_ratio": 1.67844,
    "latest_price": 124.75,
    "latest_ma_200": 118.206,
    "months": 120
  },
  {
    "inner": true,
    "original": true,
    "name": "T-Mobile US, Inc.",
    "currency": "EUR",
    "ticker": "TM5.F",
    "isin": "US8725901040",
    "sector": "null",
    "id": 196,
    "market_cap": 162490837107,
    "geopac": 0.213958,
    "gain_consistency": 0.943697,
    "loss_ratio": 1.81937,
    "latest_price": 134.26,
    "latest_ma_200": 138.393,
    "months": 120
  },
  {
    "inner": true,
    "original": true,
    "name": "Pan Pacific International Holdings Corporation",
    "currency": "EUR",
    "ticker": "QJE.F",
    "isin": "JP3639650005",
    "sector": "null",
    "id": 303,
    "market_cap": 10122320736,
    "geopac": 0.128993,
    "gain_consistency": 0.860924,
    "loss_ratio": 2.28244,
    "latest_price": 16.5,
    "latest_ma_200": 16.664,
    "months": 120
  },
  {
    "inner": true,
    "original": true,
    "name": "Texas Instruments Incorporated",
    "currency": "EUR",
    "ticker": "TII.F",
    "isin": "US8825081040",
    "sector": "null",
    "id": 193,
    "market_cap": 135963924987,
    "geopac": 0.188245,
    "gain_consistency": 0.95084,
    "loss_ratio": 1.60046,
    "latest_price": 149.74,
    "latest_ma_200": 164.802,
    "months": 120
  },
  {
    "inner": true,
    "original": true,
    "name": "Wolters Kluwer N.V.",
    "currency": "EUR",
    "ticker": "WOSB.F",
    "isin": "NL0000395903",
    "sector": "null",
    "id": 194,
    "market_cap": 29874354048,
    "geopac": 0.197564,
    "gain_consistency": 0.966667,
    "loss_ratio": 1.35551,
    "latest_price": 119.0,
    "latest_ma_200": 104.586,
    "months": 120
  },
  {
    "inner": true,
    "original": true,
    "name": "Activision Blizzard",
    "currency": "EUR",
    "ticker": "AIY.F",
    "isin": "US00507V1098",
    "sector": "Technologie",
    "id": 225,
    "market_cap": 55108901120,
    "geopac": 0.199779,
    "gain_consistency": 0.90014,
    "loss_ratio": 2.03851,
    "latest_price": 70.0,
    "latest_ma_200": 74.3824,
    "months": 120
  },
  {
    "inner": true,
    "original": true,
    "name": "Zoetis Inc.",
    "currency": "EUR",
    "ticker": "ZOE.F",
    "isin": "US98978V1035",
    "sector": "Chemie, Pharma",
    "id": 226,
    "market_cap": 72751063739,
    "geopac": 0.208018,
    "gain_consistency": 0.943137,
    "loss_ratio": 1.60302,
    "latest_price": 156.35,
    "latest_ma_200": 153.535,
    "months": 120
  },
  {
    "inner": true,
    "original": true,
    "name": "Ross Store",
    "currency": "EUR",
    "ticker": "RSO.F",
    "isin": "US7782961038",
    "sector": "Handel & Konsum",
    "id": 229,
    "market_cap": 32553000263,
    "geopac": 0.13909,
    "gain_consistency": 0.881653,
    "loss_ratio": 2.62334,
    "latest_price": 94.55,
    "latest_ma_200": 97.158,
    "months": 120
  },
  {
    "inner": true,
    "original": true,
    "name": "Edwards Lifesciences",
    "currency": "EUR",
    "ticker": "EWL.F",
    "isin": "US28176E1082",
    "sector": "Chemie, Pharma",
    "id": 35,
    "market_cap": 47772799292,
    "geopac": 0.24717,
    "gain_consistency": 0.933613,
    "loss_ratio": 2.30281,
    "latest_price": 78.82,
    "latest_ma_200": 80.2321,
    "months": 120
  },
  {
    "inner": true,
    "original": true,
    "name": "Schindler",
    "currency": "CHF",
    "ticker": "SCHN.SW",
    "isin": "CH0024638196",
    "sector": "Maschinenbau, Verkehr",
    "id": 232,
    "market_cap": 20695409466,
    "geopac": 0.0396223,
    "gain_consistency": 0.797759,
    "loss_ratio": 2.15905,
    "latest_price": 189.6,
    "latest_ma_200": 175.871,
    "months": 120
  },
  {
    "inner": true,
    "original": true,
    "name": "KONE",
    "currency": "EUR",
    "ticker": "KC4.F",
    "isin": "FI0009013403",
    "sector": "Maschinenbau, Verkehr",
    "id": 233,
    "market_cap": 26957370734,
    "geopac": 0.0428416,
    "gain_consistency": 0.82437,
    "loss_ratio": 1.9963,
    "latest_price": 51.84,
    "latest_ma_200": 45.5566,
    "months": 120
  },
  {
    "inner": true,
    "original": true,
    "name": "Monolithic Power Systems",
    "currency": "EUR",
    "ticker": "NQG.F",
    "isin": "US6098391054",
    "sector": "null",
    "id": 234,
    "market_cap": 19100086735,
    "geopac": 0.355327,
    "gain_consistency": 0.964846,
    "loss_ratio": 2.54644,
    "latest_price": 398.8,
    "latest_ma_200": 408.458,
    "months": 120
  },
  {
    "inner": true,
    "original": true,
    "name": "Svenska Cellulosa Aktiebolaget SCA (publ)",
    "currency": "EUR",
    "ticker": "SCA.F",
    "isin": "SE0000112724",
    "sector": "null",
    "id": 237,
    "market_cap": 8103719824,
    "geopac": 0.116085,
    "gain_consistency": 0.904342,
    "loss_ratio": 2.43548,
    "latest_price": 11.405,
    "latest_ma_200": 13.0959,
    "months": 120
  },
  {
    "inner": true,
    "original": true,
    "name": "Halma plc",
    "currency": "EUR",
    "ticker": "H11.F",
    "isin": "GB0004052071",
    "sector": "null",
    "id": 238,
    "market_cap": 9567191646,
    "geopac": 0.145956,
    "gain_consistency": 0.923249,
    "loss_ratio": 2.35998,
    "latest_price": 25.1,
    "latest_ma_200": 24.8953,
    "months": 120
  },
  {
    "inner": true,
    "original": true,
    "name": "Esker SA",
    "currency": "EUR",
    "ticker": "EKE.F",
    "isin": "FR0000035818",
    "sector": "null",
    "id": 239,
    "market_cap": 763974970,
    "geopac": 0.251716,
    "gain_consistency": 0.938095,
    "loss_ratio": 3.23455,
    "latest_price": 131.0,
    "latest_ma_200": 141.435,
    "months": 120
  },
  {
    "inner": true,
    "original": true,
    "name": "Rational",
    "currency": "EUR",
    "ticker": "RAA.F",
    "isin": "DE0007010803",
    "sector": "Maschinenbau, Verkehr",
    "id": 69,
    "market_cap": 45520860000,
    "geopac": 0.100429,
    "gain_consistency": 0.860784,
    "loss_ratio": 2.9298,
    "latest_price": 649.0,
    "latest_ma_200": 582.563,
    "months": 120
  },
  {
    "inner": true,
    "original": true,
    "name": "TJX Companies",
    "currency": "EUR",
    "ticker": "TJX.F",
    "isin": "US8725401090",
    "sector": "Handel & Konsum",
    "id": 81,
    "market_cap": 81369626278,
    "geopac": 0.128469,
    "gain_consistency": 0.912745,
    "loss_ratio": 2.00789,
    "latest_price": 69.82,
    "latest_ma_200": 69.7534,
    "months": 120
  },
  {
    "inner": true,
    "original": true,
    "name": "Cadence Design Systems, Inc.",
    "currency": "EUR",
    "ticker": "CDS.F",
    "isin": "US1273871087",
    "sector": "null",
    "id": 241,
    "market_cap": 50905598486,
    "geopac": 0.335889,
    "gain_consistency": 0.972829,
    "loss_ratio": 1.75515,
    "latest_price": 183.2,
    "latest_ma_200": 170.188,
    "months": 120
  },
  {
    "inner": true,
    "original": true,
    "name": "DSV Panalpina A/S",
    "currency": "EUR",
    "ticker": "DS81.F",
    "isin": "DK0060079531",
    "sector": "null",
    "id": 242,
    "market_cap": 34953444000,
    "geopac": 0.238479,
    "gain_consistency": 0.945518,
    "loss_ratio": 2.37406,
    "latest_price": 162.0,
    "latest_ma_200": 151.596,
    "months": 120
  },
  {
    "inner": true,
    "original": true,
    "name": "ServiceNow, Inc.",
    "currency": "EUR",
    "ticker": "4S0.F",
    "isin": "US81762P1021",
    "sector": "null",
    "id": 243,
    "market_cap": 85748649679,
    "geopac": 0.273911,
    "gain_consistency": 0.932913,
    "loss_ratio": 1.98494,
    "latest_price": 415.3,
    "latest_ma_200": 409.443,
    "months": 120
  },
  {
    "inner": true,
    "original": true,
    "name": "EPAM Systems, Inc.",
    "currency": "EUR",
    "ticker": "E3M.F",
    "isin": "US29414B1044",
    "sector": "null",
    "id": 244,
    "market_cap": 14755935450,
    "geopac": 0.274545,
    "gain_consistency": 0.933193,
    "loss_ratio": 3.35751,
    "latest_price": 254.5,
    "latest_ma_200": 332.413,
    "months": 120
  },
  {
    "inner": true,
    "original": true,
    "name": "Fair Isaac Corporation",
    "currency": "EUR",
    "ticker": "FRI.F",
    "isin": "US3032501047",
    "sector": "null",
    "id": 245,
    "market_cap": 16602168000,
    "geopac": 0.323626,
    "gain_consistency": 0.958683,
    "loss_ratio": 2.13789,
    "latest_price": 660.0,
    "latest_ma_200": 539.455,
    "months": 120
  },
  {
    "inner": true,
    "original": true,
    "name": "Warehouses De Pauw NV",
    "currency": "EUR",
    "ticker": "WPHB.F",
    "isin": "BE0974349814",
    "sector": "null",
    "id": 246,
    "market_cap": 5419693442,
    "geopac": 0.139255,
    "gain_consistency": 0.943978,
    "loss_ratio": 1.93276,
    "latest_price": 26.3,
    "latest_ma_200": 27.8945,
    "months": 120
  },
  {
    "inner": true,
    "original": true,
    "name": "Facebook, Inc.",
    "currency": "EUR",
    "ticker": "FB2A.F",
    "isin": "US30303M1027",
    "sector": "null",
    "id": 247,
    "market_cap": 560935799362,
    "geopac": 0.191213,
    "gain_consistency": 0.877871,
    "loss_ratio": 3.0113,
    "latest_price": 217.6,
    "latest_ma_200": 147.912,
    "months": 120
  },
  {
    "inner": true,
    "original": true,
    "name": "Rollins, Inc.",
    "currency": "EUR",
    "ticker": "RLS.F",
    "isin": "US7757111049",
    "sector": "null",
    "id": 249,
    "market_cap": 17541685648,
    "geopac": 0.192448,
    "gain_consistency": 0.947199,
    "loss_ratio": 1.94387,
    "latest_price": 35.6,
    "latest_ma_200": 35.737,
    "months": 120
  },
  {
    "inner": true,
    "original": true,
    "name": "Laboratorios Farmaceuticos Rovi, S.A.",
    "currency": "EUR",
    "ticker": "41L.F",
    "isin": "ES0157261019",
    "sector": "null",
    "id": 250,
    "market_cap": 2125255855,
    "geopac": 0.166655,
    "gain_consistency": 0.914426,
    "loss_ratio": 2.78457,
    "latest_price": 40.58,
    "latest_ma_200": 42.4348,
    "months": 120
  },
  {
    "inner": true,
    "original": true,
    "name": "Broadridge Financial Solutions, Inc.",
    "currency": "EUR",
    "ticker": "5B9.F",
    "isin": "US11133T1034",
    "sector": "null",
    "id": 251,
    "market_cap": 14829318000,
    "geopac": 0.186838,
    "gain_consistency": 0.945518,
    "loss_ratio": 1.80553,
    "latest_price": 126.0,
    "latest_ma_200": 143.205,
    "months": 120
  },
  {
    "inner": true,
    "original": true,
    "name": "Dollar General Corporation",
    "currency": "EUR",
    "ticker": "7DG.F",
    "isin": "US2566771059",
    "sector": "null",
    "id": 252,
    "market_cap": 44068243392,
    "geopac": 0.166213,
    "gain_consistency": 0.933613,
    "loss_ratio": 1.80576,
    "latest_price": 201.0,
    "latest_ma_200": 228.383,
    "months": 120
  },
  {
    "inner": true,
    "original": true,
    "name": "First Republic Bank",
    "currency": "EUR",
    "ticker": "81R.F",
    "isin": "US33616C1009",
    "sector": "null",
    "id": 253,
    "market_cap": 1061448310,
    "geopac": -0.0928685,
    "gain_consistency": 0.893838,
    "loss_ratio": 3.19755,
    "latest_price": 5.7,
    "latest_ma_200": 112.67,
    "months": 120
  },
  {
    "inner": true,
    "original": true,
    "name": "Crown Castle International Corp. (REIT)",
    "currency": "EUR",
    "ticker": "8CW.F",
    "isin": "US22822V1017",
    "sector": "null",
    "id": 254,
    "market_cap": 46806899337,
    "geopac": 0.0844266,
    "gain_consistency": 0.917507,
    "loss_ratio": 2.25192,
    "latest_price": 107.85,
    "latest_ma_200": 140.141,
    "months": 120
  },
  {
    "inner": true,
    "original": true,
    "name": "Automatic Data Processing, Inc.",
    "currency": "EUR",
    "ticker": "ADP.F",
    "isin": "US0530151036",
    "sector": "null",
    "id": 255,
    "market_cap": 82376236213,
    "geopac": 0.138874,
    "gain_consistency": 0.935154,
    "loss_ratio": 2.13684,
    "latest_price": 191.66,
    "latest_ma_200": 226.418,
    "months": 120
  },
  {
    "inner": true,
    "original": true,
    "name": "Agilent Technologies, Inc.",
    "currency": "EUR",
    "ticker": "AG8.F",
    "isin": "US00846U1016",
    "sector": "null",
    "id": 256,
    "market_cap": 37236164787,
    "geopac": 0.163895,
    "gain_consistency": 0.952101,
    "loss_ratio": 1.87008,
    "latest_price": 120.1,
    "latest_ma_200": 134.27,
    "months": 120
  },
  {
    "inner": true,
    "original": true,
    "name": "ANSYS, Inc.",
    "currency": "EUR",
    "ticker": "AKX.F",
    "isin": "US03662Q1058",
    "sector": "null",
    "id": 257,
    "market_cap": 24584792432,
    "geopac": 0.17531,
    "gain_consistency": 0.916667,
    "loss_ratio": 2.30941,
    "latest_price": 283.2,
    "latest_ma_200": 251.546,
    "months": 120
  },
  {
    "inner": true,
    "original": true,
    "name": "Honeywell International Inc.",
    "currency": "EUR",
    "ticker": "ALD.F",
    "isin": "US4385161066",
    "sector": "null",
    "id": 258,
    "market_cap": 119301929548,
    "geopac": 0.106835,
    "gain_consistency": 0.929832,
    "loss_ratio": 1.76254,
    "latest_price": 177.82,
    "latest_ma_200": 189.368,
    "months": 120
  },
  {
    "inner": true,
    "original": true,
    "name": "The Allstate Corporation",
    "currency": "EUR",
    "ticker": "ALS.F",
    "isin": "US0200021014",
    "sector": "null",
    "id": 259,
    "market_cap": 27076818816,
    "geopac": 0.100461,
    "gain_consistency": 0.916947,
    "loss_ratio": 2.0229,
    "latest_price": 102.0,
    "latest_ma_200": 120.768,
    "months": 120
  },
  {
    "inner": true,
    "original": true,
    "name": "Avery Dennison Corporation",
    "currency": "EUR",
    "ticker": "AV3.F",
    "isin": "US053611109",
    "sector": "null",
    "id": 260,
    "market_cap": 12085241000,
    "geopac": 0.166024,
    "gain_consistency": 0.936555,
    "loss_ratio": 2.06535,
    "latest_price": 149.0,
    "latest_ma_200": 174.007,
    "months": 120
  },
  {
    "inner": true,
    "original": true,
    "name": "Amplifon S.p.A.",
    "currency": "EUR",
    "ticker": "AXNA.F",
    "isin": "IT0004056880",
    "sector": "null",
    "id": 261,
    "market_cap": 7518661199,
    "geopac": 0.231026,
    "gain_consistency": 0.935014,
    "loss_ratio": 2.7596,
    "latest_price": 33.37,
    "latest_ma_200": 27.8298,
    "months": 120
  },
  {
    "inner": true,
    "original": true,
    "name": "Brown & Brown, Inc.",
    "currency": "EUR",
    "ticker": "BTW.F",
    "isin": "US1152361010",
    "sector": "null",
    "id": 262,
    "market_cap": 16700592503,
    "geopac": 0.162811,
    "gain_consistency": 0.943137,
    "loss_ratio": 1.78793,
    "latest_price": 56.68,
    "latest_ma_200": 57.3018,
    "months": 120
  },
  {
    "inner": true,
    "original": true,
    "name": "Chesapeake Utilities Corporation",
    "currency": "EUR",
    "ticker": "CH5.F",
    "isin": "US1653031088",
    "sector": "null",
    "id": 263,
    "market_cap": 1999221000,
    "geopac": 0.154743,
    "gain_consistency": 0.939496,
    "loss_ratio": 1.88742,
    "latest_price": 111.0,
    "latest_ma_200": 118.51,
    "months": 120
  },
  {
    "inner": true,
    "original": true,
    "name": "Carlisle Companies Incorporated",
    "currency": "EUR",
    "ticker": "CLE.F",
    "isin": "US1423391002",
    "sector": "null",
    "id": 264,
    "market_cap": 9776673408,
    "geopac": 0.145711,
    "gain_consistency": 0.903081,
    "loss_ratio": 2.30364,
    "latest_price": 191.4,
    "latest_ma_200": 249.835,
    "months": 120
  },
  {
    "inner": true,
    "original": true,
    "name": "CSL Limited",
    "currency": "EUR",
    "ticker": "CSJ.F",
    "isin": "AU000000CSL8",
    "sector": "null",
    "id": 265,
    "market_cap": 88180932275,
    "geopac": 0.145421,
    "gain_consistency": 0.938936,
    "loss_ratio": 1.90694,
    "latest_price": 180.05,
    "latest_ma_200": 188.454,
    "months": 120
  },
  {
    "inner": true,
    "original": true,
    "name": "Costco Wholesale Corporation",
    "currency": "EUR",
    "ticker": "CTO.F",
    "isin": "US22160K1051",
    "sector": "null",
    "id": 266,
    "market_cap": 197704719552,
    "geopac": 0.18242,
    "gain_consistency": 0.940476,
    "loss_ratio": 1.7946,
    "latest_price": 445.8,
    "latest_ma_200": 480.749,
    "months": 120
  },
  {
    "inner": true,
    "original": true,
    "name": "Comcast Corporation",
    "currency": "EUR",
    "ticker": "CTP2.F",
    "isin": "US20030N1019",
    "sector": "null",
    "id": 267,
    "market_cap": 139017288305,
    "geopac": 0.0713355,
    "gain_consistency": 0.85,
    "loss_ratio": 2.10563,
    "latest_price": 32.66,
    "latest_ma_200": 34.5566,
    "months": 120
  },
  {
    "inner": true,
    "original": true,
    "name": "Chemed Corporation",
    "currency": "EUR",
    "ticker": "CXM.F",
    "isin": "US16359R1032",
    "sector": "null",
    "id": 268,
    "market_cap": 7596700000,
    "geopac": 0.238466,
    "gain_consistency": 0.948459,
    "loss_ratio": 1.63326,
    "latest_price": 500.0,
    "latest_ma_200": 472.125,
    "months": 120
  },
  {
    "inner": true,
    "original": true,
    "name": "Deere & Company",
    "currency": "EUR",
    "ticker": "DCO.F",
    "isin": "US2441991054",
    "sector": "null",
    "id": 269,
    "market_cap": 100489184383,
    "geopac": 0.19475,
    "gain_consistency": 0.935154,
    "loss_ratio": 2.04845,
    "latest_price": 337.4,
    "latest_ma_200": 377.706,
    "months": 120
  },
  {
    "inner": true,
    "original": true,
    "name": "Daikin Industries,Ltd.",
    "currency": "EUR",
    "ticker": "DKI.F",
    "isin": "JP3481800005",
    "sector": "null",
    "id": 270,
    "market_cap": 48098970000,
    "geopac": 0.156277,
    "gain_consistency": 0.927311,
    "loss_ratio": 2.18522,
    "latest_price": 164.25,
    "latest_ma_200": 161.444,
    "months": 120
  },
  {
    "inner": true,
    "original": true,
    "name": "Deutsche Wohnen SE",
    "currency": "EUR",
    "ticker": "DWNI.F",
    "isin": "DE000A0HN5C6",
    "sector": "null",
    "id": 271,
    "market_cap": 7930761278,
    "geopac": 0.0324451,
    "gain_consistency": 0.758543,
    "loss_ratio": 2.83399,
    "latest_price": 19.98,
    "latest_ma_200": 21.0984,
    "months": 120
  },
  {
    "inner": true,
    "original": true,
    "name": "EDP Renováveis, S.A.",
    "currency": "EUR",
    "ticker": "EDW.F",
    "isin": "ES0127797019",
    "sector": "null",
    "id": 272,
    "market_cap": 20115938626,
    "geopac": 0.176965,
    "gain_consistency": 0.933473,
    "loss_ratio": 1.91695,
    "latest_price": 19.61,
    "latest_ma_200": 21.6919,
    "months": 120
  },
  {
    "inner": true,
    "original": true,
    "name": "First Industrial Realty Trust, Inc.",
    "currency": "EUR",
    "ticker": "F5W.F",
    "isin": "US32054K1034",
    "sector": "null",
    "id": 273,
    "market_cap": 6348457219,
    "geopac": 0.14229,
    "gain_consistency": 0.928852,
    "loss_ratio": 2.01247,
    "latest_price": 46.6,
    "latest_ma_200": 48.0585,
    "months": 120
  },
  {
    "inner": true,
    "original": true,
    "name": "American States Water Company",
    "currency": "EUR",
    "ticker": "FDK.F",
    "isin": "US0298991011",
    "sector": "null",
    "id": 274,
    "market_cap": 2983987297,
    "geopac": 0.143832,
    "gain_consistency": 0.919048,
    "loss_ratio": 1.83451,
    "latest_price": 80.7,
    "latest_ma_200": 85.5338,
    "months": 120
  },
  {
    "inner": true,
    "original": true,
    "name": "Extra Space Storage Inc.",
    "currency": "EUR",
    "ticker": "FG8.F",
    "isin": "US30225T1025",
    "sector": "null",
    "id": 275,
    "market_cap": 19249295676,
    "geopac": 0.163541,
    "gain_consistency": 0.898319,
    "loss_ratio": 2.37678,
    "latest_price": 136.15,
    "latest_ma_200": 161.215,
    "months": 120
  },
  {
    "inner": true,
    "original": true,
    "name": "Arthur J. Gallagher & Co.",
    "currency": "EUR",
    "ticker": "GAH.F",
    "isin": "US3635761097",
    "sector": "null",
    "id": 276,
    "market_cap": 40429489761,
    "geopac": 0.181218,
    "gain_consistency": 0.958123,
    "loss_ratio": 1.46024,
    "latest_price": 186.55,
    "latest_ma_200": 178.59,
    "months": 120
  },
  {
    "inner": true,
    "original": true,
    "name": "American Water Works",
    "currency": "EUR",
    "ticker": "AWC.F",
    "isin": "US0304201033",
    "sector": "Sonstiges",
    "id": 7,
    "market_cap": 25692877056,
    "geopac": 0.156835,
    "gain_consistency": 0.940896,
    "loss_ratio": 1.53635,
    "latest_price": 132.0,
    "latest_ma_200": 142.062,
    "months": 120
  },
  {
    "inner": true,
    "original": true,
    "name": "Broadcom Inc.",
    "currency": "EUR",
    "ticker": "1YD.F",
    "isin": "US11135F1012",
    "sector": "null",
    "id": 235,
    "market_cap": 232205635968,
    "geopac": 0.329488,
    "gain_consistency": 0.955742,
    "loss_ratio": 1.94804,
    "latest_price": 552.2,
    "latest_ma_200": 524.73,
    "months": 120
  },
  {
    "inner": true,
    "original": true,
    "name": "Synopsys, Inc.",
    "currency": "EUR",
    "ticker": "SYP.F",
    "isin": "US8716071076",
    "sector": "null",
    "id": 145,
    "market_cap": 51110520666,
    "geopac": 0.290351,
    "gain_consistency": 0.965266,
    "loss_ratio": 1.82124,
    "latest_price": 333.6,
    "latest_ma_200": 327.178,
    "months": 120
  },
  {
    "inner": true,
    "original": true,
    "name": "Teleperformance SE",
    "currency": "EUR",
    "ticker": "RCF.F",
    "isin": "FR0000051807",
    "sector": "null",
    "id": 240,
    "market_cap": 12350403952,
    "geopac": 0.189633,
    "gain_consistency": 0.941317,
    "loss_ratio": 2.37931,
    "latest_price": 181.75,
    "latest_ma_200": 254.179,
    "months": 120
  },
  {
    "inner": true,
    "original": true,
    "name": "Mettler-Toledo International Inc.",
    "currency": "EUR",
    "ticker": "MTO.F",
    "isin": "US5926881054",
    "sector": "null",
    "id": 154,
    "market_cap": 29176672200,
    "geopac": 0.230471,
    "gain_consistency": 0.951821,
    "loss_ratio": 1.89477,
    "latest_price": 1322.0,
    "latest_ma_200": 1324.0,
    "months": 120
  },
  {
    "inner": true,
    "original": true,
    "name": "SAP",
    "currency": "EUR",
    "ticker": "SAP.F",
    "isin": "DE0007164600",
    "sector": "Technologie",
    "id": 230,
    "market_cap": 144970434255,
    "geopac": 0.0718474,
    "gain_consistency": 0.832213,
    "loss_ratio": 2.51735,
    "latest_price": 123.6,
    "latest_ma_200": 100.249,
    "months": 120
  },
  {
    "inner": true,
    "original": true,
    "name": "Lonza Group",
    "currency": "CHF",
    "ticker": "LONN.SW",
    "isin": "CH0013841017",
    "sector": "Chemie, Pharma",
    "id": 214,
    "market_cap": 40825165546,
    "geopac": 0.223566,
    "gain_consistency": 0.938796,
    "loss_ratio": 2.03393,
    "latest_price": 549.6,
    "latest_ma_200": 519.61,
    "months": 120
  },
  {
    "inner": true,
    "original": true,
    "name": "Unilever",
    "currency": "EUR",
    "ticker": "UNVB.F",
    "isin": "GB00B10RZP78",
    "sector": "Handel & Konsum",
    "id": 231,
    "market_cap": 126872166067,
    "geopac": 0.0463019,
    "gain_consistency": 0.74916,
    "loss_ratio": 1.57034,
    "latest_price": 49.83,
    "latest_ma_200": 46.8312,
    "months": 120
  },
  {
    "inner": true,
    "original": true,
    "name": "Nvidia Corp.",
    "currency": "EUR",
    "ticker": "NVD.F",
    "isin": "US67066G1040",
    "sector": "Technologie",
    "id": 215,
    "market_cap": 607743539032,
    "geopac": 0.565935,
    "gain_consistency": 0.941176,
    "loss_ratio": 3.39312,
    "latest_price": 246.05,
    "latest_ma_200": 173.86,
    "months": 120
  },
  {
    "inner": true,
    "original": true,
    "name": "S&P Global Inc.",
    "currency": "EUR",
    "ticker": "MHL.F",
    "isin": "US78409V1044",
    "sector": "null",
    "id": 216,
    "market_cap": 100515757952,
    "geopac": 0.204489,
    "gain_consistency": 0.95,
    "loss_ratio": 1.91176,
    "latest_price": 306.5,
    "latest_ma_200": 333.155,
    "months": 120
  },
  {
    "inner": true,
    "original": true,
    "name": "West Pharmaceutical Services, Inc.",
    "currency": "EUR",
    "ticker": "WPS.F",
    "isin": "US9553061055",
    "sector": "Chemie, Pharma",
    "id": 227,
    "market_cap": 24571025807,
    "geopac": 0.263493,
    "gain_consistency": 0.937255,
    "loss_ratio": 2.39945,
    "latest_price": 328.8,
    "latest_ma_200": 269.189,
    "months": 120
  },
  {
    "inner": true,
    "original": true,
    "name": "Merck KGaA",
    "currency": "EUR",
    "ticker": "MRK.F",
    "isin": "DE0006599905",
    "sector": "Chemie, Pharma",
    "id": 218,
    "market_cap": 70414342071,
    "geopac": 0.11038,
    "gain_consistency": 0.855322,
    "loss_ratio": 2.20253,
    "latest_price": 160.85,
    "latest_ma_200": 176.113,
    "months": 120
  },
  {
    "inner": true,
    "original": true,
    "name": "Moody's Corporation",
    "currency": "EUR",
    "ticker": "DUT.F",
    "isin": "US6153691059",
    "sector": "null",
    "id": 220,
    "market_cap": 50867300000,
    "geopac": 0.180502,
    "gain_consistency": 0.935434,
    "loss_ratio": 2.11019,
    "latest_price": 275.0,
    "latest_ma_200": 278.195,
    "months": 120
  },
  {
    "inner": true,
    "original": true,
    "name": "Deutsche Börse",
    "currency": "EUR",
    "ticker": "DB1.F",
    "isin": "DE0005810055",
    "sector": "Finanzen",
    "id": 221,
    "market_cap": 31215911360,
    "geopac": 0.1266,
    "gain_consistency": 0.927731,
    "loss_ratio": 1.69464,
    "latest_price": 170.0,
    "latest_ma_200": 168.76,
    "months": 120
  },
  {
    "inner": true,
    "original": true,
    "name": "Nasdaq, Inc.",
    "currency": "EUR",
    "ticker": "NAQ.F",
    "isin": "US6311031081",
    "sector": "null",
    "id": 291,
    "market_cap": 23863346417,
    "geopac": 0.191901,
    "gain_consistency": 0.958543,
    "loss_ratio": 1.75005,
    "latest_price": 48.8,
    "latest_ma_200": 57.412,
    "months": 120
  },
  {
    "inner": true,
    "original": true,
    "name": "Nomura Research Institute ",
    "currency": "EUR",
    "ticker": "NR7.F",
    "isin": "JP3762800005",
    "sector": "null",
    "id": 292,
    "market_cap": 13039596057,
    "geopac": 0.124419,
    "gain_consistency": 0.905182,
    "loss_ratio": 2.25615,
    "latest_price": 21.6,
    "latest_ma_200": 23.507,
    "months": 120
  },
  {
    "inner": true,
    "original": true,
    "name": "Nissan Chemical Corp.",
    "currency": "EUR",
    "ticker": "NSC.F",
    "isin": "JP3670800006",
    "sector": "null",
    "id": 293,
    "market_cap": 5665570009,
    "geopac": 0.144252,
    "gain_consistency": 0.896218,
    "loss_ratio": 2.20172,
    "latest_price": 39.8,
    "latest_ma_200": 44.2145,
    "months": 120
  },
  {
    "inner": true,
    "original": true,
    "name": "NICE",
    "currency": "EUR",
    "ticker": "NSY.F",
    "isin": "US6536561086",
    "sector": "null",
    "id": 294,
    "market_cap": 11448324000,
    "geopac": 0.216623,
    "gain_consistency": 0.937115,
    "loss_ratio": 2.06381,
    "latest_price": 180.0,
    "latest_ma_200": 193.21,
    "months": 120
  },
  {
    "inner": true,
    "original": true,
    "name": "Northrop Grumman",
    "currency": "EUR",
    "ticker": "NTH.F",
    "isin": "US6668071029",
    "sector": "null",
    "id": 295,
    "market_cap": 62093600722,
    "geopac": 0.189045,
    "gain_consistency": 0.917507,
    "loss_ratio": 1.93274,
    "latest_price": 405.7,
    "latest_ma_200": 469.453,
    "months": 120
  },
  {
    "inner": true,
    "original": true,
    "name": "NVR",
    "currency": "EUR",
    "ticker": "NVE.F",
    "isin": "US62944T1051",
    "sector": "null",
    "id": 296,
    "market_cap": 16532925000,
    "geopac": 0.209745,
    "gain_consistency": 0.939776,
    "loss_ratio": 1.90354,
    "latest_price": 5100.0,
    "latest_ma_200": 4491.6,
    "months": 120
  },
  {
    "inner": true,
    "original": true,
    "name": "Nexus",
    "currency": "EUR",
    "ticker": "NXU.F",
    "isin": "DE0005220909",
    "sector": "null",
    "id": 297,
    "market_cap": 897309506,
    "geopac": 0.177415,
    "gain_consistency": 0.928011,
    "loss_ratio": 2.17346,
    "latest_price": 51.9,
    "latest_ma_200": 52.61,
    "months": 120
  },
  {
    "inner": true,
    "original": true,
    "name": "OBIC",
    "currency": "EUR",
    "ticker": "OBL.F",
    "isin": "JP3173400007",
    "sector": "null",
    "id": 298,
    "market_cap": 12492888544,
    "geopac": 0.208103,
    "gain_consistency": 0.917227,
    "loss_ratio": 2.04584,
    "latest_price": 139.0,
    "latest_ma_200": 144.425,
    "months": 120
  },
  {
    "inner": true,
    "original": true,
    "name": "Orbis",
    "currency": "EUR",
    "ticker": "OBS.F",
    "isin": "DE0005228779",
    "sector": "null",
    "id": 299,
    "market_cap": 66286920,
    "geopac": 0.0917026,
    "gain_consistency": 0.879552,
    "loss_ratio": 1.60277,
    "latest_price": 7.0,
    "latest_ma_200": 7.05675,
    "months": 120
  },
  {
    "inner": true,
    "original": true,
    "name": "Oriental Land",
    "currency": "EUR",
    "ticker": "OLL.F",
    "isin": "JP3198900007",
    "sector": "null",
    "id": 300,
    "market_cap": 53337371324,
    "geopac": 0.00894863,
    "gain_consistency": 0.895518,
    "loss_ratio": 3.31214,
    "latest_price": 32.2,
    "latest_ma_200": 131.63,
    "months": 120
  },
  {
    "inner": true,
    "original": true,
    "name": "Canadian Pacific Railway",
    "currency": "EUR",
    "ticker": "PC8.F",
    "isin": "CA13645T1003",
    "sector": "null",
    "id": 301,
    "market_cap": 66929624594,
    "geopac": 0.132045,
    "gain_consistency": 0.894958,
    "loss_ratio": 1.89471,
    "latest_price": 71.9,
    "latest_ma_200": 73.2766,
    "months": 120
  },
  {
    "inner": true,
    "original": true,
    "name": "Progressive",
    "currency": "EUR",
    "ticker": "PGV.F",
    "isin": "US7433151039",
    "sector": "null",
    "id": 302,
    "market_cap": 70595140636,
    "geopac": 0.214446,
    "gain_consistency": 0.959104,
    "loss_ratio": 1.42689,
    "latest_price": 120.6,
    "latest_ma_200": 124.508,
    "months": 120
  },
  {
    "inner": true,
    "original": true,
    "name": "SCSK Corporation",
    "currency": "EUR",
    "ticker": "QSU.F",
    "isin": "JP3400400002",
    "sector": "null",
    "id": 304,
    "market_cap": 4153443653,
    "geopac": 0.0844625,
    "gain_consistency": 0.879132,
    "loss_ratio": 2.06918,
    "latest_price": 13.3,
    "latest_ma_200": 14.519,
    "months": 120
  },
  {
    "inner": true,
    "original": true,
    "name": "ResMed Inc.",
    "currency": "EUR",
    "ticker": "RME.F",
    "isin": "US7611521078 ",
    "sector": "null",
    "id": 305,
    "market_cap": 29528707392,
    "geopac": 0.190135,
    "gain_consistency": 0.938796,
    "loss_ratio": 2.0222,
    "latest_price": 201.0,
    "latest_ma_200": 212.717,
    "months": 120
  },
  {
    "inner": true,
    "original": true,
    "name": "Roper Technologies, Inc.",
    "currency": "EUR",
    "ticker": "ROP.F",
    "isin": "US7766961061",
    "sector": "null",
    "id": 306,
    "market_cap": 41105416051,
    "geopac": 0.154858,
    "gain_consistency": 0.945378,
    "loss_ratio": 1.77202,
    "latest_price": 386.9,
    "latest_ma_200": 403.092,
    "months": 120
  },
  {
    "inner": true,
    "original": true,
    "name": "RPM International Inc.",
    "currency": "EUR",
    "ticker": "RP8.F",
    "isin": "US7496851038",
    "sector": "null",
    "id": 307,
    "market_cap": 9236248000,
    "geopac": 0.108323,
    "gain_consistency": 0.908683,
    "loss_ratio": 2.36358,
    "latest_price": 71.0,
    "latest_ma_200": 86.89,
    "months": 120
  },
  {
    "inner": true,
    "original": true,
    "name": "Rentokil Initial plc",
    "currency": "EUR",
    "ticker": "RTO1.F",
    "isin": "GB00B082RF11",
    "sector": "null",
    "id": 308,
    "market_cap": 17518862800,
    "geopac": 0.180126,
    "gain_consistency": 0.942857,
    "loss_ratio": 1.90806,
    "latest_price": 6.814,
    "latest_ma_200": 5.95844,
    "months": 120
  },
  {
    "inner": true,
    "original": true,
    "name": "SEGRO Plc",
    "currency": "EUR",
    "ticker": "S4VC.F",
    "isin": "GB00B5ZN1N88",
    "sector": "null",
    "id": 309,
    "market_cap": 10999079424,
    "geopac": 0.095043,
    "gain_consistency": 0.905042,
    "loss_ratio": 2.27202,
    "latest_price": 9.0,
    "latest_ma_200": 9.586,
    "months": 120
  },
  {
    "inner": true,
    "original": true,
    "name": "Sun Communities, Inc.",
    "currency": "EUR",
    "ticker": "SCZ.F",
    "isin": "US8666741041",
    "sector": "null",
    "id": 310,
    "market_cap": 15613235000,
    "geopac": 0.142401,
    "gain_consistency": 0.919468,
    "loss_ratio": 1.83684,
    "latest_price": 121.0,
    "latest_ma_200": 139.55,
    "months": 120
  },
  {
    "inner": true,
    "original": true,
    "name": "Gr. Sarantis S.A.",
    "currency": "EUR",
    "ticker": "SSA1.F",
    "isin": "GRS204003008",
    "sector": "null",
    "id": 311,
    "market_cap": 471618374,
    "geopac": 0.0904063,
    "gain_consistency": 0.839916,
    "loss_ratio": 1.78504,
    "latest_price": 6.81,
    "latest_ma_200": 6.58825,
    "months": 120
  },
  {
    "inner": true,
    "original": true,
    "name": "Service Corporation International",
    "currency": "EUR",
    "ticker": "SVC.F",
    "isin": "US8175651046",
    "sector": "null",
    "id": 312,
    "market_cap": 9873515615,
    "geopac": 0.165221,
    "gain_consistency": 0.934174,
    "loss_ratio": 1.95109,
    "latest_price": 63.36,
    "latest_ma_200": 64.6461,
    "months": 120
  },
  {
    "inner": true,
    "original": true,
    "name": "Teleflex Incorporated",
    "currency": "EUR",
    "ticker": "TBH.F",
    "isin": "US8793691069",
    "sector": "null",
    "id": 313,
    "market_cap": 11366086600,
    "geopac": 0.13232,
    "gain_consistency": 0.869048,
    "loss_ratio": 2.36814,
    "latest_price": 242.0,
    "latest_ma_200": 224.015,
    "months": 120
  },
  {
    "inner": true,
    "original": true,
    "name": "Taiwan Semiconductor Manufacturing Company Limited",
    "currency": "EUR",
    "ticker": "TSFA.F",
    "isin": "US8740391003",
    "sector": "null",
    "id": 314,
    "market_cap": 394660660605,
    "geopac": 0.204981,
    "gain_consistency": 0.922829,
    "loss_ratio": 2.49592,
    "latest_price": 76.1,
    "latest_ma_200": 78.902,
    "months": 120
  },
  {
    "inner": true,
    "original": true,
    "name": "Tyler Technologies, Inc.",
    "currency": "EUR",
    "ticker": "TYP.F",
    "isin": "US9022521051",
    "sector": "null",
    "id": 315,
    "market_cap": 13983277096,
    "geopac": 0.179259,
    "gain_consistency": 0.917087,
    "loss_ratio": 2.10768,
    "latest_price": 330.2,
    "latest_ma_200": 329.574,
    "months": 120
  },
  {
    "inner": true,
    "original": true,
    "name": "Teledyne Technologies Incorporated",
    "currency": "EUR",
    "ticker": "TYZ.F",
    "isin": "US8793601050",
    "sector": "null",
    "id": 316,
    "market_cap": 17146353350,
    "geopac": 0.20442,
    "gain_consistency": 0.943557,
    "loss_ratio": 2.18897,
    "latest_price": 360.5,
    "latest_ma_200": 383.128,
    "months": 120
  },
  {
    "inner": true,
    "original": true,
    "name": "Verisk Analytics, Inc.",
    "currency": "EUR",
    "ticker": "VA7A.F",
    "isin": "US92345Y1064",
    "sector": "null",
    "id": 317,
    "market_cap": 25190491710,
    "geopac": 0.143529,
    "gain_consistency": 0.936975,
    "loss_ratio": 2.13156,
    "latest_price": 172.9,
    "latest_ma_200": 175.334,
    "months": 120
  },
  {
    "inner": true,
    "original": true,
    "name": "ÖKOWORLD AG",
    "currency": "EUR",
    "ticker": "VVV3.F",
    "isin": "DE0005408686",
    "sector": "null",
    "id": 318,
    "market_cap": 281058267,
    "geopac": 0.228438,
    "gain_consistency": 0.902521,
    "loss_ratio": 3.19714,
    "latest_price": 39.3,
    "latest_ma_200": 43.5827,
    "months": 120
  },
  {
    "inner": true,
    "original": true,
    "name": "Watts Water Technologies, Inc.",
    "currency": "EUR",
    "ticker": "W3W.F",
    "isin": "US9427491025",
    "sector": "null",
    "id": 319,
    "market_cap": 4724160000,
    "geopac": 0.143681,
    "gain_consistency": 0.930532,
    "loss_ratio": 2.07528,
    "latest_price": 140.0,
    "latest_ma_200": 142.845,
    "months": 120
  },
  {
    "inner": true,
    "original": true,
    "name": "Watsco, Inc.",
    "currency": "EUR",
    "ticker": "WC3.F",
    "isin": "US9426222009",
    "sector": "null",
    "id": 320,
    "market_cap": 12297050100,
    "geopac": 0.156136,
    "gain_consistency": 0.928992,
    "loss_ratio": 1.76832,
    "latest_price": 313.0,
    "latest_ma_200": 269.443,
    "months": 120
  },
  {
    "inner": true,
    "original": true,
    "name": "Xylem Inc.",
    "currency": "EUR",
    "ticker": "XY6.F",
    "isin": "US98419M1009",
    "sector": "null",
    "id": 321,
    "market_cap": 16515710360,
    "geopac": 0.153027,
    "gain_consistency": 0.933473,
    "loss_ratio": 2.10211,
    "latest_price": 91.44,
    "latest_ma_200": 97.4185,
    "months": 120
  },
  {
    "inner": true,
    "original": true,
    "name": "Azbil Corporation",
    "currency": "EUR",
    "ticker": "YMK.F",
    "isin": "JP3937200008",
    "sector": "null",
    "id": 322,
    "market_cap": 3366743808,
    "geopac": 0.111907,
    "gain_consistency": 0.910364,
    "loss_ratio": 2.28536,
    "latest_price": 24.0,
    "latest_ma_200": 25.944,
    "months": 120
  },
  {
    "inner": true,
    "original": true,
    "name": "Fidelity National Information Services, Inc.",
    "currency": "EUR",
    "ticker": "ZGY.F",
    "isin": "US31620M1062",
    "sector": "null",
    "id": 323,
    "market_cap": 29174059692,
    "geopac": 0.0293047,
    "gain_consistency": 0.820308,
    "loss_ratio": 2.99597,
    "latest_price": 49.24,
    "latest_ma_200": 71.1814,
    "months": 120
  },
  {
    "inner": true,
    "original": true,
    "name": "Constellation Software Inc.",
    "currency": "EUR",
    "ticker": "W9C.F",
    "isin": "CA21037X1006",
    "sector": "null",
    "id": 325,
    "market_cap": 37400868400,
    "geopac": 0.282989,
    "gain_consistency": 0.963159,
    "loss_ratio": 1.53611,
    "latest_price": 1756.0,
    "latest_ma_200": 1544.73,
    "months": 117
  },
  {
    "inner": true,
    "original": true,
    "name": "Intuitive Surgical, Inc.",
    "currency": "EUR",
    "ticker": "IUI1.F",
    "isin": "US46120E6023",
    "sector": "null",
    "id": 283,
    "market_cap": 93924183911,
    "geopac": 0.210383,
    "gain_consistency": 0.939636,
    "loss_ratio": 2.38366,
    "latest_price": 268.05,
    "latest_ma_200": 229.706,
    "months": 120
  },
  {
    "inner": true,
    "original": true,
    "name": "Ferrari N.V.",
    "currency": "EUR",
    "ticker": "2FE.F",
    "isin": "NL0011585146",
    "sector": "null",
    "id": 326,
    "market_cap": 46062534517,
    "geopac": 0.271984,
    "gain_consistency": 0.941823,
    "loss_ratio": 2.01805,
    "latest_price": 250.6,
    "latest_ma_200": 216.623,
    "months": 90
  },
  {
    "inner": true,
    "original": true,
    "name": "WD-40 Company",
    "currency": "EUR",
    "ticker": "WD1.F",
    "isin": "US9292361071",
    "sector": "null",
    "id": 327,
    "market_cap": 2381920800,
    "geopac": 0.129706,
    "gain_consistency": 0.887675,
    "loss_ratio": 2.13914,
    "latest_price": 174.0,
    "latest_ma_200": 169.026,
    "months": 120
  },
  {
    "inner": true,
    "original": true,
    "name": "Montea Comm. VA",
    "currency": "EUR",
    "ticker": "M8E.F",
    "isin": "BE0003853703",
    "sector": "null",
    "id": 328,
    "market_cap": 1406698122,
    "geopac": 0.101374,
    "gain_consistency": 0.907843,
    "loss_ratio": 2.21378,
    "latest_price": 78.1,
    "latest_ma_200": 76.1345,
    "months": 120
  },
  {
    "inner": true,
    "original": true,
    "name": "Republic Services, Inc.",
    "currency": "EUR",
    "ticker": "RPU.F",
    "isin": "US7607591002",
    "sector": "null",
    "id": 329,
    "market_cap": 39166818917,
    "geopac": 0.172443,
    "gain_consistency": 0.946218,
    "loss_ratio": 1.55446,
    "latest_price": 123.85,
    "latest_ma_200": 129.025,
    "months": 120
  },
  {
    "inner": true,
    "original": true,
    "name": "Quebecor Inc.",
    "currency": "EUR",
    "ticker": "QB3.F",
    "isin": "CA7481932084",
    "sector": "null",
    "id": 330,
    "market_cap": 5316252839,
    "geopac": 0.0989469,
    "gain_consistency": 0.882493,
    "loss_ratio": 1.69453,
    "latest_price": 22.8,
    "latest_ma_200": 20.907,
    "months": 120
  },
  {
    "inner": true,
    "original": true,
    "name": "Vonovia SE",
    "currency": "EUR",
    "ticker": "VNA.F",
    "isin": "DE000A1ML7J1",
    "sector": "null",
    "id": 331,
    "market_cap": 15431530704,
    "geopac": 0.00697879,
    "gain_consistency": 0.797377,
    "loss_ratio": 3.19059,
    "latest_price": 19.39,
    "latest_ma_200": 24.0283,
    "months": 117
  },
  {
    "inner": true,
    "original": true,
    "name": "Telefónica, S.A.",
    "currency": "EUR",
    "ticker": "TNE5.F",
    "isin": "ES0178430E18",
    "sector": "Telekommunikation",
    "id": 332,
    "market_cap": 23559914898,
    "geopac": -0.0980548,
    "gain_consistency": 0.127031,
    "loss_ratio": 3.39449,
    "latest_price": 4.09,
    "latest_ma_200": 3.75716,
    "months": 120
  },
  {
    "inner": true,
    "original": true,
    "name": "Siemens Healthineers",
    "currency": "EUR",
    "ticker": "SHL.F",
    "isin": "DE000SHL1006",
    "sector": "Chemie, Pharma",
    "id": 333,
    "market_cap": 62350021180,
    "geopac": 0.0785437,
    "gain_consistency": 0.814208,
    "loss_ratio": 2.61713,
    "latest_price": 55.7,
    "latest_ma_200": 49.2493,
    "months": 61
  },
  {
    "inner": true,
    "original": true,
    "name": "Bayer",
    "currency": "EUR",
    "ticker": "BAYN.F",
    "isin": "DE000BAY0017",
    "sector": "Chemie, Pharma",
    "id": 334,
    "market_cap": 58876541778,
    "geopac": -0.0351187,
    "gain_consistency": 0.234874,
    "loss_ratio": 3.17933,
    "latest_price": 59.89,
    "latest_ma_200": 54.4949,
    "months": 120
  },
  {
    "inner": true,
    "original": true,
    "name": "BASF",
    "currency": "EUR",
    "ticker": "BAS.F",
    "isin": "DE000BASF111",
    "sector": "Chemie, Pharma",
    "id": 335,
    "market_cap": 42918802221,
    "geopac": -0.0420335,
    "gain_consistency": 0.278431,
    "loss_ratio": 3.00268,
    "latest_price": 47.99,
    "latest_ma_200": 46.8663,
    "months": 120
  },
  {
    "inner": true,
    "original": true,
    "name": "Aareal Bank",
    "currency": "EUR",
    "ticker": "ARL.F",
    "isin": "DE0005408116",
    "sector": "Finanzen",
    "id": 336,
    "market_cap": 1966310000,
    "geopac": 0.0294784,
    "gain_consistency": 0.435994,
    "loss_ratio": 3.09065,
    "latest_price": 32.75,
    "latest_ma_200": 32.565,
    "months": 120
  },
  {
    "inner": true,
    "original": true,
    "name": "bet-at-home.com",
    "currency": "EUR",
    "ticker": "ACX.F",
    "isin": "DE000A0DNAY5",
    "sector": "Sonstiges",
    "id": 337,
    "market_cap": 33901700,
    "geopac": -0.0985122,
    "gain_consistency": 0.441317,
    "loss_ratio": 6.33302,
    "latest_price": 4.75,
    "latest_ma_200": 6.39787,
    "months": 120
  },
  {
    "inner": true,
    "original": true,
    "name": "CR Capital",
    "currency": "EUR",
    "ticker": "CRZK.F",
    "isin": "DE000A2GS625",
    "sector": "Sonstiges",
    "id": 338,
    "market_cap": 134630103,
    "geopac": 0.239762,
    "gain_consistency": 0.894538,
    "loss_ratio": 3.65056,
    "latest_price": 29.7,
    "latest_ma_200": 28.7722,
    "months": 120
  },
  {
    "inner": true,
    "original": true,
    "name": "Henkel Vz.",
    "currency": "EUR",
    "ticker": "HEN3.F",
    "isin": "DE0006048432",
    "sector": "Handel & Konsum",
    "id": 339,
    "market_cap": 29136337843,
    "geopac": -0.00703118,
    "gain_consistency": 0.385854,
    "loss_ratio": 2.30251,
    "latest_price": 73.16,
    "latest_ma_200": 65.819,
    "months": 120
  },
  {
    "inner": true,
    "original": true,
    "name": "MPH Health Care",
    "currency": "EUR",
    "ticker": "93M1.F",
    "isin": "DE000A289V03",
    "sector": "Chemie, Pharma",
    "id": 340,
    "market_cap": 65933250,
    "geopac": -0.0752616,
    "gain_consistency": 0.427031,
    "loss_ratio": 3.95846,
    "latest_price": 15.4,
    "latest_ma_200": 13.8437,
    "months": 120
  },
  {
    "inner": true,
    "original": true,
    "name": "Novartis",
    "currency": "CHF",
    "ticker": "NOVN.SW",
    "isin": "CH0012005267",
    "sector": "Chemie, Pharma",
    "id": 341,
    "market_cap": 193626368804,
    "geopac": 0.0304153,
    "gain_consistency": 0.70084,
    "loss_ratio": 1.68272,
    "latest_price": 91.35,
    "latest_ma_200": 81.2862,
    "months": 120
  },
  {
    "inner": true,
    "original": true,
    "name": "TotalEnergies",
    "currency": "EUR",
    "ticker": "TOTB.F",
    "isin": "FR0000120271",
    "sector": "Sonstiges",
    "id": 342,
    "market_cap": 141065859035,
    "geopac": 0.0251853,
    "gain_consistency": 0.542577,
    "loss_ratio": 2.45932,
    "latest_price": 57.38,
    "latest_ma_200": 55.0069,
    "months": 120
  },
  {
    "inner": true,
    "original": true,
    "name": "TUI",
    "currency": "EUR",
    "ticker": "TUI1.F",
    "isin": "DE000TUAG000",
    "sector": "Sonstiges",
    "id": 343,
    "market_cap": 1972010324,
    "geopac": -0.185382,
    "gain_consistency": 0.291877,
    "loss_ratio": 6.04433,
    "latest_price": 5.84,
    "latest_ma_200": 15.3908,
    "months": 120
  },
  {
    "inner": true,
    "original": true,
    "name": "American Tower Corp.",
    "currency": "EUR",
    "ticker": "A0T.F",
    "isin": "US03027X1000",
    "sector": "Sonstiges",
    "id": 344,
    "market_cap": 84655256358,
    "geopac": 0.123199,
    "gain_consistency": 0.920308,
    "loss_ratio": 1.89315,
    "latest_price": 181.65,
    "latest_ma_200": 213.674,
    "months": 120
  },
  {
    "inner": true,
    "original": true,
    "name": "7C Solarparken AG",
    "currency": "EUR",
    "ticker": "HRPK.F",
    "isin": "DE000A11QW68",
    "sector": "null",
    "id": 278,
    "market_cap": 319392000,
    "geopac": 0.203132,
    "gain_consistency": 0.939076,
    "loss_ratio": 1.83729,
    "latest_price": 4.0,
    "latest_ma_200": 4.51958,
    "months": 120
  },
  {
    "inner": true,
    "original": true,
    "name": "Humana Inc.",
    "currency": "EUR",
    "ticker": "HUM.F",
    "isin": "US4448591028",
    "sector": "null",
    "id": 280,
    "market_cap": 57013924000,
    "geopac": 0.203536,
    "gain_consistency": 0.945378,
    "loss_ratio": 2.19105,
    "latest_price": 452.0,
    "latest_ma_200": 484.224,
    "months": 120
  },
  {
    "inner": true,
    "original": true,
    "name": "HOYA Corporation",
    "currency": "EUR",
    "ticker": "HYB.F",
    "isin": "JP3837800006",
    "sector": "null",
    "id": 281,
    "market_cap": 33722542387,
    "geopac": 0.18598,
    "gain_consistency": 0.923389,
    "loss_ratio": 2.44813,
    "latest_price": 94.44,
    "latest_ma_200": 97.3272,
    "months": 120
  },
  {
    "inner": true,
    "original": true,
    "name": "Intercontinental Exchange, Inc.",
    "currency": "EUR",
    "ticker": "IC2.F",
    "isin": "US45866F1049",
    "sector": "null",
    "id": 282,
    "market_cap": 52723644845,
    "geopac": 0.126837,
    "gain_consistency": 0.948459,
    "loss_ratio": 1.84139,
    "latest_price": 94.2,
    "latest_ma_200": 97.9631,
    "months": 120
  },
  {
    "inner": true,
    "original": false,
    "name": "PayPal Holdings, Inc.",
    "currency": "EUR",
    "ticker": "2PP.F",
    "isin": "US70450Y1038",
    "sector": "null",
    "id": 324,
    "market_cap": 75762831080,
    "geopac": 0.101771,
    "gain_consistency": 0.819542,
    "loss_ratio": 3.50441,
    "latest_price": 67.23,
    "latest_ma_200": 78.9971,
    "months": 93
  },
  {
    "inner": true,
    "original": true,
    "name": "Jack Henry & Associates, Inc.",
    "currency": "EUR",
    "ticker": "JHY.F",
    "isin": "US4262811015",
    "sector": "null",
    "id": 284,
    "market_cap": 10204100641,
    "geopac": 0.132641,
    "gain_consistency": 0.939216,
    "loss_ratio": 1.94875,
    "latest_price": 139.8,
    "latest_ma_200": 173.25,
    "months": 120
  },
  {
    "inner": true,
    "original": true,
    "name": "Keyence Corporation",
    "currency": "EUR",
    "ticker": "KEE.F",
    "isin": "JP3236200006",
    "sector": "null",
    "id": 285,
    "market_cap": 100284501000,
    "geopac": 0.205206,
    "gain_consistency": 0.931092,
    "loss_ratio": 2.32526,
    "latest_price": 413.5,
    "latest_ma_200": 393.991,
    "months": 120
  },
  {
    "inner": true,
    "original": true,
    "name": "Landstar System, Inc.",
    "currency": "EUR",
    "ticker": "LDS.F",
    "isin": "US5150981018",
    "sector": "null",
    "id": 286,
    "market_cap": 5475465600,
    "geopac": 0.145573,
    "gain_consistency": 0.937255,
    "loss_ratio": 1.9046,
    "latest_price": 152.0,
    "latest_ma_200": 156.855,
    "months": 120
  },
  {
    "inner": true,
    "original": true,
    "name": "Lennox International Inc.",
    "currency": "EUR",
    "ticker": "LXI.F",
    "isin": "US5261071071",
    "sector": "null",
    "id": 288,
    "market_cap": 8306415000,
    "geopac": 0.149749,
    "gain_consistency": 0.902941,
    "loss_ratio": 2.17078,
    "latest_price": 234.0,
    "latest_ma_200": 236.99,
    "months": 120
  },
  {
    "inner": true,
    "original": true,
    "name": "Equity LifeStyle Properties, Inc.",
    "currency": "EUR",
    "ticker": "MHV.F",
    "isin": "US29472R1086",
    "sector": "null",
    "id": 289,
    "market_cap": 12025600512,
    "geopac": 0.15826,
    "gain_consistency": 0.920868,
    "loss_ratio": 1.70396,
    "latest_price": 61.0,
    "latest_ma_200": 64.3375,
    "months": 120
  },
  {
    "inner": true,
    "original": true,
    "name": "Marsh & McLennan Companies, Inc.",
    "currency": "EUR",
    "ticker": "MSN.F",
    "isin": "US5717481023",
    "sector": "null",
    "id": 290,
    "market_cap": 78462752350,
    "geopac": 0.167047,
    "gain_consistency": 0.958683,
    "loss_ratio": 1.44561,
    "latest_price": 158.6,
    "latest_ma_200": 158.178,
    "months": 120
  },
  {
    "inner": true,
    "original": true,
    "name": "Mercedes-Benz Group AG",
    "currency": "EUR",
    "ticker": "MBG.F",
    "isin": "DE0007100000",
    "sector": "Consumer Cyclical",
    "id": 347,
    "market_cap": 75520733197,
    "geopac": 0.0224428,
    "gain_consistency": 0.451261,
    "loss_ratio": 3.18828,
    "latest_price": 70.48,
    "latest_ma_200": 63.4416,
    "months": 120
  },
  {
    "inner": true,
    "original": true,
    "name": "Atlassian Corporation",
    "currency": "EUR",
    "ticker": "48D.F",
    "isin": "US0494681010",
    "sector": "Technology",
    "id": 348,
    "market_cap": 11451354096,
    "geopac": 0.281718,
    "gain_consistency": 0.904389,
    "loss_ratio": 3.54368,
    "latest_price": 136.5,
    "latest_ma_200": 174.504,
    "months": 88
  },
  {
    "inner": true,
    "original": true,
    "name": "L3Harris Technologies, Inc.",
    "currency": "EUR",
    "ticker": "HRS.F",
    "isin": "US5024311095",
    "sector": "null",
    "id": 279,
    "market_cap": 33242473600,
    "geopac": 0.148814,
    "gain_consistency": 0.932073,
    "loss_ratio": 2.08146,
    "latest_price": 175.0,
    "latest_ma_200": 210.099,
    "months": 120
  },
  {
    "inner": true,
    "original": true,
    "name": "Shell plc",
    "currency": "EUR",
    "ticker": "R6C0.F",
    "isin": "GB00BP6MXD84",
    "sector": "Sonstiges",
    "id": 345,
    "market_cap": 184783866293,
    "geopac": 0.00511113,
    "gain_consistency": 0.429972,
    "loss_ratio": 2.61435,
    "latest_price": 27.005,
    "latest_ma_200": 26.8751,
    "months": 120
  },
  {
    "inner": true,
    "original": true,
    "name": "Dassault Systèmes SE",
    "currency": "EUR",
    "ticker": "DSY.F",
    "isin": "FR0000130650",
    "sector": "Technology",
    "id": 346,
    "market_cap": 49206733829,
    "geopac": 0.155223,
    "gain_consistency": 0.931513,
    "loss_ratio": 2.14565,
    "latest_price": 34.6,
    "latest_ma_200": 35.923,
    "months": 120
  },
  {
    "inner": true,
    "original": true,
    "name": "Waste Management, Inc.",
    "currency": "EUR",
    "ticker": "UWS.F",
    "isin": "US94106L1098",
    "sector": "null",
    "id": 195,
    "market_cap": 60376213952,
    "geopac": 0.170408,
    "gain_consistency": 0.944538,
    "loss_ratio": 1.61398,
    "latest_price": 147.7,
    "latest_ma_200": 154.754,
    "months": 120
  },
  {
    "inner": true,
    "original": true,
    "name": "Balchem",
    "currency": "EUR",
    "ticker": "BL9B.BE",
    "isin": "US0576652004",
    "sector": "Chemie, Pharma",
    "id": 12,
    "market_cap": 4011203000,
    "geopac": 0.117256,
    "gain_consistency": 0.908263,
    "loss_ratio": 2.394,
    "latest_price": 110.9,
    "latest_ma_200": 124.404,
    "months": 120
  },
  {
    "inner": true,
    "original": true,
    "name": "Keurig Dr Pepper",
    "currency": "EUR",
    "ticker": "DP5.F",
    "isin": "US49271V1008",
    "sector": "Nahrung & Genuss",
    "id": 217,
    "market_cap": 43480404521,
    "geopac": -0.00950941,
    "gain_consistency": 0.439216,
    "loss_ratio": 2.14175,
    "latest_price": 30.915,
    "latest_ma_200": 35.3333,
    "months": 120
  },
  {
    "inner": true,
    "original": true,
    "name": "Lockheed Martin Corporation",
    "currency": "EUR",
    "ticker": "LOM.F",
    "isin": "US5398301094",
    "sector": "null",
    "id": 287,
    "market_cap": 106007166832,
    "geopac": 0.160837,
    "gain_consistency": 0.918067,
    "loss_ratio": 1.76314,
    "latest_price": 416.5,
    "latest_ma_200": 437.687,
    "months": 120
  },
  {
    "inner": true,
    "original": true,
    "name": "Sofina Société Anonyme",
    "currency": "EUR",
    "ticker": "8FS.F",
    "isin": "BE0003717312",
    "sector": "null",
    "id": 236,
    "market_cap": 6769655897,
    "geopac": 0.102023,
    "gain_consistency": 0.92437,
    "loss_ratio": 2.47196,
    "latest_price": 202.2,
    "latest_ma_200": 209.837,
    "months": 120
  },
  {
    "inner": true,
    "original": true,
    "name": "LVMH Moët Hennessy - Louis Vuitton, Société Européenne",
    "currency": "EUR",
    "ticker": "MOH.F",
    "isin": "FR0000121014",
    "sector": "null",
    "id": 192,
    "market_cap": 453411700548,
    "geopac": 0.201334,
    "gain_consistency": 0.933613,
    "loss_ratio": 1.81071,
    "latest_price": 885.3,
    "latest_ma_200": 724.809,
    "months": 120
  },
  {
    "inner": true,
    "original": true,
    "name": "Abbott",
    "currency": "EUR",
    "ticker": "ABL.F",
    "isin": "US0028241000",
    "sector": "Chemie, Pharma",
    "id": 2,
    "market_cap": 172109295439,
    "geopac": 0.130648,
    "gain_consistency": 0.922129,
    "loss_ratio": 1.5121,
    "latest_price": 98.45,
    "latest_ma_200": 101.172,
    "months": 120
  }
]