Place,Name,Sex,Event,Division,WeightClassKg,Equipment,BirthYear,Team,State,BodyweightKg,Squat1Kg,Squat2Kg,Squat3Kg,Best3SquatKg,Bench1Kg,Bench2Kg,Bench3Kg,Best3BenchKg,Deadlift1Kg,Deadlift2Kg,Deadlift3Kg,Best3DeadliftKg,TotalKg,Age,BirthDate
1,Skyleigh Sears,F,SBD,F-Jr,60,Single-ply,2000,,TX,59.57,200,-210,210,210,105,112.5,-115,112.5,175,-182.5,182.5,182.5,505,,
1,Geri Fredrickson,F,SBD,F-Jr,82.5,Single-ply,2001,,WI,81.75,220,230,235,235,120,132.5,137.5,137.5,165,175,-185,175,547.5,,
1,Renee Brown,F,SBD,F-M1,48,Single-ply,1981,,IN,46.07,-157.5,-157.5,157.5,157.5,100,105,-110,105,147.5,157.5,163,163,425.5,,
1,Katey Dodge,F,SBD,F-M1,90,Single-ply,1981,,NE,88.37,210,222.5,232.5,232.5,127.5,135,-140,135,187.5,200,-212.5,200,567.5,,
2,Kehaulani Richardson,F,SBD,F-M1,90,Single-ply,1981,,NV,88.22,192.5,202.5,-205,202.5,107.5,112.5,120,120,185,195,202.5,202.5,525,,
1,Andrea Pettyjohn,F,SBD,F-M1,100+,Single-ply,1979,,GA,120.81,190,200,207.5,207.5,147.5,-150,150,150,175,185,187.5,187.5,545,,
1,Heather Burman,F,SBD,F-M1,67.5,Single-ply,1979,,TX,64.23,152.5,165,-175,165,80,87.5,-92.5,87.5,160,172.5,-182.5,172.5,425,,
1,Stacie Metcalfe,F,SBD,F-M2,60,Single-ply,1970,,GA,58.99,60,65,-70,65,42.5,-47.5,-47.5,42.5,75,85,92.5,92.5,200,,
1,Sarah Bohlen,F,SBD,F-M2,90,Single-ply,1969,,WA,86.3,132.5,140,-145,140,85,87.5,-90,87.5,150,160,-162.5,160,387.5,,
1,Terri Brown,F,SBD,F-M2,100,Single-ply,1970,,WI,98.02,127.5,137.5,145,145,77.5,87.5,-92.5,87.5,152.5,167.5,177.5,177.5,410,,
1,Dawn Dotson,F,SBD,F-M2,100+,Single-ply,1967,,AZ,155.4,-70,70,77.5,77.5,105,110,115,115,110,-115,115,115,307.5,,
DQ,Amy Pancake,F,SBD,F-M2,67.5,Single-ply,1967,,GA,66.72,152.5,-162.5,-162.5,152.5,-90,-90,-90,,150,155,160,160,,,
1,Marie Brenden,F,SBD,F-M2,82.5,Single-ply,1964,,WA,80.29,125,135,137.5,137.5,95,102.5,112.5,112.5,135,142.5,155,155,405,,
1,Cindy Goodrich,F,SBD,F-M3,52,Single-ply,1957,,WA,49.95,-105,105,115,115,65,72.5,75,75,110,120,-125,120,310,,
1,Jane Hanisch,F,SBD,F-M3,75,Single-ply,1955,,KS,73.51,-80,-85,85,85,50,55,-57.5,55,102.5,110,-120,110,250,,
DQ,Jill Arnow,F,SBD,F-M3,90,Single-ply,1959,,MA,89.17,-165,-170,-170,,115,120,-125,120,140,150,-152.5,150,,,
1,Sue Hallen,F,SBD,F-M3,100,Single-ply,1957,,IL,96.76,-125,-130,130,130,92.5,-102.5,-102.5,92.5,125,140,-150,140,362.5,,
1,Ann Whitmarsh,F,SBD,F-M3,67.5,Single-ply,1953,,FL,62,72.5,77.5,-82.5,77.5,37.5,42.5,-45,42.5,92.5,97.5,102.5,102.5,222.5,,
1,Leslie Macko,F,SBD,F-M4,67.5,Single-ply,1949,,WA,65.52,60,67.5,-72.5,67.5,40,45,47.5,47.5,82.5,90,-95,90,205,,
1,Renee Brown,F,SBD,F-O,48,Single-ply,1981,,IN,46.07,-157.5,-157.5,157.5,157.5,100,105,-110,105,147.5,157.5,163,163,425.5,,
2,Alexis Iglesias #1,F,SBD,F-O,48,Single-ply,2004,,TX,46.15,117.5,-125,125,125,72.5,77.5,82.5,82.5,117.5,125,-130,125,332.5,,
1,Jenica Flores,F,SBD,F-O,52,Single-ply,1997,,TX,51.77,-152.5,152.5,-162.5,152.5,70,75,-80,75,145,-155,-155,145,372.5,,
1,Rilee Stewart,F,SBD,F-O,56,Single-ply,2001,,MO,55.15,130,-135,140,140,90,-92.5,92.5,92.5,130,140,147.5,147.5,380,,
DQ,Ashlee Hafenbrack,F,SBD,F-O,56,Single-ply,1988,,TX,55.84,-140,-140,-140,,107.5,-110,-110,107.5,140,145,-150,145,,,
1,Skyleigh Sears,F,SBD,F-O,60,Single-ply,2000,,TX,59.57,200,-210,210,210,105,112.5,-115,112.5,175,-182.5,182.5,182.5,505,,
2,Kaylee Longoria,F,SBD,F-O,60,Single-ply,2003,Texas Strength Systems,TX,59.12,120,135,-140,135,72.5,77.5,-80,77.5,125,130,132.5,132.5,345,,
1,Julianna Perez,F,SBD,F-O,75,Single-ply,2002,Texas Strength Systems,TX,74.14,197.5,207.5,-217.5,207.5,130,135,-142.5,135,157.5,165,177.5,177.5,520,,
2,Alyssa Echazarreta,F,SBD,F-O,75,Single-ply,2003,,TX,73.29,192.5,200,205,205,115,120,-125,120,-145,145,150,150,475,,
DQ,Cara Garcia,F,SBD,F-O,75,Single-ply,2001,Texas Strength Systems,TX,74.96,-175,-180,180,180,-105,-105,-105,,160,172.5,-180,172.5,,,
1,Katey Dodge,F,SBD,F-O,90,Single-ply,1981,,NE,88.37,210,222.5,232.5,232.5,127.5,135,-140,135,187.5,200,-212.5,200,567.5,,
2,Kehaulani Richardson,F,SBD,F-O,90,Single-ply,1981,,NV,88.22,192.5,202.5,-205,202.5,107.5,112.5,120,120,185,195,202.5,202.5,525,,
3,Kennedi Butcher,F,SBD,F-O,90,Single-ply,2003,,TX,89.59,-195,-195,195,195,-107.5,107.5,-110,107.5,167.5,-177.5,-177.5,167.5,470,,
4,Chloe Cooper,F,SBD,F-O,90,Single-ply,2004,,WI,88.74,172.5,182.5,-187.5,182.5,92.5,100,107.5,107.5,155,165,-175,165,455,,
5,Jayla Dandridge,F,SBD,F-O,90,Single-ply,2004,,TX,86.8,155,167.5,192.5,192.5,70,75,82.5,82.5,135,-152.5,152.5,152.5,427.5,,
6,Emily St. Germain,F,SBD,F-O,90,Single-ply,1998,,LA,88.42,132.5,-150,150,150,105,110,115,115,135,147.5,152.5,152.5,417.5,,
1,Alyssa Orlando,F,SBD,F-O,100,Single-ply,1992,,MA,91.69,165,175,182.5,182.5,122.5,130,137.5,137.5,167.5,178,180.5,180.5,500.5,,
2,Desiree Gonzales,F,SBD,F-O,100,Single-ply,2002,Texas Strength Systems,TX,99.73,-225,225,235,235,80,-125,-125,80,155,167.5,-178.5,167.5,482.5,,
1,Krysti Llamas,F,SBD,F-O,100+,Single-ply,2001,,TX,109.35,255,267.5,-275,267.5,150,157.5,165,165,180,195,-205,195,627.5,,
2,Andrea Pettyjohn,F,SBD,F-O,100+,Single-ply,1979,,GA,120.81,190,200,207.5,207.5,147.5,-150,150,150,175,185,187.5,187.5,545,,
3,Katie Collins,F,SBD,F-O,100+,Single-ply,1993,,WI,116.21,142.5,155,-162.5,155,120,127.5,132.5,132.5,150,170,190,190,477.5,,
4,Leah Cantu,F,SBD,F-O,100+,Single-ply,2002,Texas Strength Systems,TX,112.22,170,-175,175,175,-107.5,107.5,-112.5,107.5,127.5,135,142.5,142.5,425,,
5,Dawn Dotson,F,SBD,F-O,100+,Single-ply,1967,,AZ,155.4,-70,70,77.5,77.5,105,110,115,115,110,-115,115,115,307.5,,
DQ,Rian Garza,F,SBD,F-O,100+,Single-ply,2003,,TX,107.85,-167.5,-167.5,-167.5,,,,,,,,,,,,
1,Sophia Veiras,F,SBD,F-O,67.5,Single-ply,1991,,CT,65.38,182.5,195,205,205,117.5,125,-130,125,182.5,195,-205,195,525,,
DQ,Amy Pancake,F,SBD,F-O,67.5,Single-ply,1967,,GA,66.72,152.5,-162.5,-162.5,152.5,-90,-90,-90,,150,155,160,160,,,
1,Lauryn Cudworth,F,SBD,F-O,82.5,Single-ply,1997,,WI,80.72,195,207.5,220,220,95,102.5,107.5,107.5,197.5,217.5,220,220,547.5,,
2,Geri Fredrickson,F,SBD,F-O,82.5,Single-ply,2001,,WI,81.75,220,230,235,235,120,132.5,137.5,137.5,165,175,-185,175,547.5,,
3,Caitlin Dunn,F,SBD,F-O,82.5,Single-ply,1987,,CT,79.05,195,-202.5,-205,195,107.5,112.5,117.5,117.5,-180,180,-187.5,180,492.5,,
4,Billie Denison,F,SBD,F-O,82.5,Single-ply,1989,,AK,81.09,155,165,-175,165,80,90,95,95,117.5,127.5,132.5,132.5,392.5,,
G,Chantal McCalla,F,SBD,FR-G,100,Raw,1991,,CT,92.34,132.5,140,-145,140,97.5,102.5,-107.5,102.5,202.5,210,-215,210,452.5,,
1,Alexis Jones #1,F,SBD,FR-Jr,100+,Raw,2000,,FL,135.67,240,250,260,260,155,160,162.5,162.5,232.5,237.5,250,250,672.5,,
1,Eileen Brzoska,F,SBD,FR-M1,48,Raw,1976,,TX,47.62,-92.5,92.5,97.5,97.5,62.5,-67.5,67.5,67.5,115,120,,120,285,,
1,Jannett Chavez,F,SBD,FR-M1,52,Raw,1981,,IA,51.15,-110,-110,110,110,67.5,70,-72.5,70,135,-140,-140,135,315,,
1,Patty Tabacchi,F,SBD,FR-M1,56,Raw,1974,,NY,54.25,120,127.5,132.5,132.5,60,65,67.5,67.5,155,165,170,170,370,,
2,Elizabeth Haass,F,SBD,FR-M1,56,Raw,1979,,NY,53.07,107.5,112.5,120,120,55,60,62.5,62.5,137.5,142.5,147.5,147.5,330,,
3,Megan Schilling,F,SBD,FR-M1,56,Raw,1977,,MN,53.58,-117.5,117.5,122.5,122.5,60,-62.5,-62.5,60,135,142.5,-147.5,142.5,325,,
1,Amy Mason,F,SBD,FR-M1,60,Raw,1976,,NC,59.77,127.5,135,140,140,70,75,77.5,77.5,162.5,170,175,175,392.5,,
2,Jennifer Sauter,F,SBD,FR-M1,60,Raw,1979,,NY,59.52,135,-142.5,-145,135,67.5,72.5,-75,72.5,155,165,170,170,377.5,,
3,Serena Arave,F,SBD,FR-M1,60,Raw,1978,,ID,59.53,125,132.5,-137.5,132.5,65,72.5,75,75,145,155,-165,155,362.5,,
4,Julie Adams,F,SBD,FR-M1,60,Raw,1976,,TX,59.27,-122.5,122.5,-127.5,122.5,55,60,62.5,62.5,157.5,162.5,167.5,167.5,352.5,,
5,Rebecca Holland,F,SBD,FR-M1,60,Raw,1973,,WI,59.01,110,-117.5,-117.5,110,72.5,-77.5,77.5,77.5,150,160,162.5,162.5,350,,
1,Linette Bogdan,F,SBD,FR-M1,75,Raw,1980,,NJ,74.45,135,145,152.5,152.5,85,90,-92.5,90,175,-192.5,-192.5,175,417.5,,
2,Kristin Ripley,F,SBD,FR-M1,75,Raw,1979,,IN,73.4,125,135,140,140,67.5,75,85,85,160,170,-172.5,170,395,,
3,Amy Hutchison,F,SBD,FR-M1,75,Raw,1982,,NC,74.45,140,147.5,-152.5,147.5,72.5,77.5,-80,77.5,157.5,167.5,-175,167.5,392.5,,
4,April Johnson,F,SBD,FR-M1,75,Raw,1979,,MI,74.03,142.5,-147.5,-147.5,142.5,-77.5,77.5,80,80,145,150,157.5,157.5,380,,
5,Michelle Stamper,F,SBD,FR-M1,75,Raw,1981,,TX,73.57,110,117.5,120,120,-72.5,72.5,77.5,77.5,165,172.5,180,180,377.5,,
6,Suzette Bradley,F,SBD,FR-M1,75,Raw,1979,,CA,74.93,135,140,142.5,142.5,70,72.5,75,75,-145,145,157.5,157.5,375,,
1,Allison Snead,F,SBD,FR-M1,90,Raw,1975,,NC,88.34,150,162.5,-172.5,162.5,82.5,-90,-90,82.5,165,180,-197.5,180,425,,
1,Jacquelynne Duble,F,SBD,FR-M1,100,Raw,1982,,PA,97.86,190,202.5,215,215,102.5,110,115,115,190,205,215,215,545,,
2,April Grey,F,SBD,FR-M1,100,Raw,1977,,CT,90.85,170,177.5,-182.5,177.5,95,100,-102.5,100,177.5,187.5,200,200,477.5,,
3,Anna Castano,F,SBD,FR-M1,100,Raw,1982,,CO,98.57,152.5,162.5,-167.5,162.5,97.5,-100,-100,97.5,170,182.5,-187.5,182.5,442.5,,
4,Kristin McCarthy,F,SBD,FR-M1,100,Raw,1973,,NC,96.79,140,145,147.5,147.5,77.5,80,-82.5,80,182.5,187.5,190,190,417.5,,
5,Angela Waits,F,SBD,FR-M1,100,Raw,1977,,MO,97.95,-150,-150,150,150,72.5,75,-85,75,-145,145,170,170,395,,
6,Nachelle Pena,F,SBD,FR-M1,100,Raw,1982,,WA,98.6,142.5,152.5,-162.5,152.5,82.5,90,-92.5,90,142.5,152.5,-160,152.5,395,,
1,Racheal Paveglio,F,SBD,FR-M1,100+,Raw,1982,,NC,124.93,180,195,-215,195,97.5,105,-115,105,195,215,222.5,222.5,522.5,,
2,Aranda Brown,F,SBD,FR-M1,100+,Raw,1981,,MD,126.73,172.5,185,195,195,70,75,77.5,77.5,197.5,212.5,225,225,497.5,,
3,Kimberly Spyres,F,SBD,FR-M1,100+,Raw,1980,,MO,122.53,-182.5,-182.5,182.5,182.5,100,-105,-105,100,-175,175,185,185,467.5,,
4,Veronica Hamm,F,SBD,FR-M1,100+,Raw,1982,,WA,138.54,162.5,170,-175,170,100,105,-107.5,105,172.5,-182.5,-182.5,172.5,447.5,,
5,April Garcia #1,F,SBD,FR-M1,100+,Raw,1979,,NE,105.19,137.5,145,-150,145,65,70,77.5,77.5,175,182.5,192.5,192.5,415,,
6,Angela Abreu-Powell,F,SBD,FR-M1,100+,Raw,1975,Team Sam Strong,NC,106.56,142.5,150,152.5,152.5,77.5,82.5,-85,82.5,157.5,165,-170,165,400,,
7,Misti Elliott,F,SBD,FR-M1,100+,Raw,1974,,KS,108.84,140,-150,-150,140,-92.5,92.5,-100,92.5,140,-145,145,145,377.5,,
DQ,Amanda Doll,F,SBD,FR-M1,100+,Raw,1982,,OH,128.78,-190,-200,-200,,-127.5,135,-145,135,162.5,175,-182.5,175,,,
1,Jennifer Thompson #1,F,SBD,FR-M1,67.5,Raw,1973,,NC,64.73,135,150,157.5,157.5,137.5,-140,144.5,144.5,165,190,200,200,502,,
2,Becky Enright,F,SBD,FR-M1,67.5,Raw,1979,,WA,66.14,160,170,177.5,177.5,92.5,-95,-95,92.5,157.5,167.5,175,175,445,,
3,Leah Lutz,F,SBD,FR-M1,67.5,Raw,1975,,CA,67.5,140,147.5,150,150,82.5,90,-95,90,162.5,170,177.5,177.5,417.5,,
4,Kaylen Williams-Henry,F,SBD,FR-M1,67.5,Raw,1981,,IA,64.62,130,137.5,-140,137.5,72.5,75,77.5,77.5,142.5,152.5,157.5,157.5,372.5,,
5,Nez Smith,F,SBD,FR-M1,67.5,Raw,1982,,CA,64.09,135,142.5,147.5,147.5,65,70,72.5,72.5,140,150,-157.5,150,370,,
6,Nina Tesene,F,SBD,FR-M1,67.5,Raw,1980,,IA,64.83,-127.5,127.5,135,135,60,62.5,-65,62.5,152.5,162.5,167.5,167.5,365,,
7,Megan Slivka,F,SBD,FR-M1,67.5,Raw,1981,,NE,65.97,130,-137.5,-140,130,62.5,67.5,70,70,145,155,162.5,162.5,362.5,,
8,Leah Hardesty,F,SBD,FR-M1,67.5,Raw,1979,,WA,66.65,112.5,120,-125,120,60,62.5,65,65,152.5,160,-165,160,345,,
9,Alice Beck,F,SBD,FR-M1,67.5,Raw,1982,,KY,65.31,115,-125,125,125,60,65,-67.5,65,100,-102.5,-102.5,100,290,,
1,Michelle Kane,F,SBD,FR-M1,82.5,Raw,1974,,OH,80.35,127.5,137.5,147.5,147.5,90,97.5,102.5,102.5,150,165,170,170,420,,
2,Francesca Bill,F,SBD,FR-M1,82.5,Raw,1975,,MN,80.86,145,152.5,-157.5,152.5,77.5,82.5,87.5,87.5,155,162.5,-182.5,162.5,402.5,,
1,Kelley Sherwin,F,SBD,FR-M2,48,Raw,1972,,WI,47.55,90,-95,95,95,57.5,60,62.5,62.5,-122.5,122.5,132.5,132.5,290,,1972-03-21
2,Chiaki Takada,F,SBD,FR-M2,48,Raw,1965,,FL,47.86,77.5,82.5,-85,82.5,60,-65,-65,60,122.5,127.5,-133,127.5,270,,
3,Lynn-Marie Aronica,F,SBD,FR-M2,48,Raw,1972,Mustache Fitness & Barbell,NY,46.61,75,80,-85,80,50,52.5,55,55,102.5,110,-115,110,245,,
1,Felicia Sherman,F,SBD,FR-M2,52,Raw,1969,,OH,49.36,-110,110,-117.5,110,57.5,60,-62.5,60,130,137.5,140,140,310,,
1,Suzanne Hartwig-Gary,F,SBD,FR-M2,56,Raw,1968,,MT,53.16,130,137.5,143.5,143.5,65,70,75.5,75.5,145,155.5,-158.5,155.5,374.5,,
2,Alana McGolrick,F,SBD,FR-M2,56,Raw,1972,,CA,55.28,130,135,137.5,137.5,70,-72.5,-72.5,70,132.5,137.5,-142.5,137.5,345,,
3,Antoinette Kemper,F,SBD,FR-M2,56,Raw,1964,,CO,55.45,117.5,122.5,127.5,127.5,67.5,70,-72.5,70,120,130,-137.5,130,327.5,,
4,Lynn Pietig,F,SBD,FR-M2,56,Raw,1966,,MN,55.5,-107.5,-107.5,107.5,107.5,47.5,50,-52.5,50,147.5,-157.5,157.5,157.5,315,,
5,Tracey Quast,F,SBD,FR-M2,56,Raw,1968,,WI,55.59,100,110,115,115,62.5,-67.5,-67.5,62.5,122.5,130,-137.5,130,307.5,,
1,Melissa Mitchell,F,SBD,FR-M2,60,Raw,1967,Team Sam Strong,VA,57.08,120,127.5,135,135,80,85,88,88,-142.5,142.5,150,150,373,,
2,Anita Sher,F,SBD,FR-M2,60,Raw,1964,,NY,58.16,92.5,102.5,110,110,65,72.5,-75,72.5,142.5,145,155,155,337.5,,
3,Michele Moe,F,SBD,FR-M2,60,Raw,1969,,NC,58.19,95,105,-110,105,67.5,-70,-72.5,67.5,127.5,135,142.5,142.5,315,,
4,Crystal Zarbatany,F,SBD,FR-M2,60,Raw,1966,,CA,59.47,112.5,117.5,-120,117.5,60,-62.5,,60,120,125,-132.5,125,302.5,,
5,Kimberly Sparks,F,SBD,FR-M2,60,Raw,1968,,AZ,57.72,-90,-90,90,90,-52.5,-52.5,52.5,52.5,112.5,120,-125,120,262.5,,
DQ,Angela Saliani,F,SBD,FR-M2,60,Raw,1970,,AZ,59.58,-135,-135,-135,,-65,-65,-65,,,,,,,,
1,Cynthia Browning,F,SBD,FR-M2,75,Raw,1970,,IN,72.72,120,-130,130,130,97.5,105,-107.5,105,172.5,185,190,190,425,,
2,Stephanie Carpenter,F,SBD,FR-M2,75,Raw,1972,,ID,73.87,130,140,152.5,152.5,77.5,85,-87.5,85,160,175,182.5,182.5,420,,
3,Melody Miller,F,SBD,FR-M2,75,Raw,1970,,CO,72.37,122.5,130,135,135,85,90,-92.5,90,147.5,157.5,165,165,390,,
4,Cheryl Iseri,F,SBD,FR-M2,75,Raw,1972,,ID,73.03,112.5,122.5,-132.5,122.5,75,-85,-85,75,150,170,175,175,372.5,,
5,Lora Robinson,F,SBD,FR-M2,75,Raw,1970,,WI,72.67,110,117.5,122.5,122.5,70,75,-77.5,75,142.5,152.5,160,160,357.5,,
6,Kelly Swanson,F,SBD,FR-M2,75,Raw,1965,,MN,72.81,110,112.5,-117.5,112.5,57.5,62.5,-65,62.5,132.5,137.5,-140,137.5,312.5,,
7,Maria Doheny,F,SBD,FR-M2,75,Raw,1967,,PA,73.11,107.5,117.5,-125,117.5,52.5,55,-57.5,55,132.5,140,-145,140,312.5,,
1,Alicia Webb,F,SBD,FR-M2,90,Raw,1971,,GA,89.08,187.5,200,-207.5,200,117.5,122.5,127.5,127.5,182.5,200,207.5,207.5,535,,
2,Lisa Benavides,F,SBD,FR-M2,90,Raw,1972,,TX,88.89,142.5,147.5,157.5,157.5,102.5,107.5,-112.5,107.5,185,192.5,-197.5,192.5,457.5,,
3,Jennifer Rosario,F,SBD,FR-M2,90,Raw,1972,,MN,82.9,132.5,137.5,140,140,70,75,77.5,77.5,147.5,157.5,-167.5,157.5,375,,
4,Rachel Olstad,F,SBD,FR-M2,90,Raw,1971,,MN,82.8,110,117.5,120,120,65,70,72.5,72.5,137.5,147.5,-152.5,147.5,340,,
5,Gina Martino Trubits,F,SBD,FR-M2,90,Raw,1966,Mustache Fitness & Barbell,NY,88.23,-105,105,115,115,-55,55,-58,55,125,135,140,140,310,,
1,Patricia Johnson,F,SBD,FR-M2,100,Raw,1970,,CA,97.28,190,200,-205,200,110,117.5,120,120,230,240,-250,240,560,,
2,Violeta Karr,F,SBD,FR-M2,100,Raw,1969,,OR,96.9,122.5,127.5,132.5,132.5,87.5,92.5,-95,92.5,167.5,172.5,-177.5,172.5,397.5,,
3,Michelle Collier,F,SBD,FR-M2,100,Raw,1970,Team Sam Strong,PA,96.72,-120,120,127.5,127.5,75,-82.5,82.5,82.5,162.5,170,180,180,390,,
4,Cindi Jaeger,F,SBD,FR-M2,100,Raw,1971,,WI,97.96,110,117.5,127.5,127.5,62.5,65,67.5,67.5,130,142.5,150,150,345,,
DQ,Angela Diamond,F,SBD,FR-M2,100,Raw,1970,,MI,96.76,-97.5,-102.5,102.5,102.5,-65,-65,-65,,120,127.5,135,135,,,
1,Stacia Proefrock,F,SBD,FR-M2,100+,Raw,1970,,MI,113.03,120,125,132.5,132.5,57.5,60,62.5,62.5,147.5,152.5,157.5,157.5,352.5,,
2,Tish Horne,F,SBD,FR-M2,100+,Raw,1968,AFA Powerlifting,CA,122.09,112.5,122.5,-130,122.5,-75,80,85,85,127.5,137.5,-145,137.5,345,,
3,Rhonda Boer,F,SBD,FR-M2,100+,Raw,1965,,OH,146.84,102.5,107.5,112.5,112.5,57.5,62.5,-65,62.5,-152.5,152.5,-157.5,152.5,327.5,,
1,Tracy Cook,F,SBD,FR-M2,67.5,Raw,1970,,NC,65.82,122.5,130,135.5,135.5,80,85,-87.5,85,160,170,-172.5,170,390.5,,
2,Cathy Avery,F,SBD,FR-M2,67.5,Raw,1969,Team Sam Strong,PA,65.57,125,132.5,-136,132.5,80,-85,85,85,140,147.5,155,155,372.5,,
3,Robin Shell,F,SBD,FR-M2,67.5,Raw,1971,Mustache Fitness & Barbell,OH,63.06,102.5,110,115,115,70,75,77.5,77.5,142.5,152.5,160,160,352.5,,
4,Nandi Xie,F,SBD,FR-M2,67.5,Raw,1963,,CO,65.16,100,-112.5,-112.5,100,70,-75,75,75,110,130,-140,130,305,,
1,Toni Gish,F,SBD,FR-M2,82.5,Raw,1968,,CA,78.2,125,135,140,140,87.5,92.5,-95,92.5,140,150,-155,150,382.5,,
2,Lesa Sparrow,F,SBD,FR-M2,82.5,Raw,1969,,TN,78.92,130,142.5,150,150,62.5,70,75,75,137.5,150,157.5,157.5,382.5,,
3,Trina Scordo,F,SBD,FR-M2,82.5,Raw,1971,,NJ,76.15,117.5,125,132.5,132.5,65,67.5,70,70,157.5,167.5,175,175,377.5,,
4,Laquita Johnson,F,SBD,FR-M2,82.5,Raw,1971,,MO,81.69,-110,110,117.5,117.5,72.5,77.5,-80,77.5,140,150,155,155,350,,
1,Malinda French,F,SBD,FR-M3,56,Raw,1955,,CA,55.35,75,80,-85,80,35,-40,-40,35,115,122.5,125,125,240,,
2,Dede Catsavis,F,SBD,FR-M3,56,Raw,1959,,MO,55.87,82.5,-87.5,-87.5,82.5,40,42.5,-45,42.5,95,100,105,105,230,,
3,Cathy Littell,F,SBD,FR-M3,56,Raw,1958,,IN,53.64,60,65,70,70,35,40,45,45,85,92.5,100,100,215,,
4,Bonnie Triolo,F,SBD,FR-M3,56,Raw,1955,,NJ,55.15,52.5,57.5,60,60,35,40,42.5,42.5,80,87.5,92.5,92.5,195,,
1,Judith Drenth,F,SBD,FR-M3,60,Raw,1958,,MN,58.14,92.5,97.5,100,100,58,-60.5,-60.5,58,122.5,130,-135,130,288,,
2,Tammy Remsberg,F,SBD,FR-M3,60,Raw,1961,,MI,58.06,-97.5,-97.5,97.5,97.5,50,52.5,-55,52.5,120,127.5,-137.5,127.5,277.5,,
3,Karen Baldwin,F,SBD,FR-M3,60,Raw,1956,,NC,57.38,60,62.5,67.5,67.5,37.5,40,-42.5,40,82.5,87.5,92.5,92.5,200,,
1,Joanne Craig,F,SBD,FR-M3,75,Raw,1961,,PA,74.7,125,138,-140,138,62.5,67.5,70,70,120,135,142.5,142.5,350.5,,
2,Kathryn Christensen,F,SBD,FR-M3,75,Raw,1959,,CA,72,117.5,-122.5,122.5,122.5,-62.5,65,-67.5,65,142.5,147.5,150,150,337.5,,
3,Maureen Aldrich,F,SBD,FR-M3,75,Raw,1959,,VT,72.49,120,-125,-125,120,55,60,-65,60,137.5,142.5,-147.5,142.5,322.5,,
4,Heidi Barker,F,SBD,FR-M3,75,Raw,1960,,ID,74.25,100,-105,105,105,-70,70,-72.5,70,137.5,142.5,-150,142.5,317.5,,
5,Susi Bostock,F,SBD,FR-M3,75,Raw,1962,,NY,72.03,-90,-92.5,92.5,92.5,47.5,50,52.5,52.5,115,122.5,-127.5,122.5,267.5,,
6,Brenda Davila,F,SBD,FR-M3,75,Raw,1958,,WA,73.6,92.5,95,100,100,45,47.5,-55,47.5,115,117.5,120,120,267.5,,
7,Lynnett Doyle,F,SBD,FR-M3,75,Raw,1961,,IN,72.55,80,87.5,95,95,47.5,-50,-50,47.5,97.5,107.5,-112.5,107.5,250,,
8,Debbie Bookman,F,SBD,FR-M3,75,Raw,1958,,FL,67.88,77.5,82.5,-85,82.5,52.5,-55,-55,52.5,105,110,-115,110,245,,
1,Diana Hicks,F,SBD,FR-M3,90,Raw,1959,,PA,85.65,-95,95,105,105,50,52.5,55,55,115,127.5,140,140,300,,
2,Pegi Miskey,F,SBD,FR-M3,90,Raw,1960,Mustache Fitness & Barbell,NY,88.8,-72.5,-72.5,72.5,72.5,37.5,40,-42.5,40,120,132.5,137.5,137.5,250,,
1,Lori Hartle,F,SBD,FR-M3,100,Raw,1958,,MD,98.37,92.5,100,105,105,55,60,63,63,125,132.5,135.5,135.5,303.5,,
2,Elaine Ostrander,F,SBD,FR-M3,100,Raw,1958,,MD,93.45,77.5,85,-90,85,40,45,-50,45,110,122.5,-127.5,122.5,252.5,,
3,Jane Shewman,F,SBD,FR-M3,100,Raw,1960,,NY,98.4,-75,75,-80,75,55,-57.5,-57.5,55,-120,-120,120,120,250,,
1,Wendy Shoemaker,F,SBD,FR-M3,100+,Raw,1959,,IN,107.38,110,-120,-120,110,70,75,80,80,130,142.5,-150,142.5,332.5,,
1,Deborah Mazzullo,F,SBD,FR-M3,67.5,Raw,1957,,NC,65.32,105,-110,110,110,62.5,65,-67.5,65,135,142.5,147.5,147.5,322.5,,
2,Alma Kimura,F,SBD,FR-M3,67.5,Raw,1954,,WA,65.85,102.5,110,114,114,47.5,50,-55,50,130,140,142.5,142.5,306.5,,
3,Dianne Wamsley,F,SBD,FR-M3,67.5,Raw,1956,,NY,66.32,102.5,110,115,115,52.5,55,57.5,57.5,120,127.5,132.5,132.5,305,,
4,Joani Kieninger,F,SBD,FR-M3,67.5,Raw,1955,,MT,64.66,60,65,70,70,40,42.5,45,45,80,85,90,90,205,,
5,Ann Peden,F,SBD,FR-M3,67.5,Raw,1960,,GA,65.96,-52.5,52.5,62.5,62.5,32.5,35,37.5,37.5,82.5,92.5,97.5,97.5,197.5,,
1,Laurie MacDonald,F,SBD,FR-M3,82.5,Raw,1962,,WY,80.67,130,140,142.5,142.5,77.5,83,85.5,85.5,147.5,155,160,160,388,,
2,Diane Kuhn,F,SBD,FR-M3,82.5,Raw,1958,,TX,81.43,125,132.5,137.5,137.5,67.5,70,72.5,72.5,152.5,160,167.5,167.5,377.5,,
3,Janice Francis,F,SBD,FR-M3,82.5,Raw,1955,,NY,81.22,110,117.5,-120,117.5,75,-80,82.5,82.5,140,147.5,-155,147.5,347.5,,
4,Roberta Carlson #2,F,SBD,FR-M3,82.5,Raw,1960,,IN,77.22,100,105,-110,105,62.5,65,-67.5,65,120,122.5,-127.5,122.5,292.5,,
5,Connie Geiger,F,SBD,FR-M3,82.5,Raw,1961,,MN,81.63,92.5,100,110,110,50,-57.5,-57.5,50,102.5,125,-137.5,125,285,,
1,Denise Johnson,F,SBD,FR-M4,48,Raw,1947,,WA,47.34,-35,40,42.5,42.5,30,32.5,-35,32.5,65,72.5,75,75,150,,
1,Katherine Evert,F,SBD,FR-M4,75,Raw,1949,,MO,75,75,80,85,85,47.5,50,52.5,52.5,100,107.5,112.5,112.5,250,,
2,Peggy Linn,F,SBD,FR-M4,75,Raw,1948,,MO,73.56,75,80,-85,80,45,47.5,50,50,97.5,-105,112.5,112.5,242.5,,
3,Lenore Gelb,F,SBD,FR-M4,75,Raw,1950,,MD,70.53,-67.5,67.5,-72.5,67.5,42.5,45,47.5,47.5,110,120,-125.5,120,235,,
1,Sonya Stevenson,F,SBD,FR-M4,100,Raw,1951,,MO,92.81,90,95,100,100,65,67.5,70,70,110,117.5,125,125,295,,
1,Linda Gorham,F,SBD,FR-M4,82.5,Raw,1951,,MD,81.18,90,100,-105,100,55,60,62.5,62.5,125,132.5,137.5,137.5,300,,
1,Bebe Burns,F,SBD,FR-M5,52,Raw,1942,,WA,51.21,42.5,50,-55,50,-32.5,32.5,35,35,65,70,75,75,160,,
1,Leanne Le,F,SBD,FR-O,44,Raw,2001,,TX,43.21,115,122.5,-127.5,122.5,62.5,67.5,72.5,72.5,155,-160,-160,155,350,,
1,Jessica Espinal,F,SBD,FR-O,48,Raw,2001,,TX,46.73,132.5,137.5,140,140,92.5,95.5,97,97,155,165,-175,165,402,,
2,Demetria Thaten,F,SBD,FR-O,48,Raw,1997,Adelante Barbell Club,NY,47.13,117.5,125,130,130,85,90,-92.5,90,150,157.5,165,165,385,,
3,Kate Cohen,F,SBD,FR-O,48,Raw,1992,,FL,47.53,120,127.5,132.5,132.5,67.5,72.5,75,75,165,177.5,-180,177.5,385,,
4,Katherina Gindinova,F,SBD,FR-O,48,Raw,1994,,NY,47.56,127.5,-132.5,-132.5,127.5,82.5,87.5,-90,87.5,147.5,152.5,157.5,157.5,372.5,,
5,Tiffany Leung,F,SBD,FR-O,48,Raw,1991,,CA,47.91,137.5,-143.5,-143.5,137.5,65,67.5,-70,67.5,142.5,152.5,155,155,360,,
6,Denise Juarez,F,SBD,FR-O,48,Raw,1996,,CA,46.9,-115,115,122.5,122.5,82.5,87.5,-91.5,87.5,132.5,140,145,145,355,,
7,Ava Allen,F,SBD,FR-O,48,Raw,2003,NORi Powerlifting,NY,46.95,115,122.5,-125,122.5,60,62.5,65,65,147.5,157.5,-160,157.5,345,,
8,Melissa Shirley,F,SBD,FR-O,48,Raw,2002,,TX,47.22,117.5,-125,125,125,67.5,70,72.5,72.5,140,145,-152.5,145,342.5,,
9,Tram Vo,F,SBD,FR-O,48,Raw,1998,,MI,46.29,115,-122.5,127.5,127.5,52.5,57.5,62.5,62.5,135,145,150,150,340,,
10,Janie Baythavong,F,SBD,FR-O,48,Raw,1988,,CA,47.17,-117.5,120,-127.5,120,62.5,67.5,70,70,130,140,-142.5,140,330,,
11,Mallory Brown,F,SBD,FR-O,48,Raw,1993,,IL,47.8,130,-137.5,137.5,137.5,67.5,-72.5,-72.5,67.5,125,,,125,330,,
12,Kristen Vo,F,SBD,FR-O,48,Raw,2000,,TX,47.41,102.5,110,115,115,57.5,62.5,67.5,67.5,130,137.5,145,145,327.5,,
13,Jen Bebert,F,SBD,FR-O,48,Raw,1996,,NJ,47.09,110,120,-127.5,120,52.5,55,57.5,57.5,135,142.5,145,145,322.5,,
14,Noelle Wojnar,F,SBD,FR-O,48,Raw,1989,,NY,46.77,115,120,-125,120,62.5,-65,65,65,127.5,132.5,-137.5,132.5,317.5,,
15,Sarah Hernandez #1,F,SBD,FR-O,48,Raw,1999,Reformance,CA,46.84,90,95,100,100,67.5,72.5,75,75,122.5,132.5,-137.5,132.5,307.5,,
16,Tiffany Nguyen #1,F,SBD,FR-O,48,Raw,1994,,TX,47.17,92.5,-102.5,-102.5,92.5,55,60,-62.5,60,105,115,122.5,122.5,275,,
1,Jamie Fisher #1,F,SBD,FR-O,52,Raw,1990,,NM,50.88,-132.5,132.5,135,135,105,108,110.5,110.5,157.5,162.5,165,165,410.5,,
2,Vanessa Furby,F,SBD,FR-O,52,Raw,1988,,CA,51.82,135,142.5,147.5,147.5,70,75,77.5,77.5,160,167.5,-175,167.5,392.5,,
3,Jazzylyn Pepper,F,SBD,FR-O,52,Raw,1996,,GA,51.84,127.5,135,-140,135,77.5,82.5,85,85,157.5,165,172.5,172.5,392.5,,
4,Jaclyn Alcazar,F,SBD,FR-O,52,Raw,1994,,CA,51.9,135,142.5,-147.5,142.5,67.5,72.5,75,75,160,167.5,172.5,172.5,390,,
5,Lindy Tran,F,SBD,FR-O,52,Raw,1998,,TX,51.51,137.5,140,-145,140,75,80,-82.5,80,152.5,162.5,167.5,167.5,387.5,,
6,Marta Tsikitas,F,SBD,FR-O,52,Raw,1996,,PA,51.38,122.5,127.5,132.5,132.5,90,-95,-95,90,152.5,160,-165,160,382.5,,
7,Gabrielle Polanco,F,SBD,FR-O,52,Raw,1993,,TX,51.79,125,132.5,135,135,77.5,82.5,87.5,87.5,145,155,160,160,382.5,,
8,Heather Faas,F,SBD,FR-O,52,Raw,1983,,SC,51.5,122.5,130,135,135,67.5,72.5,-75,72.5,152.5,162.5,170,170,377.5,,
9,Julie Antonova,F,SBD,FR-O,52,Raw,1989,,CA,51.78,-130,140,145,145,75,80,82.5,82.5,140,150,-155,150,377.5,,
10,Emma Ife,F,SBD,FR-O,52,Raw,1989,,IL,50.39,115,122.5,127.5,127.5,72.5,77.5,80,80,142.5,150,157.5,157.5,365,,
11,Melissa Fulgencio,F,SBD,FR-O,52,Raw,1985,,CA,51.8,117.5,125,-130,125,-70,70,72.5,72.5,155,165,-175,165,362.5,,
12,Yuzhou Zou,F,SBD,FR-O,52,Raw,1991,,CA,51.33,117.5,122.5,-125,122.5,67.5,70,-72.5,70,152.5,157.5,162.5,162.5,355,,
13,Jennifer Tamayo,F,SBD,FR-O,52,Raw,1994,,NJ,50.77,112.5,117.5,120,120,72.5,77.5,80,80,135,142.5,-145,142.5,342.5,,
DQ,Arielle Patra,F,SBD,FR-O,52,Raw,1997,Mustache Fitness & Barbell,NC,51.77,130,-137.5,140,140,-82.5,-85,-85,,145,155,-160,155,,,
1,Christina Peracchi,F,SBD,FR-O,56,Raw,1989,,MA,55.37,145,152.5,157.5,157.5,-95,100,102.5,102.5,180,185,-190,185,445,,
2,Kathy Le,F,SBD,FR-O,56,Raw,1992,,CT,54.65,145,155,160,160,82.5,87.5,90,90,172.5,185,-195,185,435,,
3,Allison Weinberg,F,SBD,FR-O,56,Raw,1994,Adelante Barbell Club,NJ,54.56,150,160,-162.5,160,-90,90,-95,90,170,182.5,-192.5,182.5,432.5,,
4,Brittany Suplicki,F,SBD,FR-O,56,Raw,1992,Mustache Fitness & Barbell,NC,55.6,155,160,-162.5,160,97.5,-100,-100,97.5,165,175,-182.5,175,432.5,,
5,Avilia Lieu,F,SBD,FR-O,56,Raw,1998,,CA,54.45,135,145,152.5,152.5,75,80,85,85,175,185,192.5,192.5,430,,
6,Moriah Boldon,F,SBD,FR-O,56,Raw,1994,,WA,54.94,132.5,140,142.5,142.5,90,95,100,100,175,185,-192.5,185,427.5,,
7,Rebecca Nunns,F,SBD,FR-O,56,Raw,1990,,NC,55.45,142.5,150,-152.5,150,92.5,-97.5,97.5,97.5,165,172.5,-177.5,172.5,420,,
8,Lauren Harriman,F,SBD,FR-O,56,Raw,1994,,GA,55.47,147.5,152.5,-157.5,152.5,90,92.5,,92.5,170,175,-182.5,175,420,,
9,Megan Hurlburt,F,SBD,FR-O,56,Raw,1992,,TX,55.93,140,155,-160,155,92.5,-95,-95,92.5,150,170,-177.5,170,417.5,,
10,Helena Wu,F,SBD,FR-O,56,Raw,1998,,PA,55.74,122.5,130,132.5,132.5,77.5,82.5,-85,82.5,182.5,193,201,201,416,,
11,Lorraine Luna,F,SBD,FR-O,56,Raw,1997,,CA,55.42,140,150,157.5,157.5,77.5,85,-90,85,160,170,-175,170,412.5,,
12,Tara Thomas,F,SBD,FR-O,56,Raw,1990,,FL,55.05,130,137.5,142.5,142.5,70,75,77.5,77.5,167.5,177.5,185,185,405,,
13,Amber Joy Jipson,F,SBD,FR-O,56,Raw,1994,,TX,55.73,145,-150,150,150,75,80,-82.5,80,162.5,170,175,175,405,,
14,Brianna Lanoye,F,SBD,FR-O,56,Raw,1991,Mustache Fitness & Barbell,NY,55.71,145,152.5,157.5,157.5,72.5,77.5,-80,77.5,152.5,160,167.5,167.5,402.5,,
15,Semra Memedovski,F,SBD,FR-O,56,Raw,1998,,IL,55.62,137.5,145,-150,145,80,85,-87.5,85,160,170,-180,170,400,,
16,Elaine Chen,F,SBD,FR-O,56,Raw,1996,Reformance,OH,54.28,125,130,135,135,70,75,80,80,175,182.5,-190,182.5,397.5,,
17,Jodel Patino,F,SBD,FR-O,56,Raw,1997,,TX,55.58,135,142.5,-150,142.5,75,77.5,-80,77.5,160,167.5,172.5,172.5,392.5,,
18,Rose Huang,F,SBD,FR-O,56,Raw,2000,,VA,55.74,135,142.5,-147.5,142.5,75,82.5,85,85,145,152.5,162.5,162.5,390,,
19,Michelle Lin,F,SBD,FR-O,56,Raw,1989,,CA,54.83,130,-137.5,-140,130,92.5,97.5,-102.5,97.5,145,152.5,160,160,387.5,,
20,Mara Rosenfeld,F,SBD,FR-O,56,Raw,1993,Adelante Barbell Club,NJ,53.87,127.5,137.5,-140,137.5,85,90,-92.5,90,142.5,155,157.5,157.5,385,,
21,Charissa Ikel,F,SBD,FR-O,56,Raw,1985,,OK,54.74,125,130,135,135,85,90,-92.5,90,142.5,155,160,160,385,,
22,Quynh-Anh Nguyen,F,SBD,FR-O,56,Raw,1999,Team CRAFTSMANSHIP,TX,55.32,130,140,147.5,147.5,62.5,67.5,70,70,150,160,167.5,167.5,385,,
23,Becca Dison,F,SBD,FR-O,56,Raw,1998,Team CRAFTSMANSHIP,NC,55.61,135,142.5,147.5,147.5,80,85,87.5,87.5,135,142.5,147.5,147.5,382.5,,
24,Jacqueline De Luna,F,SBD,FR-O,56,Raw,1996,,CA,55.5,127.5,135,-142.5,135,72.5,77.5,-82.5,77.5,150,160,165,165,377.5,,
25,Laura Su,F,SBD,FR-O,56,Raw,1997,,WA,54.95,112.5,125,130,130,67.5,72.5,75,75,157.5,170,-175,170,375,,
26,Tirsa St Fort,F,SBD,FR-O,56,Raw,1988,,CA,55.94,125,135,-147.5,135,80,85,-90,85,130,142.5,-150,142.5,362.5,,
1,Celine Crum,F,SBD,FR-O,60,Raw,1998,,SC,59.81,160,170,175,175,97.5,105,107.5,107.5,187.5,202.5,207.5,207.5,490,,
2,Caitlin Berry #1,F,SBD,FR-O,60,Raw,2002,NORi Powerlifting,TX,59.04,142.5,150,155,155,122.5,-130,-130,122.5,180,190,-195,190,467.5,,
3,Charley Leonard,F,SBD,FR-O,60,Raw,1995,,NH,58.8,160,170,-175,170,100,105,-107.5,105,180,190,-195,190,465,,
4,Christiane Hazzard,F,SBD,FR-O,60,Raw,1999,Reformance,OH,59.38,160,-170,170,170,-105,105,110,110,170,-177.5,-177.5,170,450,,
5,Adegbemisola Aregbe,F,SBD,FR-O,60,Raw,1995,,TN,58.68,167.5,-170,-170,167.5,-92.5,95,-97.5,95,185,-192.5,-192.5,185,447.5,,
6,Frida De La Peña,F,SBD,FR-O,60,Raw,1997,,NC,58.87,145,152.5,157.5,157.5,90,95,-97.5,95,177.5,192.5,-200,192.5,445,,
7,Jessica Tesoro,F,SBD,FR-O,60,Raw,1997,,NY,58.68,145,152.5,160,160,87.5,92.5,95,95,170,180,-190,180,435,,
8,Mae Angeli Saguil,F,SBD,FR-O,60,Raw,1996,,TX,60,132.5,140,145,145,95,100,102.5,102.5,-172.5,180,187.5,187.5,435,,
9,Hannah Jenny,F,SBD,FR-O,60,Raw,1995,,NY,59.81,142.5,150,-155,150,80,85,87.5,87.5,172.5,182.5,190,190,427.5,,
10,Linda Chungchootairong,F,SBD,FR-O,60,Raw,1984,,CA,59.33,-142.5,150,157.5,157.5,75,80,-85,80,162.5,172.5,-182.5,172.5,410,,
11,Tiara Howard,F,SBD,FR-O,60,Raw,1998,,NJ,58.35,145,-152.5,152.5,152.5,60,62.5,65,65,182.5,190,-192.5,190,407.5,,
12,Martha Salaya,F,SBD,FR-O,60,Raw,1999,,TX,59.43,-132.5,137.5,145,145,85,92.5,97.5,97.5,145,155,162.5,162.5,405,,
13,Vicky Zhen,F,SBD,FR-O,60,Raw,2001,,PA,59.27,135,142.5,150,150,75,82.5,-85,82.5,147.5,157.5,170,170,402.5,,
14,Brooke Reynolds,F,SBD,FR-O,60,Raw,1991,,MA,59.35,152.5,162.5,-167.5,162.5,60,67.5,70,70,152.5,160,170,170,402.5,,
15,Amy Mason,F,SBD,FR-O,60,Raw,1976,,NC,59.77,127.5,135,140,140,70,75,77.5,77.5,162.5,170,175,175,392.5,,
16,Qing Xia Li,F,SBD,FR-O,60,Raw,1996,,MD,59.92,127.5,137.5,-145,137.5,72.5,77.5,-80,77.5,160,170,177.5,177.5,392.5,,
17,Grace Rummel,F,SBD,FR-O,60,Raw,2000,,CO,58.76,127.5,135,-140,135,67.5,72.5,77.5,77.5,155,165,177.5,177.5,390,,
18,Allie Rainey,F,SBD,FR-O,60,Raw,1998,,PA,58.17,135,-142.5,-142.5,135,77.5,82.5,-85,82.5,160,170,-175,170,387.5,,
19,Danielle Resnick,F,SBD,FR-O,60,Raw,1994,,VA,58.92,122.5,127.5,130,130,77.5,82.5,85,85,155,165,-172.5,165,380,,
20,Keren Joy Pananganan,F,SBD,FR-O,60,Raw,1992,,MD,57.93,122.5,127.5,-137.5,127.5,87.5,92.5,-97.5,92.5,147.5,155,-162.5,155,375,,
21,Christina Voss,F,SBD,FR-O,60,Raw,2000,,NC,59.85,130,137.5,-142.5,137.5,82.5,-90,-90,82.5,140,147.5,-152.5,147.5,367.5,,
22,Gabrielle Dardis,F,SBD,FR-O,60,Raw,1995,,NC,58.3,120,-130,-130,120,82.5,85,87.5,87.5,130,135,-140,135,342.5,,
DQ,Natalie Richards #1,F,SBD,FR-O,60,Raw,1998,,NC,57.69,162.5,170,-177.5,170,97.5,102.5,105,105,-210,-210,-215,,,,
1,Jasmyn Penn,F,SBD,FR-O,75,Raw,1996,Team CRAFTSMANSHIP,TX,73.55,-190,190,205,205,117.5,122.5,127.5,127.5,195,210,-215,210,542.5,,
2,Claire Zai,F,SBD,FR-O,75,Raw,1994,,CA,73.11,175,182.5,187.5,187.5,115,120,122.5,122.5,202.5,212.5,217.5,217.5,527.5,,
3,Autumm Greene,F,SBD,FR-O,75,Raw,1989,,KS,74.45,187.5,195,202.5,202.5,102.5,107.5,110,110,197.5,207.5,-212.5,207.5,520,,
4,Shannon Carr,F,SBD,FR-O,75,Raw,1998,NORi Powerlifting,NY,74.42,165,172.5,180,180,100,105,110,110,185,195,200,200,490,,
5,LaTonya Wise,F,SBD,FR-O,75,Raw,1988,,SC,74.57,165,170,-172.5,170,100,105,-107.5,105,200,207.5,215,215,490,,
6,Lori McCormick,F,SBD,FR-O,75,Raw,1999,,IN,74.32,162.5,172.5,177.5,177.5,107.5,112.5,115,115,180,190,195,195,487.5,,
7,Rachel Everett,F,SBD,FR-O,75,Raw,1989,,CO,74.77,162.5,170,175,175,97.5,102.5,-105,102.5,200,210,-215,210,487.5,,
8,Brandes Dey,F,SBD,FR-O,75,Raw,1995,,NC,73.09,170,177.5,180,180,105,110,112.5,112.5,177.5,190,-195,190,482.5,,
9,Olivia Vilella,F,SBD,FR-O,75,Raw,1996,,GA,74.06,165,-175,182.5,182.5,100,107.5,112.5,112.5,162.5,177.5,187.5,187.5,482.5,,
10,Kelsey Garonzik,F,SBD,FR-O,75,Raw,1997,,PA,72.08,162.5,172.5,177.5,177.5,105,110,112.5,112.5,165,177.5,182.5,182.5,472.5,,
11,Elizabeth Turner #1,F,SBD,FR-O,75,Raw,1996,,GA,74.09,165,175,-177.5,175,102.5,-107.5,-107.5,102.5,172.5,182.5,190,190,467.5,,
12,Desirae Kramer,F,SBD,FR-O,75,Raw,1995,NORi Powerlifting,MN,72.53,162.5,170,175,175,80,85,-90,85,185,195,205,205,465,,
13,Keara Wilson,F,SBD,FR-O,75,Raw,1996,,MI,73.72,170,-182.5,-185,170,105,110,-115,110,175,185,-195,185,465,,
14,Emily Reynolds,F,SBD,FR-O,75,Raw,2002,,WI,74.84,167.5,177.5,-180,177.5,77.5,82.5,87.5,87.5,177.5,187.5,195,195,460,,
15,Anne Smith,F,SBD,FR-O,75,Raw,1995,,WI,73.96,160,-170,-170,160,-87.5,92.5,97.5,97.5,175,185,195,195,452.5,,
16,Amanda Herdman,F,SBD,FR-O,75,Raw,1999,,CT,73.19,145,155,162.5,162.5,85,92.5,95,95,170,182.5,187.5,187.5,445,,
17,Sophia Berhumoglu,F,SBD,FR-O,75,Raw,1991,,NY,74.78,-152.5,152.5,-162.5,152.5,87.5,92.5,95,95,192.5,195,197.5,197.5,445,,
18,Jessica Biemiller,F,SBD,FR-O,75,Raw,1992,,MD,73.74,145,152.5,-157.5,152.5,102.5,105,-107.5,105,167.5,177.5,182.5,182.5,440,,
19,Meka Story,F,SBD,FR-O,75,Raw,1997,,CA,73.2,-147.5,147.5,157.5,157.5,85,90,-95,90,172.5,180,190,190,437.5,,
20,Sarah Braman,F,SBD,FR-O,75,Raw,1996,,MA,74.47,152.5,160,-165,160,87.5,92.5,-95,92.5,175,185,-190,185,437.5,,
21,Kayleigh Guthrie,F,SBD,FR-O,75,Raw,1991,Team CRAFTSMANSHIP,TX,72.5,167.5,180,-187.5,180,67.5,75,80,80,160,172.5,-180,172.5,432.5,,
22,Amy Schmidt,F,SBD,FR-O,75,Raw,1987,,VA,72.27,130,137.5,142.5,142.5,100,105,107.5,107.5,180,-190,-190,180,430,,
23,Autumn Osgood,F,SBD,FR-O,75,Raw,1994,Mustache Fitness & Barbell,VT,73.72,-140,145,155,155,80,85,87.5,87.5,165,177.5,187.5,187.5,430,,
24,Cynthia Browning,F,SBD,FR-O,75,Raw,1970,,IN,72.72,120,-130,130,130,97.5,105,-107.5,105,172.5,185,190,190,425,,
25,Amanda Berggren,F,SBD,FR-O,75,Raw,1988,,IL,73.92,145,150,155,155,87.5,92.5,95,95,165,175,-185,175,425,,
26,Halah Little,F,SBD,FR-O,75,Raw,1999,,NC,73.37,145,-155,-162.5,145,80,85,-87.5,85,165,180,190,190,420,,
27,Sydney Cunfer,F,SBD,FR-O,75,Raw,1997,,CO,74.07,145,152.5,155,155,82.5,87.5,-90,87.5,175,-182.5,-182.5,175,417.5,,
28,Whitney Weidenborner,F,SBD,FR-O,75,Raw,1998,,WY,72.07,-147.5,147.5,-160,147.5,87.5,92.5,95,95,155,167.5,170,170,412.5,,
29,Holli Mann,F,SBD,FR-O,75,Raw,1985,,NC,74.71,142.5,147.5,-150,147.5,87.5,92.5,-95,92.5,172.5,-177.5,-177.5,172.5,412.5,,
30,Ekaterina Gorbacheva,F,SBD,FR-O,75,Raw,1992,,NC,71.73,-150,155,-162.5,155,82.5,-87.5,87.5,87.5,160,-172.5,-172.5,160,402.5,,
31,Xochitl Montes,F,SBD,FR-O,75,Raw,1996,,TX,74.36,140,-147.5,-147.5,140,82.5,87.5,-92.5,87.5,165,175,-185,175,402.5,,
1,Daniella Melo,F,SBD,FR-O,90,Raw,1998,NORi Powerlifting,FL,87.96,185,197.5,207.5,207.5,125,132.5,138,138,202.5,217.5,225,225,570.5,,
2,Karley Richard,F,SBD,FR-O,90,Raw,1991,,PA,85.7,192.5,202.5,210,210,97.5,102.5,-105,102.5,232.5,-242.5,242.5,242.5,555,,
3,Marina Shelton,F,SBD,FR-O,90,Raw,1994,,CA,88.29,190,200,210,210,105,112.5,117.5,117.5,212.5,225,-235,225,552.5,,
4,Kieonna Peake,F,SBD,FR-O,90,Raw,1985,,SC,87.84,185,200,210,210,95,102.5,107.5,107.5,207.5,222.5,230,230,547.5,,
5,Shelby Miles,F,SBD,FR-O,90,Raw,1998,,IN,89.55,175,185,192.5,192.5,110,117.5,-122.5,117.5,200,215,227.5,227.5,537.5,,
6,Alicia Webb,F,SBD,FR-O,90,Raw,1971,,GA,89.08,187.5,200,-207.5,200,117.5,122.5,127.5,127.5,182.5,200,207.5,207.5,535,,
7,Christine Woodrick,F,SBD,FR-O,90,Raw,1992,Mustache Fitness & Barbell,NY,89.03,180,187.5,-192.5,187.5,85,90,92.5,92.5,177.5,190,-195,190,470,,
8,Lillian Myers,F,SBD,FR-O,90,Raw,1997,,MD,89.5,-155,162.5,170,170,87.5,95,100,100,182.5,192.5,-200,192.5,462.5,,
9,Amna Chaudhary,F,SBD,FR-O,90,Raw,2001,,FL,89.09,175,185,-187.5,185,85,87.5,-90,87.5,-177.5,182.5,187.5,187.5,460,,
10,Alyssa Higby,F,SBD,FR-O,90,Raw,1991,,FL,89.58,165,170,-177.5,170,92.5,97.5,100,100,170,177.5,185,185,455,,
11,Ana Cyrene Manalili,F,SBD,FR-O,90,Raw,1998,,CA,89.02,157.5,170,-177.5,170,80,85,-90,85,170,182.5,192.5,192.5,447.5,,
12,Ellysia Martin,F,SBD,FR-O,90,Raw,1995,Mustache Fitness & Barbell,NY,88.68,-160,165,-172.5,165,67.5,-75,-75,67.5,170,182.5,-190,182.5,415,,
1,Patricia Johnson,F,SBD,FR-O,100,Raw,1970,,CA,97.28,190,200,-205,200,110,117.5,120,120,230,240,-250,240,560,,
2,Jacquelynne Duble,F,SBD,FR-O,100,Raw,1982,,PA,97.86,190,202.5,215,215,102.5,110,115,115,190,205,215,215,545,,
3,Nicolette Zeigler,F,SBD,FR-O,100,Raw,1994,,MI,91.42,190,200,205,205,105,115,-122.5,115,197.5,210,220,220,540,,
4,Makenna Henderson,F,SBD,FR-O,100,Raw,2000,,TX,95.34,215,-225,225,225,115,-122.5,122.5,122.5,167.5,-177.5,-177.5,167.5,515,,
5,Maria Canela Basilio,F,SBD,FR-O,100,Raw,1993,Team CRAFTSMANSHIP,NY,96.59,190,200,205,205,100,105,107.5,107.5,187.5,-205,-205,187.5,500,,
6,Michelle Akpala,F,SBD,FR-O,100,Raw,1989,,TX,92.79,162.5,172.5,-182.5,172.5,82.5,87.5,90,90,222.5,232.5,-242,232.5,495,,
7,Hillary Beard,F,SBD,FR-O,100,Raw,1990,Mustache Fitness & Barbell,CA,97.34,-175,180,-190,180,87.5,95,97.5,97.5,200,215,-240,215,492.5,,
8,Cherryl Zekeng,F,SBD,FR-O,100,Raw,1989,,MI,97.24,-155,162.5,172.5,172.5,82.5,87.5,-92.5,87.5,205,217.5,-232.5,217.5,477.5,,
9,Stephanie Steele,F,SBD,FR-O,100,Raw,1985,,AK,92.07,162.5,172.5,-182.5,172.5,92.5,100,-107.5,100,175,185,197.5,197.5,470,,
10,Katelyn Bunch,F,SBD,FR-O,100,Raw,1992,,IN,98.67,175,-185,-185,175,90,-100,-100,90,175,182.5,-190,182.5,447.5,,
DQ,Joyce Accad,F,SBD,FR-O,100,Raw,1996,,NV,99.02,-197.5,-205,-205,,-105,,,,-185,,,,,,
1,Alexis Jones #1,F,SBD,FR-O,100+,Raw,2000,,FL,135.67,240,250,260,260,155,160,162.5,162.5,232.5,237.5,250,250,672.5,,
2,Britney Baker,F,SBD,FR-O,100+,Raw,1996,,OK,131.87,202.5,212.5,222.5,222.5,130,135,-137.5,135,225,240,247.5,247.5,605,,
3,Jasmine Davis #1,F,SBD,FR-O,100+,Raw,1992,,MI,133.36,205,222.5,232.5,232.5,137.5,150,-157.5,150,205,222.5,-232.5,222.5,605,,
4,Sarah Brenner #1,F,SBD,FR-O,100+,Raw,1990,Adelante Barbell Club,NJ,136.2,207.5,217.5,227.5,227.5,95,102.5,-107.5,102.5,217.5,230,240,240,570,,
5,Mackenzie Hoven,F,SBD,FR-O,100+,Raw,1995,Mustache Fitness & Barbell,NY,130.05,215,230,-242.5,230,85,90,95,95,215,225,227.5,227.5,552.5,,
6,Ashleigh Andrews,F,SBD,FR-O,100+,Raw,1994,,TX,114.24,200,207.5,212.5,212.5,127.5,135,-140,135,185,192.5,202.5,202.5,550,,
7,Dani Myers,F,SBD,FR-O,100+,Raw,1991,,OH,110.87,200,207.5,-215,207.5,102.5,107.5,112.5,112.5,197.5,205,212.5,212.5,532.5,,
8,Nadia Moumine,F,SBD,FR-O,100+,Raw,1996,,MA,131.46,192.5,205,-215,205,120,125,130,130,-172.5,185,192.5,192.5,527.5,,
9,Racheal Paveglio,F,SBD,FR-O,100+,Raw,1982,,NC,124.93,180,195,-215,195,97.5,105,-115,105,195,215,222.5,222.5,522.5,,
10,Kasey Kotara,F,SBD,FR-O,100+,Raw,1988,,TX,149.92,200,212.5,-227.5,212.5,102.5,-107.5,-112.5,102.5,182.5,200,-207.5,200,515,,
11,Kari Kraus,F,SBD,FR-O,100+,Raw,1988,,NE,133.74,175,-190,192.5,192.5,110,-122.5,-122.5,110,192.5,-205,205,205,507.5,,
12,Elaine To,F,SBD,FR-O,100+,Raw,1994,,CA,108.71,192.5,200,207.5,207.5,85,92.5,97.5,97.5,185,195,-202.5,195,500,,
13,Lindsay Dziedzic,F,SBD,FR-O,100+,Raw,1999,Mustache Fitness & Barbell,NY,115.59,200,215,-227.5,215,77.5,82.5,87.5,87.5,180,195,-207.5,195,497.5,,
14,Abbie Leschinsky,F,SBD,FR-O,100+,Raw,1997,,NE,109.93,160,167.5,175,175,105,110,115,115,185,195,202.5,202.5,492.5,,
15,Jessica Marcus,F,SBD,FR-O,100+,Raw,1994,,NC,126.27,-182.5,182.5,200,200,102.5,-120,-120,102.5,165,170,175,175,477.5,,
DQ,Brenda Sanchez,F,SBD,FR-O,100+,Raw,1999,,TX,121.34,215,227.5,-232.5,227.5,,,,,,,,,,,
DQ,Amanda Doll,F,SBD,FR-O,100+,Raw,1982,,OH,128.78,-190,-200,-200,,-127.5,135,-145,135,162.5,175,-182.5,175,,,
1,Gabby Martinez,F,SBD,FR-O,67.5,Raw,1997,,TX,66.8,172.5,182.5,190,190,115,120,-122.5,120,207.5,217.5,-220,217.5,527.5,,
2,Samantha Calhoun,F,SBD,FR-O,67.5,Raw,1990,,VA,61.79,165,172.5,177.5,177.5,102.5,107.5,110,110,210,220,-226.5,220,507.5,,
3,Jennifer Thompson #1,F,SBD,FR-O,67.5,Raw,1973,,NC,64.73,135,150,157.5,157.5,137.5,-140,144.5,144.5,165,190,200,200,502,,
4,Jordanne Panton,F,SBD,FR-O,67.5,Raw,1999,Team CRAFTSMANSHIP,WI,64.02,152.5,162.5,172.5,172.5,87.5,92.5,-95,92.5,205,220,227.5,227.5,492.5,,
5,Cassandra Carlton,F,SBD,FR-O,67.5,Raw,1999,,TX,67.12,180,-187.5,-190.5,180,105,112.5,-117.5,112.5,187.5,195,200,200,492.5,,
6,Maria Rojas Chacon,F,SBD,FR-O,67.5,Raw,1997,NORi Powerlifting,PA,66.62,162.5,167.5,175,175,87.5,92.5,95,95,185,197.5,210,210,480,,
7,Haley Hunter #1,F,SBD,FR-O,67.5,Raw,2001,,CA,66.29,177.5,190,-193,190,82.5,87.5,92.5,92.5,180,190,195,195,477.5,,
8,Julia Williams #1,F,SBD,FR-O,67.5,Raw,1990,,CA,66.03,167.5,175,-180,175,90,97.5,102.5,102.5,185,197.5,-202.5,197.5,475,,
9,Laisha Gardner,F,SBD,FR-O,67.5,Raw,1999,Team CRAFTSMANSHIP,TX,66.17,150,165,172.5,172.5,102.5,110,-115,110,177.5,190,-200,190,472.5,,
10,Jennifer Millican,F,SBD,FR-O,67.5,Raw,1983,,TN,65.56,167.5,175,-180,175,95,100,102.5,102.5,175,180,187.5,187.5,465,,
11,Solana Lewis,F,SBD,FR-O,67.5,Raw,1996,,NJ,65.09,170,180,-182.5,180,85,90,-92.5,90,160,175,192.5,192.5,462.5,,
12,Brianna Abbott,F,SBD,FR-O,67.5,Raw,1989,Mustache Fitness & Barbell,VA,65.86,145,152.5,160,160,87.5,95,100,100,165,180,195,195,455,,
13,Karina Stech,F,SBD,FR-O,67.5,Raw,1999,,PA,66.65,142.5,155,-160,155,87.5,95,100,100,177.5,190,-197.5,190,445,,
14,Marisa Ikeda-Iyeki,F,SBD,FR-O,67.5,Raw,1987,,NJ,66.92,157.5,162.5,167.5,167.5,102.5,107.5,-110,107.5,157.5,162.5,167.5,167.5,442.5,,
15,Deidra Power,F,SBD,FR-O,67.5,Raw,1992,,NC,65.16,162.5,-167.5,-167.5,162.5,82.5,-85,-85,82.5,182.5,190,-195,190,435,,
16,Amanda LaCass,F,SBD,FR-O,67.5,Raw,1988,,OH,67.11,147.5,155,160,160,72.5,77.5,82.5,82.5,172.5,182.5,190,190,432.5,,
17,Charlcie Eyth,F,SBD,FR-O,67.5,Raw,1989,,WA,63.36,140,147.5,-150,147.5,97.5,102.5,105,105,165,172.5,177.5,177.5,430,,
18,Bailey Kahn,F,SBD,FR-O,67.5,Raw,1993,,TX,67.15,147.5,-155,-155,147.5,100,-105,105,105,165,175,-182.5,175,427.5,,
19,Daisy Arreola Garcia,F,SBD,FR-O,67.5,Raw,2001,,OR,64.06,-150,-160,160,160,80,87.5,92.5,92.5,172.5,-180,-185,172.5,425,,
20,Briana Quintana,F,SBD,FR-O,67.5,Raw,1993,,FL,65.62,155,167.5,-175,167.5,82.5,87.5,-92.5,87.5,155,167.5,-175,167.5,422.5,,
21,Haley Echelmeier,F,SBD,FR-O,67.5,Raw,1995,,MD,66.51,-145,145,-152.5,145,70,75,-77.5,75,177.5,190,200,200,420,,
22,Gabriela Nunez,F,SBD,FR-O,67.5,Raw,1992,,NY,66.89,147.5,155,160,160,80,85,87.5,87.5,160,167.5,172.5,172.5,420,,
23,Andrea Pilavis,F,SBD,FR-O,67.5,Raw,1996,,MA,66.51,142.5,152.5,-160,152.5,75,80,-82.5,80,165,175,182.5,182.5,415,,
24,Katie An,F,SBD,FR-O,67.5,Raw,1998,,MA,66.77,152.5,157.5,-160,157.5,90,92.5,95,95,152.5,160,-162.5,160,412.5,,
25,Evelyn Mendoza,F,SBD,FR-O,67.5,Raw,1999,,WI,67.34,155,-162.5,-162.5,155,75,80,-82.5,80,165,172.5,177.5,177.5,412.5,,
26,Alexis Birkett,F,SBD,FR-O,67.5,Raw,2000,,WI,66.15,147.5,155,162.5,162.5,87.5,90,92.5,92.5,150,155,-160,155,410,,
27,Rachael Hannan,F,SBD,FR-O,67.5,Raw,1996,,AK,63.96,130,135,137.5,137.5,87.5,90,-97.5,90,160,170,180,180,407.5,,
28,Samantha Hammer,F,SBD,FR-O,67.5,Raw,1998,,FL,64.98,130,135,-140,135,87.5,95,100,100,150,162.5,172.5,172.5,407.5,,
29,Stephanie Ockner,F,SBD,FR-O,67.5,Raw,1992,,CA,65.52,125,132.5,135,135,97.5,-100,-100,97.5,165,175,-182.5,175,407.5,,
30,Sierra Adams,F,SBD,FR-O,67.5,Raw,1995,,CA,67.47,-155,155,165,165,80,85,-87.5,85,147.5,155,-157.5,155,405,,
31,Nicole Karpowicz,F,SBD,FR-O,67.5,Raw,1999,,VA,63.25,127.5,135,140,140,92.5,97.5,-100,97.5,165,-175,-175,165,402.5,,
32,Mary Happ,F,SBD,FR-O,67.5,Raw,1995,,IA,67.2,150,-155,-155,150,75,77.5,-80,77.5,165,-172.5,175,175,402.5,,
DQ,Cherese Fields,F,SBD,FR-O,67.5,Raw,1995,,CO,62.95,-160,-165,-165,,80,82.5,87.5,87.5,165,170,-172.5,170,,,
DQ,Yvy Llambes,F,SBD,FR-O,67.5,Raw,1984,,TX,64.45,-172.5,-175,-175,,-90,-90,,,-180,,,,,,
DQ,Najihatussolehah Mohd-Zamri,F,SBD,FR-O,67.5,Raw,1998,NORi Powerlifting,TX,67.49,140,147.5,155,155,72.5,77.5,-82.5,77.5,182.5,-192.5,-192.5,182.5,,,
1,Kennia Webb,F,SBD,FR-O,82.5,Raw,1993,,VA,81.95,160,165,170,170,110,-115,115,115,220,232.5,235,235,520,,
2,Michelle Robbins,F,SBD,FR-O,82.5,Raw,1997,,WA,78.06,175,-182.5,-182.5,175,115,120,-122.5,120,215,222.5,-227.5,222.5,517.5,,
3,Mikah Ward,F,SBD,FR-O,82.5,Raw,1998,,TX,81.88,185,195,200,200,100,-107.5,-107.5,100,190,197.5,207.5,207.5,507.5,,
4,Tyana Coatney,F,SBD,FR-O,82.5,Raw,1996,,TX,80.57,177.5,185,190,190,105,112.5,-115,112.5,185,192.5,200,200,502.5,,
5,Hope Hunsberger,F,SBD,FR-O,82.5,Raw,1999,,PA,81.9,180,187.5,-195,187.5,97.5,102.5,105,105,180,195,-200,195,487.5,,
6,Angela Kattula,F,SBD,FR-O,82.5,Raw,2001,,MI,81.86,182.5,192.5,197.5,197.5,87.5,92.5,-95,92.5,180,192.5,-195,192.5,482.5,,
7,Jeovanna Padgett,F,SBD,FR-O,82.5,Raw,1993,,OH,82.29,167.5,180,187.5,187.5,97.5,100,107.5,107.5,175,187.5,-195,187.5,482.5,,
8,Abbee Posten,F,SBD,FR-O,82.5,Raw,1993,,MO,76.21,157.5,170,-172.5,170,102.5,-107.5,-107.5,102.5,185,195,200,200,472.5,,
9,Erika Lamb,F,SBD,FR-O,82.5,Raw,1992,,TX,80.74,147.5,155,160,160,102.5,107.5,110,110,175,187.5,200,200,470,,
10,Stephanie Mager,F,SBD,FR-O,82.5,Raw,1997,,CT,80.12,157.5,-170,182.5,182.5,90,97.5,102.5,102.5,157.5,170,182.5,182.5,467.5,,
11,Gina Hensley,F,SBD,FR-O,82.5,Raw,1995,,MI,82.5,160,172.5,-175,172.5,102.5,107.5,-110,107.5,180,187.5,-190,187.5,467.5,,
12,Mary Jane Krebs,F,SBD,FR-O,82.5,Raw,1995,,IN,82.2,155,167.5,-177.5,167.5,100,107.5,-110,107.5,167.5,180,190,190,465,,
13,Kendra Bryant,F,SBD,FR-O,82.5,Raw,1986,,NE,81.15,162.5,167.5,175,175,85,90,-92.5,90,167.5,180,-187.5,180,445,,
1,CJ Shuford,M,SBD,M-Jr,67.5,Single-ply,2002,,LA,66.56,-287.5,-287.5,300,300,175,185,190,190,250,257.5,-275,257.5,747.5,,
1,Eric Cordeiro,M,SBD,M-M1,90,Single-ply,1975,,MA,89.1,-255,255,265,265,167.5,172.5,-175,172.5,225,235,245,245,682.5,,
2,William Kahapea,M,SBD,M-M1,90,Single-ply,1975,,HI,89.39,-235,235,245,245,177.5,-185,-187.5,177.5,230,242.5,-260,242.5,665,,
1,Daniel Elmore,M,SBD,M-M1,100,Single-ply,1975,,GA,97.2,255,-262.5,267.5,267.5,170,175,185,185,220,232.5,-245,232.5,685,,
1,Ryan Donnelly,M,SBD,M-M1,110,Single-ply,1982,,NJ,108.33,255,272.5,285,285,202.5,212.5,-217.5,212.5,250,270,280,280,777.5,,
2,Antony Dyer,M,SBD,M-M1,110,Single-ply,1980,,GA,106.26,185,195,-210,195,-200,-200,200,200,187.5,207.5,-227.5,207.5,602.5,,
1,Barron Henderson,M,SBD,M-M1,125,Single-ply,1976,,FL,122.74,285,-295,-295,285,200,215,222.5,222.5,285,-295,-295,285,792.5,,
2,Travis Koehn,M,SBD,M-M1,125,Single-ply,1973,,WY,119.26,275,302.5,-305,302.5,197.5,-210,210,210,247.5,265,272.5,272.5,785,,
1,Jason Christus,M,SBD,M-M1,140+,Single-ply,1979,,WI,170.65,325,350,365,365,275,282.5,-287.5,282.5,295,322.5,-332.5,322.5,970,,
1,Alan Krockover,M,SBD,M-M2,100,Single-ply,1968,,TX,98.57,-242.5,242.5,-260,242.5,150,160,165,165,240,250,255,255,662.5,,
2,Chris Eastman,M,SBD,M-M2,100,Single-ply,1969,,WI,94.99,165,175,185,185,120,135,145,145,182.5,200,217.5,217.5,547.5,,
1,Matt Muraoka,M,SBD,M-M2,67.5,Single-ply,1965,,WA,65,125,137.5,147.5,147.5,125,-135,,125,150,160,,160,432.5,,
1,Ted Longo,M,SBD,M-M2,82.5,Single-ply,1963,,MS,81.3,-185,195,-205,195,120,125,-132.5,125,200,215,220,220,540,,
2,Scott Gillett,M,SBD,M-M2,82.5,Single-ply,1967,,TX,79.68,120,130,-137.5,130,70,75,-80,75,130,137.5,140,140,345,,
1,Mark Daniel,M,SBD,M-M3,90,Single-ply,1962,,MD,88.94,-202.5,202.5,212.5,212.5,155,160,165,165,207.5,220,-227.5,220,597.5,,
2,Gary Grahn,M,SBD,M-M3,90,Single-ply,1955,,MN,87.94,140,147.5,155,155,107.5,112.5,,112.5,140,150,155,155,422.5,,
1,Larry Robinson,M,SBD,M-M3,100,Single-ply,1953,,SD,98.17,127.5,-137.5,137.5,137.5,102.5,107.5,112.5,112.5,160,-187.5,-187.5,160,410,,
1,Gary Pamplin,M,SBD,M-M3,110,Single-ply,1957,,TX,103.19,227.5,250,277.5,277.5,182.5,195,202.5,202.5,200,227.5,237.5,237.5,717.5,,
1,Ted Stewart,M,SBD,M-M3,125,Single-ply,1956,,WY,123.31,165,172.5,180,180,117.5,122.5,125,125,182.5,200,205,205,510,,
1,Joseph Schofield,M,SBD,M-M4,75,Single-ply,1952,,AZ,72.21,-77.5,80,-97.5,80,50,60,70,70,-120,130,142.5,142.5,292.5,,
1,Michael Nichols #1,M,SBD,M-M4,110,Single-ply,1945,,VA,102.98,-120,120,140,140,-102.5,102.5,107.5,107.5,152.5,162.5,172.5,172.5,420,,
1,Bill Sindelar,M,SBD,M-M4,125,Single-ply,1951,,KS,118.28,210,-220,228,228,155,176,180.5,180.5,191.5,205.5,217,217,625.5,,
1,Christopher Medina Jr,M,SBD,M-O,56,Single-ply,2001,,TX,54.55,182.5,190,197.5,197.5,102.5,107.5,110,110,185,195,202.5,202.5,510,,
1,Andy Bui,M,SBD,M-O,60,Single-ply,1997,,LA,58.22,200,210,-220,210,120,130,140,140,210,225,232.5,232.5,582.5,,
1,Michael Hafenbrack,M,SBD,M-O,75,Single-ply,1984,Sam Houston State University,TX,69.76,265,275,282.5,282.5,160,170,-175,170,235,245,-255,245,697.5,,
2,Gustavo Maldonado,M,SBD,M-O,75,Single-ply,1993,Sam Houston State University,TX,74.75,230,245,252.5,252.5,132.5,140,-147.5,140,235,250,-260,250,642.5,,
1,Eric Cordeiro,M,SBD,M-O,90,Single-ply,1975,,MA,89.1,-255,255,265,265,167.5,172.5,-175,172.5,225,235,245,245,682.5,,
2,William Kahapea,M,SBD,M-O,90,Single-ply,1975,,HI,89.39,-235,235,245,245,177.5,-185,-187.5,177.5,230,242.5,-260,242.5,665,,
DQ,Shane Brady,M,SBD,M-O,90,Single-ply,1987,,AZ,88.9,-325,-335,-345,,-260,260,-280,260,290,-320,,290,,,
1,Kevin Sanon,M,SBD,M-O,100,Single-ply,1990,,MA,98.49,272.5,-287.5,-287.5,272.5,157.5,167.5,175,175,237.5,250,262.5,262.5,710,,
2,Daniel Elmore,M,SBD,M-O,100,Single-ply,1975,,GA,97.2,255,-262.5,267.5,267.5,170,175,185,185,220,232.5,-245,232.5,685,,
3,Joseph Stephen,M,SBD,M-O,100,Single-ply,1984,,MA,95.83,255,-265,-265,255,155,-165,165,165,232.5,245,250,250,670,,
DQ,Abram Guerra,M,SBD,M-O,100,Single-ply,1995,,TX,99.39,325,337.5,-350,337.5,-265,-265,-265,,,,,,,,
1,Brant Kobersky,M,SBD,M-O,110,Single-ply,1998,Sam Houston State University,TX,106.87,285,300,310,310,215,225,232.5,232.5,245,260,-265,260,802.5,,
2,Ryan Donnelly,M,SBD,M-O,110,Single-ply,1982,,NJ,108.33,255,272.5,285,285,202.5,212.5,-217.5,212.5,250,270,280,280,777.5,,
3,Aaron Henderson,M,SBD,M-O,110,Single-ply,1983,,NV,109.31,257.5,270,-277.5,270,200,207.5,-212.5,207.5,270,290,-300,290,767.5,,
1,Jessie Badeaux,M,SBD,M-O,125,Single-ply,1999,,LA,114.67,327.5,352.5,367.5,367.5,-255,260,272.5,272.5,260,280,290,290,930,,
2,Daniel Lau,M,SBD,M-O,125,Single-ply,1994,,MA,122.7,270,285,300,300,167.5,177.5,185,185,245,260,272.5,272.5,757.5,,
DQ,Garrett Bailey,M,SBD,M-O,125,Single-ply,1992,Louisiana Legends,LA,116.43,355,-370,375,375,-255,-260,-260,,325,340,345,345,,,
DD,Chris Peterson,M,SBD,M-O,140,Single-ply,1986,,NE,128.09,300,310,320,320,-230,-230,230,230,295,315,-321,315,,,
1,Carter Wheat,M,SBD,M-O,140+,Single-ply,1998,,TX,171.27,400,410,-420,410,275,287.5,295,295,275,295,320,320,1025,,
2,Jason Christus,M,SBD,M-O,140+,Single-ply,1979,,WI,170.65,325,350,365,365,275,282.5,-287.5,282.5,295,322.5,-332.5,322.5,970,,
3,Kenneth Brashears,M,SBD,M-O,140+,Single-ply,1987,,WI,143.53,325,-345,-345,325,-255,255,-275,255,125,180,250,250,830,,
DQ,Dustin Meaux,M,SBD,M-O,140+,Single-ply,1984,,TX,153.8,325,340,-350,340,-282.5,-282.5,-282.5,,250,-275,-275,250,,,
1,CJ Shuford,M,SBD,M-O,67.5,Single-ply,2002,,LA,66.56,-287.5,-287.5,300,300,175,185,190,190,250,257.5,-275,257.5,747.5,,
DD,James Vang,M,SBD,M-O,67.5,Single-ply,1992,,GA,67.21,252.5,270,282.5,282.5,-200,200,207.5,207.5,-247.5,257.5,-267.5,257.5,,,
2,Josue Leon,M,SBD,M-O,67.5,Single-ply,1993,Louisiana Legends,LA,67,237.5,250,257.5,257.5,142.5,155,160,160,250,265,275,275,692.5,,
3,Trung Nguyen,M,SBD,M-O,67.5,Single-ply,1993,,NC,65.92,185,-190,190,190,120,125,-130,125,180,187.5,-195,187.5,502.5,,
4,William Garcia,M,SBD,M-O,67.5,Single-ply,1990,,CA,67.34,75,,,75,215,-230.5,-230.5,215,75,,,75,365,,
1,Jared Naquin,M,SBD,M-O,82.5,Single-ply,1994,,LA,82,285,305,320,320,240,250,255,255,265,282.5,287.5,287.5,862.5,,
2,Connor Loskie,M,SBD,M-O,82.5,Single-ply,1994,,TX,77.8,-265,-265,265,265,205,210,215,215,245,255,260,260,740,,
3,Alex Smith #1,M,SBD,M-O,82.5,Single-ply,1990,Sam Houston State University,TX,81.88,-255,255,265,265,220,227.5,-232.5,227.5,175,185,192.5,192.5,685,,
4,Jacob de la Paz,M,SBD,M-O,82.5,Single-ply,1996,,TX,81.86,237.5,-255,255,255,130,145,152.5,152.5,245,-260,-270,245,652.5,,
DQ,De'Quinton Gie,M,SBD,M-O,82.5,Single-ply,1997,Louisiana Legends,LA,82.37,-315,-320,-320,,,,,,,,,,,,
G,Yuya Fujii,M,SBD,MR-G,75,Raw,1998,,TX,74.79,245,252.5,-257.5,252.5,160,170,-175,170,280,295,302.5,302.5,725,,
DQ,Kevin Youngblood,M,SBD,MR-G,110,Raw,1957,,CO,104.67,-140,-140,-140,,90,-105,,90,-180,180,-207.5,180,,,
G,John Lampe,M,SBD,MR-G,125,Raw,1967,,GA,110.43,210,220,232.5,232.5,132.5,142.5,152.5,152.5,210,225,240,240,625,,
1,Mynor Marquez,M,SBD,MR-M1,52,Raw,1975,,AZ,51.53,130,140,-142.5,140,87.5,92.5,-95,92.5,160,-175,175,175,407.5,,
1,Newton Cheng,M,SBD,MR-M1,60,Raw,1978,,CA,59.22,175,-185,185,185,105,110,115,115,220,232.5,235,235,535,,
1,Jason Jackson #1,M,SBD,MR-M1,75,Raw,1974,,TX,72.33,205,220,230,230,117.5,122.5,125,125,235,250,-260,250,605,,
2,Anthony Valdivia,M,SBD,MR-M1,75,Raw,1977,,TX,74.2,202.5,215,-225,215,130,137.5,142.5,142.5,222.5,235,-245,235,592.5,,
3,John Fain,M,SBD,MR-M1,75,Raw,1980,,NC,74.29,180,192.5,-200,192.5,110,115,117.5,117.5,222.5,235,240,240,550,,
4,Denis Jobin,M,SBD,MR-M1,75,Raw,1979,Odyssey Barbell Club,NH,73.09,170,177.5,182.5,182.5,132.5,140,-145,140,212.5,220,-225,220,542.5,,
DQ,Gerald Green Jr,M,SBD,MR-M1,75,Raw,1981,,LA,73.61,197.5,200,202.5,202.5,-145,-145,-145,,242.5,250,255,255,,,
1,Matthew Swanson,M,SBD,MR-M1,90,Raw,1979,,WI,89.36,250,262.5,267.5,267.5,152.5,160,165,165,275,295,307.5,307.5,740,,
2,Kristopher Hunt,M,SBD,MR-M1,90,Raw,1982,,IN,89.53,255,270,285,285,142.5,150,155,155,272.5,287.5,300,300,740,,
1,Christopher Greene,M,SBD,MR-M1,100,Raw,1980,,CA,98.97,267.5,282.5,295,295,197.5,205,-210,205,285,295,-297.5,295,795,,
2,Nathaniel Hancock,M,SBD,MR-M1,100,Raw,1978,,UT,98.72,270,-282.5,282.5,282.5,185,195,200,200,240,252.5,262.5,262.5,745,,
3,Charr Gahagan,M,SBD,MR-M1,100,Raw,1976,,TX,99.12,245,265,277.5,277.5,145,152.5,-157.5,152.5,290,305,-317.5,305,735,,
4,Joseph Sottile,M,SBD,MR-M1,100,Raw,1979,,NY,99.13,227.5,242.5,-250,242.5,137.5,-152.5,-152.5,137.5,262.5,272.5,275,275,655,,
1,Nathan Gorham,M,SBD,MR-M1,110,Raw,1977,,MD,108.8,275,295,-317.5,295,165,175,185,185,265,285,295,295,775,,
2,Bob Eucker,M,SBD,MR-M1,110,Raw,1973,,OH,105.84,240,255,,255,162.5,172.5,-182.5,172.5,285,300,-315,300,727.5,,
3,Jesse Scott-Hinkle,M,SBD,MR-M1,110,Raw,1975,,NV,105.28,240,255,260,260,140,150,-152.5,150,252.5,267.5,280,280,690,,
1,Nathan Alexander #1,M,SBD,MR-M1,125,Raw,1982,,WA,123.79,305,-325,-325,305,185,190,-195,190,325,345,-360,345,840,,
2,Antonio Yharbrough,M,SBD,MR-M1,125,Raw,1982,,MI,123.22,295,-302.5,-302.5,295,190,200,207.5,207.5,310,-330,-330,310,812.5,,
3,Marc Lehnert,M,SBD,MR-M1,125,Raw,1980,,MI,119.64,260,275,282.5,282.5,197.5,202.5,-207.5,202.5,275,290,295,295,780,,
4,Todd Hale,M,SBD,MR-M1,125,Raw,1975,,MN,122.07,245,260,-272.5,260,175,185,-195,185,275,300,320,320,765,,
5,Lee Wells,M,SBD,MR-M1,125,Raw,1976,,NC,119.66,237.5,250,260,260,180,190,195,195,280,295,-305,295,750,,
1,Rob Ward #1,M,SBD,MR-M1,140,Raw,1980,,NY,139.49,302.5,-322.5,-322.5,302.5,170,-180,180,180,280,-290,-290,280,762.5,,
2,Jonathan Allsopp,M,SBD,MR-M1,140,Raw,1981,,AZ,139.77,250,265,-267.5,265,142.5,152.5,157.5,157.5,280,282.5,287.5,287.5,710,,
1,James Russell,M,SBD,MR-M1,140+,Raw,1980,,WY,175.3,262.5,282.5,295,295,185,197.5,205,205,250,262.5,272.5,272.5,772.5,,
1,Jacob Lyons,M,SBD,MR-M1,67.5,Raw,1976,,CA,65.39,182.5,192.5,-200,192.5,120,-127.5,127.5,127.5,247.5,257.5,265,265,585,,
2,Michael Yu #1,M,SBD,MR-M1,67.5,Raw,1982,,NY,66.3,142.5,155,162.5,162.5,117.5,125,132.5,132.5,190,200,207.5,207.5,502.5,,1982-05-08
3,Huaiyu Tan,M,SBD,MR-M1,67.5,Raw,1977,,FL,66.42,152.5,162.5,167.5,167.5,95,102.5,105,105,200,210,-217.5,210,482.5,,
1,Benjamin Rowe,M,SBD,MR-M1,82.5,Raw,1976,,TX,81.92,240,250,-262.5,250,140,150,155,155,240,255,-265,255,660,,
2,Jose Gonzalez #5,M,SBD,MR-M1,82.5,Raw,1980,,SC,81.33,207.5,220,230,230,-130,135,142.5,142.5,255,272.5,-277.5,272.5,645,,
3,Charles Ice,M,SBD,MR-M1,82.5,Raw,1979,,MD,81.54,-197.5,207.5,215,215,142.5,150,-152.5,150,230,245,255,255,620,,
4,Anthony Perkins,M,SBD,MR-M1,82.5,Raw,1978,,TX,80.15,197.5,210,217.5,217.5,135,140,147.5,147.5,222.5,235,250,250,615,,
5,Nick Verstoppen,M,SBD,MR-M1,82.5,Raw,1981,,WI,81.41,185,195,207.5,207.5,140,147.5,-150,147.5,240,250,-265,250,605,,
6,Ian Matthews,M,SBD,MR-M1,82.5,Raw,1976,,FL,80.45,230,-242.5,-242.5,230,142.5,-150,-150,142.5,-225,-225,225,225,597.5,,
7,Ernest Draper,M,SBD,MR-M1,82.5,Raw,1976,,MN,80.44,-167.5,175,185,185,140,-150,-150,140,230,240,250,250,575,,
8,Tuan Tran,M,SBD,MR-M1,82.5,Raw,1981,,TX,81.49,200,205,-212.5,205,115,120,-122.5,120,205,-207.5,-207.5,205,530,,
1,Paul Lariviere,M,SBD,MR-M2,75,Raw,1964,,NH,74.15,167.5,175,182.5,182.5,110,115,-120,115,200,215,-220,215,512.5,,
2,Patrick Foster,M,SBD,MR-M2,75,Raw,1967,,PA,74.34,170,177.5,182.5,182.5,110,115,-120,115,165,180,-195,180,477.5,,
DQ,Robert Lane,M,SBD,MR-M2,75,Raw,1971,,WA,73.95,-190,-190,,,137.5,142.5,-145,142.5,-90,-95,-107.5,,,,
1,Spencer Minnix,M,SBD,MR-M2,100,Raw,1970,,WA,98.65,-235,235,242.5,242.5,165,177.5,182.5,182.5,237.5,250,265,265,690,,
2,Michael McQueen,M,SBD,MR-M2,100,Raw,1971,,TX,97.07,217.5,227.5,235,235,165,175,180,180,242.5,255,-270,255,670,,
3,Mike Burns,M,SBD,MR-M2,100,Raw,1966,Northern White Lights,MN,96.65,170,187.5,195,195,160,165,170,170,205,227.5,242.5,242.5,607.5,,
4,Joseph Whitcomb,M,SBD,MR-M2,100,Raw,1969,,CO,97.26,200,-207.5,207.5,207.5,157.5,165,170,170,207.5,220,230,230,607.5,,
5,Joey August,M,SBD,MR-M2,100,Raw,1964,,WA,98.71,-185,185,-187.5,185,147.5,155,-165,155,195,-205,207.5,207.5,547.5,,
1,Wade Craig,M,SBD,MR-M2,110,Raw,1963,,WA,105.2,217.5,237.5,250,250,140,147.5,152.5,152.5,240,260,275,275,677.5,,
2,Matthew Smith #15,M,SBD,MR-M2,110,Raw,1964,Northern White Lights,MN,108.46,220,230,240,240,145,150,155,155,255,270,-277.5,270,665,,
3,James Holmberg,M,SBD,MR-M2,110,Raw,1970,,MN,109.78,-225,225,-232.5,225,-125,125,-132.5,125,215,-242.5,-242.5,215,565,,
1,Edward North,M,SBD,MR-M2,125,Raw,1971,,LA,112.33,220,230,235,235,130,137.5,140,140,255,272.5,-280,272.5,647.5,,
2,Matthew King #1,M,SBD,MR-M2,125,Raw,1968,,FL,112.95,230,237.5,240,240,140,145,-147.5,145,255,260,-267.5,260,645,,
3,Richard Acosta,M,SBD,MR-M2,125,Raw,1967,,NJ,119.11,207.5,217.5,227.5,227.5,132.5,140,142.5,142.5,237.5,252.5,262.5,262.5,632.5,,
DQ,Ronald Iacobucci Jr,M,SBD,MR-M2,125,Raw,1971,,CT,114.07,-227.5,240,250,250,-145,-145,-145,,227.5,-237.5,-237.5,227.5,,,
1,Callistus Schissel,M,SBD,MR-M2,140+,Raw,1969,Northern White Lights,MN,147.53,192.5,220,240,240,225,233,-240,233,220,240,250,250,723,,
1,Rick Brink,M,SBD,MR-M2,67.5,Raw,1969,,CO,66.8,165,175,182.5,182.5,105,110,112.5,112.5,200,210,215,215,510,,
2,Jay Thompson,M,SBD,MR-M2,67.5,Raw,1964,,NC,64.31,-165,-165,165,165,110,115,117.5,117.5,200,215,-222.5,215,497.5,,
1,John D'Alessio,M,SBD,MR-M2,82.5,Raw,1968,,NJ,81.67,197.5,205,-207.5,205,140,145,-147.5,145,205,212.5,220,220,570,,
2,Donovan Thompson,M,SBD,MR-M2,82.5,Raw,1966,,NC,82,175,-195,-197.5,175,142.5,152.5,-155,152.5,195,207.5,215,215,542.5,,
3,Brad Runyon,M,SBD,MR-M2,82.5,Raw,1969,,MI,81.3,160,170,175,175,115,125,-130,125,215,225,235,235,535,,
4,Ammon Shea,M,SBD,MR-M2,82.5,Raw,1970,,NY,81.17,192.5,-200,-200,192.5,110,115,117.5,117.5,195,205,212.5,212.5,522.5,,
5,Albert Mategrano,M,SBD,MR-M2,82.5,Raw,1969,,VA,81.52,170,180,185,185,115,120,-125,120,200,212.5,-222.5,212.5,517.5,,
1,Duane Madere,M,SBD,MR-M3,75,Raw,1962,,TX,73.18,192.5,200,-205,200,117.5,122.5,125,125,210,217.5,222.5,222.5,547.5,,
2,Monte Lofing,M,SBD,MR-M3,75,Raw,1958,,NE,70.84,170,182.5,190,190,95,102.5,105,105,172.5,185,-192.5,185,480,,
3,Chris Burkhart,M,SBD,MR-M3,75,Raw,1956,,CA,73.35,-75,85,92.5,92.5,95,102.5,-105,102.5,90,100,107.5,107.5,302.5,,
1,Matt Muccigrosso,M,SBD,MR-M3,90,Raw,1959,,MO,86.35,185,190,-195,190,147.5,150,-155,150,220,230,-235,230,570,,
2,Darrell Allen,M,SBD,MR-M3,90,Raw,1961,,GA,88.7,172.5,182.5,-187.5,182.5,130,140,-142.5,140,175,185,190,190,512.5,,
1,Michael McKeon,M,SBD,MR-M3,100,Raw,1960,,FL,98.51,187.5,197.5,200,200,135,-137.5,137.5,137.5,-207.5,207.5,212.5,212.5,550,,
2,Tim Maitski,M,SBD,MR-M3,100,Raw,1960,,GA,99.04,-187.5,187.5,192.5,192.5,132.5,-137.5,-137.5,132.5,205,-215,-215,205,530,,
1,Jim Kathios,M,SBD,MR-M3,110,Raw,1961,,NH,101.88,175,185,190,190,140,-150,150,150,205,230,237.5,237.5,577.5,,
DQ,John Wetter,M,SBD,MR-M3,110,Raw,1962,,CA,105.76,-177.5,-177.5,-180,,-155,155,-160,155,160,-167.5,170,170,,,
1,Bradford Olson,M,SBD,MR-M3,67.5,Raw,1962,,OH,66.59,150,165,-170,165,110,-120,120,120,185,-205.5,-205.5,185,470,,
2,Bruce Endler,M,SBD,MR-M3,67.5,Raw,1958,,MN,66.25,110,115,122.5,122.5,75,80,82.5,82.5,150,160,167.5,167.5,372.5,,
1,James Flora,M,SBD,MR-M3,82.5,Raw,1953,,NV,81.07,-157.5,157.5,-167.5,157.5,57.5,-62.5,62.5,62.5,165,195,-205,195,415,,
2,Roger Rineck,M,SBD,MR-M3,82.5,Raw,1960,,MN,80.34,-110,110,135,135,92.5,-97.5,-102.5,92.5,150,170,-180,170,397.5,,
3,Joel Ruzich,M,SBD,MR-M3,82.5,Raw,1957,,WA,81.25,107.5,120,-137.5,120,82.5,92.5,-95,92.5,155,167.5,-180,167.5,380,,
4,Stuart Bookman,M,SBD,MR-M3,82.5,Raw,1956,,FL,80.47,102.5,110,-120,110,77.5,80,-85,80,137.5,142.5,-147.5,142.5,332.5,,
DQ,Harmesh Sharma,M,SBD,MR-M4,60,Raw,1944,,MA,58.59,-65,-75,-75,,52.5,55,-57.5,55,90,105,117.5,117.5,,,
1,David Barnes,M,SBD,MR-M4,75,Raw,1948,,TX,73.41,115,125,132.5,132.5,110,-115,-115,110,185,-192.5,-192.5,185,427.5,,
1,Jo House,M,SBD,MR-M4,90,Raw,1951,,TN,88.25,140,150,-160,150,105,112.5,118.5,118.5,192.5,-212.5,-212.5,192.5,461,,
2,Robert Harper,M,SBD,MR-M4,90,Raw,1944,,WA,88.23,-135,-135,135,135,80,85,-87.5,85,205,215,-221,215,435,,
3,James Bronke,M,SBD,MR-M4,90,Raw,1950,,MI,87.46,-80,-80,80,80,65,70,72.5,72.5,-100,100,105,105,257.5,,
1,Steve Picatti,M,SBD,MR-M4,100,Raw,1944,,ID,98.71,150,160,-165,160,-107.5,107.5,110,110,172.5,-185,-185,172.5,442.5,,
1,Mack Hodges,M,SBD,MR-M4,125,Raw,1947,,AZ,110.25,147.5,157.5,165,165,132.5,-137.5,-137.5,132.5,165,172.5,182.5,182.5,480,,
1,Daniel Rohrbach,M,SBD,MR-M4,67.5,Raw,1947,,SC,65.41,95,100,105,105,67.5,72.5,75,75,110,117.5,125,125,305,,
1,Kenneth Woods,M,SBD,MR-M4,82.5,Raw,1948,,TN,80.68,65,-85,85,85,65,67.5,-70,67.5,-130,130,150,150,302.5,,
2,Bob Simpkins,M,SBD,MR-M4,82.5,Raw,1945,AFA Powerlifting,CA,78.6,60,65,67.5,67.5,60,-62.5,-62.5,60,95,-100,102.5,102.5,230,,
1,Joby Truong,M,SBD,MR-O,52,Raw,2000,,TX,51.47,165,175,182.5,182.5,85,90,-92.5,90,200,210,-220,210,482.5,,
1,Aidan Cusack,M,SBD,MR-O,56,Raw,2001,,TX,53.98,152.5,162.5,167.5,167.5,95,100,102.5,102.5,175,185,192.5,192.5,462.5,,
2,Michael Gordiano,M,SBD,MR-O,56,Raw,1994,,CA,54.82,142.5,150,155,155,120,125,-127.5,125,165,175,182.5,182.5,462.5,,
1,Wascar Carpio,M,SBD,MR-O,60,Raw,1997,,WA,59.73,200,210,215,215,120,130,-135,130,220,230,242.5,242.5,587.5,,
2,Kenneth Imperial,M,SBD,MR-O,60,Raw,1995,Flexx Training Systems,HI,59.53,187.5,197.5,-202.5,197.5,127.5,135,140,140,222.5,230,237.5,237.5,575,,
3,Kurt Navarro,M,SBD,MR-O,60,Raw,1990,,CA,59.4,177.5,185,-187.5,185,115,120,122.5,122.5,245,255,-267.5,255,562.5,,
4,Dat Le,M,SBD,MR-O,60,Raw,1988,,TX,59.39,180,187.5,190,190,130,-135,,130,225,230,232.5,232.5,552.5,,
5,Christopher Padilla,M,SBD,MR-O,60,Raw,1992,,HI,59.37,-190,190,200,200,110,120,127.5,127.5,210,222.5,-232.5,222.5,550,,
6,Newton Cheng,M,SBD,MR-O,60,Raw,1978,,CA,59.22,175,-185,185,185,105,110,115,115,220,232.5,235,235,535,,
7,Michael Mckenney,M,SBD,MR-O,60,Raw,1998,,CA,59.38,190,-200,-200,190,102.5,-110,-110,102.5,225,235,-240,235,527.5,,
8,Joshua Kwon,M,SBD,MR-O,60,Raw,1997,,WA,59.57,172.5,182.5,187.5,187.5,105,112.5,117.5,117.5,205,215,220,220,525,,
DQ,Bruce Yang,M,SBD,MR-O,60,Raw,1995,,MN,57.47,192.5,-207.5,-210,192.5,125,-132.5,-132.5,125,-215,-215,-215,,,,
1,Eric LaPointe,M,SBD,MR-O,75,Raw,1992,Odyssey Barbell Club,NH,74.71,235,247.5,252.5,252.5,160,167.5,-172.5,167.5,302.5,320,322.5,322.5,742.5,,
2,Joseph Borenstein,M,SBD,MR-O,75,Raw,2002,,FL,74.21,232.5,242.5,247.5,247.5,170,175,-180,175,295,310,317.5,317.5,740,,
3,Anas Anbar,M,SBD,MR-O,75,Raw,1992,,TX,74.38,237.5,250,257.5,257.5,177.5,187.5,192.5,192.5,270,282.5,290,290,740,,
4,Richard Cho,M,SBD,MR-O,75,Raw,1996,,TX,74.24,260,-270,270,270,160,167.5,-170,167.5,280,297.5,-315,297.5,735,,
5,Jacob Ramos #1,M,SBD,MR-O,75,Raw,1998,,MN,74.76,260,-270,270,270,177.5,185,-190,185,277.5,-290,-295,277.5,732.5,,
6,Mark Frezzell,M,SBD,MR-O,75,Raw,1991,,VA,73.55,217.5,230,240,240,165,175,182.5,182.5,282.5,300,307.5,307.5,730,,
7,Deon Johnston,M,SBD,MR-O,75,Raw,1998,Flexx Training Systems,TX,74.52,242.5,257.5,267.5,267.5,177.5,185,190,190,272.5,-287.5,-287.5,272.5,730,,
8,Kim Tran #2,M,SBD,MR-O,75,Raw,1998,,NY,74.3,240,252.5,262.5,262.5,172.5,177.5,182.5,182.5,282.5,-292.5,-292.5,282.5,727.5,,
9,Charles Okpoko,M,SBD,MR-O,75,Raw,1995,Team CRAFTSMANSHIP,TX,71.28,250,270,-275,270,162.5,172.5,177.5,177.5,270,-282.5,-282.5,270,717.5,,
10,Dallas Bey,M,SBD,MR-O,75,Raw,1995,Adelante Barbell Club,NJ,73.91,227.5,240,250,250,160,167.5,175,175,267.5,280,290,290,715,,
11,Josiah Vivero,M,SBD,MR-O,75,Raw,1995,,VA,74.48,245,257.5,262.5,262.5,165,175,-182.5,175,257.5,270,-282.5,270,707.5,,
12,Evan Judice,M,SBD,MR-O,75,Raw,1992,,TX,74.78,225,237.5,-247.5,237.5,167.5,175,182.5,182.5,250,262.5,275,275,695,,
13,Nathen Pangaldan,M,SBD,MR-O,75,Raw,2003,,CA,73.01,222.5,237.5,242.5,242.5,160,167.5,172.5,172.5,255,-270,272.5,272.5,687.5,,
14,Michael Coladipietro,M,SBD,MR-O,75,Raw,1995,,IL,74.24,250,262.5,-272.5,262.5,150,-157.5,-157.5,150,275,-292.5,-300,275,687.5,,
15,Marcellus Williams,M,SBD,MR-O,75,Raw,1994,Team CRAFTSMANSHIP,TX,74.48,215,235,245,245,142.5,157.5,-170,157.5,225,270,285,285,687.5,,
16,Justin Ellis,M,SBD,MR-O,75,Raw,1996,,CA,74.35,232.5,245,-252.5,245,160,167.5,175,175,242.5,257.5,265,265,685,,
17,Andrew Ha,M,SBD,MR-O,75,Raw,1997,,CA,73.75,210,-222.5,222.5,222.5,137.5,145,150,150,292.5,310,-322.5,310,682.5,,
18,Kevin Cando,M,SBD,MR-O,75,Raw,1994,,NY,73.77,220,237.5,240,240,155,162.5,167.5,167.5,260,275,-292.5,275,682.5,,
19,Logan Goo,M,SBD,MR-O,75,Raw,2001,,CA,74.64,245,252.5,260,260,137.5,142.5,-147.5,142.5,-270,-280,280,280,682.5,,
20,Brian Marmolejo,M,SBD,MR-O,75,Raw,1999,,TX,74.14,225,-237.5,237.5,237.5,137.5,145,150,150,270,285,-290,285,672.5,,
21,Jeffrey Thompson #1,M,SBD,MR-O,75,Raw,1993,,MN,74.52,230,237.5,245,245,170,177.5,-182.5,177.5,230,240,250,250,672.5,,
22,Joseph Bierly,M,SBD,MR-O,75,Raw,1994,,NJ,73.36,215,232.5,-240,232.5,137.5,142.5,-145,142.5,275,295,-307.5,295,670,,
23,Joseph Rodriguez #1,M,SBD,MR-O,75,Raw,1997,,FL,71.54,222.5,232.5,-235,232.5,162.5,172.5,177.5,177.5,257.5,-262.5,-262.5,257.5,667.5,,
24,Derek LoGrande,M,SBD,MR-O,75,Raw,1993,,MD,73.92,212.5,222.5,230,230,182.5,187.5,190,190,225,237.5,247.5,247.5,667.5,,
25,Noah Forman,M,SBD,MR-O,75,Raw,1997,,CO,72.96,225,232.5,237.5,237.5,147.5,152.5,-160,152.5,257.5,265,270,270,660,,
26,Edward Tadman,M,SBD,MR-O,75,Raw,1994,Flexx Training Systems,CA,74.1,220,-230,-230,220,150,157.5,160,160,-275,-275,275,275,655,,
27,Sean Sullivan #1,M,SBD,MR-O,75,Raw,2000,,PA,74.63,220,242.5,-260,242.5,145,157.5,167.5,167.5,225,245,-265,245,655,,
28,Joshua Heiss,M,SBD,MR-O,75,Raw,1996,,CA,74.31,212.5,225,230,230,145,152.5,-160,152.5,250,270,-280,270,652.5,,
29,Mark Heimann,M,SBD,MR-O,75,Raw,1993,,CA,74.4,215,225,230,230,140,145,150,150,242.5,260,272.5,272.5,652.5,,
30,Reginald Mouton,M,SBD,MR-O,75,Raw,1998,,VA,74.47,217.5,230,-237.5,230,140,147.5,152.5,152.5,237.5,252.5,265,265,647.5,,
31,Nabil Lahlou,M,SBD,MR-O,75,Raw,1999,,VA,68.66,-222.5,222.5,-235,222.5,-122.5,122.5,127.5,127.5,285,295,-302.5,295,645,,
32,Nicklas Haddad,M,SBD,MR-O,75,Raw,1998,,OH,73.15,215,225,230,230,-135,137.5,142.5,142.5,252.5,262.5,272.5,272.5,645,,
33,William Dunn,M,SBD,MR-O,75,Raw,1996,,AZ,72.83,222.5,235,-242.5,235,130,135,137.5,137.5,255,267.5,-282.5,267.5,640,,
34,Sawyer Yandell,M,SBD,MR-O,75,Raw,1994,,TX,73.83,245,-255,-255,245,130,137.5,-142.5,137.5,247.5,257.5,-265,257.5,640,,
35,DanAngelo Cabal,M,SBD,MR-O,75,Raw,1990,,VA,74.04,202.5,215,220,220,142.5,150,-157.5,150,257.5,270,-282.5,270,640,,
36,Lucas Sison,M,SBD,MR-O,75,Raw,1999,,CA,73.93,217.5,225,227.5,227.5,117.5,125,130,130,270,275,280,280,637.5,,
37,Callum Hurst,M,SBD,MR-O,75,Raw,1997,,TX,73.65,210,220,227.5,227.5,147.5,-155,-155,147.5,240,252.5,-257.5,252.5,627.5,,
38,Matt Foddrill,M,SBD,MR-O,75,Raw,2002,,MI,72.43,210,220,-227.5,220,140,147.5,-152.5,147.5,257.5,-270,-270,257.5,625,,
39,Rey Espinoza,M,SBD,MR-O,75,Raw,1996,,TX,73.55,210,220,-227.5,220,152.5,160,162.5,162.5,225,237.5,-247.5,237.5,620,,
40,David Benavides,M,SBD,MR-O,75,Raw,1995,,GA,74.57,205,220,-222.5,220,120,125,-130,125,250,272.5,-292.5,272.5,617.5,,
41,Luis Vega,M,SBD,MR-O,75,Raw,1996,,CA,75,187.5,200,207.5,207.5,145,152.5,-160,152.5,227.5,240,252.5,252.5,612.5,,
42,Mitchell Zaplatosch,M,SBD,MR-O,75,Raw,1994,,NC,72.82,185,-202.5,-202.5,185,140,-142.5,-142.5,140,250,-262.5,-265,250,575,,
1,Brandon Pitre,M,SBD,MR-O,90,Raw,1995,Team CRAFTSMANSHIP,TX,89.16,-295,295,305,305,197.5,207.5,212.5,212.5,320,347.5,365,365,882.5,,
2,Bryce Lewis,M,SBD,MR-O,90,Raw,1987,,CO,89.6,277.5,292.5,300,300,185,195,200,200,327.5,345,-355,345,845,,
3,JamaRR Royster,M,SBD,MR-O,90,Raw,1991,Team CRAFTSMANSHIP,NC,89.02,320,332.5,-335.5,332.5,175,185,190,190,290,310,-320,310,832.5,,
4,Dominique Fuqua,M,SBD,MR-O,90,Raw,1991,,CA,89.07,295,305,-315,305,-210,210,-220,210,310,-320,-320,310,825,,
5,Connor Borkert,M,SBD,MR-O,90,Raw,1997,,VA,89.61,280,290,295,295,195,202.5,207.5,207.5,310,320,-332.5,320,822.5,,
6,Daniel Howell,M,SBD,MR-O,90,Raw,1994,Odyssey Barbell Club,MA,89.53,260,275,285,285,155,162.5,165,165,325,342.5,353,353,803,,
7,Eric Gardner #1,M,SBD,MR-O,90,Raw,1996,,LA,90,290,302.5,-310,302.5,180,-185,-185,180,305,-320,-320,305,787.5,,
8,Cameron Smith #2,M,SBD,MR-O,90,Raw,1989,Flexx Training Systems,IL,89.55,277.5,-282.5,-282.5,277.5,215.5,-220.5,220.5,220.5,265,285,-320,285,783,,
9,Joseph Adams,M,SBD,MR-O,90,Raw,1994,,NV,89.8,255,272.5,280,280,170,-180,,170,305,320,325,325,775,,
10,Vincent Victorero,M,SBD,MR-O,90,Raw,1993,,FL,89.89,265,277.5,287.5,287.5,200,210,-215.5,210,257.5,272.5,-287.5,272.5,770,,
11,Cole Waggoner,M,SBD,MR-O,90,Raw,2000,,IN,89.42,285,300,310,310,172.5,-180,180,180,265,277.5,-287.5,277.5,767.5,,
12,Peter Pires,M,SBD,MR-O,90,Raw,1996,,FL,87.33,250,275,290,290,150,170,180,180,255,277.5,295,295,765,,
13,Jason Bongard,M,SBD,MR-O,90,Raw,1993,,MN,89.23,250,260,270,270,175,180,-185,180,290,300,310,310,760,,
14,Devraj Roy,M,SBD,MR-O,90,Raw,1998,,NJ,88.34,250,265,275,275,162.5,170,175,175,265,282.5,297.5,297.5,747.5,,
15,Jefferson Shue,M,SBD,MR-O,90,Raw,1993,Flexx Training Systems,NV,89.4,240,252.5,-260,252.5,185,190,-195,190,290,300,,300,742.5,,
16,Kristopher Hunt,M,SBD,MR-O,90,Raw,1982,,IN,89.53,255,270,285,285,142.5,150,155,155,272.5,287.5,300,300,740,,
17,Jordan Glenn,M,SBD,MR-O,90,Raw,1993,,TX,89.89,250,-265,-265,250,172.5,180,-182.5,180,272.5,290,305,305,735,,
18,Nathan Barna,M,SBD,MR-O,90,Raw,1996,,IN,87.21,240,252.5,265,265,150,157.5,162.5,162.5,280,292.5,302.5,302.5,730,,
19,Garry Mendez,M,SBD,MR-O,90,Raw,1985,,TX,89.25,250,-265,,250,160,165,170,170,295,310,-317.5,310,730,,
20,Tadriaun Logan,M,SBD,MR-O,90,Raw,1989,,MO,88.93,252.5,-270,-272.5,252.5,170,172.5,,172.5,295,302.5,-315,302.5,727.5,,
21,Michael Bress,M,SBD,MR-O,90,Raw,1999,,MI,88.91,240,252.5,-257.5,252.5,175,182.5,185,185,270,287.5,-302.5,287.5,725,,
22,Sevon Bumper,M,SBD,MR-O,90,Raw,1993,,HI,89,245,262.5,-265,262.5,162.5,170,175,175,270,287.5,-300,287.5,725,,
23,Guillermo Casal,M,SBD,MR-O,90,Raw,1998,,FL,89.41,225,237.5,245,245,180,190,-200,190,267.5,282.5,-290,282.5,717.5,,
24,Michael Weshnak,M,SBD,MR-O,90,Raw,1985,,NJ,89.17,255,-270,-270,255,167.5,175,177.5,177.5,255,270,-285,270,702.5,,
1,Bobb Matthews,M,SBD,MR-O,100,Raw,1997,Team CRAFTSMANSHIP,NY,98.06,310,327.5,340,340,202.5,210,215,215,342.5,-370,375,375,930,,
2,Jonathan Hill #1,M,SBD,MR-O,100,Raw,1994,,FL,94.31,305,325,-330,325,182.5,192.5,197.5,197.5,330,350,-365,350,872.5,,
3,Lorenzo Wright,M,SBD,MR-O,100,Raw,1994,,SC,99.47,305,325,337.5,337.5,185,190,195,195,295,312.5,-325,312.5,845,,
4,Kai Zhao,M,SBD,MR-O,100,Raw,1997,,CA,98.5,262.5,277.5,-285,277.5,160,175,182.5,182.5,345,365,370,370,830,,
5,Kyle Power,M,SBD,MR-O,100,Raw,1993,Odyssey Barbell Club,MA,99.59,-292.5,305,-312.5,305,182.5,192.5,-197.5,192.5,317.5,332.5,-350,332.5,830,,
6,Zachary Yamamoto,M,SBD,MR-O,100,Raw,1996,,CA,100,270,280,285,285,222.5,-232.5,232.5,232.5,292.5,305,312.5,312.5,830,,
7,Marcus Adodo,M,SBD,MR-O,100,Raw,1995,,NC,95.8,300,-312.5,-325,300,180,-192.5,-192.5,180,310,332.5,340,340,820,,
8,Kalil Zaky,M,SBD,MR-O,100,Raw,1991,,MD,97.33,250,265,-267.5,265,170,182.5,190,190,325,345,352.5,352.5,807.5,,
9,Quentin Nunez,M,SBD,MR-O,100,Raw,1999,,CA,98.48,277.5,292.5,305,305,185,192.5,200,200,275,292.5,300,300,805,,
10,Corey Dennis,M,SBD,MR-O,100,Raw,1992,,MI,99.12,-252.5,260,272.5,272.5,165,172.5,175,175,302.5,322.5,340,340,787.5,,
11,Michael Ayles,M,SBD,MR-O,100,Raw,2000,Odyssey Barbell Club,MA,99.96,282.5,295,310,310,162.5,170,175,175,287.5,302.5,-320,302.5,787.5,,
12,Jason Coonan,M,SBD,MR-O,100,Raw,1997,,PA,97.82,-262.5,277.5,-285,277.5,170,177.5,-180,177.5,292.5,310,317.5,317.5,772.5,,
13,Deontay Walker,M,SBD,MR-O,100,Raw,1997,,OH,99.46,265,277.5,282.5,282.5,192.5,-200,202.5,202.5,272.5,280,-297.5,280,765,,
14,Ryan Sanders #1,M,SBD,MR-O,100,Raw,1999,,WI,97.2,267.5,275,280,280,182.5,190,-195,190,280,-290,292.5,292.5,762.5,,
15,Nicholas Tadrick,M,SBD,MR-O,100,Raw,1993,Adelante Barbell Club,NJ,99.64,252.5,262.5,267.5,267.5,172.5,177.5,-182.5,177.5,305,317.5,-322.5,317.5,762.5,,
16,Tyler Wang,M,SBD,MR-O,100,Raw,1998,Adelante Barbell Club,NJ,95.96,255,270,280,280,180,190,-197.5,190,270,285,-292.5,285,755,,
17,Eddy Tamayo Garcia,M,SBD,MR-O,100,Raw,1993,Flexx Training Systems,MO,97.21,260,270,-272.5,270,192.5,197.5,200,200,272.5,285,-292.5,285,755,,
18,James Flanigan,M,SBD,MR-O,100,Raw,1988,,NY,98.71,257.5,265,270,270,172.5,180,182.5,182.5,277.5,287.5,297.5,297.5,750,,
19,Judah Jones,M,SBD,MR-O,100,Raw,1996,,CA,98.98,255,270,277.5,277.5,150,160,165,165,287.5,307.5,-317.5,307.5,750,,
20,Lance London,M,SBD,MR-O,100,Raw,2000,,NJ,99.04,255,272.5,-282.5,272.5,140,150,155,155,302.5,322.5,-332.5,322.5,750,,
21,Ray Thomas,M,SBD,MR-O,100,Raw,1996,,CA,99.44,-260,270,-280,270,165,170,175,175,280,292.5,302.5,302.5,747.5,,
22,Mirwaise Masroor,M,SBD,MR-O,100,Raw,1993,,CA,94.43,240,252.5,-260,252.5,192.5,-200,-200,192.5,275,290,-302.5,290,735,,
23,Averil Royal,M,SBD,MR-O,100,Raw,1995,Team CRAFTSMANSHIP,CA,98.16,270,-290,290,290,175,187.5,-192.5,187.5,237.5,257.5,-275,257.5,735,,
24,Shakeel Holman,M,SBD,MR-O,100,Raw,1992,,IL,98.62,265,277.5,287.5,287.5,177.5,182.5,-185,182.5,265,-285,-285,265,735,,
25,Zack Berezay,M,SBD,MR-O,100,Raw,1999,,WA,99.37,250,270,282.5,282.5,147.5,160,-167.5,160,260,-282.5,282.5,282.5,725,,
26,Neitik Patel,M,SBD,MR-O,100,Raw,1997,,MD,91.77,240,257.5,-270,257.5,125,-127.5,,125,290,310,-317.5,310,692.5,,
DQ,EJ Thomas,M,SBD,MR-O,100,Raw,1986,,TX,92.61,-260,-260,-260,,145,155,162.5,162.5,275,295,-302.5,295,,,
1,Ashton Rouska,M,SBD,MR-O,110,Raw,1997,Team CRAFTSMANSHIP,TX,101.36,325,-355,355,355,197.5,202.5,205,205,327.5,360,365,365,925,,
2,David Woolson,M,SBD,MR-O,110,Raw,1991,,TX,107.77,305,320,325,325,187.5,195,200,200,355,375,-400.5,375,900,,
3,Preston Savoy Jr,M,SBD,MR-O,110,Raw,1997,,LA,105.26,305,322.5,-325,322.5,205,220,225,225,295,312.5,-320,312.5,860,,
4,Camden Wilson,M,SBD,MR-O,110,Raw,1996,Flexx Training Systems,TX,104.85,282.5,297.5,307.5,307.5,197.5,202.5,205,205,-302.5,310,320,320,832.5,,
5,Angelo Agustin,M,SBD,MR-O,110,Raw,1991,Flexx Training Systems,CA,106.61,285,295,297.5,297.5,190,195,-205,195,302.5,317.5,327.5,327.5,820,,
6,Nicolas Philippi,M,SBD,MR-O,110,Raw,1990,,NJ,109.35,277.5,292.5,305,305,165,175,182.5,182.5,302.5,320,332.5,332.5,820,,
7,Tevin Jones,M,SBD,MR-O,110,Raw,1996,,TX,108.53,305,-320,-320,305,-195,-195,195,195,290,305,-325,305,805,,
8,Brian Brickey,M,SBD,MR-O,110,Raw,1991,AFA Powerlifting,CA,105.91,260,265,270,270,177.5,185,-190,185,322.5,345,-352.5,345,800,,
9,Ragan Henderson,M,SBD,MR-O,110,Raw,1995,,TX,108.96,270,-280,-280,270,175,190,-192.5,190,310,320,335,335,795,,
10,Fabion Moffett,M,SBD,MR-O,110,Raw,1991,,TX,108.88,265,280,295,295,172.5,182.5,-187.5,182.5,312.5,-332.5,-352.5,312.5,790,,
11,Will Hemmen,M,SBD,MR-O,110,Raw,1996,,AK,105.35,285,305,-312.5,305,160,-170,-170,160,310,-330,-337.5,310,775,,
12,Kevin Elliott,M,SBD,MR-O,110,Raw,1984,,NY,107.6,285,-300,307.5,307.5,157.5,165,-170,165,280,-300,300,300,772.5,,
13,Brock Wetzlich,M,SBD,MR-O,110,Raw,2000,,HI,109.45,262.5,277.5,-287.5,277.5,167.5,177.5,185,185,290,310,-320,310,772.5,,
14,Kevin Chu #1,M,SBD,MR-O,110,Raw,1998,,NY,109.62,245,262.5,275,275,152.5,157.5,,157.5,315,337.5,-357.5,337.5,770,,
15,Alex Mostacero,M,SBD,MR-O,110,Raw,1995,,ID,107.55,270,-287.5,287.5,287.5,165,175,180,180,275,297.5,-310,297.5,765,,
16,Ryan MacDonald,M,SBD,MR-O,110,Raw,1992,,MI,107.56,250,265,272.5,272.5,195,202.5,205,205,262.5,272.5,282.5,282.5,760,,
17,John Heilman,M,SBD,MR-O,110,Raw,1995,,VA,109.53,287.5,295,300,300,172.5,-180,-180,172.5,287.5,-295,-295,287.5,760,,
18,Jeff Spawton,M,SBD,MR-O,110,Raw,1992,,NY,107.56,-295,295,-300,295,170,-177.5,177.5,177.5,270,285,-297.5,285,757.5,,
19,Billy Mangiamele,M,SBD,MR-O,110,Raw,1996,,NY,108.82,260,270,277.5,277.5,165,170,175,175,305,-320,-325,305,757.5,,
20,David James,M,SBD,MR-O,110,Raw,1992,,IL,107.64,272.5,-285,-285,272.5,182.5,187.5,-190,187.5,275,295,-300,295,755,,
21,Brenton Fleming,M,SBD,MR-O,110,Raw,1989,,SC,109,245,260,,260,170,177.5,-182.5,177.5,285,305,317.5,317.5,755,,
22,Kevin Hayes,M,SBD,MR-O,110,Raw,1996,,NJ,109.72,255,272.5,-285,272.5,190,200,-207.5,200,260,275,280,280,752.5,,
23,Brett Ramsey,M,SBD,MR-O,110,Raw,1997,,TX,104.24,260,-270,280,280,167.5,175,177.5,177.5,292.5,-307.5,-312.5,292.5,750,,
24,Michael Walker #6,M,SBD,MR-O,110,Raw,1998,,MD,109.14,260,275,-285,275,175,182.5,-185,182.5,265,287.5,-307.5,287.5,745,,
25,Airion Britt,M,SBD,MR-O,110,Raw,1990,,MN,106.65,272.5,280,-282.5,280,157.5,162.5,167.5,167.5,285,290,292.5,292.5,740,,
1,Kevin Nguyen #16,M,SBD,MR-O,125,Raw,1999,,TX,124.22,320,342.5,355,355,205,215,222.5,222.5,320,345,372.5,372.5,950,,
2,Jared Martin #1,M,SBD,MR-O,125,Raw,1989,,IN,121.9,345,365,372.5,372.5,190,197.5,202.5,202.5,335,355,372.5,372.5,947.5,,
3,Blake Atwell,M,SBD,MR-O,125,Raw,1993,,MI,116.57,330,337.5,-342.5,337.5,210,-215,-215,210,310,320,-325,320,867.5,,
4,Nathan Alexander #1,M,SBD,MR-O,125,Raw,1982,,WA,123.79,305,-325,-325,305,185,190,-195,190,325,345,-360,345,840,,
5,Matthew Cronin,M,SBD,MR-O,125,Raw,1990,,SC,122.61,295,307.5,317.5,317.5,215,222.5,-228,222.5,280,292.5,-300,292.5,832.5,,
6,Joshua Price,M,SBD,MR-O,125,Raw,1997,,MD,124.47,310,327.5,-330,327.5,180,190,197.5,197.5,290,307.5,-320,307.5,832.5,,
7,Carrington Amadi,M,SBD,MR-O,125,Raw,1997,Team CRAFTSMANSHIP,MN,124.77,270,285,290,290,177.5,187.5,-190,187.5,330,355,-370,355,832.5,,
8,Omar Marquez,M,SBD,MR-O,125,Raw,1997,,TX,124.83,-270,270,290,290,200,210,-215,210,320,325,332.5,332.5,832.5,,
9,Jaime Turcios,M,SBD,MR-O,125,Raw,1990,,NY,118.28,305,322.5,327.5,327.5,205,210,212.5,212.5,260,272.5,-287.5,272.5,812.5,,
10,John S. Jones Jr,M,SBD,MR-O,125,Raw,1986,,LA,119.51,275,290,295,295,190,200,207.5,207.5,290,-305,-305,290,792.5,,
11,Michael Brown #22,M,SBD,MR-O,125,Raw,1995,Flexx Training Systems,CA,122.26,-290,290,307.5,307.5,172.5,-177.5,-177.5,172.5,280,290,300,300,780,,
12,Robert Parisi,M,SBD,MR-O,125,Raw,1994,,NJ,122.72,315,-335,-335,315,165,175,-180,175,260,275,285,285,775,,
13,Brandon McDowell,M,SBD,MR-O,125,Raw,1993,,NC,122.59,267.5,282.5,-295,282.5,185,195,200,200,270,290,-300,290,772.5,,
1,Michael Astrologo,M,SBD,MR-O,140,Raw,1998,,FL,137.31,356,376,-386,376,210.5,220,227.5,227.5,307.5,322.5,-332.5,322.5,926,,
2,Dominic Melvin,M,SBD,MR-O,140,Raw,1993,Flexx Training Systems,NC,138.44,327.5,335,-340,335,237.5,247.5,-253,247.5,312.5,322.5,-345,322.5,905,,
3,Hagen Henderson,M,SBD,MR-O,140,Raw,1999,,KS,137.49,340,-360,-360,340,202.5,210,-215,210,-312.5,312.5,325,325,875,,
4,Jonathan Avril,M,SBD,MR-O,140,Raw,1993,,TX,136.95,300,320,330,330,192.5,207.5,212.5,212.5,307.5,325,-332.5,325,867.5,,
5,Joseph Sisombath,M,SBD,MR-O,140,Raw,1992,,TX,134.54,305,325,-335,325,200,207.5,-212.5,207.5,277.5,297.5,-307.5,297.5,830,,
6,Joshua Opiela,M,SBD,MR-O,140,Raw,1996,,TX,138.58,300,312.5,320,320,185,197.5,207.5,207.5,272.5,287.5,300,300,827.5,,
7,Rob Ward #1,M,SBD,MR-O,140,Raw,1980,,NY,139.49,302.5,-322.5,-322.5,302.5,170,-180,180,180,280,-290,-290,280,762.5,,
DQ,Chris Appiah,M,SBD,MR-O,140,Raw,1989,,NJ,138.37,-320,-320,-330,,-197.5,-197.5,-197.5,,-272.5,-272.5,-272.5,,,,
1,Joshua Longoria,M,SBD,MR-O,140+,Raw,1995,,TX,144.38,295,325,332.5,332.5,195,200,207.5,207.5,305,330,340,340,880,,
2,Lorenzo Barnes,M,SBD,MR-O,140+,Raw,1991,,TX,173.83,320,332.5,340,340,210,220,222.5,222.5,302.5,312.5,317.5,317.5,880,,
3,Caleb England,M,SBD,MR-O,140+,Raw,1992,,TX,163.55,312.5,330,340,340,227.5,232.5,237.5,237.5,270,280,285,285,862.5,,
4,Conner Wilmas,M,SBD,MR-O,140+,Raw,1993,,TX,152.95,280,310,-345,310,210,220,-230,220,280,-310,310,310,840,,
5,Tucker Richey,M,SBD,MR-O,140+,Raw,2000,,KS,141.2,307.5,322.5,337.5,337.5,187.5,200,205,205,267.5,282.5,-295,282.5,825,,
6,Juan Villarreal #1,M,SBD,MR-O,140+,Raw,1989,,TX,148.7,305,320,-335,320,165,175,182.5,182.5,292.5,312.5,-320,312.5,815,,
7,Cory Austin,M,SBD,MR-O,140+,Raw,1994,,NE,152.06,275,-290,290,290,187.5,-197.5,197.5,197.5,290,310,325,325,812.5,,
1,Morgan Aquino Garcia,M,SBD,MR-O,67.5,Raw,1989,,CA,66.92,245,252.5,,252.5,172.5,177.5,182.5,182.5,265,280,-292.5,280,715,,
2,Daniel Clements,M,SBD,MR-O,67.5,Raw,1996,,VA,67.2,-232.5,232.5,245,245,147.5,155,160,160,295,-310,-310.5,295,700,,
3,Charlie Yeng,M,SBD,MR-O,67.5,Raw,1997,,VA,65.58,217.5,230,240,240,140,147.5,152.5,152.5,265,290,-300,290,682.5,,
4,Mikay Ye,M,SBD,MR-O,67.5,Raw,1999,,WA,66.99,225,232.5,-237.5,232.5,140,145,-147.5,145,272.5,285,-295,285,662.5,,
5,Brian Le #1,M,SBD,MR-O,67.5,Raw,1999,,WA,65.31,205,220,-230,220,135,-145,147.5,147.5,267.5,-290,292.5,292.5,660,,
6,Joey Correia,M,SBD,MR-O,67.5,Raw,1994,,NY,65.73,215,227.5,237.5,237.5,125,130,132.5,132.5,250,265,275,275,645,,
7,Mark Beltran,M,SBD,MR-O,67.5,Raw,1998,Flexx Training Systems,NV,66.7,222.5,235,242.5,242.5,135,142.5,150,150,222.5,237.5,250,250,642.5,,
8,Terel Monroe,M,SBD,MR-O,67.5,Raw,1995,,TX,64.96,207.5,217.5,220,220,127.5,130,132.5,132.5,272.5,277.5,282.5,282.5,635,,
9,Leandro Gerard Faraon,M,SBD,MR-O,67.5,Raw,1993,Peak Strength Barbell,NY,66.7,210,-220,220,220,127.5,-132.5,-132.5,127.5,255,270,280,280,627.5,,
10,Jesse Rodriguez,M,SBD,MR-O,67.5,Raw,1993,Team CRAFTSMANSHIP,TX,67.26,195,212.5,222.5,222.5,140,152.5,160,160,220,240,-255,240,622.5,,
11,Kendall Washington,M,SBD,MR-O,67.5,Raw,1995,,FL,67.36,207.5,220,-232.5,220,127.5,142.5,-150,142.5,250,257.5,260,260,622.5,,
12,Geovanni Martiniano,M,SBD,MR-O,67.5,Raw,1999,,CA,67.06,195,205,-210,205,137.5,142.5,145,145,240,255,270,270,620,,
13,Jaylen Boyd,M,SBD,MR-O,67.5,Raw,1996,,MS,66.08,217.5,225,-230,225,122.5,127.5,132.5,132.5,245,252.5,-257.5,252.5,610,,
14,Carlos Mata,M,SBD,MR-O,67.5,Raw,1985,,TX,65.3,217.5,-225,-225,217.5,120,127.5,130,130,260,-272.5,-272.5,260,607.5,,
15,John Gonzaba,M,SBD,MR-O,67.5,Raw,1992,Team CRAFTSMANSHIP,TX,67.17,195,212.5,-217.5,212.5,142.5,147.5,150,150,220,235,245,245,607.5,,
16,Luke McCain,M,SBD,MR-O,67.5,Raw,2005,,VA,62.51,200,212.5,220,220,117.5,125,130,130,222.5,237.5,250,250,600,,
17,Zaw Thiha,M,SBD,MR-O,67.5,Raw,1990,,NC,66.37,205,-217.5,220,220,135,142.5,-147.5,142.5,237.5,-252.5,-252.5,237.5,600,,
18,Rodney Alexander,M,SBD,MR-O,67.5,Raw,1987,,NC,65.91,200,212.5,222.5,222.5,122.5,130,-135,130,230,242.5,-255,242.5,595,,
19,Christion Thomas,M,SBD,MR-O,67.5,Raw,1998,,PA,66.1,192.5,205,-210,205,125,-130,-130,125,250,260,265,265,595,,
20,Sterling Walker,M,SBD,MR-O,67.5,Raw,1991,,IL,66.15,187.5,200,210,210,120,127.5,132.5,132.5,232.5,247.5,-260,247.5,590,,
21,Jeff Cohen #1,M,SBD,MR-O,67.5,Raw,1984,,MD,66.96,205,215,-222.5,215,150,157.5,160,160,205,215,-220,215,590,,
22,Alex LaRochelle,M,SBD,MR-O,67.5,Raw,1994,,NH,65.75,185,195,-200,195,130,132.5,135,135,230,245,257.5,257.5,587.5,,
23,Kurt Labiano,M,SBD,MR-O,67.5,Raw,2000,,CA,67.23,-197.5,197.5,-207.5,197.5,147.5,157.5,160,160,227.5,-242.5,-242.5,227.5,585,,
24,Eugene Carl Malvar,M,SBD,MR-O,67.5,Raw,1993,,HI,67.39,195,210,217.5,217.5,120,127.5,132.5,132.5,210,225,-232.5,225,575,,
25,Joshua Lipp,M,SBD,MR-O,67.5,Raw,1997,,UT,66.48,180,190,195,195,120,122.5,125,125,235,245,250,250,570,,
1,Russel Orhii,M,SBD,MR-O,82.5,Raw,1994,Flexx Training Systems,TX,82.19,297.5,310.5,320.5,320.5,180,185,187.5,187.5,310,325,330,330,838,,
2,Angelo Fortino,M,SBD,MR-O,82.5,Raw,1993,,IL,81.92,275,290,297.5,297.5,157.5,165,-167.5,165,322.5,340,357,357,819.5,,
3,Sean Noriega,M,SBD,MR-O,82.5,Raw,1996,,NY,82.18,270,-285,285,285,204,-211,-211,204,305,322.5,330,330,819,,
4,Jon Gruden,M,SBD,MR-O,82.5,Raw,1994,,NV,81.45,282.5,300,307.5,307.5,187.5,197.5,205,205,287.5,305,-315,305,817.5,,
5,Jerald Scott,M,SBD,MR-O,82.5,Raw,1998,,GA,81.4,-277.5,277.5,287.5,287.5,185,187.5,-190,187.5,292.5,307.5,320,320,795,,
6,Kyle De Leon,M,SBD,MR-O,82.5,Raw,1996,,CA,81.66,-257.5,257.5,277.5,277.5,180,190,195,195,287.5,305,317.5,317.5,790,,
7,Jimmy Villanueva,M,SBD,MR-O,82.5,Raw,1995,,CA,81.29,252.5,265,270,270,175,180,-185,180,305,320,332.5,332.5,782.5,,
8,Alex Luckow,M,SBD,MR-O,82.5,Raw,2001,Team CRAFTSMANSHIP,MN,81.66,250,265,272.5,272.5,170,177.5,182.5,182.5,295,317.5,-330,317.5,772.5,,
9,Tracy Gilliard,M,SBD,MR-O,82.5,Raw,1997,,VA,81.39,250,265,272.5,272.5,170,177.5,-182.5,177.5,-305,305,320,320,770,,
10,Premar Namnama,M,SBD,MR-O,82.5,Raw,1993,,HI,82.07,260,272.5,-280,272.5,182.5,192.5,-200,192.5,282.5,295,-305,295,760,,
11,David Chan,M,SBD,MR-O,82.5,Raw,1996,,CA,82.12,270,285,287.5,287.5,152.5,157.5,-160,157.5,290,-305,305,305,750,,
12,Gage Carreon,M,SBD,MR-O,82.5,Raw,1998,,TX,81.05,-267.5,-267.5,267.5,267.5,152.5,-157.5,157.5,157.5,307.5,322.5,-332.5,322.5,747.5,,
13,Uthdoung Pros,M,SBD,MR-O,82.5,Raw,1987,Odyssey Barbell Club,MA,81.87,-260,260,275,275,182.5,-190,-190,182.5,265,277.5,282.5,282.5,740,,
14,Micheal Seay,M,SBD,MR-O,82.5,Raw,1996,Team CRAFTSMANSHIP,TX,79.75,255,270,277.5,277.5,187.5,-200,-200,187.5,270,-280,,270,735,,
15,Sol Na,M,SBD,MR-O,82.5,Raw,1991,,GA,81.91,250,265,275,275,175,185,-190,185,75,175,275,275,735,,
16,Alex Lau #1,M,SBD,MR-O,82.5,Raw,1992,,NY,81.93,250,265,275,275,160,-167.5,-167.5,160,260,275,295,295,730,,
17,Chance Brady,M,SBD,MR-O,82.5,Raw,1987,,TX,81.92,237.5,-247.5,247.5,247.5,165,172.5,-175,172.5,280,295,302.5,302.5,722.5,,
18,Scott Thurlow,M,SBD,MR-O,82.5,Raw,1993,Odyssey Barbell Club,MA,82.07,242.5,247.5,252.5,252.5,165,172.5,177.5,177.5,282.5,292.5,-302.5,292.5,722.5,,
19,Carson Allen,M,SBD,MR-O,82.5,Raw,1997,,IL,82.17,237.5,252.5,260,260,155,160,162.5,162.5,280,295,-305,295,717.5,,
20,Daniel Morris #1,M,SBD,MR-O,82.5,Raw,1988,,NC,81.57,-240,240,-265,240,185,-192.5,-192.5,185,272.5,290,-317.5,290,715,,
21,Dominic Rowden,M,SBD,MR-O,82.5,Raw,1996,,NC,80.67,252.5,-265,265,265,145,155,-160,155,245,275,290,290,710,,
22,Trevor Woodman,M,SBD,MR-O,82.5,Raw,1999,Flexx Training Systems,MA,82.17,252.5,267.5,275,275,152.5,-160,-160,152.5,255,265,277.5,277.5,705,,
23,James Bryant,M,SBD,MR-O,82.5,Raw,1992,,VA,82.07,255,262.5,-272.5,262.5,150,152.5,157.5,157.5,270,280,-290,280,700,,
24,Jeffrey Chavez,M,SBD,MR-O,82.5,Raw,1993,,TX,81.33,230,245,255,255,-145,145,-150,145,272.5,287.5,295,295,695,,
25,Atomu Wakamatsu,M,SBD,MR-O,82.5,Raw,1997,,CA,81.37,220,232.5,240,240,165,172.5,-175,172.5,260,280,-295,280,692.5,,
26,Ronnie Cormier,M,SBD,MR-O,82.5,Raw,1997,,LA,80.47,250,-260,-260,250,155,-165,-165,155,270,285,-302.5,285,690,,
27,Victor Cabali,M,SBD,MR-O,82.5,Raw,1992,,CA,81.44,220,230,-235,230,155,160,-165,160,-285,292.5,-317.5,292.5,682.5,,
28,Richard Readdy,M,SBD,MR-O,82.5,Raw,1989,,DE,81.77,247.5,257.5,262.5,262.5,185,190,-192.5,190,230,-235,,230,682.5,,
29,Michael Brazzel,M,SBD,MR-O,82.5,Raw,1995,,TX,81.92,220,240,-242.5,240,155,165,-170,165,260,272.5,-282.5,272.5,677.5,,
30,Ariel Merivil,M,SBD,MR-O,82.5,Raw,1983,,NE,82.33,230,242.5,-250,242.5,140,147.5,-150,147.5,277.5,282.5,287.5,287.5,677.5,,
31,Jean-Louis Nguyen,M,SBD,MR-O,82.5,Raw,1992,,MA,79.71,237.5,247.5,-255,247.5,142.5,-152.5,-152.5,142.5,260,277.5,285,285,675,,
32,Alex Hong,M,SBD,MR-O,82.5,Raw,1998,,CA,81.6,240,-252.5,255,255,157.5,167.5,170,170,250,-260,-260,250,675,,
33,Jeremiah Vivero,M,SBD,MR-O,82.5,Raw,1999,,VA,82.2,220,232.5,245,245,142.5,150,-152.5,150,255,270,-285,270,665,,
34,John Tong,M,SBD,MR-O,82.5,Raw,1996,,TX,81.59,-250,250,-262.5,250,142.5,152.5,160,160,250,-260,-260,250,660,,
DQ,Phillip Wilson,M,SBD,MR-O,82.5,Raw,1998,,TX,76.51,-240,-240,-240,,155,-162.5,-162.5,155,-250,250,-272.5,250,,,
DQ,Trevor Bowlus,M,SBD,MR-O,82.5,Raw,1997,,IN,82.32,292.5,-309,-309,292.5,-147.5,-147.5,-147.5,,292.5,310,320,320,,,
