Division,WeightClassKg,Place,Name,Team,BodyweightKg,Best3SquatKg,Best3BenchKg,Best3DeadliftKg,TotalKg,Equipment,Event,Sex,BirthDate
Boys,59.87,1,Logan Houghton,Saratoga West Hardin,58.06,106.59,77.11,120.2,303.91,Single-ply,SBD,M,
Boys,59.87,2,Weston Louviere,Saratoga West Hardin,58.97,90.72,58.97,124.74,274.42,Single-ply,SBD,M,
Boys,59.87,3,Garrett Bartlett,Beaumont Monsignor Kelly,59.65,90.72,54.43,117.93,263.08,Single-ply,SBD,M,
Boys,59.87,4,Fisher Yardley,Colmesneil,59.87,95.25,52.16,102.06,249.48,Single-ply,SBD,M,
Boys,59.87,DQ,Gavin Skufca,Saratoga West Hardin,59.87,,,,,Single-ply,SBD,M,
Boys,67.13,1,Tyler Thibodeaux,Hull-Daisetta,65.32,151.95,88.45,163.29,403.7,Single-ply,SBD,M,
Boys,67.13,2,Hau Pham,Anahuac,63.96,149.69,79.38,161.03,390.09,Single-ply,SBD,M,
Boys,67.13,3,Bryce Blanchard,Saratoga West Hardin,63.5,117.93,79.38,136.08,333.39,Single-ply,SBD,M,
Boys,67.13,4,Xander Woods,Hull-Daisetta,62.14,102.06,68.04,136.08,306.17,Single-ply,SBD,M,
Boys,67.13,5,Drake Brightwell,Anahuac,63.5,83.91,79.38,136.08,299.37,Single-ply,SBD,M,
Boys,67.13,6,Clay Whiterspoon,Anahuac,63.96,115.67,70.31,111.13,297.1,Single-ply,SBD,M,
Boys,67.13,7,Baylor Lanferman,Anahuac,64.86,92.99,74.84,129.27,297.1,Single-ply,SBD,M,
Boys,67.13,DQ,Steven Soudi,Beaumont Monsignor Kelly,67.13,,,,,Single-ply,SBD,M,
Boys,67.13,DQ,James Hare,Colmesneil,65.77,,,,,Single-ply,SBD,M,
Boys,74.84,1,Jermi Shamblin,Colmesneil,74.39,161.03,106.59,172.37,439.98,Single-ply,SBD,M,
Boys,74.84,2,Caden Knox,Beaumont Monsignor Kelly,70.31,158.76,90.72,181.44,430.91,Single-ply,SBD,M,
Boys,74.84,3,Cayden Anders,Hull-Daisetta,71.99,147.42,81.65,163.29,392.36,Single-ply,SBD,M,
Boys,74.84,4,Aiden Gray,Colmesneil,74.84,149.69,99.79,140.61,390.09,Single-ply,SBD,M,
Boys,74.84,5,Braden Lanferman,Anahuac,69.4,120.2,77.11,163.29,360.61,Single-ply,SBD,M,
Boys,74.84,6,Scott Eddins,Colmesneil,74.39,142.88,79.38,138.35,360.61,Single-ply,SBD,M,
Boys,74.84,7,Hayden Smith,Saratoga West Hardin,74.57,104.33,68.04,122.47,294.84,Single-ply,SBD,M,
Boys,82.1,1,Nhan Pham,Anahuac,79.83,195.04,113.4,183.7,492.15,Single-ply,SBD,M,
Boys,82.1,2,Jayden Shamblin,Colmesneil,78.47,179.17,106.59,192.78,478.54,Single-ply,SBD,M,
Boys,82.1,3,Adrian Manning,Anahuac,77.11,158.76,102.06,156.49,417.3,Single-ply,SBD,M,
Boys,82.1,4,Max Mahan,Beaumont Monsignor Kelly,80.29,136.08,99.79,161.03,396.89,Single-ply,SBD,M,
Boys,82.1,5,Blanton Johnston,Colmesneil,77.11,133.81,72.57,154.22,360.61,Single-ply,SBD,M,
Boys,82.1,6,Kopeland Heckman,Colmesneil,78.93,133.81,65.77,133.81,333.39,Single-ply,SBD,M,
Boys,82.1,7,Roberto Alverez,Anahuac,75.75,92.99,52.16,115.67,260.82,Single-ply,SBD,M,
Boys,89.81,1,Mason Totzer,Anahuac,83.91,158.76,104.33,197.31,460.4,Single-ply,SBD,M,
Boys,89.81,2,Mason Wells,Saratoga West Hardin,89.81,136.08,106.59,183.7,426.38,Single-ply,SBD,M,
Boys,89.81,3,Dalton Hendrix,Anahuac,83.91,142.88,102.06,158.76,403.7,Single-ply,SBD,M,
Boys,89.81,4,Presley Mouton,Anahuac,88.9,142.88,102.06,158.76,403.7,Single-ply,SBD,M,
Boys,89.81,5,Ethan Bourdonnay,Beaumont Monsignor Kelly,89.81,138.35,74.84,138.35,351.53,Single-ply,SBD,M,
Boys,89.81,6,Landon Bickerstaff,Saratoga West Hardin,86.64,97.52,68.04,124.74,290.3,Single-ply,SBD,M,
Boys,99.79,1,Ethan Pham,Beaumont Monsignor Kelly,97.07,176.9,127.01,188.24,492.15,Single-ply,SBD,M,
Boys,99.79,2,Mathew Abbot,Beaumont Monsignor Kelly,92.99,170.1,83.91,172.37,426.38,Single-ply,SBD,M,
Boys,99.79,3,Thaddeus Woods,Colmesneil,92.53,117.93,74.84,147.42,340.19,Single-ply,SBD,M,
Boys,99.79,4,Peyton Hall,Beaumont Monsignor Kelly,98.88,127.01,74.84,136.08,337.93,Single-ply,SBD,M,
Boys,99.79,DQ,Payton Smith,Saratoga West Hardin,99.79,,83.91,122.47,,Single-ply,SBD,M,
Boys,99.79,DQ,Landon Seale,Saratoga West Hardin,99.06,,,,,Single-ply,SBD,M,
Boys,109.77,1,Collin Alverson,Hull-Daisetta,100.7,161.03,120.2,172.37,453.59,Single-ply,SBD,M,
Boys,109.77,DQ,Holden Loper,Saratoga West Hardin,108.32,204.12,,172.37,,Single-ply,SBD,M,
Boys,124.74,1,Dylan Fowler,Colmesneil,110.68,206.38,131.54,217.72,555.65,Single-ply,SBD,M,
Boys,124.74,2,Kolyer Marshall,Colmesneil,122.47,206.38,104.33,199.58,510.29,Single-ply,SBD,M,
Boys,124.74,3,Lane Abshier,Hull-Daisetta,116.57,192.78,111.13,179.17,483.08,Single-ply,SBD,M,
Boys,124.74,4,Greyson Vanya,Saratoga West Hardin,122.47,181.44,74.84,138.35,394.63,Single-ply,SBD,M,
Boys,139.71,1,Dylan Scott,Hull-Daisetta,131.09,183.7,136.08,213.19,532.97,Single-ply,SBD,M,
Boys,139.71,2,David Sweet,Colmesneil,132.45,167.83,99.79,201.85,469.47,Single-ply,SBD,M,
Boys,139.71,3,Jason Ford,Hull-Daisetta,130.63,158.76,90.72,151.95,401.43,Single-ply,SBD,M,
Boys,139.71,4,Hogan Ueckert,Colmesneil,127.01,120.2,68.04,151.95,340.19,Single-ply,SBD,M,
