@startuml

Title PoNC component diagram


interface "Tester" as TE

package "PoNC services" {
    [Issuer interface] -up-> [Download site]: Publishes PoNC 
    [Issuer interface] -left-> [Update service]: Updates CAs and revocation list.
}

TE -> [Issuer interface]: Submits Citizen data

interface "Citizen" as CI

CI --> [Download site]: Downloads PoNC
CI -left-> [Verifier app]: Offers PoNC to scan

[Verifier app] --> [Update service]: Refreshes CAs and revocation list.

@enduml
