@startuml

Title Key Management Diagram


interface "Tester" as TE

package "Lab Terminal" {
	[Tester Interface] as II
}

package "Lab Server" {
	[Issuer]
	[Key Gen Cronjob] as KG
}

package "PoNC services" {
	[Key Manager] as KM
	[CA Bundle] as CA
}

[Verifier] as VF
interface "Citizen" as CI

KG -> KG: "1. Generate keys for the day"
KG -up-> Issuer: "2. Register private key"
KG -down-> KM: "3. Submit public key"
KM -down-> KM: "4. Generate signed certificate"
KM -left-> CA: "5. Append certificate to bundle"
VF -down-> CA: "6. Download CA update"
TE -left-> II: "7. Submit citizen data"
II -down-> Issuer: "8. Submit citizen data"
Issuer -> Issuer: "9. Generate PoNC"
Issuer -up-> II: "10. Return PoNC"
II -left-> CI: "11. Provide PoNC"
VF -up-> CI: "12. Scan PoNC"
VF -> VF: "13. Verify PoNC"


@enduml
