${AnsiColor.GREEN}
_____________         ______         ________________       ________                 ______  _____
___  __/___(_)_______ ___  /________ ___  __/___  __/       ___  __ \______ ____________  /_____(_)_______ _______ _
__  /   __  / __  __ \__  //_/_  __ \__  /_  __  /_         __  /_/ /_  __ `/__  ___/__  //_/__  / __  __ \__  __ `/
_  /    _  /  _  / / /_  ,<   / /_/ /_  __/  _  __/         _  ____/ / /_/ / _  /    _  ,<   _  /  _  / / /_  /_/ /
/_/     /_/   /_/ /_/ /_/|_|  \____/ /_/     /_/            /_/      \__,_/  /_/     /_/|_|  /_/   /_/ /_/ _\__, /
                                                                                                           /____/
${application.title} ${application.version}
Powered by Spring Boot ${spring-boot.version}