[
    {
       "@id": "0",
       "answer": "3",
       "text": "Какого типа данных нет в C#?",
       "variant1": "int",
       "variant2": "double",
       "variant3": "str",
       "variant4": "Integer"
    },
    {
       "@id": "1",
       "answer": "2",
       "text": "Какая ошибка будет получена в результате работы кода:\"Console.PrintLine(5 / 0);\"?",
       "variant1": "ArgumentOutOfRangeException",
       "variant2": "DivideByZeroException",
       "variant3": "InvalidCastException",
       "variant4": "NullReferenceException"
    },
    {
       "@id": "2",
       "answer": "1",
       "text": "Наследниками какого класса являются все классы в C#?",
       "variant1": "Object",
       "variant2": "Integer",
       "variant3": "Numeric",
       "variant4": "Variable"
    },
    {
       "@id": "3",
       "answer": "4",
       "text": "Какое действие выполняется в результате работы кода:\"delegate void Message();\"?",
       "variant1": "Отложенный вызов метода Message()",
       "variant2": "Анонимный вызов метода Message()",
       "variant3": "Объявление виртуального метода Message()",
       "variant4": "Объявление делегата Message"
    }
 ]
