<svg width="20" height="20" viewBox="0 0 20 20" fill="none" xmlns="http://www.w3.org/2000/svg">
<path d="M10.8334 4.16667C14.9756 4.16667 18.3334 6.96489 18.3334 10.4167C18.3334 12.1322 17.504 13.6863 16.1612 14.8156C15.9598 14.985 15.8334 15.2302 15.8334 15.4933V17.5H14.1667L13.5052 16.5562C13.4026 16.4097 13.2181 16.346 13.0449 16.3906C11.6041 16.761 10.0628 16.761 8.62196 16.3906C8.44873 16.346 8.26428 16.4097 8.16162 16.5562L7.50008 17.5H5.83341V15.5129C5.83341 15.2389 5.6987 14.9823 5.47311 14.8268C4.57745 14.2093 1.66675 13.0012 1.66675 11.7152V10.4167C1.66675 9.92356 2.03984 9.52381 2.50008 9.52381C3.00562 9.52381 3.41831 9.3274 3.58512 8.80506C4.43802 6.13435 7.35997 4.16667 10.8334 4.16667Z" stroke="#515560" stroke-width="1.5" stroke-linejoin="round"/>
<path d="M12.0833 6.66667C11.5567 6.39585 10.9969 6.25 10.4167 6.25C9.8364 6.25 9.27665 6.39585 8.75 6.66667" stroke="#515560" stroke-width="1.5" stroke-linecap="round" stroke-linejoin="round"/>
<path d="M6.24984 9.16667H6.25732" stroke="#515560" stroke-width="2" stroke-linecap="round" stroke-linejoin="round"/>
<path d="M17.5 7.08333C17.9167 6.66666 18.3333 5.8858 18.3333 4.85877C18.3333 3.55605 17.214 2.49999 15.8333 2.49999C15.5411 2.49999 15.2606 2.54729 15 2.63421" stroke="#515560" stroke-width="1.5" stroke-linecap="round"/>
</svg>
