<svg width="40" height="40" viewBox="0 0 40 40" fill="none" xmlns="http://www.w3.org/2000/svg">
<rect width="40" height="40" rx="20" fill="white"/>
<circle cx="13" cy="15" r="3" stroke="#515560" stroke-width="1.5"/>
<circle cx="16" cy="26" r="4" stroke="#515560" stroke-width="1.5"/>
<circle cx="25" cy="15" r="5" stroke="#515560" stroke-width="1.5"/>
</svg>
