<svg width="32" height="22" viewBox="0 0 32 22" fill="none" xmlns="http://www.w3.org/2000/svg">
<path d="M28 0.333313H4C1.79086 0.333313 0 2.12418 0 4.33332V17.6666C0 19.8758 1.79086 21.6666 4 21.6666H28C30.2091 21.6666 32 19.8758 32 17.6666V4.33331C32 2.12417 30.2091 0.333313 28 0.333313Z" fill="#0E47CB"/>
<path d="M28 0.333313H4C1.79086 0.333313 0 2.12418 0 4.33332V17.6666C0 19.8758 1.79086 21.6666 4 21.6666H28C30.2091 21.6666 32 19.8758 32 17.6666V4.33331C32 2.12417 30.2091 0.333313 28 0.333313Z" stroke="white"/>
<path d="M15.5331 4.44654C15.5622 4.3559 15.53 4.25523 15.4532 4.1991C15.2811 4.07342 15.3692 3.8 15.5823 3.8C15.6775 3.8 15.762 3.73856 15.7912 3.64793C15.8566 3.44516 16.1434 3.44516 16.2088 3.64793C16.238 3.73856 16.3225 3.8 16.4177 3.8C16.6308 3.8 16.7189 4.07342 16.5468 4.1991C16.47 4.25523 16.4378 4.3559 16.4669 4.44654C16.5318 4.64902 16.3012 4.82193 16.13 4.6958C16.0527 4.63883 15.9473 4.63883 15.87 4.6958C15.6988 4.82193 15.4682 4.64902 15.5331 4.44654ZM16.547 18.1056C16.4701 18.1618 16.4378 18.2621 16.467 18.3528C16.5323 18.5554 16.3014 18.7268 16.1296 18.6013C16.0524 18.5449 15.9476 18.5449 15.8704 18.6013C15.6986 18.7268 15.4677 18.5554 15.533 18.3528C15.5622 18.2621 15.5299 18.1618 15.453 18.1056C15.281 17.98 15.369 17.7067 15.582 17.7067C15.6774 17.7067 15.762 17.645 15.7911 17.5542C15.8562 17.351 16.1438 17.351 16.2089 17.5542C16.238 17.645 16.3226 17.7067 16.418 17.7067C16.631 17.7067 16.719 17.98 16.547 18.1056ZM9.09333 11.5475C9.09333 11.5416 9.08666 11.5383 9.08193 11.5417L8.83012 11.7273C8.70098 11.8224 8.52567 11.6963 8.57486 11.5436L8.62739 11.3806C8.65606 11.2916 8.62375 11.1943 8.54753 11.1401C8.37734 11.0192 8.468 10.7511 8.67678 10.7511C8.77069 10.7511 8.85521 10.6901 8.88401 10.6007C8.94935 10.398 9.23677 10.3963 9.30211 10.599C9.33131 10.6897 9.416 10.7511 9.51122 10.7511C9.72567 10.7511 9.8131 11.0278 9.64006 11.1545C9.56358 11.2105 9.53073 11.3098 9.5598 11.4C9.62528 11.6032 9.39193 11.7711 9.22005 11.6445L9.09624 11.5533C9.09441 11.5519 9.09333 11.5498 9.09333 11.5475ZM13.0931 5.12914C13.0164 5.18465 12.9846 5.2847 13.0136 5.37482C13.079 5.57765 12.8489 5.75202 12.6762 5.62709C12.599 5.57122 12.4945 5.5714 12.4176 5.6276C12.2456 5.75321 12.0144 5.58209 12.0797 5.37937C12.1089 5.28868 12.0766 5.18852 11.9997 5.13232C11.8276 5.00665 11.9159 4.73333 12.129 4.73333C12.2242 4.73333 12.3087 4.67189 12.3379 4.58126C12.4032 4.37849 12.6902 4.37871 12.7555 4.58147C12.7847 4.67195 12.8691 4.73333 12.9641 4.73333C13.1762 4.73333 13.2648 5.00483 13.0931 5.12914ZM9.61689 7.27556C9.71278 7.27556 9.79771 7.21369 9.82712 7.12242C9.89274 6.91878 10.1821 6.92257 10.2487 7.12588C10.2778 7.21455 10.3609 7.27556 10.4542 7.27556C10.6626 7.27556 10.75 7.54162 10.5823 7.66523L10.5636 7.679C10.4871 7.73535 10.4552 7.83435 10.4844 7.92477C10.55 8.12853 10.3165 8.2975 10.1438 8.17105C10.0661 8.11419 9.96055 8.11419 9.88288 8.17105C9.71014 8.2975 9.47666 8.12853 9.54231 7.92477C9.57145 7.83435 9.53934 7.73519 9.46286 7.67884C9.28954 7.55113 9.37892 7.27556 9.59421 7.27556H9.61689ZM8.92444 14.2267H9.61689C9.71278 14.2267 9.79771 14.1648 9.82712 14.0735C9.89274 13.8699 10.1821 13.8737 10.2487 14.077C10.2778 14.1657 10.3609 14.2267 10.4542 14.2267C10.6626 14.2267 10.75 14.4927 10.5823 14.6163L10.5643 14.6296C10.4874 14.6862 10.4554 14.786 10.4847 14.8769C10.5505 15.0812 10.3173 15.2516 10.1436 15.1256C10.0659 15.0693 9.96076 15.0693 9.88306 15.1256C9.70939 15.2516 9.47617 15.0812 9.54197 14.8769C9.57128 14.786 9.53926 14.6862 9.46233 14.6296L8.92271 14.2319C8.92044 14.2303 8.92162 14.2267 8.92444 14.2267ZM12.0799 17.4188C12.1089 17.3287 12.077 17.2291 12.0003 17.1736C11.8285 17.0493 11.9172 16.7778 12.1292 16.7778C12.2243 16.7778 12.3087 16.7164 12.3378 16.6259C12.4032 16.4232 12.6902 16.4232 12.7555 16.6259C12.7847 16.7164 12.8691 16.7778 12.9641 16.7778C13.1762 16.7778 13.2648 17.0493 13.0931 17.1736C13.0164 17.2291 12.9844 17.3287 13.0135 17.4188C13.0787 17.6214 12.8481 17.7934 12.6762 17.6679C12.599 17.6116 12.4943 17.6116 12.4171 17.6679C12.2453 17.7934 12.0146 17.6214 12.0799 17.4188ZM23.4519 11.155C23.3758 11.2111 23.3442 11.3102 23.3732 11.4002C23.4384 11.6025 23.2069 11.7723 23.0357 11.6462C22.9589 11.5896 22.8533 11.5899 22.7762 11.646C22.6026 11.7723 22.3651 11.6056 22.4309 11.4013C22.4602 11.3103 22.4278 11.2107 22.3507 11.1542C22.1768 11.0269 22.2663 10.7511 22.4818 10.7511H22.5069C22.6021 10.7511 22.6865 10.6897 22.7157 10.599C22.781 10.3963 23.0683 10.3977 23.1337 10.6004C23.1625 10.69 23.246 10.7511 23.3402 10.7511C23.5495 10.7511 23.6373 11.0184 23.4688 11.1425L23.4519 11.155ZM19.0356 5.22562C19.0356 5.22349 19.0345 5.22148 19.0328 5.22023L18.9077 5.12969C18.7357 5.00521 18.8237 4.73333 19.0361 4.73333C19.1311 4.73333 19.2153 4.67195 19.2445 4.58147C19.3098 4.37871 19.5968 4.37871 19.6622 4.58147C19.6913 4.67195 19.7757 4.73333 19.8708 4.73333C20.0828 4.73333 20.1715 5.00483 19.9997 5.12914C19.923 5.18465 19.8912 5.2847 19.9203 5.37482C19.9856 5.57765 19.7555 5.75202 19.5829 5.62709C19.5057 5.57122 19.4012 5.5714 19.3243 5.6276C19.1522 5.75321 18.92 5.58533 18.9853 5.3826L19.0352 5.22766C19.0354 5.227 19.0356 5.22631 19.0356 5.22562ZM21.5447 7.27197C21.6388 7.27146 21.7223 7.20998 21.7516 7.12057C21.8182 6.91727 22.1073 6.91434 22.1729 7.11798C22.2023 7.20924 22.2885 7.27111 22.3844 7.27111C22.6005 7.27111 22.6963 7.54711 22.5246 7.67823C22.4502 7.73499 22.4195 7.83391 22.4482 7.92292C22.5134 8.12515 22.2827 8.29693 22.1116 8.17089C22.0346 8.11416 21.9295 8.11416 21.8523 8.17064C21.6797 8.29702 21.4457 8.12815 21.5113 7.92452C21.5404 7.83429 21.5088 7.73533 21.4326 7.67885L21.4156 7.66625C21.2469 7.54108 21.3346 7.27312 21.5447 7.27197ZM22.2222 14.2267H22.3916C22.6061 14.2267 22.6968 14.4998 22.5258 14.6292C22.4506 14.6862 22.4198 14.7858 22.4487 14.8756C22.514 15.0782 22.2834 15.2511 22.1114 15.1255C22.0344 15.0692 21.9297 15.0692 21.8525 15.1252C21.6789 15.2511 21.4452 15.0808 21.5109 14.8767C21.5402 14.7859 21.5082 14.686 21.4316 14.6292C21.2592 14.5013 21.3492 14.2267 21.5638 14.2267C21.6595 14.2267 21.7446 14.1652 21.7744 14.0742L21.8056 13.9789C21.8626 13.8051 22.1088 13.8057 22.1649 13.9799L22.2376 14.2055C22.241 14.216 22.2332 14.2267 22.2222 14.2267ZM19.8708 16.7778C20.0828 16.7778 20.1715 17.0493 19.9997 17.1736C19.923 17.2291 19.8911 17.3287 19.9201 17.4188C19.9854 17.6214 19.7547 17.7934 19.5829 17.6679C19.5057 17.6116 19.401 17.6116 19.3238 17.6679C19.1519 17.7934 18.9213 17.6214 18.9865 17.4188C19.0156 17.3287 18.9836 17.2291 18.9069 17.1736C18.7352 17.0493 18.8238 16.7778 19.0359 16.7778C19.1309 16.7778 19.2153 16.7164 19.2445 16.6259C19.3098 16.4232 19.5968 16.4232 19.6622 16.6259C19.6913 16.7164 19.7757 16.7778 19.8708 16.7778Z" fill="#FFCC00"/>
</svg>
