{
  "add": {
    "message": "追加"
  },
  "add_filters_msg": {
    "message": "フィルタを追加しますか?"
  },
  "block_element": {
    "message": "要素をブロック"
  },
  "cancel": {
    "message": "キャンセル"
  },
  "click_element_to_block_it": {
    "message": "ページ上の要素をクリックしてブロックします。"
  },
  "common_feature_anti_adblock_title": {
    "message": "Adblock に対する警告メッセージを隠す"
  },
  "common_feature_malware_title": {
    "message": "マルウェアのブロック"
  },
  "common_feature_privacy_title": {
    "message": "トラッキングの追加ブロック"
  },
  "common_feature_social_title": {
    "message": "ソーシャルメディア アイコン トラッキングのブロック"
  },
  "common_notification_hide": {
    "message": "通知を閉じる"
  },
  "continue": {
    "message": "続行"
  },
  "description": {
    "message": "Adblock Plus は、5億回以上ダウンロードされた、世界で最も人気のある広告ブロッカーのひとつです。"
  },
  "easy_create_filter": {
    "message": "要素をブロック"
  },
  "filter_elemhideemulation_nodomain": {
    "message": "拡張要素非表示フィルタに指定されたドメインは有効ではありません"
  },
  "filter_invalid_csp": {
    "message": "無効なコンテンツセキュリティポリシー"
  },
  "filter_invalid_domain": {
    "message": "不正な（または空の）ドメインが指定されました"
  },
  "filter_invalid_regexp": {
    "message": "無効な正規表現"
  },
  "filter_snippet_nodomain": {
    "message": "CSS プロパティフィルタにドメインが正しく指定されていません"
  },
  "filter_unknown_option": {
    "message": "不明なフィルター オプション"
  },
  "filters_subscription_lastDownload_connectionError": {
    "message": "更新失敗: ダウンロード失敗"
  },
  "firstRun_browser_description": {
    "message": "Adblock Plus、デスクトップ ブラウザー、最も人気のある広告のブロッカーの背後にあるチームから Adblock BrowserーがAndroidと iOS デバイスの登場。"
  },
  "firstRun_browser_store_android": {
    "message": "Google PlayでのAndroidアプリ"
  },
  "firstRun_browser_store_ios": {
    "message": "iTunes App Store で利用可能"
  },
  "firstRun_browser_title": {
    "message": "Adblock Browser アプリ"
  },
  "firstRun_control_description": {
    "message": "既定では、 <a0>の厳格な基準</a0>に準拠するいくつかの非侵入型広告を参照してください可能性があります。我々 は、許容可能な広告としてこれらの広告を識別します。すべての広告をブロックすることを好むか。 <a1>許可される広告</a1> <a2>設定</a2> でオフにします。"
  },
  "firstRun_fair_description": {
    "message": "Adblock Plus およびホワイト リストのウェブサイトにオプションの公正な使用にお勧めします。使用するフィルターによっては、理解し、意図しない結果が (例えばのウェブサイト上でのコンテンツのブロック) を発生することを受け入れます。 <a0>の利用規約</a0> Adblock Plus の公正使用の詳細についてを参照してください。"
  },
  "firstRun_fair_title": {
    "message": "公正な使用"
  },
  "firstRun_footer_copyright": {
    "message": "Copyright © $year$ 全著作権所有 。Adblock Plus® は <a0>eyeo GmbH</a0> の登録商標です。",
    "placeholders": {
      "year": {
        "content": "$1",
        "example": "1984"
      }
    }
  },
  "firstRun_subtitle": {
    "message": "あなたはちょうどあなたのブラウザーの制御を取った。"
  },
  "firstRun_title": {
    "message": "インストールが完了しました！"
  },
  "firstRun_warning_dataCorrupted_intro": {
    "message": "一部のユーザーで、ブラウザが起動するたびにこのページが開く問題が発生しています。この問題は、Adblock Plusをアンインストールして再インストールすることで解決できます："
  },
  "firstRun_warning_dataCorrupted_note": {
    "message": "それでもサポートが必要な場合は、<a0>support@adblockplus.org</a0>にお問い合わせになるか、<a1>ヘルプセンター</a1>をご覧ください。"
  },
  "firstRun_warning_dataCorrupted_step1": {
    "message": "ブラウザの「拡張機能」タブを開きます。"
  },
  "firstRun_warning_dataCorrupted_step2": {
    "message": "Adblock Plusを見つけて削除します。"
  },
  "firstRun_warning_dataCorrupted_step3": {
    "message": "<a>adblockplus.org</a> から Adblock Plus を再インストールしてください。"
  },
  "firstRun_warning_reinitialized": {
    "message": "すべてのフィルタが削除されてしまう問題が発生したようです。バックアップから復元することができず、お使いのフィルタと控えめな広告の設定をリセットする必要がありました。 <a>Adblock Plus のオプション</a>から、お使いのフィルタリストと控えめな広告の設定を確認してください。"
  },
  "invalid_css_selector": {
    "message": "$selector$ は有効な CSS セレクタではありません",
    "placeholders": {
      "selector": {
        "content": "$1"
      }
    }
  },
  "issueReporter_anonymousSubmission_label": {
    "message": "匿名で報告"
  },
  "issueReporter_anonymousSubmission_warning": {
    "message": "匿名で報告の際は報告者を個別に識別できないので優先度が下がります。"
  },
  "issueReporter_commentPage_heading": {
    "message": "コメントを入力"
  },
  "issueReporter_comment_description": {
    "message": "以下のテキストフィールドに、私たちが問題を理解するのを助けるためのコメントを入力できます。この手順は省略できますが、問題が明らかではない場合には推奨されます。また送信前にレポートデータを確認できます。"
  },
  "issueReporter_comment_label": {
    "message": "コメント (省略可):"
  },
  "issueReporter_confirmationMessage": {
    "message": "あなたの不具合報告は保存されました。次のアドレスでアクセスできます:"
  },
  "issueReporter_data_gathering_tab": {
    "message": "<strong>注記：</strong> 追加タブが一時的に開くため、現在開いているページはIssue Reporterによる影響を受けません。"
  },
  "issueReporter_detailsButton_label": {
    "message": "詳細"
  },
  "issueReporter_doneButton_label": {
    "message": "完了"
  },
  "issueReporter_email_description": {
    "message": "メールアドレスを入力すると調査中の不明な点を問い合わせたり、報告者毎に優先度に上げた対応が可能になります。"
  },
  "issueReporter_email_label": {
    "message": "Eメール:"
  },
  "issueReporter_errorMessage": {
    "message": "不具合報告の送信がエラーコード \"?1?\" で失敗しました。インターネットに接続されているか確認し再試行してください。問題が解決しない場合は [link]Adblock Plus フォーラム[/link] で助けを求めてください。"
  },
  "issueReporter_falseNegative_description": {
    "message": "Adblock Plus が有効でも広告が表示される場合はこの選択肢。"
  },
  "issueReporter_falseNegative_label": {
    "message": "Adblock Plus が広告をブロックしていない"
  },
  "issueReporter_falsePositive_description": {
    "message": "あるべきコンテンツがない、表示がおかしい、フィルタが適切に機能してない場合はこの選択肢。 (ヒント: Adblock Plus を一時的に無効にすれば、原因に Adblock Plus が関わっているか確認できます)"
  },
  "issueReporter_falsePositive_label": {
    "message": "Adblock Plus のブロックが過剰"
  },
  "issueReporter_highlighter_description": {
    "message": "ツールを使用して、各広告を強調表示したり、スクリーン ショットでは、機密性の高い情報を非表示にします。広告を強調すると、高速の問題を解決させていただきます。"
  },
  "issueReporter_highlighter_heading": {
    "message": "問題をハイライト表示します。"
  },
  "issueReporter_knownIssueMessage": {
    "message": "恐らく、あなたの報告した不具合は既知の問題です。詳細:"
  },
  "issueReporter_markIssueButton_label": {
    "message": "問題をマークします。"
  },
  "issueReporter_page_title": {
    "message": "不具合報告"
  },
  "issueReporter_privacyPolicy": {
    "message": "プライバシー・ポリシー"
  },
  "issueReporter_processing_screenshot": {
    "message": "処理中"
  },
  "issueReporter_screenshot_hide": {
    "message": "非表示"
  },
  "issueReporter_screenshot_highlight": {
    "message": "ハイライト"
  },
  "issueReporter_selectIssueButton_label": {
    "message": "不具合種別を選択"
  },
  "issueReporter_sendButton_label": {
    "message": "不具合報告を送信"
  },
  "issueReporter_sendPage_heading": {
    "message": "不具合報告を送信"
  },
  "issueReporter_sending": {
    "message": "Adblock Plus が不具合報告を送信する間、しばらくお待ちください"
  },
  "issueReporter_showData_label": {
    "message": "不具合報告データを表示"
  },
  "issueReporter_typeSelector_description": {
    "message": "このウィンドウで不具合の報告に必要なステップをご案内します。まず最初に、遭遇した不具合の種別を選択してください:"
  },
  "issueReporter_typeSelector_heading": {
    "message": "不具合種別を選択"
  },
  "line": {
    "message": "$number$ 行目",
    "placeholders": {
      "number": {
        "content": "$1"
      }
    }
  },
  "loading": {
    "message": "読み込み中..."
  },
  "name": {
    "message": "Adblock Plus"
  },
  "name_devbuild": {
    "message": "Adblock Plus 開発版"
  },
  "name_releasebuild": {
    "description": "Extension name to be shown for release builds. Note: this cannot be longer than 45 characters.",
    "message": "Adblock Plus - free ad blocker"
  },
  "notification_antiadblock_message": {
    "message": "このサイトは Adblock Plus ユーザーを対象としたメッセージを表示することで知られています。Adblock Plus でこれらのメッセージを非表示にしますか？"
  },
  "notification_antiadblock_title": {
    "message": "Adblock Plus ユーザー向けのメッセージを非表示にしますか？"
  },
  "notification_configure": {
    "message": "通知について設定する"
  },
  "notification_open_all": {
    "message": "この通知内のリンクをすべて開く"
  },
  "notification_with_buttons": {
    "message": "この通知のすべてのリンクを開くには [OK] をクリックしてください。"
  },
  "notification_without_buttons": {
    "message": "通知内すべてのリンクを開くにはここをクリックしてください。"
  },
  "options_acceptableAds_ads_description_1": {
    "message": "控えめな広告は、迷惑ではなく、表示するコンテンツの邪魔になりません。<a>控えめな広告の基準について詳細を読む</a>"
  },
  "options_acceptableAds_ads_label": {
    "message": "控えめな広告の許可"
  },
  "options_acceptableAds_description": {
    "message": "控えめな広告とは控え目な（非侵入型の）広告の事を指します。これはウェブサイトのオーナーに収益をもたらすことになるので、広告ブロックとオンライン コンテンツへのサポートとの間の妥協点的な存在となります。"
  },
  "options_acceptableAds_dnt_notification": {
    "message": "<strong>注:</strong> ブラウザ設定で<strong>Do Not Track (DNT)</strong> が無効になっています。この機能を正常に動作させるには、ブラウザ設定で <strong>DNT</strong> を有効にしてください。<a>DNT を有効にする方法を確認する</a>"
  },
  "options_acceptableAds_header": {
    "message": "控えめな広告"
  },
  "options_acceptableAds_privacy_label": {
    "message": "第三者のトラッキングがない広告のみを許可します"
  },
  "options_advanced_description": {
    "message": "Adblock Plus のカスタマイズ、フィルターリストの追加または削除、自分用のフィルターリスト作成またはメンテナンスを行います。"
  },
  "options_anti_cv_header": {
    "message": "回避対策"
  },
  "options_anti_cv_title": {
    "message": "ABP 回避対策フィルタリスト"
  },
  "options_anti_cv_tooltip": {
    "message": "このフィルタリストは、ブロック回避（広告ブロック使用者に広告を強制表示する技術）に対して機能します。これらのフィルタはブロックを回避する広告や関連するトラッキングに対処します。"
  },
  "options_close": {
    "message": "閉じる"
  },
  "options_control_remove_title": {
    "message": "削除"
  },
  "options_customFilter_cancel": {
    "message": "キャンセル"
  },
  "options_customFilters_description": {
    "message": "自分用のカスタムフィルターを作って、Adblock Plus が許可またはブロックするコンテンツを詳細に管理します。"
  },
  "options_customFilters_title": {
    "message": "自分のフィルターリストを作成して編集する"
  },
  "options_customFilters_widget_title": {
    "message": "マイ フィルターリスト"
  },
  "options_customize_blockElement": {
    "message": "右クリックでメニュー項目、[要素のブロック] を表示させます"
  },
  "options_customize_blockElement_tooltip": {
    "message": "ウェブページで気障りな項目を一時的にブロックします（画像またはアニメーション表示のスライドショーなど）。"
  },
  "options_customize_header": {
    "message": "カスタマイズ"
  },
  "options_customize_iconStats": {
    "message": "広告アイコンのブロック数を表示"
  },
  "options_customize_showDevToolsPanel": {
    "message": "開発者ツールの [Adblock Plus] パネルを表示させます"
  },
  "options_customize_showDevToolsPanel_tooltip": {
    "message": "ブラウザーの開発者ツールのパネルでブロック済みまたはホワイトリストに登録された項目を閲覧します。"
  },
  "options_customize_showNotifications": {
    "message": "有用な通知を表示"
  },
  "options_customize_showNotifications_tooltip": {
    "message": "Adblock Plus (重要なパフォーマンス上の問題は常に表示される) からの通知を許可します。"
  },
  "options_dialog_about_copyright": {
    "message": "Copyright © $currentYear$ eyeo GmbH.",
    "placeholders": {
      "currentYear": {
        "content": "$1",
        "example": "2017"
      }
    }
  },
  "options_dialog_about_title": {
    "message": "Adblock Plus について"
  },
  "options_dialog_about_trademark": {
    "message": "全著作権所有。Adblock Plus® は eyeo GmbH の登録商標 です。"
  },
  "options_dialog_about_version": {
    "message": "バージョン番号 $version$",
    "placeholders": {
      "version": {
        "content": "$1",
        "example": "2.6.7"
      }
    }
  },
  "options_dialog_import_subscription_location": {
    "message": "フィルターリストの URL"
  },
  "options_dialog_import_subscription_location_error": {
    "message": "有効な URL を入力してください"
  },
  "options_dialog_import_title": {
    "message": "フィルターリストを追加"
  },
  "options_dialog_language_other_empty": {
    "message": "利用可能な言語がありません。"
  },
  "options_dialog_language_title": {
    "message": "言語の選択"
  },
  "options_dialog_predefined_confirm": {
    "message": "はい、このフィルターリストを使用します"
  },
  "options_dialog_predefined_title": {
    "message": "個のフィルターリストを追加しますか？"
  },
  "options_email": {
    "message": "Eメール:"
  },
  "options_english": {
    "message": "英語"
  },
  "options_filterList_add": {
    "message": "+ 新規フィルターリストを追加"
  },
  "options_filterList_column_name": {
    "message": "フィルターリスト"
  },
  "options_filterList_column_status": {
    "message": "ステータス"
  },
  "options_filterList_column_update": {
    "message": "最終更新日時"
  },
  "options_filterList_description": {
    "message": "Adblock Plus 設定はそれぞれフィルターリストによって機能します。以下はユーザー設定された Adblock Plus 設定に対応するフィルターリストです。当社の既知のコミュニティによって作成・メンテナンスされている追加フィルターを加えることも出来ます。"
  },
  "options_filterList_empty": {
    "message": "Adblock Plus にフィルターリストが全く追加されていません。追加されたフィルターリストはここに表示されます。"
  },
  "options_filterList_hours": {
    "message": "時間前"
  },
  "options_filterList_lastDownload_checksumMismatch": {
    "message": "更新失敗: チェックサム不一致"
  },
  "options_filterList_lastDownload_connectionError": {
    "message": "更新失敗: 接続エラー"
  },
  "options_filterList_lastDownload_inProgress": {
    "message": "更新中"
  },
  "options_filterList_lastDownload_invalidData": {
    "message": "更新失敗: フィルターリスト無効"
  },
  "options_filterList_lastDownload_invalidURL": {
    "message": "更新失敗: アドレス無効"
  },
  "options_filterList_minutes": {
    "message": "分前"
  },
  "options_filterList_now": {
    "message": "たった今"
  },
  "options_filterList_source": {
    "message": "ソース"
  },
  "options_filterList_state_active": {
    "message": "アクティブ"
  },
  "options_filterList_state_disabled": {
    "message": "無効"
  },
  "options_filterList_title": {
    "message": "フィルターリスト"
  },
  "options_filterList_update": {
    "message": "すべてのフィルターリストを更新"
  },
  "options_filterList_updateNow": {
    "message": "今すぐ更新"
  },
  "options_filterList_website": {
    "message": "ウェブサイト"
  },
  "options_footer_about": {
    "message": "Adblock Plus について"
  },
  "options_footer_contribute": {
    "message": "ご寄付のお願い"
  },
  "options_general_description": {
    "message": "Adblock Plus がウェブサイトで表示・非表示にするものを特定します"
  },
  "options_help_description": {
    "message": "ヘルプを見るか、当社までお問い合わせください"
  },
  "options_language_add": {
    "message": "+ 言語の追加"
  },
  "options_language_change": {
    "message": "変更"
  },
  "options_language_description": {
    "message": "あなたがよく閲覧するウェブサイトの言語に合わせて Adblock Plus を最適化。"
  },
  "options_language_empty": {
    "message": "言語特定のフィルターが設定されていません。"
  },
  "options_language_header": {
    "message": "言語"
  },
  "options_language_tip": {
    "message": "<strong>コツ:</strong>必要な言語だけを選択してください。言語を多く選択するほど広告ブロッカーが遅くなるので、閲覧にかかるスピードも遅くなります。"
  },
  "options_learn_more": {
    "message": "詳細を読む"
  },
  "options_more_filters_description": {
    "message": "これらのフィルターはこれまでに Adblock Plus に追加されたことのあるフィルターです。"
  },
  "options_more_filters_header": {
    "message": "その他のフィルター"
  },
  "options_more_filters_note": {
    "message": "<strong>注記:</strong>信頼できる作者が提供するサードパーティのフィルターリストのみを使用するようにしてください。"
  },
  "options_new_label": {
    "message": "新規"
  },
  "options_page_document_title": {
    "message": "設定"
  },
  "options_page_title": {
    "message": "設定"
  },
  "options_privacy_header": {
    "message": "プライバシー & セキュリティー"
  },
  "options_protection_privacy_tooltip": {
    "message": "訪問したウェブサイトでのオンライン活動が追跡される可能性がある既知の団体からプライバシーを保護します。"
  },
  "options_protection_social_tooltip": {
    "message": "閲覧したウェブサイトにあるソーシャルメディア アイコンでは、このをクリックしない場合でも、ユーザーの習慣的な閲覧履歴に基づいてプロファイルを構築します。このようなアイコン を非表示して、自分のプロファイルを守ることができます。"
  },
  "options_refresh": {
    "message": "更新"
  },
  "options_report_bug": {
    "message": "バグがあった場合<a>バグ報告を送信</a>してください"
  },
  "options_report_forum": {
    "message": "当社コミュニティのサポートを得るには<a>フォーラムに行く</a>"
  },
  "options_short": {
    "message": "オプション"
  },
  "options_social_description": {
    "message": "当社へのご質問やご提案について是非お役立てください。"
  },
  "options_social_title": {
    "message": "お問い合わせ"
  },
  "options_support_title": {
    "message": "サポート"
  },
  "options_tab_advanced": {
    "message": "詳細設定"
  },
  "options_tab_general": {
    "message": "全般"
  },
  "options_tab_help": {
    "message": "ヘルプ"
  },
  "options_tab_whitelist": {
    "message": "ホワイトリストに登録されているウェブサイト"
  },
  "options_tracking_warning_1": {
    "message": "<strong>$tracking$</strong> と <strong>$acceptableAds$</strong> の両方が有効になっています。",
    "placeholders": {
      "acceptableAds": {
        "content": "$2",
        "example": "Allow Acceptable Ads"
      },
      "tracking": {
        "content": "$1",
        "example": "Block additional tracking"
      }
    }
  },
  "options_tracking_warning_2": {
    "message": "より関連した広告を表示するために、広告主は控えめな広告で多少のトラッキングをする<strong>かもしれない</strong>ことを、あなたに知っておいてほしいと思います。"
  },
  "options_tracking_warning_3": {
    "message": "更なるプライバシーを求める場合、以下の <strong>$acceptableAdsPrivacy$</strong> チェックボックスを選択してください。",
    "placeholders": {
      "acceptableAdsPrivacy": {
        "content": "$1",
        "example": "Only allow ads without third-party tracking"
      }
    }
  },
  "options_tracking_warning_acknowledgment": {
    "message": "OK, わかりました"
  },
  "options_whitelist_add": {
    "message": "ウェブサイトの追加"
  },
  "options_whitelist_description": {
    "message": "これらウェブサイトでは広告ブロッカーがオフになっているので、広告が表示されます。"
  },
  "options_whitelist_empty_1": {
    "message": "ホワイトリストに登録されているウェブサイトがありません。"
  },
  "options_whitelist_empty_2": {
    "message": "信頼出来て広告を許可できるウェブサイトはここに表示されます。"
  },
  "options_whitelist_notification": {
    "message": "$website$ がホワイトリストに登録されました。",
    "placeholders": {
      "website": {
        "content": "$1",
        "example": "example.com"
      }
    }
  },
  "options_whitelist_placeholder_example": {
    "message": "例: $domain$",
    "placeholders": {
      "domain": {
        "content": "$1",
        "example": "www.example.com"
      }
    }
  },
  "overlay_notification_button_no": {
    "message": "いいえ"
  },
  "overlay_notification_button_yes": {
    "message": "はい"
  },
  "overlay_notification_closing_button_hide": {
    "message": "閉じる"
  },
  "overlay_notification_closing_button_optout": {
    "message": "通知の表示を停止"
  },
  "promote_abp_module": {
    "message": "Adblock Plus モバイルに興味がありますか？"
  },
  "refresh_to_take_effect": {
    "message": "<strong>更新</strong> の変更を反映をクリックします。"
  },
  "sendReport": {
    "message": "問題を報告"
  },
  "stats_header": {
    "message": "ブロックした数"
  },
  "stats_label_page": {
    "message": "このページ内で <strong>$number$</strong>",
    "placeholders": {
      "number": {
        "content": "$1"
      }
    }
  },
  "stats_label_total": {
    "message": "これまでの累計で  <strong>$number$</strong>",
    "placeholders": {
      "number": {
        "content": "$1"
      }
    }
  },
  "status_header": {
    "message": "広告をブロック:"
  },
  "unexpected_filter_list_header": {
    "message": "ここにフィルタのヘッダーを記述することはできません"
  },
  "updates_adblockBrowser": {
    "message": "デスクトップ上の広告管理に取り組んでいるのなら、携帯の広告もブロックし、プライバシーとセキュリティも改善できるはずです。<a>下から Adblock Browser アプリを入手</a>しましょう"
  },
  "updates_blockAds": {
    "message": "オープンソース反乱同盟軍は、帝国が逆襲しても、Facebook などのウェブサイト上の隠された広告も削除できる、新たなブロックフィルターを作成しました。"
  },
  "updates_heading": {
    "message": "Adblock Plus がアップデートされました！"
  },
  "updates_optionsPageNews": {
    "message": "設定のページが新しくなりました - プライバシーとセキュリティのオプション追加、およびデザインの刷新と、スタイルの変更により、<a>Adblock Plusを思い通りに、より簡単に カスタマイズできるよう</a>になりました。"
  },
  "updates_phone": {
    "message": "でも、まだ安心できません！携帯はどうでしょうか？"
  },
  "updates_status": {
    "message": "アップデート完了"
  },
  "updates_subheading": {
    "message": "更新内容"
  }
}
