{
  "add": {
    "message": "Añadir"
  },
  "add_filters_msg": {
    "message": "¿Añadir filtro(s)?"
  },
  "block_element": {
    "message": "Bloquear elemento"
  },
  "cancel": {
    "message": "Cancelar"
  },
  "click_element_to_block_it": {
    "message": "Haz clic en un elemento de la página para bloquearlo."
  },
  "common_feature_anti_adblock_title": {
    "message": "Ocultar mensajes de advertencia de Adblock"
  },
  "common_feature_malware_title": {
    "message": "Bloquear \"malware\""
  },
  "common_feature_privacy_title": {
    "message": "Bloquear el seguimiento adicional"
  },
  "common_feature_social_title": {
    "message": "Bloquear el seguimiento de los iconos de medios sociales"
  },
  "common_notification_hide": {
    "message": "Cerrar la notificación"
  },
  "continue": {
    "message": "Continuar"
  },
  "copy_selected": {
    "message": "Copiar seleccionados"
  },
  "delete": {
    "message": "Eliminar"
  },
  "description": {
    "message": "Descarga Adblock Plus, uno de los bloqueadores de anuncios más famosos del mundo."
  },
  "devtools_action_block": {
    "message": "Bloquear elemento"
  },
  "devtools_action_remove": {
    "message": "Eliminar regla"
  },
  "devtools_action_unblock": {
    "message": "Añadir una excepción"
  },
  "devtools_filter_origin_custom": {
    "message": "definida por el usuario"
  },
  "devtools_filter_origin_none": {
    "message": "suscripción sin nombre"
  },
  "devtools_filter_subtitle": {
    "message": "Origen"
  },
  "devtools_filter_title": {
    "message": "Filtro"
  },
  "devtools_footer": {
    "message": "<a0>Actualiza</a0> la página para ver los cambios producidos por el filtro"
  },
  "devtools_header": {
    "message": "Mostrar elementos <slot0></slot0> de tipo <slot1></slot1>"
  },
  "devtools_header_state_all": {
    "message": "cualesquiera"
  },
  "devtools_header_state_blocked": {
    "message": "bloqueados"
  },
  "devtools_header_state_whitelisted": {
    "message": "permitidos"
  },
  "devtools_header_type_any": {
    "message": "cualquiera"
  },
  "devtools_request_subtitle": {
    "message": "Dominio del documento"
  },
  "devtools_request_title": {
    "message": "Solicitud"
  },
  "devtools_request_url": {
    "message": "<a0></a0> reescrita como <a1></a1>"
  },
  "devtools_type_title": {
    "message": "Tipo"
  },
  "easy_create_filter": {
    "message": "Bloquear elemento"
  },
  "filter_action_failed": {
    "message": "Algo no ha funcionado. Por favor, inténtalo de nuevo."
  },
  "filter_elemhideemulation_nodomain": {
    "message": "No se ha especificado ningún dominio activo para el filtro extendido de ocultación de elementos"
  },
  "filter_invalid_csp": {
    "message": "Política de seguridad de contenido no válida"
  },
  "filter_invalid_domain": {
    "message": "El dominio especificado no es válido (o está vacío)"
  },
  "filter_invalid_regexp": {
    "message": "Expresión regular no válida"
  },
  "filter_slow": {
    "message": "Para conseguir que un filtro sea rápido, comprueba la longitud de la secuencia de elementos y asegúrate de que no contiene ninguna expresión regular."
  },
  "filter_snippet_nodomain": {
    "message": "No se ha especificado un dominio activo para el filtro de fragmentos"
  },
  "filter_unknown_option": {
    "message": "Opción de filtrado desconocida"
  },
  "filters_subscription_lastDownload_connectionError": {
    "message": "Error: error de descarga"
  },
  "firstRun_browser_description": {
    "message": "Del equipo que está detrás de Adblock Plus, el bloqueador de anuncios para navegadores de escritorio más popular del mundo, Adblock Browser está ahora disponible para dispositivos Android e iOS."
  },
  "firstRun_browser_store_android": {
    "message": "Aplicación Android en Google Play"
  },
  "firstRun_browser_store_ios": {
    "message": "Disponible en la iTunes App Store"
  },
  "firstRun_browser_title": {
    "message": "Aplicación Adblock Browser"
  },
  "firstRun_control_description": {
    "message": "De forma predeterminada, verás algunos anuncios no intrusivos que se adhieren a <a0>criterios estrictos</a0>. Los identificamos como anuncios aceptables. ¿Prefieres bloquear todos los anuncios? <a1>Desactiva los anuncios aceptables</a1> en tus <a2>Ajustes</a2>."
  },
  "firstRun_control_title": {
    "message": "Tú tienes el control"
  },
  "firstRun_fair_description": {
    "message": "Te animamos a hacer un uso razonable de Adblock Plus y de la opción de lista blanca para sitios web permitidos. Según los filtros que uses, deberás entender y aceptar que se pueden generar resultados no intencionados, como contenido bloqueado en un sitio web. Consulta los <a0>Términos de uso</a0> para conocer más información sobre un uso razonable de Adblock Plus."
  },
  "firstRun_fair_title": {
    "message": "Uso razonable"
  },
  "firstRun_footer_copyright": {
    "message": "Copyright © $year$ Todos los derechos reservados. Adblock Plus® es una marca registrada de <a0>eyeo GmbH</a0>.",
    "placeholders": {
      "year": {
        "content": "$1",
        "example": "1984"
      }
    }
  },
  "firstRun_subtitle": {
    "message": "Acabas de tomar el control de tu navegador"
  },
  "firstRun_title": {
    "message": "Instalación realizada correctamente"
  },
  "firstRun_warning_dataCorrupted_intro": {
    "message": "Un problema está causando que esta página se muestre a algunos usuarios cada vez que inician el navegador. Esto se puede solucionar desinstalando e instalando Adblock Plus:"
  },
  "firstRun_warning_dataCorrupted_note": {
    "message": "Si todavía necesitas asistencia, envíanos un e-mail a <a0>support@adblockplus.org</a0> o visita nuestro <a1>centro de ayuda</a1>."
  },
  "firstRun_warning_dataCorrupted_step1": {
    "message": "Accede a la sección Extensiones de tu navegador."
  },
  "firstRun_warning_dataCorrupted_step2": {
    "message": "Localiza Adblock Plus y elimínalo."
  },
  "firstRun_warning_dataCorrupted_step3": {
    "message": "Vuelve a instalar Adblock Plus desde la página <a>adblockplus.org</a>."
  },
  "firstRun_warning_reinitialized": {
    "message": "Parece ser que se han eliminado todos los filtros como consecuencia de un error y no podemos restaurar la copia de seguridad. Por tanto, hemos tenido que restablecer tus filtros y ajustes de Anuncios Aceptables. Comprueba tus listas de filtros y ajustes de Anuncios Aceptables en las <a>opciones de Adblock Plus</a>."
  },
  "invalid_css_selector": {
    "message": "$selector$ no es un selector CSS válido",
    "placeholders": {
      "selector": {
        "content": "$1"
      }
    }
  },
  "issueReporter_anonymousSubmission_label": {
    "message": "Envío anónimo"
  },
  "issueReporter_anonymousSubmission_warning": {
    "message": "No podremos comunicar con usted y es probable que le demos una prioridad inferior a su informe."
  },
  "issueReporter_closeButton_label": {
    "message": "Cerrar"
  },
  "issueReporter_commentPage_heading": {
    "message": "Dejar un comentario"
  },
  "issueReporter_comment_description": {
    "message": "Ayúdanos a comprender mejor el problema. Para ello, déjanos un comentario a continuación."
  },
  "issueReporter_comment_label": {
    "message": "Comentario (opcional):"
  },
  "issueReporter_confirmationMessage": {
    "message": "Su informe ha sido guardado. Puede acceder a él en la siguiente dirección:"
  },
  "issueReporter_data_gathering_tab": {
    "message": "<strong>Nota:</strong> Se abrirá una pestaña temporal adicional para que el generador de informes de problemas no afecte a la página en la que te encuentras actualmente."
  },
  "issueReporter_detailsButton_label": {
    "message": "Detalles"
  },
  "issueReporter_doneButton_label": {
    "message": "Hecho"
  },
  "issueReporter_email_description": {
    "message": "Introduce una dirección de correo electrónico válida. Nos será de gran utilidad. De este modo, podremos ponernos en contacto contigo y solucionar así los problemas más complicados, como el \"malware\". Recuerda que no estás obligado a introducir una dirección de correo electrónico y que nunca la compartiremos con otras personas."
  },
  "issueReporter_email_label": {
    "message": "Correo electrónico:"
  },
  "issueReporter_errorMessage": {
    "message": "Un intento de enviar el informe produjo un fallo con código de error \"?1?\". Por favor, asegúrese de que está conectado a Internet y vuelva a intentarlo. Si el problema persiste por favor pida ayuda en el [link]foro de Adblock Plus[/link]."
  },
  "issueReporter_falseNegative_description": {
    "message": "He activado Adblock Plus, pero siguen apareciendo anuncios."
  },
  "issueReporter_falseNegative_label": {
    "message": "Siguen apareciendo anuncios"
  },
  "issueReporter_falsePositive_description": {
    "message": "La página no se muestra correctamente, no funciona correctamente o parece que falta contenido importante."
  },
  "issueReporter_falsePositive_label": {
    "message": "La página que intento visualizar está rota"
  },
  "issueReporter_highlighter_description": {
    "message": "Utiliza las herramientas para destacar los anuncios u ocultar la información confidencial que aparezca en la captura de pantalla. Destacar los anuncios nos ayudará a solucionar el problema con mayor rapidez."
  },
  "issueReporter_highlighter_heading": {
    "message": "Destacar problema"
  },
  "issueReporter_knownIssueMessage": {
    "message": "El problema del que informó probablemente ya fuera conocido. Más información:"
  },
  "issueReporter_markIssueButton_label": {
    "message": "Marcar problema"
  },
  "issueReporter_page_title": {
    "message": "Creador de informes de errores"
  },
  "issueReporter_privacyPolicy": {
    "message": "Política de privacidad"
  },
  "issueReporter_processing_screenshot": {
    "message": "procesando"
  },
  "issueReporter_screenreader_warning": {
    "message": "Cuando envías un informe de error, se requiere una captura de pantalla del problema para ayudarnos a entenderlo mejor. Dependiendo de la página web en la que estés ahora, la captura de pantalla puede contener datos personales. Si te incomoda enviar esa información, puedes mandar un correo a <a0>support@adblockplus.org</a0> detallando el error."
  },
  "issueReporter_screenshot_hide": {
    "message": "Ocultar"
  },
  "issueReporter_screenshot_highlight": {
    "message": "Resaltar"
  },
  "issueReporter_selectIssueButton_label": {
    "message": "Seleccionar problema"
  },
  "issueReporter_sendButton_label": {
    "message": "Enviar informe"
  },
  "issueReporter_sendPage_heading": {
    "message": "Enviar informe"
  },
  "issueReporter_sending": {
    "message": "Por favor, espere mientras Adblock Plus envía su informe."
  },
  "issueReporter_showData_label": {
    "message": "Hacer clic en este enlace para revisar los datos del informe antes de enviarlo"
  },
  "issueReporter_typeSelector_description": {
    "message": "Selecciona un problema:"
  },
  "issueReporter_typeSelector_heading": {
    "message": "¿De qué tipo de problema se trata?"
  },
  "line": {
    "message": "Línea $number$",
    "placeholders": {
      "number": {
        "content": "$1"
      }
    }
  },
  "loading": {
    "message": "Cargando..."
  },
  "name": {
    "message": "Adblock Plus"
  },
  "name_devbuild": {
    "message": "Adblock Plus (versión de desarrollo)"
  },
  "name_releasebuild": {
    "message": "Adblock Plus - bloqueador de anuncios gratis"
  },
  "notification_antiadblock_message": {
    "message": "Se sabe que este sitio ha mostrado en el pasado mensajes dirigidos a los usuarios de Adblock Plus. ¿Quiere que Adblock Plus oculte esos mensajes?"
  },
  "notification_antiadblock_title": {
    "message": "¿Ocultar mensajes dirigidos a usuarios de Adblock Plus?"
  },
  "notification_configure": {
    "message": "Configurar opciones de notificación"
  },
  "notification_open_all": {
    "message": "Abrir todos los enlaces de esta notificación"
  },
  "notification_with_buttons": {
    "message": "Pulse \"Aceptar\" para abrir todos los enlaces de este aviso."
  },
  "notification_without_buttons": {
    "message": "Pulse en el aviso para abrir todos los enlaces que contiene."
  },
  "options_acceptableAds_ads_description_1": {
    "message": "Los anuncios aceptables no son molestos y no interfieren con el contenido que estás viendo. <a>Leer más sobre los criterios de Anuncios Aceptables</a>"
  },
  "options_acceptableAds_ads_label": {
    "message": "Permitir Anuncios Aceptables"
  },
  "options_acceptableAds_description": {
    "message": "Los anuncios aceptables son anuncios no intrusivos. Son el punto intermedio entre el bloqueo de anuncios y el apoyo de contenidos en línea, puesto que generan ingresos para los propietarios de páginas web."
  },
  "options_acceptableAds_dnt_notification": {
    "message": "<strong>Nota:</strong> Tienes desactivada la función <strong>No realizar seguimiento (DNT)</strong> en los ajustes de tu navegador. Para que esta funcione correctamente, activa <strong>DNT</strong> en las preferencias de tu navegador. <a>Descubre cómo activar DNT</a>"
  },
  "options_acceptableAds_header": {
    "message": "ANUNCIOS ACEPTABLES"
  },
  "options_acceptableAds_privacy_label": {
    "message": "Permitir solo anuncios sin seguimiento por parte de terceros"
  },
  "options_advanced_description": {
    "message": "Personaliza Adblock Plus, añade o elimina listas de filtros, crea y mantén tus propias listas de filtros"
  },
  "options_anti_cv_header": {
    "message": "Antielusión"
  },
  "options_anti_cv_title": {
    "message": "Lista de filtros antielusión de ABP"
  },
  "options_anti_cv_tooltip": {
    "message": "Esta lista de filtros funciona contra cualquier práctica de elusión en sitios web (es decir, técnicas para forzar anuncios en aquellos usuarios que cuenten con bloqueo de anuncios). Estos filtros abordan tanto los anuncios que eluden el bloqueo como el seguimiento relacionado."
  },
  "options_close": {
    "message": "CERRAR"
  },
  "options_control_remove_title": {
    "message": "Eliminar"
  },
  "options_customFilter_cancel": {
    "message": "CANCELAR"
  },
  "options_customFilters_description": {
    "message": "Crea y mantén tus propios filtros para un mayor control sobre qué contenido bloquea o permite Adblock Plus. <a0>Más información sobre cómo crear filtros</a0>"
  },
  "options_customFilters_title": {
    "message": "Tus filtros personalizados"
  },
  "options_customFilters_widget_title": {
    "message": "Mi lista de filtros"
  },
  "options_customize_blockElement": {
    "message": "Mostrar la opción \"Bloquear elemento\" en el menú contextual (botón derecho)"
  },
  "options_customize_blockElement_tooltip": {
    "message": "Bloquea temporalmente los elementos molestos en una página web (p. ej., imágenes o presentaciones de diapositivas animadas)."
  },
  "options_customize_header": {
    "message": "Personalización"
  },
  "options_customize_iconStats": {
    "message": "Mostrar número de anuncios bloqueados en icono"
  },
  "options_customize_showDevToolsPanel": {
    "message": "Mostrar el panel de \"Adblock Plus\" en herramientas del desarrollador"
  },
  "options_customize_showDevToolsPanel_tooltip": {
    "message": "Comprueba los elementos bloqueados y de la lista blanca en el panel de herramientas del desarrollador de tu navegador."
  },
  "options_customize_showNotifications": {
    "message": "Mostrar avisos útiles"
  },
  "options_customize_showNotifications_tooltip": {
    "message": "Permitir notificaciones de Adblock Plus (las notificaciones relacionadas con problemas de rendimiento críticos se mostrarán siempre)."
  },
  "options_dialog_about_copyright": {
    "message": "Copyright © $currentYear$ eyeo GmbH.",
    "placeholders": {
      "currentYear": {
        "content": "$1",
        "example": "2017"
      }
    }
  },
  "options_dialog_about_title": {
    "message": "Acerca de Adblock Plus"
  },
  "options_dialog_about_trademark": {
    "message": "Todos los derechos reservados. Adblock Plus® es una marca registrada de eyeo GmbH."
  },
  "options_dialog_about_version": {
    "message": "Número de versión $version$",
    "placeholders": {
      "version": {
        "content": "$1",
        "example": "2.6.7"
      }
    }
  },
  "options_dialog_import_subscription_location": {
    "message": "Dirección URL de la lista de filtros"
  },
  "options_dialog_import_subscription_location_error": {
    "message": "Introduce una dirección URL válida"
  },
  "options_dialog_import_title": {
    "message": "Añadir una lista de filtros"
  },
  "options_dialog_language_other_empty": {
    "message": "No hay idiomas disponibles."
  },
  "options_dialog_language_title": {
    "message": "Seleccionar un idioma"
  },
  "options_dialog_predefined_confirm": {
    "message": "Sí, utilizar esta lista de filtros"
  },
  "options_dialog_predefined_title": {
    "message": "¿Seguro que deseas añadir esta lista de filtros?"
  },
  "options_email": {
    "message": "Correo electrónico:"
  },
  "options_english": {
    "message": "Inglés"
  },
  "options_filterList_add": {
    "message": "+ Añadir una nueva lista de filtros"
  },
  "options_filterList_column_name": {
    "message": "Listas de filtros"
  },
  "options_filterList_column_status": {
    "message": "Estado"
  },
  "options_filterList_column_update": {
    "message": "Última actualización"
  },
  "options_filterList_description": {
    "message": "Cada ajuste de Adblock Plus funciona en base a una lista de filtros. A continuación se muestran las listas de filtros que se corresponden con todos tus ajustes de Adblock Plus. También puedes añadir filtros adicionales creados y mantenidos por nuestra comunidad de confianza."
  },
  "options_filterList_empty": {
    "message": "No has añadido ninguna lista de filtros a Adblock Plus. Las listas de filtros que añadas se mostrarán aquí."
  },
  "options_filterList_hours": {
    "message": "hace horas"
  },
  "options_filterList_lastDownload_checksumMismatch": {
    "message": "Error, el checksum no coincide"
  },
  "options_filterList_lastDownload_connectionError": {
    "message": "Error: error de descarga"
  },
  "options_filterList_lastDownload_inProgress": {
    "message": "Actualizando"
  },
  "options_filterList_lastDownload_invalidData": {
    "message": "Error: lista de filtros no válida"
  },
  "options_filterList_lastDownload_invalidURL": {
    "message": "Error: dirección no válida"
  },
  "options_filterList_minutes": {
    "message": "hace minutos"
  },
  "options_filterList_now": {
    "message": "Hace un momento"
  },
  "options_filterList_source": {
    "message": "Fuente"
  },
  "options_filterList_state_active": {
    "message": "Activada"
  },
  "options_filterList_state_disabled": {
    "message": "Inactiva"
  },
  "options_filterList_title": {
    "message": "Listas de filtros"
  },
  "options_filterList_update": {
    "message": "ACTUALIZAR TODAS LAS LISTAS DE FILTROS"
  },
  "options_filterList_updateNow": {
    "message": "Actualizar ahora"
  },
  "options_filterList_website": {
    "message": "Página web"
  },
  "options_filter_list_rule": {
    "message": "Regla del filtro"
  },
  "options_filters_search_or_add": {
    "message": "Buscar o añadir filtro(s) (p. ej. $filter$)",
    "placeholders": {
      "filter": {
        "content": "/ads/track/*"
      }
    }
  },
  "options_footer_about": {
    "message": "Acerca de Adblock Plus"
  },
  "options_footer_contribute": {
    "message": "CONTRIBUIR"
  },
  "options_general_description": {
    "message": "Determina qué muestra y oculta Adblock Plus en páginas web"
  },
  "options_help_description": {
    "message": "Encuentra ayuda o contacta con nosotros"
  },
  "options_language_add": {
    "message": "+ añadir un idioma"
  },
  "options_language_change": {
    "message": "CAMBIAR"
  },
  "options_language_description": {
    "message": "Optimiza Adblock Plus para los idiomas que sueles utilizar para navegar por las páginas web."
  },
  "options_language_empty": {
    "message": "No tienes ningún filtro específico de idiomas."
  },
  "options_language_header": {
    "message": "Idioma"
  },
  "options_language_tip": {
    "message": "<strong>SUGERENCIA:</strong> Selecciona solo los idiomas que necesitas. Seleccionar más ralentizará el bloqueador de anuncios y, por tanto, la velocidad de navegación."
  },
  "options_learn_more": {
    "message": "Más información"
  },
  "options_more_filters_description": {
    "message": "Estos son filtros adicionales que has añadido previamente a Adblock Plus."
  },
  "options_more_filters_header": {
    "message": "Más filtros"
  },
  "options_more_filters_note": {
    "message": "<strong>Nota:</strong> Usa exclusivamente listas de filtros de terceros de autores en los que confíes."
  },
  "options_new_label": {
    "message": "NUEVO"
  },
  "options_page_document_title": {
    "message": "Ajustes"
  },
  "options_page_title": {
    "message": "Ajustes"
  },
  "options_privacy_header": {
    "message": "PRIVACIDAD Y SEGURIDAD"
  },
  "options_protection_privacy_tooltip": {
    "message": "Protege tu privacidad de entidades conocidas que pudieran realizar un seguimiento de tu actividad en línea en los sitios web que visites."
  },
  "options_protection_social_tooltip": {
    "message": "Los iconos de medios sociales en las páginas web que visitas permiten que las redes de medios sociales construyan un perfil tuyo en base a tus hábitos de navegación, incluso cuando no haces clic en ellos. Ocultar estos iconos puede proteger tu perfil."
  },
  "options_refresh": {
    "message": "Actualizar"
  },
  "options_report_bug": {
    "message": "¿Encontraste un error? <a>Envíanos un informe de error</a>"
  },
  "options_report_forum": {
    "message": "¿Deseas obtener ayuda de nuestra comunidad? <a>Accede al foro</a>"
  },
  "options_short": {
    "message": "Opciones"
  },
  "options_social_description": {
    "message": "¿Tienes alguna pregunta o idea nueva? Estamos aquí para ayudarte."
  },
  "options_social_title": {
    "message": "Ponerse en contacto"
  },
  "options_support_title": {
    "message": "Asistencia"
  },
  "options_tab_advanced": {
    "message": "Avanzado"
  },
  "options_tab_general": {
    "message": "General"
  },
  "options_tab_help": {
    "message": "Ayuda"
  },
  "options_tab_whitelist": {
    "message": "Páginas web de la lista blanca"
  },
  "options_tracking_warning_1": {
    "message": "Hemos detectado que tienes activadas las opciones <strong>$tracking$</strong> y <strong>$acceptableAds$</strong>.",
    "placeholders": {
      "acceptableAds": {
        "content": "$2",
        "example": "Allow Acceptable Ads"
      },
      "tracking": {
        "content": "$1",
        "example": "Block additional tracking"
      }
    }
  },
  "options_tracking_warning_2": {
    "message": "Queremos que sepas que <strong>tal vez</strong> haya algún tipo de seguimiento con los anuncios aceptables para que los anunciantes puedan mostrarte publicidad de mayor relevancia."
  },
  "options_tracking_warning_3": {
    "message": "Si prefieres privacidad extra, selecciona la casilla <strong>$acceptableAdsPrivacy$</strong> a continuación.",
    "placeholders": {
      "acceptableAdsPrivacy": {
        "content": "$1",
        "example": "Only allow ads without third-party tracking"
      }
    }
  },
  "options_tracking_warning_acknowledgment": {
    "message": "Entendido"
  },
  "options_whitelist_add": {
    "message": "AÑADIR PÁGINA WEB"
  },
  "options_whitelist_description": {
    "message": "Has desactivado el bloqueo de anuncios en estas páginas web y, por tanto, verás anuncios."
  },
  "options_whitelist_empty_1": {
    "message": "No tienes ninguna página web en la lista blanca."
  },
  "options_whitelist_empty_2": {
    "message": "Las páginas web en las que confías y deseas permitir anuncios se mostrarán aquí."
  },
  "options_whitelist_notification": {
    "message": "\"$website$\" ha sido añadida a la lista blanca.",
    "placeholders": {
      "website": {
        "content": "$1",
        "example": "example.com"
      }
    }
  },
  "options_whitelist_placeholder_example": {
    "message": "p.ej. $domain$",
    "placeholders": {
      "domain": {
        "content": "$1",
        "example": "www.example.com"
      }
    }
  },
  "overlay_notification_button_no": {
    "message": "No"
  },
  "overlay_notification_button_yes": {
    "message": "Sí"
  },
  "overlay_notification_closing_button_hide": {
    "message": "Cerrar"
  },
  "overlay_notification_closing_button_optout": {
    "message": "Dejar de mostrar avisos"
  },
  "promote_abp_module": {
    "message": "¿Te interesa Adblock Plus para móvil?"
  },
  "refresh_to_take_effect": {
    "message": "Haz clic en <strong>Actualizar</strong> para que se apliquen los cambios."
  },
  "sendReport": {
    "message": "Informar de un problema"
  },
  "stats_header": {
    "message": "Número de elementos bloqueados"
  },
  "stats_label_page": {
    "message": "<strong>$number$</strong> en esta página",
    "placeholders": {
      "number": {
        "content": "$1"
      }
    }
  },
  "stats_label_total": {
    "message": "<strong>$number$</strong> en total",
    "placeholders": {
      "number": {
        "content": "$1"
      }
    }
  },
  "status_header": {
    "message": "Bloquear anuncios en:"
  },
  "unexpected_filter_list_header": {
    "message": "Los encabezados de listas de filtros no se permiten aquí"
  },
  "updates_adblockBrowser": {
    "message": "Si ya controlas el bloqueo de anuncios desde el escritorio, podrás hacerlo también en tu móvil y mejorar tanto la privacidad como la seguridad. Descarga la <a>aplicación Adblock Browser más abajo</a>"
  },
  "updates_blockAds": {
    "message": "La Alianza Rebelde del código abierto ha creado nuevos filtros de bloqueo que te permitirán destruir anuncios ocultos en páginas como Facebook, incluso si el Imperio contraataca."
  },
  "updates_heading": {
    "message": "Adblock Plus ha sido actualizado"
  },
  "updates_optionsPageNews": {
    "message": "Nueva página de configuración: modernizada y renovada con más opciones de privacidad y seguridad, para que sea más fácil <a>personalizar a tu gusto Adblock Plus</a>."
  },
  "updates_phone": {
    "message": "¡Espera! ¿Qué pasa con tu teléfono?"
  },
  "updates_status": {
    "message": "Actualización completada"
  },
  "updates_subheading": {
    "message": "Novedades"
  }
}
