[
  {
    "camera": {
      "x": 668.0,
      "y": 84.0
    },
    "world": {
      "x": 0.0,
      "y": 0.0,
      "z": 0.0
    }
  },
  {
    "camera": {
      "x": 1987.0,
      "y": 83.0
    },
    "world": {
      "x": 29.0,
      "y": 0.0,
      "z": 0.0
    }
  },
  {
    "camera": {
      "x": 1973.0,
      "y": 1411.0
    },
    "world": {
      "x": 29.0,
      "y": 29.0,
      "z": 0.0
    }
  },
  {
    "camera": {
      "x": 642.0,
      "y": 1393.0
    },
    "world": {
      "x": 0.0,
      "y": 29.0,
      "z": 0.0
    }
  }
]
