^E:\C++ PROJECTS\GITLAB REPO\C++ TUTORIALS\FUNCTIONS_UDEMY\FUNCTIONS_UDEMY\ŹRÓDŁO.CPP
E:\C++ PROJECTS\GITLAB REPO\C++ TUTORIALS\FUNCTIONS_UDEMY\FUNCTIONS_UDEMY\X64\DEBUG\VC143.PDB
E:\C++ PROJECTS\GITLAB REPO\C++ TUTORIALS\FUNCTIONS_UDEMY\FUNCTIONS_UDEMY\X64\DEBUG\VC143.IDB
E:\C++ PROJECTS\GITLAB REPO\C++ TUTORIALS\FUNCTIONS_UDEMY\FUNCTIONS_UDEMY\X64\DEBUG\ŹRóDłO.OBJ
