^E:\C++ PROJECTS\GITLAB REPO\C++ TUTORIALS\ARRAYS\ARRAYS\ŹRÓDŁO.CPP
E:\C++ PROJECTS\GITLAB REPO\C++ TUTORIALS\ARRAYS\ARRAYS\X64\DEBUG\VC143.PDB
E:\C++ PROJECTS\GITLAB REPO\C++ TUTORIALS\ARRAYS\ARRAYS\X64\DEBUG\VC143.IDB
E:\C++ PROJECTS\GITLAB REPO\C++ TUTORIALS\ARRAYS\ARRAYS\X64\DEBUG\ŹRóDłO.OBJ
