%YAML 1.1
%TAG !u! tag:unity3d.com,2011:
--- !u!114 &11400000
MonoBehaviour:
  m_ObjectHideFlags: 0
  m_PrefabParentObject: {fileID: 0}
  m_PrefabInternal: {fileID: 0}
  m_GameObject: {fileID: 0}
  m_Enabled: 1
  m_EditorHideFlags: 0
  m_Script: {fileID: 11500000, guid: 2ef5dd69d1c2b8d43822148e6af83421, type: 3}
  m_Name: Mouth Images Installer
  m_EditorClassIdentifier: 
  MouthImagesConfig: {fileID: 11400000, guid: dbe558c73a5608e42872bd467280f4b1, type: 2}
