<?xml version="1.0" encoding="UTF-8" standalone="no"?>
<svg width="40" height="40" xmlns="http://www.w3.org/2000/svg">
    <circle cx="20" cy="20" r="20" fill="gray"/>
    <path d="M 15 10 L 25 20 L 15 30" stroke="white" stroke-width="2" fill="none"></path>
</svg>
