<?xml version="1.0" encoding="UTF-8" standalone="no"?>
<svg
   xmlns:dc="http://purl.org/dc/elements/1.1/"
   xmlns:cc="http://creativecommons.org/ns#"
   xmlns:rdf="http://www.w3.org/1999/02/22-rdf-syntax-ns#"
   xmlns:svg="http://www.w3.org/2000/svg"
   xmlns="http://www.w3.org/2000/svg"
   xmlns:sodipodi="http://sodipodi.sourceforge.net/DTD/sodipodi-0.dtd"
   xmlns:inkscape="http://www.inkscape.org/namespaces/inkscape"
   sodipodi:docname="n3.svg"
   inkscape:version="1.0 (4035a4fb49, 2020-05-01)"
   id="svg901"
   version="1.1"
   viewBox="0 0 42.333332 52.916668"
   height="200"
   width="160">
  <defs
     id="defs895">
    <inkscape:path-effect
       lpeversion="1"
       is_visible="true"
       id="path-effect2687"
       effect="spiro" />
    <inkscape:path-effect
       lpeversion="1"
       is_visible="true"
       id="path-effect2683"
       effect="spiro" />
    <inkscape:path-effect
       effect="spiro"
       id="path-effect2097"
       is_visible="true"
       lpeversion="1" />
    <inkscape:path-effect
       effect="spiro"
       id="path-effect2093"
       is_visible="true"
       lpeversion="1" />
    <inkscape:path-effect
       lpeversion="1"
       is_visible="true"
       id="path-effect1506"
       effect="spiro" />
    <inkscape:path-effect
       lpeversion="1"
       is_visible="true"
       id="path-effect1502"
       effect="spiro" />
    <inkscape:path-effect
       lpeversion="1"
       is_visible="true"
       id="path-effect1498"
       effect="spiro" />
    <inkscape:path-effect
       lpeversion="1"
       is_visible="true"
       id="path-effect1494"
       effect="spiro" />
    <inkscape:path-effect
       lpeversion="1"
       is_visible="true"
       id="path-effect1490"
       effect="spiro" />
    <inkscape:path-effect
       lpeversion="1"
       is_visible="true"
       id="path-effect1486"
       effect="spiro" />
    <inkscape:path-effect
       lpeversion="1"
       is_visible="true"
       id="path-effect1482"
       effect="spiro" />
    <inkscape:path-effect
       lpeversion="1"
       is_visible="true"
       id="path-effect1478"
       effect="spiro" />
    <inkscape:path-effect
       lpeversion="1"
       is_visible="true"
       id="path-effect1474"
       effect="spiro" />
  </defs>
  <sodipodi:namedview
     inkscape:window-maximized="0"
     inkscape:window-y="0"
     inkscape:window-x="87"
     inkscape:window-height="1033"
     inkscape:window-width="1815"
     units="px"
     showgrid="true"
     inkscape:document-rotation="0"
     inkscape:current-layer="layer1"
     inkscape:document-units="mm"
     inkscape:cy="100.48251"
     inkscape:cx="80"
     inkscape:zoom="4.0588973"
     inkscape:pageshadow="2"
     inkscape:pageopacity="0.0"
     borderopacity="1.0"
     bordercolor="#666666"
     pagecolor="#ffffff"
     id="base">
    <inkscape:grid
       spacingy="2.6458333"
       spacingx="2.6458333"
       id="grid1464"
       type="xygrid" />
  </sodipodi:namedview>
  <metadata
     id="metadata898">
    <rdf:RDF>
      <cc:Work
         rdf:about="">
        <dc:format>image/svg+xml</dc:format>
        <dc:type
           rdf:resource="http://purl.org/dc/dcmitype/StillImage" />
        <dc:title />
      </cc:Work>
    </rdf:RDF>
  </metadata>
  <g
     id="layer1"
     inkscape:groupmode="layer"
     inkscape:label="Warstwa 1">
    <path
       inkscape:original-d="m 10.583333,13.229166 c 3.528042,-1.763624 7.05582,-3.5275128 10.583333,-5.2916661 3.527513,-1.7641535 5.291932,5.2919311 7.9375,7.9375001 2.645569,2.645568 -5.291402,5.291931 -7.9375,7.937499"
       inkscape:path-effect="#path-effect2683"
       id="path2681"
       d="m 10.583333,13.229166 c 1.024049,-1.826432 2.605939,-3.3351242 4.478805,-4.2715568 1.872865,-0.9364326 4.028953,-1.29673 6.104528,-1.0201093 2.011668,0.2681034 3.954843,1.142928 5.415227,2.5521701 1.460384,1.409243 2.413679,3.358783 2.522273,5.38533 0.112894,2.106783 -0.707097,4.246687 -2.198955,5.738545 -1.491858,1.491857 -3.631763,2.311848 -5.738545,2.198954"
       style="fill:none;stroke:#000000;stroke-width:1.32291667;stroke-linecap:butt;stroke-linejoin:miter;stroke-opacity:1;stroke-miterlimit:4;stroke-dasharray:none" />
    <path
       inkscape:original-d="m 26.458333,23.812499 c 1.764154,3.528042 3.528041,7.055822 5.291667,10.583334 1.763625,3.527512 -8.81918,7.055818 -13.229167,10.583333 -4.409987,3.527512 -7.055291,-5.291402 -10.5833331,-7.9375"
       inkscape:path-effect="#path-effect2687"
       id="path2685"
       d="m 26.458333,23.812499 c 1.767051,1.090987 3.221653,2.681925 4.150386,4.539391 0.928733,1.857465 1.328722,3.97571 1.141281,6.043943 -0.283335,3.126333 -1.934187,6.091452 -4.399914,8.03424 -2.465727,1.942789 -5.70486,2.853074 -8.829253,2.549093 -2.30767,-0.22452 -4.549125,-1.094528 -6.403978,-2.485668 -1.854854,-1.39114 -3.3176683,-3.299334 -4.1793551,-5.451832"
       style="fill:none;stroke:#000000;stroke-width:1.32291667;stroke-linecap:butt;stroke-linejoin:miter;stroke-opacity:1;stroke-miterlimit:4;stroke-dasharray:none" />
  </g>
</svg>
