<?xml version="1.0" encoding="UTF-8" standalone="no"?>
<svg
   xmlns:dc="http://purl.org/dc/elements/1.1/"
   xmlns:cc="http://creativecommons.org/ns#"
   xmlns:rdf="http://www.w3.org/1999/02/22-rdf-syntax-ns#"
   xmlns:svg="http://www.w3.org/2000/svg"
   xmlns="http://www.w3.org/2000/svg"
   xmlns:sodipodi="http://sodipodi.sourceforge.net/DTD/sodipodi-0.dtd"
   xmlns:inkscape="http://www.inkscape.org/namespaces/inkscape"
   sodipodi:docname="n4.svg"
   inkscape:version="1.0 (4035a4fb49, 2020-05-01)"
   id="svg901"
   version="1.1"
   viewBox="0 0 42.333332 52.916668"
   height="200"
   width="160">
  <defs
     id="defs895">
    <inkscape:path-effect
       lpeversion="1"
       is_visible="true"
       id="path-effect1506"
       effect="spiro" />
    <inkscape:path-effect
       lpeversion="1"
       is_visible="true"
       id="path-effect1502"
       effect="spiro" />
    <inkscape:path-effect
       lpeversion="1"
       is_visible="true"
       id="path-effect1498"
       effect="spiro" />
    <inkscape:path-effect
       lpeversion="1"
       is_visible="true"
       id="path-effect1494"
       effect="spiro" />
    <inkscape:path-effect
       lpeversion="1"
       is_visible="true"
       id="path-effect1490"
       effect="spiro" />
    <inkscape:path-effect
       lpeversion="1"
       is_visible="true"
       id="path-effect1486"
       effect="spiro" />
    <inkscape:path-effect
       lpeversion="1"
       is_visible="true"
       id="path-effect1482"
       effect="spiro" />
    <inkscape:path-effect
       lpeversion="1"
       is_visible="true"
       id="path-effect1478"
       effect="spiro" />
    <inkscape:path-effect
       lpeversion="1"
       is_visible="true"
       id="path-effect1474"
       effect="spiro" />
  </defs>
  <sodipodi:namedview
     inkscape:window-maximized="0"
     inkscape:window-y="0"
     inkscape:window-x="87"
     inkscape:window-height="1033"
     inkscape:window-width="1815"
     units="px"
     showgrid="true"
     inkscape:document-rotation="0"
     inkscape:current-layer="layer1"
     inkscape:document-units="mm"
     inkscape:cy="100.48251"
     inkscape:cx="80"
     inkscape:zoom="4.145"
     inkscape:pageshadow="2"
     inkscape:pageopacity="0.0"
     borderopacity="1.0"
     bordercolor="#666666"
     pagecolor="#ffffff"
     id="base">
    <inkscape:grid
       spacingy="2.6458333"
       spacingx="2.6458333"
       id="grid1464"
       type="xygrid" />
  </sodipodi:namedview>
  <metadata
     id="metadata898">
    <rdf:RDF>
      <cc:Work
         rdf:about="">
        <dc:format>image/svg+xml</dc:format>
        <dc:type
           rdf:resource="http://purl.org/dc/dcmitype/StillImage" />
        <dc:title></dc:title>
      </cc:Work>
    </rdf:RDF>
  </metadata>
  <g
     id="layer1"
     inkscape:groupmode="layer"
     inkscape:label="Warstwa 1">
    <path
       inkscape:original-d="M 26.458333,7.9374999 C 22.93082,11.465542 19.403042,14.99332 15.875,18.520833 c -3.528043,3.527513 -3.527514,7.05582 -5.291667,10.583333"
       inkscape:path-effect="#path-effect1498"
       id="path1496"
       d="M 26.458333,7.9374999 C 22.334193,10.792674 18.730174,14.396693 15.875,18.520833 c -2.252616,3.253778 -4.040214,6.828974 -5.291667,10.583333"
       style="fill:none;stroke:#000000;stroke-width:1.32291667;stroke-linecap:butt;stroke-linejoin:miter;stroke-opacity:1;stroke-miterlimit:4;stroke-dasharray:none" />
    <path
       inkscape:original-d="m 13.229166,29.104166 c 3.528043,2.65e-4 7.05582,2.65e-4 10.583333,0"
       inkscape:path-effect="#path-effect1502"
       id="path1500"
       d="M 13.229166,29.104166 H 23.812499"
       style="fill:none;stroke:#000000;stroke-width:1.32291667;stroke-linecap:butt;stroke-linejoin:miter;stroke-opacity:1;stroke-miterlimit:4;stroke-dasharray:none" />
    <path
       inkscape:original-d="m 26.458333,23.812499 c 2.64e-4,7.055822 2.64e-4,14.111375 0,21.166667"
       inkscape:path-effect="#path-effect1506"
       id="path1504"
       d="M 26.458333,23.812499 V 44.979166"
       style="fill:none;stroke:#000000;stroke-width:1.32291667;stroke-linecap:butt;stroke-linejoin:miter;stroke-opacity:1;stroke-miterlimit:4;stroke-dasharray:none" />
  </g>
</svg>
