<mxfile host="65bd71144e">
    <diagram name="Page-1" id="8ce9d11a-91a2-4d17-14d8-a56ed91bf033">
        <mxGraphModel dx="1100" dy="1133" grid="1" gridSize="10" guides="1" tooltips="1" connect="1" arrows="1" fold="1" page="1" pageScale="1" pageWidth="1100" pageHeight="850" background="none" math="0" shadow="0">
            <root>
                <mxCell id="0"/>
                <mxCell id="1" parent="0"/>
                <mxCell id="4URYS8IVdaSAiPS1KO5_-67" value="&lt;font color=&quot;#000000&quot;&gt;Pull Price from FTX API&lt;/font&gt;" style="swimlane;rounded=0;shadow=0;fontFamily=Verdana;fontSize=15;strokeColor=#666666;strokeWidth=2;html=1;fontStyle=0;fillColor=#f5f5f5;fontColor=#333333;" parent="1" vertex="1">
                    <mxGeometry x="30" y="69" width="370" height="660" as="geometry"/>
                </mxCell>
                <mxCell id="4URYS8IVdaSAiPS1KO5_-70" value="&lt;font face=&quot;Helvetica&quot;&gt;Notify Developer&lt;/font&gt;" style="rounded=0;whiteSpace=wrap;html=1;shadow=0;labelBackgroundColor=none;strokeWidth=2;fontFamily=Verdana;fontSize=12;align=center;fillColor=#647687;strokeColor=#CC0000;fontColor=#ffffff;" parent="4URYS8IVdaSAiPS1KO5_-67" vertex="1">
                    <mxGeometry x="28" y="530" width="120" height="70" as="geometry"/>
                </mxCell>
                <mxCell id="4URYS8IVdaSAiPS1KO5_-23" value="&lt;font style=&quot;font-size: 8px&quot;&gt;&lt;b&gt;YES&lt;/b&gt;&lt;/font&gt;" style="text;html=1;strokeColor=none;fillColor=none;align=center;verticalAlign=middle;whiteSpace=wrap;rounded=0;shadow=0;fontFamily=Verdana;fontColor=#5E824A;" parent="4URYS8IVdaSAiPS1KO5_-67" vertex="1">
                    <mxGeometry x="280" y="292" width="40" height="20" as="geometry"/>
                </mxCell>
                <mxCell id="32" value="&lt;span style=&quot;color: rgb(255 , 255 , 255) ; font-family: &amp;#34;verdana&amp;#34; ; font-size: 12px&quot;&gt;START&lt;/span&gt;" style="ellipse;whiteSpace=wrap;html=1;fontSize=10;" vertex="1" parent="4URYS8IVdaSAiPS1KO5_-67">
                    <mxGeometry x="38" y="41" width="120" height="30" as="geometry"/>
                </mxCell>
                <mxCell id="34" value="&lt;font style=&quot;font-size: 10px&quot;&gt;Request Connection to FTX REST API&amp;nbsp;&lt;/font&gt;" style="rounded=0;whiteSpace=wrap;html=1;shadow=0;labelBackgroundColor=none;strokeWidth=1;fontFamily=Verdana;fontSize=12;align=center;fillColor=#647687;strokeColor=#314354;fontColor=#ffffff;" vertex="1" parent="4URYS8IVdaSAiPS1KO5_-67">
                    <mxGeometry x="40" y="111" width="118" height="50" as="geometry"/>
                </mxCell>
                <mxCell id="4URYS8IVdaSAiPS1KO5_-10" value="&lt;font style=&quot;font-size: 12px&quot;&gt;Pull Price&lt;br&gt;&lt;/font&gt;" style="rhombus;whiteSpace=wrap;html=1;rounded=0;fontSize=16;strokeWidth=1;fillColor=#76608a;strokeColor=#432D57;fontColor=#ffffff;" parent="4URYS8IVdaSAiPS1KO5_-67" vertex="1">
                    <mxGeometry x="152" y="276" width="138" height="70" as="geometry"/>
                </mxCell>
                <mxCell id="4URYS8IVdaSAiPS1KO5_-25" value="&lt;font style=&quot;font-size: 8px&quot;&gt;&lt;b&gt;NO&lt;/b&gt;&lt;/font&gt;" style="text;html=1;strokeColor=none;fillColor=none;align=center;verticalAlign=middle;whiteSpace=wrap;rounded=0;shadow=0;fontFamily=Verdana;fontColor=#990000;" parent="4URYS8IVdaSAiPS1KO5_-67" vertex="1">
                    <mxGeometry x="124" y="292" width="40" height="20" as="geometry"/>
                </mxCell>
                <mxCell id="59" value="&lt;font&gt;&lt;font style=&quot;font-size: 11px&quot;&gt;Establish &lt;br&gt;Connection&lt;/font&gt;&lt;br&gt;&lt;/font&gt;" style="rhombus;whiteSpace=wrap;html=1;rounded=0;fontSize=16;strokeWidth=1;fillColor=#76608a;strokeColor=#432D57;fontColor=#ffffff;" vertex="1" parent="4URYS8IVdaSAiPS1KO5_-67">
                    <mxGeometry x="48" y="191" width="118" height="59" as="geometry"/>
                </mxCell>
                <mxCell id="61" value="" style="endArrow=classic;html=1;fontFamily=Verdana;fontSize=16;fillColor=#d5e8d4;strokeColor=#82b366;strokeWidth=2;entryX=0.5;entryY=0;entryDx=0;entryDy=0;exitX=0.5;exitY=1;exitDx=0;exitDy=0;" edge="1" parent="4URYS8IVdaSAiPS1KO5_-67" source="32" target="34">
                    <mxGeometry width="50" height="50" relative="1" as="geometry">
                        <mxPoint x="209.75" y="171.9861111111111" as="sourcePoint"/>
                        <mxPoint x="192" y="285.9999999999999" as="targetPoint"/>
                    </mxGeometry>
                </mxCell>
                <mxCell id="62" value="" style="endArrow=classic;html=1;fontFamily=Verdana;fontSize=16;fillColor=#d5e8d4;strokeColor=#82b366;strokeWidth=2;" edge="1" parent="4URYS8IVdaSAiPS1KO5_-67" source="34" target="59">
                    <mxGeometry width="50" height="50" relative="1" as="geometry">
                        <mxPoint x="97.5" y="161" as="sourcePoint"/>
                        <mxPoint x="99" y="191" as="targetPoint"/>
                    </mxGeometry>
                </mxCell>
                <mxCell id="63" value="" style="endArrow=classic;html=1;fontFamily=Verdana;fontSize=16;fillColor=#d5e8d4;strokeColor=#82b366;strokeWidth=2;entryX=0.5;entryY=0;entryDx=0;entryDy=0;exitX=1;exitY=0.5;exitDx=0;exitDy=0;" edge="1" parent="4URYS8IVdaSAiPS1KO5_-67" source="59" target="4URYS8IVdaSAiPS1KO5_-10">
                    <mxGeometry width="50" height="50" relative="1" as="geometry">
                        <mxPoint x="109" y="171" as="sourcePoint"/>
                        <mxPoint x="109" y="201" as="targetPoint"/>
                        <Array as="points">
                            <mxPoint x="221" y="221"/>
                        </Array>
                    </mxGeometry>
                </mxCell>
                <mxCell id="64" value="&lt;font style=&quot;font-size: 8px&quot;&gt;&lt;b&gt;YES&lt;/b&gt;&lt;/font&gt;" style="text;html=1;strokeColor=none;fillColor=none;align=center;verticalAlign=middle;whiteSpace=wrap;rounded=0;shadow=0;fontFamily=Verdana;fontColor=#5E824A;" vertex="1" parent="4URYS8IVdaSAiPS1KO5_-67">
                    <mxGeometry x="158" y="201" width="40" height="20" as="geometry"/>
                </mxCell>
                <mxCell id="4URYS8IVdaSAiPS1KO5_-13" value="&lt;font face=&quot;Helvetica&quot;&gt;Log Error Message&lt;/font&gt;" style="rounded=0;whiteSpace=wrap;html=1;shadow=0;labelBackgroundColor=none;strokeWidth=2;fontFamily=Verdana;fontSize=12;align=center;fillColor=#647687;strokeColor=#CC0000;fontColor=#ffffff;" parent="4URYS8IVdaSAiPS1KO5_-67" vertex="1">
                    <mxGeometry x="28" y="413" width="120" height="70" as="geometry"/>
                </mxCell>
                <mxCell id="4URYS8IVdaSAiPS1KO5_-71" value="" style="edgeStyle=orthogonalEdgeStyle;rounded=1;orthogonalLoop=1;jettySize=auto;html=1;fontFamily=Verdana;fontSize=15;fontColor=#5E824A;strokeColor=#990000;strokeWidth=2;" parent="4URYS8IVdaSAiPS1KO5_-67" source="4URYS8IVdaSAiPS1KO5_-13" target="4URYS8IVdaSAiPS1KO5_-70" edge="1">
                    <mxGeometry relative="1" as="geometry"/>
                </mxCell>
                <mxCell id="4URYS8IVdaSAiPS1KO5_-15" value="" style="endArrow=classic;html=1;fontSize=16;exitX=0;exitY=0.5;exitDx=0;exitDy=0;fillColor=#f8cecc;strokeColor=#b85450;strokeWidth=2;" parent="4URYS8IVdaSAiPS1KO5_-67" source="4URYS8IVdaSAiPS1KO5_-10" target="4URYS8IVdaSAiPS1KO5_-13" edge="1">
                    <mxGeometry width="50" height="50" relative="1" as="geometry">
                        <mxPoint x="431" y="321" as="sourcePoint"/>
                        <mxPoint x="121" y="460" as="targetPoint"/>
                        <Array as="points">
                            <mxPoint x="88" y="311"/>
                        </Array>
                    </mxGeometry>
                </mxCell>
                <mxCell id="68" value="" style="endArrow=classic;html=1;fontSize=16;fillColor=#f8cecc;strokeColor=#b85450;strokeWidth=2;" edge="1" parent="4URYS8IVdaSAiPS1KO5_-67" source="59" target="4URYS8IVdaSAiPS1KO5_-13">
                    <mxGeometry width="50" height="50" relative="1" as="geometry">
                        <mxPoint x="30" y="221" as="sourcePoint"/>
                        <mxPoint x="8" y="323" as="targetPoint"/>
                        <Array as="points">
                            <mxPoint x="20" y="221"/>
                            <mxPoint x="20" y="311"/>
                            <mxPoint x="88" y="311"/>
                        </Array>
                    </mxGeometry>
                </mxCell>
                <mxCell id="69" value="&lt;font style=&quot;font-size: 8px&quot;&gt;&lt;b&gt;NO&lt;/b&gt;&lt;/font&gt;" style="text;html=1;strokeColor=none;fillColor=none;align=center;verticalAlign=middle;whiteSpace=wrap;rounded=0;shadow=0;fontFamily=Verdana;fontColor=#990000;" vertex="1" parent="4URYS8IVdaSAiPS1KO5_-67">
                    <mxGeometry x="23" y="201" width="40" height="20" as="geometry"/>
                </mxCell>
                <mxCell id="4URYS8IVdaSAiPS1KO5_-69" value="&lt;font color=&quot;#000000&quot;&gt;Decide Position&lt;/font&gt;" style="swimlane;rounded=0;shadow=0;fontFamily=Verdana;fontSize=15;fontColor=#333333;strokeColor=#666666;strokeWidth=2;html=1;fontStyle=0;fillColor=#f5f5f5;" parent="1" vertex="1">
                    <mxGeometry x="400" y="69" width="560" height="660" as="geometry"/>
                </mxCell>
                <mxCell id="4URYS8IVdaSAiPS1KO5_-6" value="&lt;font face=&quot;Helvetica&quot;&gt;Compare Price to BASELINE&lt;br&gt;(over/under)&lt;/font&gt;" style="rounded=0;whiteSpace=wrap;html=1;shadow=0;labelBackgroundColor=none;strokeWidth=1;fontFamily=Verdana;fontSize=12;align=center;fillColor=#647687;strokeColor=#314354;fontColor=#ffffff;" parent="4URYS8IVdaSAiPS1KO5_-69" vertex="1">
                    <mxGeometry x="87" y="278" width="117" height="66" as="geometry"/>
                </mxCell>
                <mxCell id="4URYS8IVdaSAiPS1KO5_-12" value="&lt;font style=&quot;font-size: 12px&quot;&gt;Threshold Crossed&lt;br&gt;&lt;/font&gt;" style="rhombus;whiteSpace=wrap;html=1;rounded=0;fontSize=16;strokeWidth=1;fillColor=#76608a;strokeColor=#432D57;fontColor=#ffffff;" parent="4URYS8IVdaSAiPS1KO5_-69" vertex="1">
                    <mxGeometry x="179" y="128" width="148" height="74" as="geometry"/>
                </mxCell>
                <mxCell id="4URYS8IVdaSAiPS1KO5_-16" style="edgeStyle=orthogonalEdgeStyle;rounded=0;orthogonalLoop=1;jettySize=auto;html=1;exitX=0.5;exitY=1;exitDx=0;exitDy=0;fontSize=16;" parent="4URYS8IVdaSAiPS1KO5_-69" source="4URYS8IVdaSAiPS1KO5_-12" target="4URYS8IVdaSAiPS1KO5_-12" edge="1">
                    <mxGeometry relative="1" as="geometry"/>
                </mxCell>
                <mxCell id="4URYS8IVdaSAiPS1KO5_-22" value="" style="endArrow=classic;html=1;fontFamily=Verdana;fontSize=16;fillColor=#d5e8d4;strokeWidth=2;strokeColor=#82B366;" parent="4URYS8IVdaSAiPS1KO5_-69" source="4URYS8IVdaSAiPS1KO5_-6" target="4URYS8IVdaSAiPS1KO5_-12" edge="1">
                    <mxGeometry width="50" height="50" relative="1" as="geometry">
                        <mxPoint x="207" y="284" as="sourcePoint"/>
                        <mxPoint x="193" y="578" as="targetPoint"/>
                        <Array as="points">
                            <mxPoint x="253" y="311"/>
                        </Array>
                    </mxGeometry>
                </mxCell>
                <mxCell id="4URYS8IVdaSAiPS1KO5_-27" value="&lt;font style=&quot;font-size: 10px&quot;&gt;&lt;b style=&quot;font-size: 10px&quot;&gt;Yes&lt;/b&gt;&lt;/font&gt;" style="text;html=1;strokeColor=none;fillColor=none;align=center;verticalAlign=middle;whiteSpace=wrap;rounded=0;shadow=0;fontFamily=Verdana;fontSize=10;fontColor=#865AAD;" parent="4URYS8IVdaSAiPS1KO5_-69" vertex="1">
                    <mxGeometry x="318" y="145" width="40" height="20" as="geometry"/>
                </mxCell>
                <mxCell id="4URYS8IVdaSAiPS1KO5_-29" value="" style="endArrow=classic;html=1;fontFamily=Verdana;fontSize=16;exitX=1;exitY=0.5;exitDx=0;exitDy=0;fillColor=#647687;strokeWidth=2;entryX=0.5;entryY=0;entryDx=0;entryDy=0;strokeColor=#865AAD;" parent="4URYS8IVdaSAiPS1KO5_-69" source="4URYS8IVdaSAiPS1KO5_-12" target="10" edge="1">
                    <mxGeometry width="50" height="50" relative="1" as="geometry">
                        <mxPoint x="327" y="181" as="sourcePoint"/>
                        <mxPoint x="387" y="444" as="targetPoint"/>
                        <Array as="points">
                            <mxPoint x="363" y="165"/>
                        </Array>
                    </mxGeometry>
                </mxCell>
                <mxCell id="4URYS8IVdaSAiPS1KO5_-28" value="&lt;font style=&quot;font-size: 10px&quot;&gt;No&lt;/font&gt;" style="text;html=1;strokeColor=none;fillColor=none;align=center;verticalAlign=middle;whiteSpace=wrap;rounded=0;shadow=0;fontFamily=Verdana;fontStyle=1;fontSize=10;fontColor=#5E824A;" parent="4URYS8IVdaSAiPS1KO5_-69" vertex="1">
                    <mxGeometry x="148" y="145" width="40" height="20" as="geometry"/>
                </mxCell>
                <mxCell id="10" value="&lt;font style=&quot;font-size: 12px&quot;&gt;New Trend&lt;br&gt;&lt;/font&gt;" style="rhombus;whiteSpace=wrap;html=1;rounded=0;fontSize=16;strokeWidth=1;fillColor=#76608a;strokeColor=#432D57;fontColor=#ffffff;" vertex="1" parent="4URYS8IVdaSAiPS1KO5_-69">
                    <mxGeometry x="289" y="327" width="148" height="74" as="geometry"/>
                </mxCell>
                <mxCell id="12" value="" style="endArrow=classic;html=1;fontFamily=Verdana;fontSize=16;exitX=1;exitY=0.5;exitDx=0;exitDy=0;fillColor=#76608a;strokeWidth=2;strokeColor=#865AAD;" edge="1" parent="4URYS8IVdaSAiPS1KO5_-69" source="10">
                    <mxGeometry width="50" height="50" relative="1" as="geometry">
                        <mxPoint x="523" y="344" as="sourcePoint"/>
                        <mxPoint x="477" y="414" as="targetPoint"/>
                        <Array as="points">
                            <mxPoint x="477" y="364"/>
                        </Array>
                    </mxGeometry>
                </mxCell>
                <mxCell id="13" value="&lt;font style=&quot;font-size: 10px&quot;&gt;&lt;b style=&quot;font-size: 10px&quot;&gt;Bull&lt;/b&gt;&lt;/font&gt;" style="text;html=1;strokeColor=none;fillColor=none;align=center;verticalAlign=middle;whiteSpace=wrap;rounded=0;shadow=0;fontFamily=Verdana;fontSize=10;fontColor=#865AAD;" vertex="1" parent="4URYS8IVdaSAiPS1KO5_-69">
                    <mxGeometry x="253" y="344" width="40" height="20" as="geometry"/>
                </mxCell>
                <mxCell id="14" value="&lt;font style=&quot;font-size: 10px&quot;&gt;&lt;b style=&quot;font-size: 10px&quot;&gt;Bear&lt;/b&gt;&lt;/font&gt;" style="text;html=1;strokeColor=none;fillColor=none;align=center;verticalAlign=middle;whiteSpace=wrap;rounded=0;shadow=0;fontFamily=Verdana;fontSize=10;fontColor=#865AAD;" vertex="1" parent="4URYS8IVdaSAiPS1KO5_-69">
                    <mxGeometry x="437" y="344" width="40" height="20" as="geometry"/>
                </mxCell>
                <mxCell id="15" value="&lt;font face=&quot;Helvetica&quot;&gt;Innitiate Buy &lt;br&gt;Position&lt;/font&gt;" style="rounded=0;whiteSpace=wrap;html=1;shadow=0;labelBackgroundColor=none;strokeWidth=1;fontFamily=Verdana;fontSize=12;align=center;fillColor=#647687;strokeColor=#314354;fontColor=#ffffff;" vertex="1" parent="4URYS8IVdaSAiPS1KO5_-69">
                    <mxGeometry x="189" y="414" width="117" height="66" as="geometry"/>
                </mxCell>
                <mxCell id="16" value="&lt;font face=&quot;Helvetica&quot;&gt;Innitiate Sell&lt;br&gt;Position&lt;br&gt;&lt;/font&gt;" style="rounded=0;whiteSpace=wrap;html=1;shadow=0;labelBackgroundColor=none;strokeWidth=1;fontFamily=Verdana;fontSize=12;align=center;fillColor=#647687;strokeColor=#314354;fontColor=#ffffff;" vertex="1" parent="4URYS8IVdaSAiPS1KO5_-69">
                    <mxGeometry x="417" y="414" width="117" height="66" as="geometry"/>
                </mxCell>
                <mxCell id="17" value="&lt;font&gt;&lt;font style=&quot;font-size: 11px&quot;&gt;Successfull Change &lt;br&gt;in Position&lt;/font&gt;&lt;br&gt;&lt;/font&gt;" style="rhombus;whiteSpace=wrap;html=1;rounded=0;fontSize=16;strokeWidth=1;fillColor=#76608a;strokeColor=#432D57;fontColor=#ffffff;" vertex="1" parent="4URYS8IVdaSAiPS1KO5_-69">
                    <mxGeometry x="289" y="554" width="148" height="84" as="geometry"/>
                </mxCell>
                <mxCell id="18" value="" style="endArrow=classic;html=1;fontFamily=Verdana;fontSize=16;fillColor=#d5e8d4;strokeWidth=2;exitX=0.5;exitY=1;exitDx=0;exitDy=0;entryX=0.5;entryY=0;entryDx=0;entryDy=0;strokeColor=#865AAD;" edge="1" parent="4URYS8IVdaSAiPS1KO5_-69" source="15">
                    <mxGeometry width="50" height="50" relative="1" as="geometry">
                        <mxPoint x="277" y="540" as="sourcePoint"/>
                        <mxPoint x="363" y="554" as="targetPoint"/>
                        <Array as="points">
                            <mxPoint x="247" y="524"/>
                            <mxPoint x="363" y="524"/>
                        </Array>
                    </mxGeometry>
                </mxCell>
                <mxCell id="19" value="" style="endArrow=classic;html=1;fontFamily=Verdana;fontSize=16;fillColor=#d5e8d4;strokeWidth=2;exitX=0.5;exitY=1;exitDx=0;exitDy=0;entryX=0.5;entryY=0;entryDx=0;entryDy=0;strokeColor=#865AAD;" edge="1" parent="4URYS8IVdaSAiPS1KO5_-69" source="16">
                    <mxGeometry width="50" height="50" relative="1" as="geometry">
                        <mxPoint x="257.5" y="504" as="sourcePoint"/>
                        <mxPoint x="363" y="554" as="targetPoint"/>
                        <Array as="points">
                            <mxPoint x="476" y="524"/>
                            <mxPoint x="363" y="524"/>
                        </Array>
                    </mxGeometry>
                </mxCell>
                <mxCell id="25" value="&lt;font style=&quot;font-size: 11px&quot;&gt;User Input: &lt;br&gt;Threshold &lt;br&gt;Percentage&lt;/font&gt;" style="shape=parallelogram;perimeter=parallelogramPerimeter;whiteSpace=wrap;html=1;fixedSize=1;fontSize=10;fontColor=#ffffff;fillColor=#a0522d;strokeColor=#6D1F00;" vertex="1" parent="4URYS8IVdaSAiPS1KO5_-69">
                    <mxGeometry x="380" y="61" width="120" height="60" as="geometry"/>
                </mxCell>
                <mxCell id="20" value="&lt;font style=&quot;font-size: 8px&quot;&gt;&lt;b&gt;NO&lt;/b&gt;&lt;/font&gt;" style="text;html=1;strokeColor=none;fillColor=none;align=center;verticalAlign=middle;whiteSpace=wrap;rounded=0;shadow=0;fontFamily=Verdana;fontColor=#990000;" vertex="1" parent="4URYS8IVdaSAiPS1KO5_-69">
                    <mxGeometry x="260" y="574" width="40" height="20" as="geometry"/>
                </mxCell>
                <mxCell id="24" value="&lt;font style=&quot;font-size: 8px&quot;&gt;&lt;b&gt;YES&lt;/b&gt;&lt;/font&gt;" style="text;html=1;strokeColor=none;fillColor=none;align=center;verticalAlign=middle;whiteSpace=wrap;rounded=0;shadow=0;fontFamily=Verdana;fontColor=#5E824A;" vertex="1" parent="4URYS8IVdaSAiPS1KO5_-69">
                    <mxGeometry x="430" y="574" width="40" height="20" as="geometry"/>
                </mxCell>
                <mxCell id="11" value="" style="endArrow=classic;html=1;fontFamily=Verdana;fontSize=16;exitX=0;exitY=0.5;exitDx=0;exitDy=0;fillColor=#76608a;strokeWidth=2;entryX=0.5;entryY=0;entryDx=0;entryDy=0;strokeColor=#865AAD;" edge="1" parent="4URYS8IVdaSAiPS1KO5_-69" source="10" target="15">
                    <mxGeometry width="50" height="50" relative="1" as="geometry">
                        <mxPoint x="257" y="344" as="sourcePoint"/>
                        <mxPoint x="293" y="414" as="targetPoint"/>
                        <Array as="points">
                            <mxPoint x="293" y="364"/>
                            <mxPoint x="248" y="364"/>
                        </Array>
                    </mxGeometry>
                </mxCell>
                <mxCell id="60" value="" style="endArrow=classic;html=1;fontFamily=Verdana;fontSize=16;fillColor=#f0a30a;strokeWidth=2;strokeColor=#BD7000;entryX=0.5;entryY=0;entryDx=0;entryDy=0;" edge="1" parent="4URYS8IVdaSAiPS1KO5_-69" source="25" target="4URYS8IVdaSAiPS1KO5_-12">
                    <mxGeometry width="50" height="50" relative="1" as="geometry">
                        <mxPoint x="300" y="71" as="sourcePoint"/>
                        <mxPoint x="340" y="121" as="targetPoint"/>
                        <Array as="points">
                            <mxPoint x="253" y="91"/>
                        </Array>
                    </mxGeometry>
                </mxCell>
                <mxCell id="31" value="&lt;font face=&quot;Helvetica&quot;&gt;Update &lt;br&gt;BASELINE&lt;/font&gt;" style="rounded=0;whiteSpace=wrap;html=1;shadow=0;labelBackgroundColor=none;strokeWidth=1;fontFamily=Verdana;fontSize=12;align=center;fillColor=#647687;strokeColor=#314354;fontColor=#ffffff;" vertex="1" parent="4URYS8IVdaSAiPS1KO5_-69">
                    <mxGeometry x="20" y="140" width="90" height="50" as="geometry"/>
                </mxCell>
                <mxCell id="23" value="" style="endArrow=classic;html=1;fontFamily=Verdana;fontSize=16;exitX=1;exitY=0.5;exitDx=0;exitDy=0;fillColor=#647687;strokeWidth=2;strokeColor=#82B366;" edge="1" parent="4URYS8IVdaSAiPS1KO5_-69" source="17" target="31">
                    <mxGeometry width="50" height="50" relative="1" as="geometry">
                        <mxPoint x="734" y="605" as="sourcePoint"/>
                        <mxPoint x="-11.750000000000227" y="165" as="targetPoint"/>
                        <Array as="points">
                            <mxPoint x="550" y="596"/>
                            <mxPoint x="550" y="41"/>
                            <mxPoint x="150" y="41"/>
                            <mxPoint x="150" y="165"/>
                        </Array>
                    </mxGeometry>
                </mxCell>
                <mxCell id="5" value="" style="endArrow=classic;html=1;fontFamily=Verdana;fontSize=16;exitX=0;exitY=0.5;exitDx=0;exitDy=0;fillColor=#647687;strokeWidth=2;strokeColor=#82B366;" edge="1" parent="4URYS8IVdaSAiPS1KO5_-69" source="4URYS8IVdaSAiPS1KO5_-12" target="31">
                    <mxGeometry width="50" height="50" relative="1" as="geometry">
                        <mxPoint x="164" y="181.5" as="sourcePoint"/>
                        <mxPoint x="-11.750000000000227" y="165" as="targetPoint"/>
                    </mxGeometry>
                </mxCell>
                <mxCell id="65" value="&lt;font face=&quot;Helvetica&quot;&gt;Stream To Dash &lt;font style=&quot;font-size: 10px&quot;&gt;Local Host:8081&lt;/font&gt;&lt;/font&gt;" style="rounded=0;whiteSpace=wrap;html=1;shadow=0;labelBackgroundColor=none;strokeWidth=1;fontFamily=Verdana;fontSize=12;align=center;fillColor=#647687;strokeColor=#314354;fontColor=#ffffff;" vertex="1" parent="4URYS8IVdaSAiPS1KO5_-69">
                    <mxGeometry x="10.75" y="41" width="108.5" height="50" as="geometry"/>
                </mxCell>
                <mxCell id="4URYS8IVdaSAiPS1KO5_-19" value="" style="endArrow=classic;html=1;fontFamily=Verdana;fontSize=16;fillColor=#d5e8d4;strokeColor=#82b366;strokeWidth=2;" parent="4URYS8IVdaSAiPS1KO5_-69" source="31" target="65" edge="1">
                    <mxGeometry width="50" height="50" relative="1" as="geometry">
                        <mxPoint x="-221" y="160" as="sourcePoint"/>
                        <mxPoint x="-65" y="141" as="targetPoint"/>
                    </mxGeometry>
                </mxCell>
                <mxCell id="4URYS8IVdaSAiPS1KO5_-21" value="" style="endArrow=classic;html=1;fontFamily=Verdana;fontSize=16;fillColor=#d5e8d4;strokeColor=#82b366;strokeWidth=2;" parent="1" source="4URYS8IVdaSAiPS1KO5_-10" target="4URYS8IVdaSAiPS1KO5_-6" edge="1">
                    <mxGeometry width="50" height="50" relative="1" as="geometry">
                        <mxPoint x="427" y="433" as="sourcePoint"/>
                        <mxPoint x="555" y="310" as="targetPoint"/>
                    </mxGeometry>
                </mxCell>
                <mxCell id="21" value="" style="endArrow=classic;html=1;fontSize=16;exitX=0;exitY=0.5;exitDx=0;exitDy=0;fillColor=#f8cecc;strokeColor=#b85450;strokeWidth=2;" edge="1" parent="1" source="17" target="4URYS8IVdaSAiPS1KO5_-13">
                    <mxGeometry width="50" height="50" relative="1" as="geometry">
                        <mxPoint x="533" y="381" as="sourcePoint"/>
                        <mxPoint x="325" y="564" as="targetPoint"/>
                        <Array as="points">
                            <mxPoint x="565" y="665"/>
                            <mxPoint x="565" y="517"/>
                        </Array>
                    </mxGeometry>
                </mxCell>
                <mxCell id="70" value="" style="endArrow=classic;html=1;fontFamily=Verdana;fontSize=16;fillColor=#d5e8d4;strokeColor=#82b366;strokeWidth=2;" edge="1" parent="1" source="31" target="4URYS8IVdaSAiPS1KO5_-10">
                    <mxGeometry width="50" height="50" relative="1" as="geometry">
                        <mxPoint x="435" y="244" as="sourcePoint"/>
                        <mxPoint x="366.5" y="244" as="targetPoint"/>
                        <Array as="points">
                            <mxPoint x="251" y="234"/>
                        </Array>
                    </mxGeometry>
                </mxCell>
            </root>
        </mxGraphModel>
    </diagram>
</mxfile>