module pricing_verification

go 1.20

require github.com/jedib0t/go-pretty/v6 v6.4.6

require (
	github.com/mattn/go-runewidth v0.0.13 // indirect
	github.com/rivo/uniseg v0.2.0 // indirect
	golang.org/x/sys v0.1.0 // indirect
)
