<svg width="20" height="20" viewBox="0 0 20 20" fill="none" xmlns="http://www.w3.org/2000/svg">
<g id="Phosphor Icons / User">
<path id="Vector" d="M10 12.5C12.7614 12.5 15 10.2614 15 7.5C15 4.73858 12.7614 2.5 10 2.5C7.23858 2.5 5 4.73858 5 7.5C5 10.2614 7.23858 12.5 10 12.5Z" stroke="#3565C3" stroke-miterlimit="10"/>
<path id="Vector_2" d="M2.42188 16.8747C3.18979 15.5444 4.2944 14.4396 5.62465 13.6715C6.9549 12.9034 8.46392 12.499 10 12.499C11.5361 12.499 13.0451 12.9034 14.3753 13.6715C15.7056 14.4396 16.8102 15.5444 17.5781 16.8747" stroke="#3565C3" stroke-linecap="round" stroke-linejoin="round"/>
</g>
</svg>
