<svg width="14" height="14" viewBox="0 0 14 14" fill="none" xmlns="http://www.w3.org/2000/svg">
<g id="coins-stack--accounting-billing-payment-stack-cash-coins-currency-money-finance" clip-path="url(#clip0_6001_203486)">
<g id="coins-stack--accounting-billing-payment-stack-cash-coins-currency-money-finance_2">
<path id="Subtract" fill-rule="evenodd" clip-rule="evenodd" d="M0.121094 7.28567V2C0.121094 0.89543 2.13581 0 4.62109 0C7.10637 0 9.12109 0.89543 9.12109 2V3.47054C7.88533 3.51118 6.72461 3.75088 5.80888 4.15788C5.30623 4.38127 4.82208 4.67966 4.44667 5.07413C4.06513 5.47505 3.74853 6.03149 3.74853 6.71436V9.24829C1.67151 9.06764 0.121094 8.25418 0.121094 7.28567Z" fill="#CFE2FD"/>
<path id="Subtract_2" fill-rule="evenodd" clip-rule="evenodd" d="M5 6.71484V12.0005C5 13.1005 7 14.0005 9.5 14.0005C12 14.0005 14 13.1005 14 12.0005V6.71484C14 5.61027 11.9853 4.71484 9.5 4.71484C7.01472 4.71484 5 5.61027 5 6.71484Z" fill="#CFE2FD"/>
<path id="Intersect" fill-rule="evenodd" clip-rule="evenodd" d="M14 8.53906C13.9749 8.63514 13.9131 8.75172 13.7843 8.88767C13.5992 9.08294 13.3018 9.28754 12.8858 9.47315C12.0553 9.84367 10.861 10.0899 9.49991 10.0899C8.13878 10.0899 6.94453 9.84367 6.11404 9.47315C5.69803 9.28754 5.40057 9.08294 5.21552 8.88767C5.08699 8.75205 5.02521 8.63569 5 8.53975V10.2977C5.18829 10.4139 5.39131 10.5195 5.60474 10.6147C6.6302 11.0722 8.00573 11.3399 9.49991 11.3399C10.9941 11.3399 12.3696 11.0722 13.3951 10.6147C13.6086 10.5194 13.8117 10.4138 14 10.2976V8.53906Z" fill="#3F8BF8"/>
<path id="Intersect_2" fill-rule="evenodd" clip-rule="evenodd" d="M4.20244 5.36654C3.95909 5.7027 3.77804 6.11531 3.75181 6.59368C2.59741 6.51129 1.54886 6.26635 0.725832 5.89915C0.512401 5.80393 0.30938 5.69836 0.121094 5.5822V3.82422C0.146303 3.92016 0.208081 4.03651 0.336616 4.17214C0.521669 4.3674 0.819122 4.57201 1.23513 4.75761C1.97935 5.08965 3.01568 5.32188 4.20244 5.36654Z" fill="#3F8BF8"/>
<path id="Vector" d="M4.62268 2.93228C6.35807 2.93228 7.76488 2.52771 7.76488 2.02864C7.76488 1.52958 6.35807 1.125 4.62268 1.125C2.88729 1.125 1.48047 1.52958 1.48047 2.02864C1.48047 2.52771 2.88729 2.93228 4.62268 2.93228Z" fill="#3F8BF8"/>
<path id="Vector_2" d="M9.49767 7.64711C11.2331 7.64711 12.6399 7.24254 12.6399 6.74348C12.6399 6.24441 11.2331 5.83984 9.49767 5.83984C7.76228 5.83984 6.35547 6.24441 6.35547 6.74348C6.35547 7.24254 7.76228 7.64711 9.49767 7.64711Z" fill="#3F8BF8"/>
</g>
</g>
<defs>
<clipPath id="clip0_6001_203486">
<rect width="14" height="14" fill="white"/>
</clipPath>
</defs>
</svg>
