<svg width="20" height="20" viewBox="0 0 20 20" fill="none" xmlns="http://www.w3.org/2000/svg">
<g id="Phosphor Icons / Desktop">
<path id="Vector" d="M3.75 15L16.25 15C16.9404 15 17.5 14.4404 17.5 13.75V5C17.5 4.30964 16.9404 3.75 16.25 3.75L3.75 3.75C3.05964 3.75 2.5 4.30964 2.5 5L2.5 13.75C2.5 14.4404 3.05964 15 3.75 15Z" stroke="#0F6EF6" stroke-width="1.4" stroke-linecap="round" stroke-linejoin="round"/>
<path id="Vector_2" d="M12.5 17.5H7.5" stroke="#0F6EF6" stroke-width="1.4" stroke-linecap="round" stroke-linejoin="round"/>
<path id="Vector_3" d="M2.5 11.875H17.5" stroke="#0F6EF6" stroke-width="1.5" stroke-linecap="round" stroke-linejoin="round"/>
<path id="Vector_4" d="M10 15V17.5" stroke="#0F6EF6" stroke-width="1.5" stroke-linecap="round" stroke-linejoin="round"/>
</g>
</svg>
