<svg width="20" height="20" viewBox="0 0 20 20" fill="none" xmlns="http://www.w3.org/2000/svg">
<g id="Phosphor Icons / Info">
<path id="Vector" d="M10 17.5C14.1421 17.5 17.5 14.1421 17.5 10C17.5 5.85786 14.1421 2.5 10 2.5C5.85786 2.5 2.5 5.85786 2.5 10C2.5 14.1421 5.85786 17.5 10 17.5Z" stroke="#3565C3" stroke-linecap="round" stroke-linejoin="round"/>
<path id="Vector_2" d="M9.375 9.375H10V13.75H10.625" stroke="#3565C3" stroke-linecap="round" stroke-linejoin="round"/>
<path id="Vector_3" d="M10.2812 6.5625C10.2812 6.80412 10.0854 7 9.84375 7C9.60213 7 9.40625 6.80412 9.40625 6.5625C9.40625 6.32088 9.60213 6.125 9.84375 6.125C10.0854 6.125 10.2812 6.32088 10.2812 6.5625Z" fill="#3565C3" stroke="#3565C3"/>
</g>
</svg>
