<svg width="20" height="20" viewBox="0 0 20 20" fill="none" xmlns="http://www.w3.org/2000/svg">
<path d="M15 17.5L10 14.375L5 17.5V3.75C5 3.58424 5.06585 3.42527 5.18306 3.30806C5.30027 3.19085 5.45924 3.125 5.625 3.125H14.375C14.5408 3.125 14.6997 3.19085 14.8169 3.30806C14.9342 3.42527 15 3.58424 15 3.75V17.5Z" stroke="#6EA1EB" stroke-linecap="round" stroke-linejoin="round"/>
</svg>
