<svg width="20" height="20" viewBox="0 0 20 20" fill="none" xmlns="http://www.w3.org/2000/svg">
<path d="M7.85668 9.734C9.63177 9.734 11.0708 8.3013 11.0708 6.53399C11.0708 4.76668 9.63177 3.33398 7.85668 3.33398C6.08158 3.33398 4.64258 4.76668 4.64258 6.53399C4.64258 8.3013 6.08158 9.734 7.85668 9.734Z" fill="#CCFAF1"/>
<path d="M2.5 16.1341C2.5 13.1886 4.89834 10.8008 7.85683 10.8008C10.8153 10.8008 13.2137 13.1886 13.2137 16.1341C13.2137 16.4286 12.9738 16.6675 12.678 16.6675H3.03568C2.73983 16.6675 2.5 16.4286 2.5 16.1341Z" fill="#CCFAF1"/>
<path fill-rule="evenodd" clip-rule="evenodd" d="M14.4735 16.6673H16.9618C17.2576 16.6673 17.4975 16.4285 17.4975 16.134C17.4975 13.1885 15.0991 10.8006 12.1406 10.8006C12.0538 10.8006 11.9674 10.8027 11.8816 10.8068C13.503 12.0234 14.5512 13.9568 14.5512 16.134C14.5512 16.3193 14.5241 16.4984 14.4735 16.6673ZM11.2109 9.59808C11.5052 9.68648 11.8174 9.734 12.1406 9.734C13.9158 9.734 15.3547 8.3013 15.3547 6.53399C15.3547 4.76668 13.9158 3.33398 12.1406 3.33398C11.8174 3.33398 11.5052 3.38149 11.2109 3.46989C11.9546 4.27676 12.4085 5.3526 12.4085 6.53399C12.4085 7.71538 11.9546 8.79122 11.2109 9.59808Z" fill="#00E7B7"/>
</svg>
