<svg width="20" height="20" viewBox="0 0 20 20" fill="none" xmlns="http://www.w3.org/2000/svg">
<path d="M7.5 3.75L13.75 10L7.5 16.25" stroke="#3F8BF8" stroke-linecap="round" stroke-linejoin="round"/>
</svg>
