<svg width="16" height="16" viewBox="0 0 16 16" fill="none" xmlns="http://www.w3.org/2000/svg">
<path d="M12.9995 6L7.99951 11L2.99951 6" stroke="#0F6EF6" stroke-linecap="round" stroke-linejoin="round"/>
</svg>
