<svg width="32" height="32" viewBox="0 0 32 32" fill="none" xmlns="http://www.w3.org/2000/svg">
<path d="M16 28C22.6274 28 28 22.6274 28 16C28 9.37258 22.6274 4 16 4C9.37258 4 4 9.37258 4 16C4 22.6274 9.37258 28 16 28Z" stroke="#6EA1EB" stroke-width="1.5" stroke-miterlimit="10"/>
<path d="M16.7617 20.2367L20.9992 15.9992L16.7617 11.7617" stroke="#6EA1EB" stroke-width="1.5" stroke-linecap="round" stroke-linejoin="round"/>
<path d="M11 16H21" stroke="#6EA1EB" stroke-width="1.5" stroke-linecap="round" stroke-linejoin="round"/>
</svg>
