<svg width="24" height="24" viewBox="0 0 24 24" fill="none" xmlns="http://www.w3.org/2000/svg">
<path d="M12 16.5C14.4853 16.5 16.5 14.4853 16.5 12C16.5 9.51472 14.4853 7.5 12 7.5C9.51472 7.5 7.5 9.51472 7.5 12C7.5 14.4853 9.51472 16.5 12 16.5Z" stroke="#3F8BF8" stroke-width="1.4" stroke-linecap="round" stroke-linejoin="round"/>
<path d="M17.2213 6.10156C17.4588 6.32031 17.6838 6.54531 17.8963 6.77656L20.4557 7.14219C20.8727 7.86641 21.1941 8.64161 21.4119 9.44844L19.8557 11.5203C19.8557 11.5203 19.8838 12.1578 19.8557 12.4766L21.4119 14.5484C21.1951 15.3556 20.8736 16.1309 20.4557 16.8547L17.8963 17.2203C17.8963 17.2203 17.4557 17.6797 17.2213 17.8953L16.8557 20.4547C16.1314 20.8717 15.3562 21.1931 14.5494 21.4109L12.4775 19.8547C12.1594 19.8828 11.8394 19.8828 11.5213 19.8547L9.44941 21.4109C8.64225 21.1941 7.86692 20.8727 7.14316 20.4547L6.77754 17.8953C6.54629 17.6766 6.32129 17.4516 6.10254 17.2203L3.54316 16.8547C3.12615 16.1305 2.80472 15.3553 2.58691 14.5484L4.14316 12.4766C4.14316 12.4766 4.11504 11.8391 4.14316 11.5203L2.58691 9.44844C2.80371 8.64127 3.12519 7.86594 3.54316 7.14219L6.10254 6.77656C6.32129 6.54531 6.54629 6.32031 6.77754 6.10156L7.14316 3.54219C7.86739 3.12517 8.64259 2.80375 9.44941 2.58594L11.5213 4.14219C11.8394 4.11406 12.1594 4.11406 12.4775 4.14219L14.5494 2.58594C15.3566 2.80274 16.1319 3.12421 16.8557 3.54219L17.2213 6.10156Z" stroke="#3F8BF8" stroke-width="1.4" stroke-linecap="round" stroke-linejoin="round"/>
</svg>
