<svg width="20" height="20" viewBox="0 0 20 20" fill="none" xmlns="http://www.w3.org/2000/svg">
<g id="Phosphor Icons / TrashSimple">
<path id="Vector" d="M16.875 4.375H3.125" stroke="#959EAE" stroke-linecap="round" stroke-linejoin="round"/>
<path id="Vector_2" d="M6.875 1.875H13.125" stroke="#959EAE" stroke-linecap="round" stroke-linejoin="round"/>
<path id="Vector_3" d="M15.625 4.375V16.25C15.625 16.4158 15.5592 16.5747 15.4419 16.6919C15.3247 16.8092 15.1658 16.875 15 16.875H5C4.83424 16.875 4.67527 16.8092 4.55806 16.6919C4.44085 16.5747 4.375 16.4158 4.375 16.25V4.375" stroke="#959EAE" stroke-linecap="round" stroke-linejoin="round"/>
</g>
</svg>
