<svg width="24" height="24" viewBox="0 0 24 24" fill="none" xmlns="http://www.w3.org/2000/svg">
<path fill-rule="evenodd" clip-rule="evenodd" d="M5.14286 4C4.51167 4 4 4.51167 4 5.14286V12C4 12.6312 4.51167 13.1429 5.14286 13.1429H9.71429C10.3455 13.1429 10.8571 12.6312 10.8571 12V5.14286C10.8571 4.51167 10.3455 4 9.71429 4H5.14286ZM13.1429 5.14286C13.1429 4.51167 13.6545 4 14.2857 4H18.8571C19.4883 4 20 4.51167 20 5.14286V7.44C20 8.07118 19.4883 8.58286 18.8571 8.58286H14.2857C13.6545 8.58286 13.1429 8.07118 13.1429 7.44V5.14286ZM13.1429 12C13.1429 11.3688 13.6545 10.8571 14.2857 10.8571H18.8571C19.4883 10.8571 20 11.3688 20 12V18.8571C20 19.4883 19.4883 20 18.8571 20H14.2857C13.6545 20 13.1429 19.4883 13.1429 18.8571V12ZM4 16.56C4 15.9288 4.51167 15.4171 5.14286 15.4171H9.71429C10.3455 15.4171 10.8571 15.9288 10.8571 16.56V18.8571C10.8571 19.4883 10.3455 20 9.71429 20H5.14286C4.51167 20 4 19.4883 4 18.8571V16.56Z" fill="#CFE2FD"/>
</svg>
