<svg width="14" height="14" viewBox="0 0 14 14" fill="none" xmlns="http://www.w3.org/2000/svg">
<g id="bank--institution-saving-bank-payment-finance" clip-path="url(#clip0_6001_194518)">
<g id="bank--institution-saving-bank-payment-finance_2">
<path id="Subtract" fill-rule="evenodd" clip-rule="evenodd" d="M10.2852 5.93417V10.9882H12.9492V5.93359C12.9366 5.93397 12.924 5.93417 12.9113 5.93417H10.2852Z" fill="#666F82"/>
<path id="Subtract_2" fill-rule="evenodd" clip-rule="evenodd" d="M5.66797 5.93359V10.9876H8.33201V5.93359H5.66797Z" fill="#666F82"/>
<path id="Subtract_3" fill-rule="evenodd" clip-rule="evenodd" d="M1.05078 5.93359V10.9882H3.71482V5.93417H1.08895C1.07617 5.93417 1.06344 5.93398 1.05078 5.93359Z" fill="#666F82"/>
<path id="Union" fill-rule="evenodd" clip-rule="evenodd" d="M6.38647 0.233481C6.57242 0.12409 6.78425 0.0664062 6.99999 0.0664062C7.21574 0.0664062 7.42756 0.12409 7.61351 0.233481C7.62041 0.237539 7.62721 0.241761 7.6339 0.246144L13.5451 4.11696C13.9644 4.39331 14.0916 4.87038 13.9297 5.27783C13.774 5.66963 13.3809 5.93444 12.91 5.93444H1.08999C0.619092 5.93444 0.226011 5.66963 0.070329 5.27783C-0.091571 4.87038 0.0355545 4.39331 0.454834 4.11697L0.456079 4.11614L6.36608 0.246144C6.37277 0.241761 6.37957 0.237539 6.38647 0.233481ZM0 11.8777C0 11.2773 0.57154 10.9885 1 10.9885H13C13.4285 10.9885 14 11.2773 14 11.8777V13.0453C14 13.6457 13.4285 13.9345 13 13.9345H1C0.57154 13.9345 0 13.6457 0 13.0453V11.8777Z" fill="#C9CCD2"/>
</g>
</g>
<defs>
<clipPath id="clip0_6001_194518">
<rect width="14" height="14" fill="white"/>
</clipPath>
</defs>
</svg>
