<svg width="20" height="20" viewBox="0 0 20 20" fill="none" xmlns="http://www.w3.org/2000/svg">
<g id="Phosphor Icons / LogOut">
<path id="Vector 39" d="M11.4609 3.125L16.4609 3.125V16.4583H11.4609" stroke="#3F8BF8" stroke-linecap="round" stroke-linejoin="round"/>
<path id="Vector 40" d="M11.4583 9.74121L3.125 9.74121" stroke="#3F8BF8" stroke-linecap="round" stroke-linejoin="round"/>
<path id="Vector 41" d="M6.45833 6.38916L3.125 9.72249L6.45833 13.0558" stroke="#3F8BF8" stroke-linecap="round" stroke-linejoin="round"/>
</g>
</svg>
