<svg width="20" height="20" viewBox="0 0 20 20" fill="none" xmlns="http://www.w3.org/2000/svg">
<g id="Phosphor Icons / CaretDown">
<path id="Vector" d="M16.25 7.5L10 13.75L3.75 7.5" stroke="#959EAE" stroke-linecap="round" stroke-linejoin="round"/>
</g>
</svg>
