<svg width="24" height="24" viewBox="0 0 24 24" fill="none" xmlns="http://www.w3.org/2000/svg">
<path fill-rule="evenodd" clip-rule="evenodd" d="M12.8583 9.71456C12.8583 9.24118 12.4745 8.85742 12.0011 8.85742C11.5277 8.85742 11.144 9.24118 11.144 9.71456V11.7146H7.42969C6.32512 11.7146 5.42969 12.61 5.42969 13.7146V16.0003C5.42969 16.4737 5.81345 16.8574 6.28683 16.8574C6.76021 16.8574 7.14397 16.4737 7.14397 16.0003V13.7146C7.14397 13.5568 7.27189 13.4289 7.42969 13.4289H11.144V16.0003C11.144 16.4737 11.5277 16.8574 12.0011 16.8574C12.4745 16.8574 12.8583 16.4737 12.8583 16.0003V13.4289H16.5725C16.7304 13.4289 16.8583 13.5568 16.8583 13.7146V16.0003C16.8583 16.4737 17.242 16.8574 17.7154 16.8574C18.1888 16.8574 18.5725 16.4737 18.5725 16.0003V13.7146C18.5725 12.61 17.6771 11.7146 16.5725 11.7146H12.8583V9.71456Z" fill="#033FB4"/>
<path fill-rule="evenodd" clip-rule="evenodd" d="M8.85714 5.14286V9.14286C8.85714 9.77403 9.36882 10.2857 10 10.2857H14C14.6312 10.2857 15.1429 9.77403 15.1429 9.14286V5.14286C15.1429 4.51167 14.6312 4 14 4H10C9.36882 4 8.85714 4.51167 8.85714 5.14286ZM4 16.5714C4 15.9402 4.51167 15.4286 5.14286 15.4286H7.42857C8.05975 15.4286 8.57143 15.9402 8.57143 16.5714V18.8571C8.57143 19.4883 8.05975 20 7.42857 20H5.14286C4.51167 20 4 19.4883 4 18.8571V16.5714ZM9.71429 16.5714C9.71429 15.9402 10.226 15.4286 10.8571 15.4286H13.1429C13.774 15.4286 14.2857 15.9402 14.2857 16.5714V18.8571C14.2857 19.4883 13.774 20 13.1429 20H10.8571C10.226 20 9.71429 19.4883 9.71429 18.8571V16.5714ZM16.5714 15.4286C15.9402 15.4286 15.4286 15.9402 15.4286 16.5714V18.8571C15.4286 19.4883 15.9402 20 16.5714 20H18.8571C19.4883 20 20 19.4883 20 18.8571V16.5714C20 15.9402 19.4883 15.4286 18.8571 15.4286H16.5714Z" fill="#9AB2E1"/>
</svg>
