<svg width="24" height="25" viewBox="0 0 24 25" fill="none" xmlns="http://www.w3.org/2000/svg">
<path d="M21.4286 24C22.8487 24 24 22.8487 24 21.4286V2.57143C24 1.15127 22.8487 0 21.4286 0H2.57143C1.15127 0 0 1.15127 0 2.57143V21.4286C0 22.8487 1.15127 24 2.57143 24H21.4286Z" fill="#9FC5FB"/>
<path fill-rule="evenodd" clip-rule="evenodd" d="M3.42442 6.42969C3.42442 4.77283 4.76756 3.42969 6.42442 3.42969C8.08128 3.42969 9.42442 4.77283 9.42442 6.42969C9.42442 8.08654 8.08128 9.42969 6.42442 9.42969C4.76756 9.42969 3.42442 8.08654 3.42442 6.42969ZM21.4244 24.0011C22.8445 24.0011 23.9958 22.8498 23.9958 21.4297V16.2868L16.6027 11.1116C15.9212 10.6346 14.9956 10.7156 14.4074 11.3038L1.82031 23.8909C2.0567 23.9625 2.3075 24.0011 2.56728 24.0011H21.4244Z" fill="#518FE8"/>
</svg>
