<svg width="24" height="24" viewBox="0 0 24 24" fill="none" xmlns="http://www.w3.org/2000/svg">
<g id="filter-2--funnel-filter-angle-oil">
<path id="Union" fill-rule="evenodd" clip-rule="evenodd" d="M0.857148 0C0.536072 0 0.24192 0.179442 0.0950025 0.464931C-0.0519159 0.750422 -0.0269609 1.09408 0.159661 1.35535L8.57145 13.1319V23.1429C8.57145 23.459 8.74543 23.7494 9.02414 23.8986C9.30285 24.0477 9.64103 24.0314 9.90405 23.8561L15.0469 20.4275C15.2854 20.2686 15.4286 20.001 15.4286 19.7143V13.1319L23.8405 1.35535C24.027 1.09408 24.052 0.750422 23.9051 0.464931C23.7582 0.179442 23.464 0 23.1429 0H0.857148Z" fill="#CDD9F0"/>
</g>
</svg>
