<svg width="24" height="25" viewBox="0 0 24 25" fill="none" xmlns="http://www.w3.org/2000/svg">
<rect width="24" height="25" fill="#EDEDED"/>
<g id="&#226;&#156;&#133; Components">
<path d="M-10263 -1185H5771V6363H-10263V-1185Z" fill="#CACDD8"/>
<g id="image and screen">
<g id="Property 1=Foto">
<g id="landscape-2--photos-photo-landscape-picture-photography-camera-pictures-image">
<path id="Union" d="M21.4286 24C22.8487 24 24 22.8487 24 21.4286V2.57143C24 1.15127 22.8487 0 21.4286 0H2.57143C1.15127 0 0 1.15127 0 2.57143V21.4286C0 22.8487 1.15127 24 2.57143 24H21.4286Z" fill="#C9CCD2"/>
<path id="Union_2" fill-rule="evenodd" clip-rule="evenodd" d="M3.42442 6.42969C3.42442 4.77283 4.76756 3.42969 6.42442 3.42969C8.08128 3.42969 9.42442 4.77283 9.42442 6.42969C9.42442 8.08654 8.08128 9.42969 6.42442 9.42969C4.76756 9.42969 3.42442 8.08654 3.42442 6.42969ZM21.4244 24.0011C22.8445 24.0011 23.9958 22.8498 23.9958 21.4297V16.2868L16.6027 11.1116C15.9212 10.6346 14.9956 10.7156 14.4074 11.3038L1.82031 23.8909C2.0567 23.9625 2.3075 24.0011 2.56728 24.0011H21.4244Z" fill="#979EAA"/>
</g>
</g>
<rect x="-11.5" y="-11.5" width="47" height="155" rx="4.5" stroke="#9747FF" stroke-dasharray="10 5"/>
</g>
<path d="M-10263 -1185V-1186H-10264V-1185H-10263ZM5771 -1185H5772V-1186H5771V-1185ZM5771 6363V6364H5772V6363H5771ZM-10263 6363H-10264V6364H-10263V6363ZM-10263 -1184H5771V-1186H-10263V-1184ZM5770 -1185V6363H5772V-1185H5770ZM5771 6362H-10263V6364H5771V6362ZM-10262 6363V-1185H-10264V6363H-10262Z" fill="#3375F3"/>
</g>
</svg>
