<svg width="22" height="16" viewBox="0 0 22 16" fill="none" xmlns="http://www.w3.org/2000/svg">
<rect x="0.25" y="0.25" width="21.5" height="15.5" rx="1.75" fill="#F4F4F4" stroke="#F5F5F5" stroke-width="0.5"/>
<mask id="mask0_3808_3742" style="mask-type:luminance" maskUnits="userSpaceOnUse" x="0" y="0" width="22" height="16">
<rect x="0.25" y="0.25" width="21.5" height="15.5" rx="1.75" fill="white" stroke="white" stroke-width="0.5"/>
</mask>
<g mask="url(#mask0_3808_3742)">
<path fill-rule="evenodd" clip-rule="evenodd" d="M0 16.0001H22V7.4668H0V16.0001Z" fill="#EB2A50"/>
</g>
</svg>
