<svg width="24" height="24" viewBox="0 0 24 24" fill="none" xmlns="http://www.w3.org/2000/svg">
<path d="M16.5176 9.34766H21.0176V4.84766" stroke="#959EAE" stroke-width="1.5" stroke-linecap="round" stroke-linejoin="round"/>
<path d="M17.8302 17.8313C16.6766 18.9857 15.2066 19.7721 13.6061 20.091C12.0056 20.4099 10.3464 20.2469 8.83856 19.6227C7.33067 18.9984 6.0418 17.941 5.13498 16.5842C4.22816 15.2273 3.74414 13.632 3.74414 12C3.74414 10.368 4.22816 8.7727 5.13498 7.41585C6.0418 6.059 7.33067 5.00158 8.83856 4.37735C10.3464 3.75313 12.0056 3.59014 13.6061 3.90902C15.2066 4.22789 16.6766 5.0143 17.8302 6.16875L21.0177 9.34688" stroke="#959EAE" stroke-width="1.4" stroke-linecap="round" stroke-linejoin="round"/>
</svg>
