<svg width="24" height="24" viewBox="0 0 24 24" fill="none" xmlns="http://www.w3.org/2000/svg">
<path d="M3.94605 4.5H20.0523C20.1978 4.50005 20.3401 4.5424 20.4619 4.62191C20.5838 4.70141 20.6799 4.81463 20.7385 4.94777C20.7971 5.08092 20.8157 5.22824 20.7921 5.37179C20.7685 5.51533 20.7036 5.64891 20.6054 5.75625L14.4461 12.5344C14.3179 12.6716 14.2474 12.8529 14.2492 13.0406V18.3469C14.2503 18.4715 14.22 18.5944 14.161 18.7042C14.102 18.814 14.0162 18.9072 13.9117 18.975L10.9117 20.9719C10.7991 21.046 10.6687 21.0884 10.5341 21.0947C10.3995 21.101 10.2657 21.0709 10.1468 21.0076C10.0278 20.9443 9.9281 20.8501 9.85814 20.7349C9.78818 20.6198 9.75054 20.4879 9.74918 20.3531V13.0406C9.75098 12.8529 9.68049 12.6716 9.5523 12.5344L3.39293 5.75625C3.29473 5.64891 3.22987 5.51533 3.20624 5.37179C3.18262 5.22824 3.20126 5.08092 3.25988 4.94777C3.3185 4.81463 3.41458 4.70141 3.53641 4.62191C3.65825 4.5424 3.80057 4.50005 3.94605 4.5V4.5Z" stroke="#3F8BF8" stroke-width="1.4" stroke-linecap="round" stroke-linejoin="round"/>
</svg>
