<svg width="32" height="32" viewBox="0 0 32 32" fill="none" xmlns="http://www.w3.org/2000/svg">
<path d="M5 16H27" stroke="#959EAE" stroke-width="1.5" stroke-linecap="round" stroke-linejoin="round"/>
<path d="M16 5V27" stroke="#959EAE" stroke-width="1.5" stroke-linecap="round" stroke-linejoin="round"/>
</svg>
