<svg width="20" height="20" viewBox="0 0 20 20" fill="none" xmlns="http://www.w3.org/2000/svg">
<g id="Phosphor Icons / SortAscending">
<path id="Vector" d="M11.25 13.125L14.375 16.25L17.5 13.125" stroke="#3F8BF8" stroke-linecap="round" stroke-linejoin="round"/>
<path id="Vector_2" d="M14.375 8.75V16.25" stroke="#3F8BF8" stroke-linecap="round" stroke-linejoin="round"/>
<path id="Vector_3" d="M3.75 10H9.375" stroke="#3F8BF8" stroke-linecap="round" stroke-linejoin="round"/>
<path id="Vector_4" d="M3.75 5H14.375" stroke="#3F8BF8" stroke-linecap="round" stroke-linejoin="round"/>
<path id="Vector_5" d="M3.75 15H8.125" stroke="#3F8BF8" stroke-linecap="round" stroke-linejoin="round"/>
</g>
</svg>
