<svg width="17" height="17" viewBox="0 0 17 17" fill="none" xmlns="http://www.w3.org/2000/svg">
<rect x="0.316406" y="0.607422" width="16" height="16" rx="4" fill="#FFF6D8"/>
<path d="M11.081 8.15677C10.9581 8.28036 10.864 8.42952 10.8053 8.59359C10.7467 8.75769 10.725 8.93268 10.7418 9.10612L10.7359 9.10028C10.7532 9.30445 10.7256 9.50987 10.6552 9.70231C10.5848 9.8947 10.4732 10.0694 10.3283 10.2143C10.1833 10.3592 10.0085 10.4707 9.81593 10.541C9.62341 10.6114 9.41783 10.6389 9.21358 10.6217L9.21941 10.6275C8.97507 10.6048 8.72966 10.6579 8.51662 10.7797C8.30361 10.9015 8.13334 11.0859 8.02907 11.308C7.9248 11.53 7.89156 11.7787 7.93392 12.0203C7.9763 12.2619 8.09218 12.4845 8.26579 12.6579C8.4394 12.8312 8.66227 12.9468 8.90401 12.9889C9.14579 13.0311 9.39464 12.9976 9.6167 12.8932C9.83876 12.7888 10.0232 12.6185 10.1448 12.4055C10.2665 12.1925 10.3194 11.9472 10.2965 11.703L10.3026 11.7088C10.2854 11.5047 10.3129 11.2992 10.3833 11.1068C10.4537 10.9144 10.5653 10.7397 10.7103 10.5948C10.8552 10.4499 11.0301 10.3384 11.2226 10.2681C11.4151 10.1977 11.6207 10.1701 11.825 10.1874L11.8188 10.1816C12.0184 10.1995 12.2193 10.1668 12.4029 10.0865C12.5865 10.0061 12.7468 9.8808 12.869 9.72208C12.9912 9.56335 13.0714 9.37634 13.102 9.17843C13.1327 8.98049 13.1128 8.77804 13.0443 8.58979C12.9758 8.40158 12.8609 8.23368 12.7102 8.10167C12.5595 7.96965 12.3778 7.8778 12.1822 7.83462C11.9865 7.79145 11.783 7.79832 11.5907 7.85462C11.3984 7.91095 11.2234 8.01487 11.082 8.15677H11.081Z" fill="#FFD43B"/>
<path d="M8.21596 9.79301L8.20981 9.78718C8.383 9.80463 8.5579 9.78337 8.7219 9.72493C8.88587 9.66649 9.03483 9.57236 9.15796 9.44931C9.28107 9.32625 9.37535 9.17734 9.43388 9.01339C9.49244 8.84943 9.51382 8.67454 9.49651 8.5013L9.50266 8.50712C9.48545 8.3033 9.51295 8.09822 9.58316 7.90611C9.65339 7.71404 9.76472 7.5396 9.90931 7.39496C10.0539 7.25035 10.2284 7.13901 10.4204 7.06879C10.6125 6.99853 10.8175 6.97105 11.0213 6.98826L11.0152 6.98243C11.259 7.00534 11.5039 6.95245 11.7165 6.83103C11.9291 6.7096 12.0991 6.52553 12.2033 6.30393C12.3075 6.08232 12.3408 5.83397 12.2987 5.59274C12.2565 5.35151 12.141 5.12915 11.9679 4.956C11.7948 4.78284 11.5724 4.66731 11.3312 4.62518C11.09 4.58304 10.8417 4.61634 10.6201 4.72053C10.3985 4.82473 10.2145 4.99475 10.0931 5.20741C9.97166 5.42006 9.91879 5.665 9.9417 5.90881L9.93587 5.90266C9.95312 6.10648 9.92568 6.3116 9.85548 6.50372C9.78527 6.69583 9.67394 6.8703 9.52935 7.01495C9.38473 7.15956 9.21028 7.2709 9.0182 7.34111C8.82608 7.41133 8.62099 7.43877 8.41719 7.42152L8.42302 7.42767C8.24983 7.41023 8.07489 7.43149 7.91093 7.48993C7.74696 7.54833 7.598 7.64249 7.47486 7.76555C7.35173 7.8886 7.25748 8.03751 7.19892 8.20147C7.14039 8.36543 7.11901 8.54032 7.13631 8.71356L7.13049 8.70774C7.14764 8.91152 7.12011 9.11661 7.04987 9.30868C6.97959 9.50072 6.8683 9.67516 6.72371 9.81977C6.57911 9.96438 6.40471 10.0757 6.21267 10.146C6.02063 10.2162 5.81558 10.2438 5.61181 10.2266L5.61764 10.2324C5.37386 10.2095 5.12895 10.2624 4.91632 10.3838C4.70369 10.5053 4.53369 10.6893 4.42951 10.9109C4.32532 11.1325 4.29202 11.3809 4.33416 11.6221C4.37629 11.8633 4.49181 12.0857 4.66494 12.2588C4.83808 12.432 5.06041 12.5475 5.30161 12.5897C5.54281 12.6318 5.79113 12.5985 6.01271 12.4943C6.23429 12.3901 6.41834 12.2201 6.53975 12.0075C6.66117 11.7948 6.71404 11.5499 6.69113 11.306L6.69728 11.3119C6.68006 11.1081 6.70756 10.903 6.7778 10.7109C6.84801 10.5188 6.95934 10.3443 7.10393 10.1997C7.24855 10.0551 7.42297 9.94376 7.61502 9.87355C7.8071 9.8033 8.01216 9.77579 8.21596 9.79301Z" fill="#FFD43B"/>
<path d="M5.94981 9.05683C6.07275 8.93326 6.16688 8.78408 6.22547 8.61996C6.28407 8.45583 6.30569 8.28079 6.28878 8.10736L6.29494 8.11319C6.27768 7.90897 6.30524 7.70342 6.3757 7.51093C6.44616 7.31844 6.55781 7.14365 6.70287 6.99875C6.84793 6.85386 7.02287 6.74235 7.21552 6.67202C7.40816 6.60169 7.61385 6.57423 7.8182 6.59157L7.81204 6.58573C8.05636 6.60861 8.30181 6.55561 8.51489 6.43397C8.72797 6.31234 8.8983 6.12798 9.00272 5.90604C9.1071 5.6841 9.14045 5.43538 9.09822 5.1938C9.05598 4.95223 8.94018 4.72955 8.76667 4.55615C8.59316 4.38274 8.37032 4.26704 8.1286 4.22482C7.88687 4.18261 7.63798 4.21594 7.41591 4.32026C7.19381 4.42458 7.00934 4.59483 6.88764 4.80777C6.7659 5.02071 6.71287 5.26599 6.73577 5.51016L6.72993 5.50432C6.74718 5.7085 6.71961 5.91398 6.64919 6.10641C6.57877 6.29885 6.46719 6.47361 6.32221 6.6185C6.17723 6.76339 6.00235 6.87491 5.80979 6.94526C5.61723 7.01564 5.41162 7.04319 5.20732 7.02595L5.21315 7.03178C5.01352 7.01389 4.8126 7.04666 4.62902 7.12702C4.44543 7.20738 4.2851 7.33277 4.16291 7.49154C4.04071 7.65029 3.9606 7.83733 3.92999 8.03526C3.89937 8.23323 3.91926 8.4357 3.98779 8.62391C4.05632 8.81215 4.17128 8.98004 4.32203 9.11204C4.47278 9.24407 4.65443 9.33591 4.85015 9.37908C5.04587 9.42223 5.24932 9.41532 5.44167 9.35902C5.63401 9.30268 5.80836 9.19875 5.94981 9.05683Z" fill="#FFD43B"/>
</svg>
