<svg width="20" height="20" viewBox="0 0 20 20" fill="none" xmlns="http://www.w3.org/2000/svg">
<g id="Phosphor Icons / Graph">
<path id="Vector" d="M10 11.875C11.0355 11.875 11.875 11.0355 11.875 10C11.875 8.96447 11.0355 8.125 10 8.125C8.96447 8.125 8.125 8.96447 8.125 10C8.125 11.0355 8.96447 11.875 10 11.875Z" stroke="#3F8BF8" stroke-linecap="round" stroke-linejoin="round"/>
<path id="Vector_2" d="M7.5 6.25C8.53553 6.25 9.375 5.41053 9.375 4.375C9.375 3.33947 8.53553 2.5 7.5 2.5C6.46447 2.5 5.625 3.33947 5.625 4.375C5.625 5.41053 6.46447 6.25 7.5 6.25Z" stroke="#3F8BF8" stroke-linecap="round" stroke-linejoin="round"/>
<path id="Vector_3" d="M15.625 10C16.6605 10 17.5 9.16053 17.5 8.125C17.5 7.08947 16.6605 6.25 15.625 6.25C14.5895 6.25 13.75 7.08947 13.75 8.125C13.75 9.16053 14.5895 10 15.625 10Z" stroke="#3F8BF8" stroke-linecap="round" stroke-linejoin="round"/>
<path id="Vector_4" d="M15.625 16.25C16.6605 16.25 17.5 15.4105 17.5 14.375C17.5 13.3395 16.6605 12.5 15.625 12.5C14.5895 12.5 13.75 13.3395 13.75 14.375C13.75 15.4105 14.5895 16.25 15.625 16.25Z" stroke="#3F8BF8" stroke-linecap="round" stroke-linejoin="round"/>
<path id="Vector_5" d="M4.375 16.875C5.41053 16.875 6.25 16.0355 6.25 15C6.25 13.9645 5.41053 13.125 4.375 13.125C3.33947 13.125 2.5 13.9645 2.5 15C2.5 16.0355 3.33947 16.875 4.375 16.875Z" stroke="#3F8BF8" stroke-linecap="round" stroke-linejoin="round"/>
<path id="Vector_6" d="M9.24121 8.28906L8.25684 6.08594" stroke="#3F8BF8" stroke-linecap="round" stroke-linejoin="round"/>
<path id="Vector_7" d="M13.8447 8.71875L11.7822 9.40625" stroke="#3F8BF8" stroke-linecap="round" stroke-linejoin="round"/>
<path id="Vector_8" d="M14.1484 13.2266L11.4766 11.1484" stroke="#3F8BF8" stroke-linecap="round" stroke-linejoin="round"/>
<path id="Vector_9" d="M8.60156 11.2422L5.77344 13.7578" stroke="#3F8BF8" stroke-linecap="round" stroke-linejoin="round"/>
</g>
</svg>
