<svg width="20" height="20" viewBox="0 0 20 20" fill="none" xmlns="http://www.w3.org/2000/svg">
<path d="M11.25 6.875L14.375 3.75L17.5 6.875" stroke="#518FE8" stroke-linecap="round" stroke-linejoin="round"/>
<path d="M14.375 11.25V3.75" stroke="#518FE8" stroke-linecap="round" stroke-linejoin="round"/>
<path d="M3.75 10H9.375" stroke="#518FE8" stroke-linecap="round" stroke-linejoin="round"/>
<path d="M3.75 5H8.125" stroke="#518FE8" stroke-linecap="round" stroke-linejoin="round"/>
<path d="M3.75 15H14.375" stroke="#518FE8" stroke-linecap="round" stroke-linejoin="round"/>
</svg>
