<svg width="24" height="24" viewBox="0 0 24 24" fill="none" xmlns="http://www.w3.org/2000/svg">
<path d="M12 7.5V12" stroke="#959EAE" stroke-width="1.4" stroke-linecap="round" stroke-linejoin="round"/>
<path d="M15.9 14.25L12 12" stroke="#959EAE" stroke-width="1.4" stroke-linecap="round" stroke-linejoin="round"/>
<path d="M6.73242 9.34766H2.98242V5.59766" stroke="#959EAE" stroke-width="1.5" stroke-linecap="round" stroke-linejoin="round"/>
<path d="M6.16992 17.8313C7.32344 18.9857 8.79343 19.7721 10.394 20.091C11.9945 20.4099 13.6536 20.2469 15.1615 19.6227C16.6694 18.9984 17.9583 17.941 18.8651 16.5842C19.7719 15.2273 20.2559 13.632 20.2559 12C20.2559 10.368 19.7719 8.7727 18.8651 7.41585C17.9583 6.059 16.6694 5.00158 15.1615 4.37735C13.6536 3.75313 11.9945 3.59014 10.394 3.90902C8.79343 4.22789 7.32344 5.0143 6.16992 6.16875L2.98242 9.34688" stroke="#959EAE" stroke-width="1.4" stroke-linecap="round" stroke-linejoin="round"/>
</svg>
