<svg width="24" height="24" viewBox="0 0 24 24" fill="none" xmlns="http://www.w3.org/2000/svg">
<path fill-rule="evenodd" clip-rule="evenodd" d="M9.93831 4.00049C10.3277 3.99122 10.7087 4.11451 11.019 4.35028C11.3317 4.58791 11.5535 4.92546 11.6476 5.30675L11.6503 5.31778L11.8701 6.29175H18.286C18.7417 6.29175 19.1789 6.47279 19.5012 6.79507C19.8234 7.11734 20.0044 7.55443 20.0044 8.01019V10.5179C19.2072 9.92194 18.0993 9.90753 17.284 10.5036C16.5594 10.1061 15.7402 9.89236 14.8988 9.89236C14.0575 9.89236 13.2382 10.1061 12.5136 10.5036C11.5799 9.82091 10.2623 9.93904 9.4672 10.8144C8.69055 11.6695 8.68089 12.9515 9.39761 13.8156C8.76066 14.2226 8.33835 14.9359 8.33835 15.7478C8.33835 16.5598 8.76065 17.273 9.3976 17.6801C9.23547 17.8755 9.1105 18.0924 9.02318 18.3208H5.71844C5.26268 18.3208 4.82559 18.1398 4.50332 17.8175C4.18105 17.4953 4 17.0582 4 16.6024V5.71894C4 5.26317 4.18105 4.82608 4.50332 4.50381C4.82559 4.18154 5.26269 4.00049 5.71844 4.00049H9.93831Z" fill="#CFE2FD"/>
<path fill-rule="evenodd" clip-rule="evenodd" d="M11.6991 11.7193C11.3478 11.4002 10.8044 11.4264 10.4854 11.7776C10.1663 12.1289 10.1924 12.6723 10.5437 12.9914L11.7153 14.0555C11.6498 14.3138 11.6159 14.5813 11.6159 14.8522V14.889H10.5877C10.1132 14.889 9.72852 15.2737 9.72852 15.7482C9.72852 16.2228 10.1132 16.6075 10.5877 16.6075H11.6159V16.6441C11.6159 16.9152 11.6499 17.1826 11.7154 17.4409L10.5437 18.5051C10.1924 18.8241 10.1663 19.3675 10.4854 19.7188C10.8044 20.07 11.3478 20.0961 11.6991 19.7771L12.594 18.9644C13.1989 19.5544 14.0109 19.8852 14.8569 19.8852C15.703 19.8852 16.5151 19.5544 17.1199 18.9644L18.0148 19.7771C18.366 20.0961 18.9094 20.07 19.2285 19.7188C19.5475 19.3675 19.5214 18.8241 19.1702 18.5051L17.9985 17.4409C18.0641 17.1826 18.098 16.9152 18.098 16.6441V16.6075H19.1261C19.6006 16.6075 19.9853 16.2228 19.9853 15.7482C19.9853 15.2737 19.6006 14.889 19.1261 14.889H18.098V14.8522C18.098 14.5812 18.0641 14.3138 17.9985 14.0555L19.1702 12.9914C19.5214 12.6723 19.5475 12.1289 19.2285 11.7776C18.9094 11.4264 18.366 11.4002 18.0148 11.7193L17.1199 12.532C16.5151 11.942 15.703 11.6112 14.8569 11.6112C14.0108 11.6112 13.1989 11.942 12.5939 12.5321L11.6991 11.7193Z" fill="#3F8BF8"/>
</svg>
