<svg width="16" height="16" viewBox="0 0 16 16" fill="none" xmlns="http://www.w3.org/2000/svg">
<g id="Phosphor Icons / CaretDoubleRight">
<path id="Vector" d="M3.5 3L8.5 8L3.5 13" stroke="#959EAE" stroke-linecap="round" stroke-linejoin="round"/>
<path id="Vector_2" d="M8.5 3L13.5 8L8.5 13" stroke="#959EAE" stroke-linecap="round" stroke-linejoin="round"/>
</g>
</svg>
