<svg width="14" height="14" viewBox="0 0 14 14" fill="none" xmlns="http://www.w3.org/2000/svg">
<g id="coins-stack--accounting-billing-payment-stack-cash-coins-currency-money-finance" clip-path="url(#clip0_6001_207813)">
<g id="coins-stack--accounting-billing-payment-stack-cash-coins-currency-money-finance_2">
<path id="Subtract" fill-rule="evenodd" clip-rule="evenodd" d="M0.121094 7.28567V2C0.121094 0.89543 2.13581 0 4.62109 0C7.10637 0 9.12109 0.89543 9.12109 2V3.47054C7.88533 3.51118 6.72461 3.75088 5.80888 4.15788C5.30623 4.38127 4.82208 4.67966 4.44667 5.07413C4.06513 5.47505 3.74853 6.03149 3.74853 6.71436V9.24829C1.67151 9.06764 0.121094 8.25418 0.121094 7.28567Z" fill="#CDD9F0"/>
<path id="Subtract_2" fill-rule="evenodd" clip-rule="evenodd" d="M5 6.71484V12.0005C5 13.1005 7 14.0005 9.5 14.0005C12 14.0005 14 13.1005 14 12.0005V6.71484C14 5.61027 11.9853 4.71484 9.5 4.71484C7.01472 4.71484 5 5.61027 5 6.71484Z" fill="#CDD9F0"/>
<path id="Intersect" fill-rule="evenodd" clip-rule="evenodd" d="M14 8.53809C13.9749 8.63417 13.9131 8.75075 13.7843 8.8867C13.5992 9.08197 13.3018 9.28657 12.8858 9.47218C12.0553 9.8427 10.861 10.0889 9.49991 10.0889C8.13878 10.0889 6.94453 9.8427 6.11404 9.47218C5.69803 9.28657 5.40057 9.08197 5.21552 8.8867C5.08699 8.75108 5.02521 8.63472 5 8.53878V10.2967C5.18829 10.4129 5.39131 10.5185 5.60474 10.6137C6.6302 11.0712 8.00573 11.3389 9.49991 11.3389C10.9941 11.3389 12.3696 11.0712 13.3951 10.6137C13.6086 10.5184 13.8117 10.4128 14 10.2966V8.53809Z" fill="#3565C3"/>
<path id="Intersect_2" fill-rule="evenodd" clip-rule="evenodd" d="M4.20244 5.36752C3.95909 5.70368 3.77804 6.11629 3.75181 6.59466C2.59741 6.51227 1.54886 6.26733 0.725832 5.90013C0.512401 5.80491 0.30938 5.69934 0.121094 5.58318V3.8252C0.146303 3.92114 0.208081 4.03749 0.336616 4.17312C0.521669 4.36838 0.819122 4.57299 1.23513 4.75859C1.97935 5.09063 3.01568 5.32286 4.20244 5.36752Z" fill="#3565C3"/>
<path id="Vector" d="M4.62268 2.9313C6.35807 2.9313 7.76488 2.52673 7.76488 2.02766C7.76488 1.5286 6.35807 1.12402 4.62268 1.12402C2.88729 1.12402 1.48047 1.5286 1.48047 2.02766C1.48047 2.52673 2.88729 2.9313 4.62268 2.9313Z" fill="#3565C3"/>
<path id="Vector_2" d="M9.49767 7.64614C11.2331 7.64614 12.6399 7.24157 12.6399 6.74251C12.6399 6.24344 11.2331 5.83887 9.49767 5.83887C7.76228 5.83887 6.35547 6.24344 6.35547 6.74251C6.35547 7.24157 7.76228 7.64614 9.49767 7.64614Z" fill="#3565C3"/>
</g>
</g>
<defs>
<clipPath id="clip0_6001_207813">
<rect width="14" height="14" fill="white"/>
</clipPath>
</defs>
</svg>
