<svg width="24" height="24" viewBox="0 0 24 24" fill="none" xmlns="http://www.w3.org/2000/svg">
<path d="M12 20C16.4183 20 20 16.4183 20 12C20 7.58172 16.4183 4 12 4C7.58172 4 4 7.58172 4 12C4 16.4183 7.58172 20 12 20Z" fill="#9FC5FB"/>
<path d="M10.5717 10.0003C10.5717 9.2113 11.2113 8.57171 12.0003 8.57171C12.7893 8.57171 13.4289 9.2113 13.4289 10.0003C13.4289 10.7893 12.7893 11.4289 12.0003 11.4289C11.5269 11.4289 11.1431 11.8126 11.1431 12.286V13.0248C11.1431 13.4982 11.5269 13.882 12.0003 13.882C12.4737 13.882 12.8574 13.4982 12.8574 13.0248C14.1766 12.6517 15.1431 11.4389 15.1431 10.0003C15.1431 8.26453 13.736 6.85742 12.0003 6.85742C10.2645 6.85742 8.85742 8.26453 8.85742 10.0003C8.85742 10.4737 9.24118 10.8574 9.71456 10.8574C10.1879 10.8574 10.5717 10.4737 10.5717 10.0003Z" fill="#0F6EF6"/>
<path d="M12.0003 17.1431C12.6315 17.1431 13.1431 16.6315 13.1431 16.0003C13.1431 15.3691 12.6315 14.8574 12.0003 14.8574C11.3691 14.8574 10.8574 15.3691 10.8574 16.0003C10.8574 16.6315 11.3691 17.1431 12.0003 17.1431Z" fill="#0F6EF6"/>
</svg>
