<?xml version="1.0" encoding="UTF-8" standalone="no"?>
<!-- Created with Inkscape (http://www.inkscape.org/) -->

<svg
   xmlns:dc="http://purl.org/dc/elements/1.1/"
   xmlns:cc="http://creativecommons.org/ns#"
   xmlns:rdf="http://www.w3.org/1999/02/22-rdf-syntax-ns#"
   xmlns:svg="http://www.w3.org/2000/svg"
   xmlns="http://www.w3.org/2000/svg"
   xmlns:sodipodi="http://sodipodi.sourceforge.net/DTD/sodipodi-0.dtd"
   xmlns:inkscape="http://www.inkscape.org/namespaces/inkscape"
   width="263mm"
   height="130mm"
   viewBox="0 0 931.88906 460.62993"
   id="svg4265"
   version="1.1"
   inkscape:version="0.91 r13725"
   sodipodi:docname="drawing.svg">
  <defs
     id="defs4267" />
  <sodipodi:namedview
     id="base"
     pagecolor="#ffffff"
     bordercolor="#666666"
     borderopacity="1.0"
     inkscape:pageopacity="0.0"
     inkscape:pageshadow="2"
     inkscape:zoom="0.65"
     inkscape:cx="332.37579"
     inkscape:cy="330.11027"
     inkscape:document-units="px"
     inkscape:current-layer="layer1"
     showgrid="false"
     inkscape:window-width="1914"
     inkscape:window-height="1174"
     inkscape:window-x="1366"
     inkscape:window-y="20"
     inkscape:window-maximized="0" />
  <metadata
     id="metadata4270">
    <rdf:RDF>
      <cc:Work
         rdf:about="">
        <dc:format>image/svg+xml</dc:format>
        <dc:type
           rdf:resource="http://purl.org/dc/dcmitype/StillImage" />
        <dc:title></dc:title>
      </cc:Work>
    </rdf:RDF>
  </metadata>
  <g
     inkscape:label="Layer 1"
     inkscape:groupmode="layer"
     id="layer1"
     transform="translate(0,-591.7323)"
     style="display:inline">
    <g
       transform="matrix(0.98538476,-0.17034338,0.17034338,0.98538476,-246.33786,526.98117)"
       style="font-style:normal;font-weight:normal;font-size:40px;line-height:125%;font-family:sans-serif;letter-spacing:0px;word-spacing:0px;fill:#1d1d1d;fill-opacity:1;stroke:none;stroke-width:1px;stroke-linecap:butt;stroke-linejoin:miter;stroke-opacity:1"
       id="flowRoot4273">
      <path
         d="m 269.73425,342.46143 q 10.16236,0 22.24732,11.53565 2.47192,4.39453 2.47192,7.14111 0,7.5531 -2.88391,10.98633 l 0,1.09863 -1.92261,0 q -6.17981,-1.78528 -10.16235,-4.94385 -0.41199,0 -3.02124,0.54932 -4.53186,-1.09863 -7.27844,-1.09863 l -1.37329,0 q -0.54932,0 -0.54932,-0.54932 -14.28223,2.60925 -17.85278,5.49316 l 0,1.09864 q 29.52575,12.49694 29.52575,20.87402 0.82398,0 2.47193,9.33838 0,6.86645 -6.86646,16.47949 -5.90515,7.69043 -45.45593,20.32471 -1.09863,0 -33.92029,10.98633 -5.21851,-1.09864 -6.31714,-1.09864 -0.9613,0.54932 -1.92261,0.54932 0,-2.74658 -1.09863,-2.74658 -0.41199,0 -0.41199,0.54931 -5.76782,0 -5.76782,-3.84521 -0.54931,-1.09863 -0.54931,-1.64795 0.54931,0 0.54931,-0.54932 l -0.9613,0 0,-1.09863 0.9613,-1.64795 0,-1.09863 -1.51062,0 q 0,-4.66919 22.24732,-11.53565 6.86645,-4.94384 9.75036,-4.94384 l 0,0.54931 q 2.74658,0 6.72913,-3.2959 0.27466,0 1.92261,-0.54931 0,0.54931 0.54931,0.54931 0.13733,-1.09863 0.96131,-1.09863 l 2.88391,0 q 0,-1.92261 8.78906,-2.74658 2.05994,-2.47192 22.79663,-9.33838 0,-1.09863 3.84522,-2.19726 l 0,-0.54932 q -1.64795,0 -12.63428,-5.49317 -15.51819,-6.59179 -15.51819,-13.73291 -1.23596,0 -2.88391,-20.3247 l 0.54932,0 q 0,-0.54932 -0.54932,-0.54932 0,-8.92639 14.96887,-13.18359 8.37708,-3.2959 9.20105,-4.39453 0.9613,0.54931 2.05994,0.54931 0,-3.43322 15.93017,-4.39453 z"
         style="font-style:normal;font-variant:normal;font-weight:normal;font-stretch:normal;font-size:281.25px;font-family:'The Right Thing';-inkscape-font-specification:'The Right Thing';fill:#1d1d1d;fill-opacity:1"
         id="path4913"
         inkscape:connector-curvature="0" />
      <path
         d="m 338.12415,338.0669 1.64794,0 c 6.22559,2.92969 9.33838,6.04248 9.33838,9.33838 0,0.18311 0.18311,2.56348 0.54932,7.14111 0,2.83813 -6.22559,11.8103 -18.67676,26.91651 -9.15527,15.83862 -13.73291,26.45874 -13.73291,31.86035 l 1.09863,0.54931 c 9.42993,-0.64087 29.20533,-11.62719 59.32618,-32.95898 0.91553,0 4.21142,-2.19727 9.88769,-6.5918 10.89478,-6.59179 17.12037,-10.62011 18.67676,-12.08496 10.34546,-6.22559 16.75415,-9.33838 19.22607,-9.33838 5.31006,2.65503 8.42285,4.66919 9.33838,6.04248 1.09863,3.75367 1.64795,7.78199 1.64795,12.08496 l -0.54931,0 0.54931,1.09864 c 0,2.83813 -5.49316,12.17651 -16.47949,28.01513 L 396.901,429.25342 c -3.84521,3.2959 -13.00049,12.45117 -27.46582,27.46582 -3.02124,2.01416 -5.76782,4.76074 -8.23975,8.23975 -1.7395,0 -7.96508,4.94385 -18.67675,14.83154 l -13.1836,10.43701 c 0,0.54932 -2.01416,1.83106 -6.04248,3.84522 -2.19727,2.83813 -6.04248,5.76782 -11.53564,8.78906 -0.36621,0 -0.54932,-0.1831 -0.54932,-0.54931 -0.45776,0 -1.37329,0.91553 -2.74658,2.74658 -1.09863,0 -2.19727,1.09863 -3.2959,3.2959 l -0.54932,0 -1.09863,-0.54932 c -0.45776,0 -6.50024,4.39453 -18.12744,13.18359 -0.82397,0 -3.57056,1.83106 -8.23975,5.49317 0,0.82397 -1.09863,1.92261 -3.29589,3.2959 -0.91553,1.7395 -5.12696,4.48608 -12.63428,8.23974 l -1.09863,-0.54931 c -1.46485,0.73242 -2.74659,1.09863 -3.84522,1.09863 l 0,1.09863 0.54932,0 1.09863,-0.54932 0.54932,1.09864 c -0.45777,0.36621 -1.3733,0.54931 -2.74659,0.54931 l 0,-0.54931 -1.09863,0 c -0.73242,0.0915 -1.09863,0.45776 -1.09863,1.09863 0.73242,0.0915 1.09863,0.45776 1.09863,1.09863 -7.96509,4.57764 -15.2893,8.23975 -21.97265,10.98633 -0.27466,0.73242 -2.83814,1.64795 -7.69043,2.74658 0,1.09863 -4.39453,2.74658 -13.1836,4.94385 -4.85229,1.83105 -9.97925,3.11279 -15.38086,3.84522 l -1.09863,-0.54932 c -3.20435,0.36621 -5.0354,0.54932 -5.49316,0.54932 -6.77491,0 -11.35254,-2.38037 -13.73291,-7.14112 -2.19727,-3.20435 -3.2959,-5.40161 -3.2959,-6.59179 l 0,-7.14112 c 0,-1.64795 3.2959,-7.32422 9.88769,-17.02881 0.82397,0 3.75366,-2.38037 8.78907,-7.14111 3.20434,-2.47193 6.50024,-4.8523 9.88769,-7.14111 l 2.74658,0.54931 c 2.65503,-3.02124 6.50025,-5.2185 11.53565,-6.59179 0,0.73242 -0.54932,1.09863 -1.64795,1.09863 l 0,1.09863 0.54931,0 c 6.04248,-3.479 13.3667,-7.14111 21.97266,-10.98633 0.73242,0.36621 1.28174,0.54932 1.64795,0.54932 l 2.74658,-1.64795 1.09863,0 0,1.09863 -3.29589,1.09864 0,1.09863 2.19726,0 0,0.54932 c -5.85937,6.59179 -13.91601,13.18359 -24.16992,19.77539 -8.78906,5.85937 -14.09912,9.88769 -15.93018,12.08496 -7.41577,8.14819 -11.62719,12.72583 -12.63427,13.73291 l -0.54932,2.74658 c 1.09863,0.36621 1.64795,0.73242 1.64795,1.09863 3.75366,-0.45776 5.95093,-1.00708 6.5918,-1.64795 l 0.54931,0 c 0.82397,0 1.5564,0.18311 2.19727,0.54932 l 11.53564,-4.39453 1.64795,0 c 14.37378,-5.67627 27.74048,-12.63428 40.1001,-20.87402 7.41577,-5.12695 11.99341,-7.69043 13.73291,-7.69043 0,-0.82398 1.09863,-1.3733 3.2959,-1.64795 0.73242,-0.91553 1.09863,-1.64795 1.09863,-2.19727 l 0.54932,0 1.09863,0.54932 c 0,-1.46485 3.84521,-4.57764 11.53564,-9.33838 l 34.05762,-25.81787 c 0.64087,0.36621 1.3733,0.54931 2.19727,0.54931 l 0,-1.09863 -1.09864,0 c 0,-0.54931 0.54932,-1.09863 1.64795,-1.64795 l 1.09864,0.54932 c 0,-1.5564 4.39453,-5.76783 13.18359,-12.63428 10.16235,-9.06372 19.68384,-18.21899 28.56445,-27.46582 12.90894,-13.64136 23.71216,-26.27564 32.40967,-37.90283 l 0,-1.09863 c -18.49365,11.16943 -29.66309,18.49365 -33.5083,21.97265 0,0.36621 -1.64795,1.46485 -4.94385,3.2959 l -1.09863,-0.54932 c -1.92261,2.38037 -8.3313,6.5918 -19.22607,12.63428 -4.02832,1.83105 -7.87354,3.11279 -11.53565,3.84522 l -6.04248,0 c -7.32422,-3.20435 -10.98633,-7.04956 -10.98633,-11.53565 -4.39453,-6.40869 -7.14111,-12.08496 -8.23974,-17.02881 l 0,-3.84521 c 0,-9.52149 4.76074,-22.52198 14.28222,-39.00147 1.92261,-3.75366 8.14819,-11.8103 18.67676,-24.16992 z m -115.90577,164.24561 0.54932,0 0,0.54931 c -0.36621,0.73242 -0.54932,1.28174 -0.54932,1.64795 l -1.64795,0 0,-0.54932 c 0,-0.54931 0.54932,-1.09863 1.64795,-1.64794 z m -3.29589,1.64794 0.54931,0 0,0.54932 c 0,0.45777 -0.91553,1.19019 -2.74658,2.19727 l -0.54932,0 0,-1.09864 c 0.64087,0 1.5564,-0.54932 2.74659,-1.64795 z"
         style="font-style:normal;font-variant:normal;font-weight:normal;font-stretch:normal;font-size:281.25px;font-family:'The Right Thing';-inkscape-font-specification:'The Right Thing';fill:#1d1d1d;fill-opacity:1"
         id="path4915"
         inkscape:connector-curvature="0"
         sodipodi:nodetypes="ccscccccccccccccccccccccccccccccccccccccccccccccscsscccccccccccccccccccccccsccccccccccccccccccccccccccccsccccccccscccscccc" />
      <path
         d="m 493.30603,342.46143 q 10.16235,0 22.24731,11.53565 2.47193,4.39453 2.47193,7.14111 0,7.5531 -2.88391,10.98633 l 0,1.09863 -1.92261,0 q -6.17981,-1.78528 -10.16235,-4.94385 -0.41199,0 -3.02124,0.54932 -4.53186,-1.09863 -7.27845,-1.09863 l -1.37329,0 q -0.54931,0 -0.54931,-0.54932 -14.28223,2.60925 -17.85279,5.49316 l 0,1.09864 q 29.52576,12.49694 29.52576,20.87402 0.82397,0 2.47192,9.33838 0,6.86645 -6.86645,16.47949 -5.90515,7.69043 -45.45593,20.32471 -1.09864,0 -33.92029,10.98633 -5.21851,-1.09864 -6.31714,-1.09864 -0.9613,0.54932 -1.92261,0.54932 0,-2.74658 -1.09863,-2.74658 -0.41199,0 -0.41199,0.54931 -5.76782,0 -5.76782,-3.84521 -0.54932,-1.09863 -0.54932,-1.64795 0.54932,0 0.54932,-0.54932 l -0.9613,0 0,-1.09863 0.9613,-1.64795 0,-1.09863 -1.51062,0 q 0,-4.66919 22.24731,-11.53565 6.86646,-4.94384 9.75037,-4.94384 l 0,0.54931 q 2.74658,0 6.72913,-3.2959 0.27465,0 1.9226,-0.54931 0,0.54931 0.54932,0.54931 0.13733,-1.09863 0.9613,-1.09863 l 2.88391,0 q 0,-1.92261 8.78907,-2.74658 2.05993,-2.47192 22.79663,-9.33838 0,-1.09863 3.84521,-2.19726 l 0,-0.54932 q -1.64795,0 -12.63427,-5.49317 -15.51819,-6.59179 -15.51819,-13.73291 -1.23596,0 -2.88391,-20.3247 l 0.54931,0 q 0,-0.54932 -0.54931,-0.54932 0,-8.92639 14.96887,-13.18359 8.37707,-3.2959 9.20105,-4.39453 0.9613,0.54931 2.05993,0.54931 0,-3.43322 15.93018,-4.39453 z"
         style="font-style:normal;font-variant:normal;font-weight:normal;font-stretch:normal;font-size:281.25px;font-family:'The Right Thing';-inkscape-font-specification:'The Right Thing';fill:#1d1d1d;fill-opacity:1"
         id="path4917"
         inkscape:connector-curvature="0" />
      <path
         d="m 635.85364,208.56556 2.88391,-0.54932 q 1.64795,1.37329 5.2185,1.37329 6.72913,4.80652 8.23975,17.57813 1.09863,8.5144 -11.39831,33.92029 0.13732,1.09863 -7.41578,12.90893 -3.15857,8.23975 -19.77539,36.39221 -0.68664,0.96131 -4.94384,9.06372 l 0.13732,0.54932 q 8.23975,-4.11987 16.34217,-6.45447 -0.13733,-0.54931 0.41199,-0.68664 l 1.09863,0.41198 2.33459,-1.51062 q 0,0.54932 0.54932,0.54932 0,-1.09863 0.82397,-1.23596 l 0.54932,-0.13733 q 0.41199,-0.13733 0.54932,0.41199 1.9226,-1.37329 2.88391,-1.51062 0.27466,1.09863 1.09863,0.9613 l 0.9613,-0.13733 -0.13733,-1.09863 q 0.54932,-0.13733 1.51063,0.27466 4.66918,-1.23597 5.35583,-1.92261 0.9613,0.41199 2.05994,0.27466 l 0,0.54931 q 0.13733,0.54932 -0.41199,0.54932 0.13733,0.54932 2.47192,3.02124 -0.54931,0 -0.41198,0.54932 1.9226,-0.27466 2.05993,0.82397 -4.80652,9.8877 -19.22607,16.34216 -1.92261,0.27466 -3.43323,4.39454 -0.54932,0 -0.54932,-0.41199 -0.68664,0.54931 -2.88391,0.9613 l 0,0.54932 0.96131,-0.13733 0.13733,1.09863 q -1.09864,0.13733 -2.05994,-0.27466 -4.80652,3.02124 -5.63049,3.15857 l -3.43323,0.54932 q -1.51062,3.15857 -20.59937,13.18359 -6.17981,0.96131 -10.43701,9.8877 -2.47192,1.51062 -6.86645,9.47571 -3.43323,8.10241 -11.94764,21.28601 -0.54931,0 -6.45446,9.88769 l -1.78528,1.92261 -0.41199,0 -0.13733,-0.9613 q -2.88391,2.60925 -7.14111,11.53564 -12.35962,20.05005 -13.59558,20.46204 l -1.09863,-0.41199 q 0,1.78528 -3.70789,2.33459 l -0.9613,-2.60925 q 0.82397,-0.13733 1.23596,-2.47192 l -0.41199,0.13733 q -2.33459,1.9226 -3.2959,2.19726 l -1.23596,-1.51062 0,-0.54931 q -0.27466,-2.74659 0.68665,-2.88392 l -0.68665,-0.9613 q -0.13733,-1.23596 0.27466,-2.33459 -0.68665,-0.82398 -0.82398,-2.05994 l -0.13733,-0.54932 q 1.23597,-2.74658 0.96131,-4.53186 l -0.41199,0 q -2.19726,4.25721 -3.02124,4.39453 l -0.54932,0 0,-0.54931 q 1.3733,-3.70789 10.43702,-17.71546 -0.13733,-0.82397 19.50073,-33.5083 l 2.47192,-4.80652 -0.13733,-0.54931 -0.41198,0 q -3.57056,0.68664 -5.35584,2.05993 -0.54932,0 -0.54932,-0.54931 -6.45446,2.74658 -8.78906,3.02124 -6.72912,1.09863 -10.29968,-5.49317 -4.39453,-7.5531 -6.17981,-13.45825 l 0.41199,-1.23596 q -0.68665,-0.82397 -0.82398,-2.05994 2.19727,-3.15857 3.15857,-3.29589 7.82776,1.64794 8.78906,1.51062 0.82398,-0.82398 1.3733,-0.82398 0.9613,-0.13733 1.09863,0.41199 9.20105,-2.19727 22.38464,-6.86646 l 0,0.54932 q 15.51819,-5.63049 15.24353,-7.41577 l 1.23596,-2.47193 q -0.41198,0.13733 -0.54931,-0.41198 2.19726,-0.41199 3.57055,-3.84522 1.09864,-0.27466 1.09864,-3.02124 3.2959,-3.2959 15.51819,-26.22986 7.5531,-11.67297 15.93017,-29.66308 3.70789,-3.98255 7.5531,-16.20484 3.43323,-5.35583 14.1449,-32.68432 2.60925,-9.20105 4.80652,-10.71167 z"
         style="font-style:normal;font-variant:normal;font-weight:normal;font-stretch:normal;font-size:281.25px;font-family:'The Right Thing';-inkscape-font-specification:'The Right Thing';fill:#1d1d1d;fill-opacity:1"
         id="path4919"
         inkscape:connector-curvature="0" />
      <path
         d="m 641.89612,335.04566 1.78528,-0.54932 q 7.82776,-2.47192 17.99011,2.19727 4.2572,3.02124 4.66919,3.84521 l 0.27466,0.41199 q 4.11987,8.65173 -10.98633,29.80042 -4.94385,6.17981 -5.49317,9.06372 l -1.23596,0.41198 0.54932,1.23597 1.92261,-0.54932 1.37329,-1.37329 2.60925,-0.41199 q 4.39453,-2.60925 4.11987,-3.15857 1.37329,0 2.05994,-0.13733 l 10.98633,-7.96508 0.27466,0.41198 0.9613,-0.68664 1.23596,-0.41199 0.27466,0.41199 q -4.11987,4.66919 -3.98254,5.08117 l 0.68664,-0.13733 4.11987,-1.78527 0.13733,0.41198 q -2.74658,3.02124 -2.05993,4.53186 -0.82398,0.27466 -1.37329,2.88392 l -4.25721,5.76782 q -1.51062,0.41198 -20.87402,16.75415 0.27466,1.37329 -7.69043,7.27844 0.27466,0.82397 -6.45447,4.53186 0.27466,0.54932 -7.14111,5.63049 -0.54932,1.78528 -5.49316,4.66919 -3.2959,6.04248 -16.06751,13.32093 -2.05994,0.68664 -2.88391,1.37329 -2.60925,0.41198 -4.53186,0.9613 -0.9613,0.82398 -1.64795,0.9613 -7.27844,-0.9613 -22.93396,-13.87023 -0.9613,-0.54932 -1.37329,-1.51062 -3.43323,-7.00379 11.26099,-27.87781 -0.68665,-1.51062 3.43322,-3.02124 4.39453,-8.78907 7.96509,-9.8877 -1.51062,-2.88391 4.2572,-7.14111 3.02124,-4.66919 8.37708,-10.43701 3.70788,-3.43323 3.84521,-5.21851 1.64795,-0.41199 5.90515,-6.72912 l 1.51062,0.13732 q 0.96131,-0.82397 1.64795,-1.09863 l -0.27465,-0.41199 -1.23597,0.41199 -0.41198,-0.82397 3.29589,-0.54932 -0.9613,-0.68665 q 6.5918,-7.14111 21.83533,-16.0675 z m -17.99011,40.23743 0.27465,0.41198 2.3346,-0.68664 q 6.45447,-2.05994 22.52197,-22.24732 l 1.37329,-2.88391 -0.13733,-0.41198 q -1.64795,1.51062 -3.2959,2.05993 -0.41198,-0.82397 -1.64794,-0.54931 l -9.75037,10.43701 q -0.82398,0.27466 -11.67297,13.87024 z m -27.05384,40.23742 0.27466,0.96131 q 12.22229,-6.5918 31.99768,-20.32471 l 0.54932,-0.13733 -0.27466,-0.41199 q -7.27844,-1.78527 -14.41956,-8.23974 -14.69421,18.26477 -18.12744,28.15246 z"
         style="font-style:normal;font-variant:normal;font-weight:normal;font-stretch:normal;font-size:281.25px;font-family:'The Right Thing';-inkscape-font-specification:'The Right Thing';fill:#1d1d1d;fill-opacity:1"
         id="path4921"
         inkscape:connector-curvature="0" />
      <path
         d="m 737.47717,332.98572 q 2.05994,-0.27465 5.90515,5.21851 1.92261,0 6.04248,7.14111 0.27466,-0.13733 1.92261,5.6305 l -0.41199,1.23596 q 0.13733,0.54931 0.54932,0.41198 l -0.27466,3.02125 0.82398,3.43322 -1.78528,12.35962 q 27.87781,-17.02881 37.7655,-21.97265 7.69043,-3.02124 11.8103,-3.2959 9.33838,4.94384 10.16236,15.38086 0.68664,2.19726 0.9613,3.98254 -0.68664,0 -2.60925,9.47571 l -7.14111,13.45825 q -0.82398,0.13733 -13.59559,18.67676 -5.63049,9.20105 -11.67297,12.08496 -3.98254,5.63049 -6.31714,5.76782 -1.78528,0 -5.90515,-5.35583 l -0.27466,-2.88391 q 3.57056,-9.47571 20.05005,-34.8816 l -0.13733,-1.09863 -0.54931,0 q -0.54932,0 -19.36341,13.32092 -3.57055,0.41199 -8.23974,6.04248 -10.02503,4.66919 -26.09253,21.42334 l -3.43323,0.27466 q -1.92261,-1.92261 -8.92639,-18.95141 -0.54932,0 -0.54932,-0.54932 l -0.54931,-6.31714 q 3.70788,-5.49316 13.87023,-26.22986 -0.54931,0 -0.54931,-0.54931 -4.53186,0.68664 -32.27234,28.42712 -2.05994,3.84522 -10.57434,13.73291 -3.02124,6.31714 -5.63049,8.65173 0.13732,1.51062 -3.84522,6.04248 -4.11987,11.39832 -5.76782,12.22229 l -0.96131,0.13733 q -1.9226,-0.82397 -11.67297,-21.69799 -1.23596,-1.78528 -1.37329,-3.43323 l 0,-1.09864 q -0.41199,-3.43322 5.76782,-12.22229 -0.13733,-1.23596 12.35962,-20.3247 8.92639,-14.41956 18.95142,-35.98023 0.68664,0 2.19726,-2.47192 l 0.96131,-0.13733 5.2185,3.70789 q 3.98255,6.04248 4.94385,5.90515 l 1.51062,-0.13733 q -0.41199,1.23596 -0.41199,1.78528 l 2.74659,-1.92261 q 0.13732,0.54932 0.54931,0.54932 2.3346,-4.39454 3.98255,-4.53186 l 0,-1.09864 -0.96131,0.68665 -0.54931,0 q 1.78527,-3.02124 4.11987,-3.2959 l 1.51062,-0.13733 q -0.27466,-2.47192 5.49316,-4.53186 0,0.54932 0.54932,0.54932 -0.27466,-2.60926 11.67297,-5.6305 z m -23.75793,13.04627 0.13733,1.23596 -2.47193,0.82397 q -0.13733,-1.37329 2.3346,-2.05993 z m -3.2959,2.05993 0.9613,0 q 0.13733,1.09864 -0.82397,1.23597 l -0.9613,0 q 0,-1.09864 0.82397,-1.23597 z"
         style="font-style:normal;font-variant:normal;font-weight:normal;font-stretch:normal;font-size:281.25px;font-family:'The Right Thing';-inkscape-font-specification:'The Right Thing';fill:#1d1d1d;fill-opacity:1"
         id="path4923"
         inkscape:connector-curvature="0" />
    </g>
    <g
       transform="translate(-354.41336,393.8821)"
       style="font-style:normal;font-weight:normal;font-size:40px;line-height:125%;font-family:sans-serif;letter-spacing:0px;word-spacing:0px;fill:#c40000;fill-opacity:1;stroke:none;stroke-width:1px;stroke-linecap:butt;stroke-linejoin:miter;stroke-opacity:1"
       id="flowRoot4946">
      <path
         d="m 1271.646,203.4485 q 4.9133,8.75854 8.1177,15.59448 l 0.8545,0.21362 -1.709,4.48608 3.2043,8.11768 q -4.2724,19.01245 -15.3808,16.87622 -2.7771,1.92261 -28.8391,7.90405 -12.6038,5.12696 -13.4583,4.91333 l -2.5635,-0.42724 q -0.2136,1.92261 -1.9226,1.49536 -0.8545,-0.21362 -0.8545,-1.06812 -8.5449,4.69971 -61.9507,18.58521 -4.2724,3.63159 -37.1704,14.73999 -22.8576,7.69043 -45.5017,27.34375 -15.8081,19.4397 -32.2571,49.56055 -5.1269,9.61303 -12.6037,16.44897 l -13.4583,21.14868 0.8545,0.21363 q 3.2044,0.42724 26.7029,-10.25391 16.8762,-5.12695 17.3035,-7.04956 7.2632,-1.49536 14.3127,-5.76782 l 1.4954,1.06811 12.3901,-4.27246 q 0.2136,-0.85449 1.0681,-0.64087 1.709,0.64087 1.2818,2.13623 6.195,0.42725 7.0495,-4.48608 l 0.8545,0.21362 2.3499,2.34985 5.7678,-2.7771 3.418,0.64087 -0.4273,2.7771 -1.2817,1.70899 q 4.4861,0.85449 4.0588,2.56347 -1.709,0.64087 -3.6316,0.42725 l -0.2136,1.70898 1.9226,-0.64086 0.4273,2.13623 q -7.9041,1.49536 -27.9847,18.37158 -8.7585,1.49536 -38.6657,18.15796 0.8545,0.21362 0.6408,1.06811 -10.4675,4.27246 -10.6811,5.5542 -4.6997,0.85449 -6.836,4.27246 -6.6223,0.64087 -9.3994,2.99073 l 0,-0.8545 q -1.709,0.64087 -3.6316,0.21363 l 0.6409,1.9226 q -7.6904,1.28174 -17.30346,8.11768 -20.50781,10.25391 -21.3623,14.95361 -2.7771,5.12696 -14.52637,17.94434 -26.06201,44.21997 -36.10229,56.39648 -5.98145,11.32202 -18.15796,23.07129 -6.19507,2.7771 -12.17652,14.73999 -0.42724,1.70899 -12.60376,11.74927 l -1.70898,-1.28174 q -0.64087,3.63159 -3.20435,3.20435 -0.64087,-1.70899 -0.21362,-3.84522 l -1.92261,0.64087 -0.42724,-2.13623 0.42724,-2.56348 2.13623,-2.56347 -1.49536,-1.28174 q -0.64087,3.84521 -3.20434,3.20435 l 0.21362,-1.70899 7.90405,-15.59448 0.21362,-0.85449 -0.64086,-1.92261 q 3.41796,0.64087 3.84521,-1.28174 l 0.21362,-1.70898 -2.7771,1.28173 -0.85449,-0.21362 4.48609,-5.76782 q -0.64087,-1.92261 -0.42725,-2.7771 1.28174,0.21362 8.54492,-13.67188 l 1.70899,-0.42724 -0.42725,-2.13623 q 0.85449,-2.56348 5.34058,-5.5542 l -1.70899,-0.21362 0.21362,-1.92261 q 2.13623,0.42724 7.47681,-12.81738 4.91333,-4.69971 7.47681,-12.60376 4.27246,-4.91333 5.34057,-4.69971 l -0.64087,-1.92261 5.12696,-9.39941 q -27.34375,10.89477 -36.31592,9.18579 l -0.85449,-0.21362 q -10.89478,-5.34058 -16.23535,-25.63477 -0.64087,-6.62231 0.21362,-11.32202 0.21362,-1.28174 4.05884,-2.99072 l 0.85449,0.21362 q 5.5542,1.06811 11.1084,2.99072 10.46753,1.92261 69.85473,-23.71216 47.85161,-74.98169 66.86401,-111.93847 2.1362,-1.06812 8.9722,-16.23536 l 20.0805,-30.12084 16.0218,-15.80811 q 16.4489,-10.25391 17.7307,-10.04028 -0.2136,1.06811 0.6409,1.06811 -3.418,5.12696 -6.836,4.48609 l -0.4272,1.70898 27.1301,-12.81738 -0.8545,-0.21363 q -3.6316,-0.64086 -12.3901,5.34058 l -2.5635,-0.42725 0,-1.06811 q 14.3127,-8.97217 69.0002,-23.92578 1.2818,0.42724 11.1084,-1.70899 -6.195,3.84522 -10.6811,5.5542 l -0.2136,1.06812 0.8545,0 q 7.6904,-2.56348 14.9536,-3.84522 l 0.2136,-1.70898 -1.709,-0.42725 0.2136,-0.85449 q 1.709,-2.13623 66.864,-16.6626 14.9537,-3.84521 29.2664,-4.05883 z m -124.3286,29.6936 -0.2136,0.85449 0.8545,0.21362 q 5.9814,-2.7771 9.1857,-2.13623 l 0.4273,-1.70898 -0.8545,-0.21362 q -2.7771,-0.64087 -9.3994,2.99072 z m -8.3313,1.28174 -1.0681,1.70898 2.5634,0.42725 q 0.2137,-1.92261 -1.4953,-2.13623 z m -9.6131,3.84521 0,0.85449 1.709,0.42725 1.0681,-1.70898 q -1.7089,0.64086 -2.7771,0.42724 z m -14.0991,4.91333 1.709,0.21362 q 7.4768,-1.70898 7.6904,-3.20434 l -1.7089,-0.42725 q -7.4769,2.13623 -7.6905,3.41797 z m -4.6997,1.06812 -1.0681,1.49536 q 1.709,-0.42725 2.7771,-0.42725 l 0,-0.85449 -1.709,-0.21362 z"
         style="font-style:normal;font-variant:normal;font-weight:normal;font-stretch:normal;font-size:437.5px;font-family:'The Right Thing';-inkscape-font-specification:'The Right Thing';fill:#c40000;fill-opacity:1"
         id="path4981"
         inkscape:connector-curvature="0" />
    </g>
    <g
       transform="matrix(0.97396234,-0.22670987,0.22670987,0.97396234,-413.244,491.90418)"
       style="font-style:normal;font-weight:normal;font-size:40px;line-height:125%;font-family:sans-serif;letter-spacing:0px;word-spacing:0px;opacity:0.98000004;fill:#000000;fill-opacity:1;stroke:#1d1d1d;stroke-width:1px;stroke-linecap:butt;stroke-linejoin:miter;stroke-opacity:1"
       id="flowRoot4983">
      <path
         d="m 547.83398,558.41441 q 1.79627,0.42847 1.79627,1.64795 0.13183,0 0.13183,0.70862 l 0,0.28015 q 0,2.0105 -2.14233,5.50415 -0.18127,0 -1.07117,1.71387 -0.44494,1.07116 -0.70861,1.07116 l -0.36255,0.56031 q -0.11536,0.32959 -0.56031,0.79101 l 0.0659,0.13184 -0.49438,0.79101 0,0.14832 q 0.21423,0 3.2135,-1.07117 4.59778,-1.56555 5.63598,-1.56555 l 0,0.13184 q 0.18128,0 0.6427,-0.13184 0.11536,0.0659 0.28016,0.0659 l 0,0.0659 q -0.34607,0.23071 -0.42847,0.6427 -0.97229,0.6427 -1.07117,0.6427 0,0.41198 -2.07641,1.00525 -0.23072,0.29663 -2.42249,1.07116 0,0.18128 -4.56482,1.63147 l -1.2854,0.7251 q -0.26367,0.32959 -0.49438,0.92285 -0.60974,0.67566 -1.64795,2.27417 l -1.13709,1.3678 q -0.0989,0.34607 -0.21423,0.34607 l 0.0659,0.14831 q -0.18128,0.34607 -0.28015,0.36255 0,-0.0824 -0.0659,-0.0824 -1.4502,2.45545 -2.71912,4.07044 -0.32959,0 -0.85693,1.35132 -0.24719,0.18127 -1.77979,2.50488 -0.0989,0 -0.85693,1.13709 -1.10413,1.31836 -1.64795,1.71386 0,-0.0659 -0.0659,-0.0659 0,0.0989 -0.36255,0.34607 l -0.49438,-0.28015 0,-0.0659 -0.14832,0.0659 q -0.13183,0 -0.13183,-0.13183 l 0,-0.42847 q 0.57678,-1.38428 1.203,-2.14233 0,-0.18128 1.21948,-1.9281 1.18653,-1.92811 1.56555,-2.35657 l -0.0659,-0.14832 q 0.87341,-1.02173 2.14233,-3.27942 0.1648,-0.0165 2.14233,-3.14758 l 0.70862,-1.05469 0,-0.0824 -0.0659,0 q -2.65319,0.85693 -3.57605,1.43371 -2.19177,0.7251 -2.85095,1.07117 l 0,0.0659 -0.0659,0 q -0.0824,0 -0.0824,-0.0659 -2.0929,0.52734 -2.63672,1.49963 -2.02698,3.04871 -4.41651,8.05847 -0.26367,1.35132 -0.72509,1.35132 -0.75806,0 -1.71387,-1.35132 -0.34607,-0.18127 -0.34607,-0.70861 0.42847,-0.7251 0.98877,-2.35657 0.32959,-0.31311 0.85693,-1.64795 l 1.64795,-2.63672 -0.0659,-0.14831 q -0.5603,0.29663 -0.72509,0.29663 l 0,-0.0824 q -0.1648,0 -1.63147,0.6427 -2.20825,0.57678 -3.57605,0.57678 -1.07117,0 -1.77979,-2.07642 l 0,-0.42846 q 0.14832,-0.42847 0.57678,-0.42847 l 0,0.0824 0.13184,-0.0824 q 0.51086,0.14832 0.57678,0.14832 l 0.0659,0 q 2.6532,0 8.93189,-2.20826 2.47192,-3.55957 5.20751,-6.64123 0,-0.21423 2.78504,-3.27942 0.13183,0 0.98877,-1.00525 2.47192,-2.53784 4.77905,-4.4165 1.26892,-1.18653 2.5708,-1.9281 1.61499,-1.35132 3.14759,-1.64795 l 0.34606,-0.0659 z m -15.19409,17.41882 0,0.0659 q 7.48169,-2.50488 8.05847,-2.85095 l 2.57081,-4.13635 q 0.36254,-0.46143 0.36254,-0.79102 0.18128,0 0.92286,-1.2854 1.33483,-2.47192 1.77978,-3.06519 l 0.85693,-2.07641 -0.0659,0 q -1.49964,0.54382 -7.41578,5.93262 -1.53259,1.6809 -2.29064,2.20825 -0.8075,1.2854 -2.91687,3.55957 -0.7251,0.87341 -1.86219,2.43896 z m 19.47876,-6.29516 0.21424,0 0,-0.13184 -0.0659,0 q -0.14832,0.0165 -0.14832,0.13184 z"
         style="font-style:normal;font-variant:normal;font-weight:normal;font-stretch:normal;font-size:33.75px;font-family:'The Right Thing';-inkscape-font-specification:'The Right Thing';opacity:1;stroke:#1d1d1d;stroke-opacity:1"
         id="path5959"
         inkscape:connector-curvature="0" />
      <path
         d="m 569.48804,558.29905 q 0.84045,0.70862 0.79101,0.95581 0.13184,0.37903 0.19776,1.20301 -0.21424,0.42846 -0.54383,0.72509 -0.13183,0.37903 -3.59253,2.22474 -1.49963,0.87341 -2.98278,1.86218 -1.86219,1.21948 -1.87867,1.30188 -0.98877,0.5603 -1.87866,1.38428 0.0165,-0.0659 -0.0494,-0.0824 -0.033,0.16479 -0.41198,0.34607 l 0.0494,0.13183 -0.0165,0.0659 q -0.36254,-0.0494 -0.92285,0.59326 -1.33484,1.00525 -1.36779,1.25244 -0.69214,0.39551 -1.23597,1.15357 -0.34607,0.0989 -1.66443,1.68091 l -1.07116,1.03821 -0.033,0.19775 0.13183,0.033 2.53785,-0.79102 0.24719,0.11536 0.34607,-0.0659 0.13183,0.0824 0.41199,0 -0.0165,0.0659 q -0.033,0.13183 -0.23071,0.0989 l -0.0165,0.13184 0.52734,0.0989 -0.0165,0.13183 q -1.51611,1.21948 -1.53259,1.30188 -1.99402,1.21948 -3.14758,1.56555 -0.42847,0.37903 -2.60376,1.23597 -0.47791,-0.0824 -2.60376,3.16406 -0.36255,0.74158 -1.21948,1.54907 -0.0165,0.0824 -0.0989,0.19775 l 0,0.32959 q -0.39551,0.31311 -0.79102,1.43372 -0.42846,0.28015 -1.25244,2.78503 l 0.0165,0.34607 q 1.66443,0.29663 6.11389,-1.86218 1.15357,-0.32959 1.49964,-0.69214 l 0.19775,0.033 -0.033,0.13184 -0.13183,-0.0165 0,0.0659 0.13183,0.0165 q 0,-0.0659 0.46143,-0.31311 l 0.033,-0.19776 q 0.26367,-0.16479 0.36255,-0.14831 0.14831,-0.31311 0.26367,-0.29664 l -0.0165,0.0659 -0.0824,0.11536 0.0659,0.0165 q 0.28015,0.0494 1.00525,-0.29663 0.34607,-0.14832 0.97229,-0.51087 0.0989,0.18128 0.0824,0.29663 l 0.14831,-0.0494 0.0659,0.0165 q 0.13183,0.0165 0.0824,0.28015 l 0.14831,-0.0494 0.0659,0.0165 -0.11536,0.32959 q 0.0989,0.0165 0.21424,0.29663 -0.41199,0.26367 -0.69214,0.84045 l -1.31836,0.85694 q 0.0494,0.14831 0.033,0.21423 -0.39551,0.28015 -0.59326,0.23071 l 0.0494,0.14832 q -0.3955,0.34607 -0.82397,0.39551 -0.033,0.16479 -1.97754,1.15356 l 0.0494,0.14832 -1.12061,0.5603 -0.13183,-0.033 -0.13184,-0.0824 -0.0824,0.11536 q 0.0659,0.0165 0.0494,0.0824 -1.00525,0.36254 -2.14233,0.92285 -0.31311,-0.0659 -1.3678,0.42846 -0.14831,0.0494 -0.62622,0.033 l 0.0165,-0.0659 -0.14832,0.0494 q -1.07116,-0.3955 -1.56555,-1.10412 -0.98877,-1.82923 -1.26892,-2.94983 l -0.033,-0.14832 0.0165,-0.0659 q 0.0824,-0.51087 0.0824,-0.93934 0.39551,-2.19177 4.38354,-8.15734 0.1648,0.033 1.43372,-1.92811 l -0.0494,-0.14831 q 0.69214,-0.54382 2.55432,-2.90039 0.033,-0.13184 0.52735,-0.65918 1.59851,-1.96106 2.80151,-3.04871 1.68091,-1.87866 2.45544,-2.35656 0.56031,-0.84046 4.44947,-3.59253 7.67944,-4.82849 9.42627,-5.09217 z"
         style="font-style:normal;font-variant:normal;font-weight:normal;font-stretch:normal;font-size:33.75px;font-family:'The Right Thing';-inkscape-font-specification:'The Right Thing';opacity:1;stroke:#1d1d1d;stroke-opacity:1"
         id="path5961"
         inkscape:connector-curvature="0" />
      <path
         d="m 578.86487,557.67283 q 5.7019,-0.51086 6.03149,3.22998 l -0.0659,0.0165 q 0.0165,0.0659 0.0824,0.0494 0,0.87341 -0.34607,2.22473 -1.05469,1.76331 -1.74682,2.7356 -1.18653,0.65918 -2.02698,1.82922 -1.10413,0.57678 -1.18652,0.75806 -0.0989,0.19775 -0.74158,0.52734 -0.51087,0.36255 -0.79102,0.87342 0.0165,0.21423 -1.21948,1.08764 -1.00525,0.75806 -1.03821,0.95581 -2.91687,2.24121 -4.68017,3.39478 -2.5708,2.04345 -4.61426,3.97156 -1.81275,1.91162 -1.69739,3.26293 -0.0659,0 -0.0494,0.0659 l 0.0659,0.13184 q -0.0989,0.26367 -0.0824,0.46142 l 0.11536,0.59327 -0.0659,0 q 0.0989,0.46142 0.1648,0.44494 l -0.033,0.34607 0.033,0.44495 q 0.0165,0.14831 0.0989,0.26367 0,0.0659 -0.0659,0.0659 0.92285,4.69665 2.3236,6.95434 0.0165,0.1648 1.26892,2.38953 0.0824,0.0824 0.11536,0.46143 l -0.32959,0.033 q 0,0.0659 -0.36255,0.42847 -0.92285,0.0824 -3.11462,-4.69665 -1.79627,-4.4989 -1.94458,-6.24573 l 0.0659,0 -0.32959,-0.77454 0.0494,-0.13183 -0.0659,0 -0.23072,0.36255 0.0824,0.11535 0,0.0659 q -0.32959,0.0494 -0.31311,0.23071 0.13184,0 0.14832,0.11536 -0.0659,0 -0.47791,0.70862 l -0.13183,-0.0659 -0.0659,0.0165 0.0824,0.11536 q -0.67565,0.5603 -0.6427,1.05468 l -0.0659,0 0.0824,0.13184 -0.60974,1.31836 -0.0659,0 -0.14831,-0.0494 q 0.0165,0.13184 -0.0494,0.13184 l 0.0824,0.13183 0,0.0659 q -0.42847,0.69214 -0.46143,0.69214 l -0.0165,-0.13184 -0.0659,0.0165 0,0.0659 0.0824,0.11536 q -0.19775,0.51086 -0.34607,0.5603 0,-0.0659 -0.0659,-0.0494 -0.0659,0.19775 -1.13709,1.41724 -0.42847,1.1206 -1.2854,1.96106 -0.47791,0.37902 -0.62622,0.3955 -0.62622,-0.28015 -1.2854,-1.02172 l -0.0165,-0.19776 q 1.61499,-2.5708 2.25769,-3.7738 1.9281,-3.60901 2.75208,-4.86145 1.45019,-2.76856 2.19177,-3.70789 0.39551,-0.90637 1.7633,-3.1311 l 0.033,0.19775 q 0.0989,0 0.23072,-0.28015 l 0,-0.0659 -0.13184,0.0659 -0.0659,0.0165 -0.0165,-0.13184 q 1.15357,-1.86218 2.63672,-4.66369 0.84045,-1.63147 1.8457,-3.2135 0.57679,-1.64795 1.69739,-3.31238 -0.033,-0.34607 0.6427,-1.58203 l 0,-0.13184 q -0.4779,0.033 -3.2135,1.86219 -1.54907,1.31835 -1.99402,1.49963 0.0165,0.0824 -0.29663,0.36255 l -0.5603,-0.34607 q -0.85694,-0.97229 -1.12061,-1.49964 l -0.0165,-0.26367 q 1.26892,-1.79626 3.13111,-2.6532 1.17004,-0.90637 4.16931,-2.35656 3.2135,-1.40076 5.57007,-2.07642 l 0.0165,0.0659 q 0.16479,-0.0659 1.15356,-0.29663 l 0.0165,0.0659 q -0.0165,-0.0659 1.03821,-0.21424 z m 2.45544,2.42249 q 0,0.0494 -0.18127,0.21423 l -0.32959,-0.033 q -0.19776,0.0165 -0.19776,0.0824 l -0.32959,-0.033 q -2.93335,0.24719 -5.75134,1.56555 0.11536,1.31836 -1.40076,3.69141 -2.15881,3.88916 -2.4884,4.71313 -1.1206,1.81275 -1.71387,3.13111 0.18128,-0.14832 0.51087,-0.18128 l -0.0824,-0.13183 q 0.62622,-0.37903 0.82398,-0.39551 -0.0165,-0.21423 0.24719,-0.28015 1.77978,-1.54907 2.17529,-1.58203 0.5603,-0.37903 0.54382,-0.51087 0.74158,-0.52734 1.33484,-0.77453 0.1648,-0.47791 0.87342,-0.54383 l -0.0824,-0.13183 q 3.46069,-2.34009 6.22925,-5.3064 1.00525,-1.41724 1.31836,-2.22473 0.0659,-0.62622 0.19775,-0.82398 l -0.0165,-0.13183 q -1.05469,-0.36255 -1.68091,-0.31311 z m -12.45849,13.39783 0.0165,0.13183 q 0.11535,-0.0824 0.18127,-0.0824 l 0,-0.0659 -0.19775,0.0165 z"
         style="font-style:normal;font-variant:normal;font-weight:normal;font-stretch:normal;font-size:33.75px;font-family:'The Right Thing';-inkscape-font-specification:'The Right Thing';opacity:1;stroke:#1d1d1d;stroke-opacity:1"
         id="path5963"
         inkscape:connector-curvature="0" />
      <path
         d="m 597.50317,558.36497 0.0494,0.14832 -0.13183,0.0494 -0.19776,-0.0165 q 0.0165,-0.0989 0.28015,-0.18128 z m -0.34607,0.18128 q 0.0824,0.13183 0.77454,0.19775 -0.0165,0.13184 -0.14831,0.11536 0.0659,0.11535 0.0494,0.26367 l 0.32959,-0.033 q 0,0.0659 0.0659,0.0659 -0.0824,0.3955 -0.16479,0.3955 l 0.0494,0.13184 0,0.0659 q -0.28016,0.46142 -1.69739,1.17004 l 0,0.0659 -0.13184,-0.0659 -0.0659,-0.0165 0.0659,0.14832 q -0.84045,0.44494 -0.97229,0.44494 0,-0.0659 -0.0659,-0.0824 -0.74157,0.5603 -1.79626,0.97229 -0.95581,0.87341 -1.54907,0.98877 -0.1648,0.26367 -1.31836,0.74157 -1.38428,2.24122 -1.41724,2.58728 -0.60974,1.00525 -0.88989,1.77979 -0.46143,0.5603 -2.15882,3.64197 -1.0382,1.43371 -1.35131,1.74682 -1.05469,2.22473 -1.76331,2.818 -1.58203,2.24121 -2.14233,3.31237 -0.93933,1.28541 -1.12061,1.3678 -0.033,0.47791 -0.92285,1.49964 0,0.0659 -0.13184,0.0659 0.0494,0.13184 0.0494,0.19776 -0.0989,0.23071 -0.44494,0.49438 l -0.0165,0.19776 q -1.41724,1.79626 -1.4502,2.10937 l 0.0659,0.0165 q 1.73035,-0.85693 2.68616,-1.08765 0.0659,0 0.0494,0.0659 0.13184,-0.0494 0.21424,-0.0494 l 0,-0.0659 -0.13184,-0.0165 0.0165,-0.13184 0.46143,-0.0824 -0.0659,0.13184 0.26367,0.0165 0.13184,-0.0494 0,0.0659 q 0.21423,-0.11536 0.74157,-0.13184 l -0.0824,0.11536 0.0659,0 q 0.11535,-0.0494 0.26367,-0.033 -0.0165,0.13184 -0.21424,0.11536 l 0,0.13183 0.0659,0 q 0.13184,-0.0494 0.19776,-0.0494 l 0.0494,0.14832 0,0.11536 q -0.0165,0.11535 -0.77453,0.54382 0.0494,0.13183 0.0494,0.19775 -0.0989,-0.0165 -2.1753,1.26892 -0.19775,-0.0165 -2.24121,1.4502 -0.34607,0.14831 -0.34607,0.23071 -1.86218,1.23596 -3.32885,1.76331 -0.75806,0.57678 -2.34009,1.05469 -0.95581,0.57678 -1.63147,0.51086 -0.69214,-0.0494 -1.61499,-2.05994 -0.18128,-0.26367 -0.13184,-0.72509 0.24719,-0.23072 1.96106,-0.42847 l 3.74085,-1.26892 q 0.51086,-0.0824 2.4884,-3.41126 0.51086,-0.59326 1.58203,-2.24121 0.49439,-0.87341 0.84045,-1.31836 l -0.0494,-0.14831 q 0.34607,-0.21424 0.60974,-0.93933 0.21423,0.033 1.46667,-2.30713 0.13184,0 0.51087,-0.69214 0.41198,-0.82398 0.60974,-0.8075 l -0.0494,-0.13183 q 0.49438,-0.54383 1.53259,-2.45545 0.13184,0.0165 0.39551,-0.69214 0.19775,-0.0824 1.07117,-1.74682 0.87341,-1.17005 2.58728,-4.54834 l 0,-0.0659 -0.0659,0 q -0.0165,0.19775 -0.34607,0.1648 0,-0.0659 -0.0659,-0.0659 0,0.11535 -1.08764,0.49438 -0.0165,0.0989 -0.21424,0.18128 l 0,-0.0659 q -0.39551,0.36255 -2.90039,1.33484 -1.54907,0.52734 -2.02698,0.4779 -0.85693,-0.0659 -1.58203,-2.37304 l 0.0165,-0.13184 q 0.033,-0.29663 2.04346,-0.62622 5.57007,-2.05994 8.02551,-3.32886 1.12061,-2.29065 1.40076,-2.25769 0,-0.0659 0.0659,-0.0659 1.26892,0.52735 1.23596,1.03821 l 0.19775,0.0165 q 3.18054,-1.45019 6.09741,-2.43896 z"
         style="font-style:normal;font-variant:normal;font-weight:normal;font-stretch:normal;font-size:33.75px;font-family:'The Right Thing';-inkscape-font-specification:'The Right Thing';opacity:1;stroke:#1d1d1d;stroke-opacity:1"
         id="path5965"
         inkscape:connector-curvature="0" />
      <path
         d="m 610.52197,558.41441 q 1.79627,0.42847 1.79627,1.64795 0.13183,0 0.13183,0.70862 l 0,0.28015 q 0,2.0105 -2.14233,5.50415 -0.18128,0 -1.07117,1.71387 -0.44494,1.07116 -0.70862,1.07116 l -0.36254,0.56031 q -0.11536,0.32959 -0.56031,0.79101 l 0.0659,0.13184 -0.49438,0.79101 0,0.14832 q 0.21423,0 3.2135,-1.07117 4.59778,-1.56555 5.63598,-1.56555 l 0,0.13184 q 0.18128,0 0.6427,-0.13184 0.11536,0.0659 0.28015,0.0659 l 0,0.0659 q -0.34606,0.23071 -0.42846,0.6427 -0.97229,0.6427 -1.07117,0.6427 0,0.41198 -2.07642,1.00525 -0.23071,0.29663 -2.42248,1.07116 0,0.18128 -4.56482,1.63147 l -1.2854,0.7251 q -0.26367,0.32959 -0.49439,0.92285 -0.60974,0.67566 -1.64794,2.27417 l -1.13709,1.3678 q -0.0989,0.34607 -0.21423,0.34607 l 0.0659,0.14831 q -0.18128,0.34607 -0.28016,0.36255 0,-0.0824 -0.0659,-0.0824 -1.4502,2.45545 -2.71912,4.07044 -0.32959,0 -0.85693,1.35132 -0.2472,0.18127 -1.77979,2.50488 -0.0989,0 -0.85693,1.13709 -1.10413,1.31836 -1.64795,1.71386 0,-0.0659 -0.0659,-0.0659 0,0.0989 -0.36255,0.34607 l -0.49438,-0.28015 0,-0.0659 -0.14832,0.0659 q -0.13183,0 -0.13183,-0.13183 l 0,-0.42847 q 0.57678,-1.38428 1.203,-2.14233 0,-0.18128 1.21948,-1.9281 1.18652,-1.92811 1.56555,-2.35657 l -0.0659,-0.14832 q 0.87342,-1.02173 2.14234,-3.27942 0.16479,-0.0165 2.14233,-3.14758 l 0.70862,-1.05469 0,-0.0824 -0.0659,0 q -2.6532,0.85693 -3.57605,1.43371 -2.19177,0.7251 -2.85095,1.07117 l 0,0.0659 -0.0659,0 q -0.0824,0 -0.0824,-0.0659 -2.0929,0.52734 -2.63672,1.49963 -2.02698,3.04871 -4.41651,8.05847 -0.26367,1.35132 -0.7251,1.35132 -0.75805,0 -1.71386,-1.35132 -0.34607,-0.18127 -0.34607,-0.70861 0.42847,-0.7251 0.98877,-2.35657 0.32959,-0.31311 0.85693,-1.64795 l 1.64795,-2.63672 -0.0659,-0.14831 q -0.5603,0.29663 -0.72509,0.29663 l 0,-0.0824 q -0.1648,0 -1.63147,0.6427 -2.20826,0.57678 -3.57605,0.57678 -1.07117,0 -1.77979,-2.07642 l 0,-0.42846 q 0.14832,-0.42847 0.57678,-0.42847 l 0,0.0824 0.13184,-0.0824 q 0.51086,0.14832 0.57678,0.14832 l 0.0659,0 q 2.6532,0 8.93188,-2.20826 2.47193,-3.55957 5.20752,-6.64123 0,-0.21423 2.78504,-3.27942 0.13183,0 0.98877,-1.00525 2.47192,-2.53784 4.77905,-4.4165 1.26892,-1.18653 2.5708,-1.9281 1.61499,-1.35132 3.14758,-1.64795 l 0.34607,-0.0659 z m -15.19409,17.41882 0,0.0659 q 7.48169,-2.50488 8.05847,-2.85095 l 2.5708,-4.13635 q 0.36255,-0.46143 0.36255,-0.79102 0.18128,0 0.92285,-1.2854 1.33484,-2.47192 1.77979,-3.06519 l 0.85693,-2.07641 -0.0659,0 q -1.49963,0.54382 -7.41577,5.93262 -1.53259,1.6809 -2.29065,2.20825 -0.80749,1.2854 -2.91687,3.55957 -0.72509,0.87341 -1.86218,2.43896 z m 19.47876,-6.29516 0.21423,0 0,-0.13184 -0.0659,0 q -0.14832,0.0165 -0.14832,0.13184 z"
         style="font-style:normal;font-variant:normal;font-weight:normal;font-stretch:normal;font-size:33.75px;font-family:'The Right Thing';-inkscape-font-specification:'The Right Thing';opacity:1;stroke:#1d1d1d;stroke-opacity:1"
         id="path5967"
         inkscape:connector-curvature="0" />
      <path
         d="m 622.43665,558.33201 0,0.13184 0.13183,0 0.19776,-0.13184 q 0,0.0989 0.32959,0.19776 l 0.13183,-0.0659 0.0659,0 0.7251,0.52734 q 0.79101,1.79627 0.79101,1.84571 l 0,0.32959 q -0.0824,0 -0.92285,2.17529 -1.26892,3.18054 -2.83447,5.47119 -0.54383,0.54382 -1.18653,2.04346 -0.14831,0.033 -0.65917,1.05468 -0.11536,0.0989 -1.64795,2.76856 -0.0989,0.29663 -0.65918,0.98877 l -2.50489,4.4165 q -0.92285,1.51612 -2.90039,5.07569 0,0.11535 -1.38427,2.76855 -1.58204,2.58728 -1.58204,2.70264 0,0.26367 -0.19775,0.46142 0.0659,0 0.0659,0.0659 3.7738,-1.54907 9.22851,-4.48242 0.31311,0 0.46143,-0.32959 0.16479,0 0.59326,-0.26367 l 0.13184,0.0659 q 0,-0.29664 0.72509,-0.46143 0,0.0659 0.0659,0.0659 l 0.0659,-0.13184 q -0.0659,0 -0.0659,-0.0659 l 0.0659,0 q 0.13184,0.0659 0.19775,0.0659 0,-0.49438 1.58204,-0.92285 0.95581,-0.42847 1.05468,-0.59326 l 0.32959,0 q 0.14832,0 0.26368,0.0659 0.31311,-0.13184 0.59326,-0.13184 l -0.19776,0.32959 q 0.0659,0.13184 0.0659,0.19775 -0.31311,0.57679 -0.79101,1.05469 -0.11536,0 -0.7251,0.7251 -1.26892,0.85693 -1.38428,0.85693 l -0.0659,0.26367 -0.13183,-0.0659 q -0.033,0.14831 -0.59327,0.32959 -0.46142,0.52734 -0.52734,0.52734 l -0.19775,-0.13184 0,0.0659 0.0659,0.13184 -0.92286,0.59326 q 0,0.13184 -2.43896,1.38428 -0.51087,0.37903 -0.92285,0.59326 0,0.14831 -1.25244,0.85693 -0.39551,0.39551 -0.52735,0.39551 -0.39551,0 -0.59326,0.32959 l -0.32959,0 q 0,-0.0659 -0.0659,-0.0659 -0.79101,0.74158 -1.64795,0.98877 -1.63147,0.93933 -2.63672,1.25244 -0.0659,0.0659 -0.52734,0.0659 l -0.13184,0 q -0.4779,0 -1.51611,-1.05469 -1.31836,-1.00525 -1.31836,-1.71386 0.0989,-0.0824 1.51612,-2.90039 0.60974,-0.93934 1.18652,-2.1753 1.25244,-2.10937 2.30713,-4.48242 0.42846,-0.62622 3.55957,-6.19629 5.6195,-9.57458 7.31689,-13.05176 1.91162,-4.74609 1.91162,-4.81201 l 0.26368,0 z"
         style="font-style:normal;font-variant:normal;font-weight:normal;font-stretch:normal;font-size:33.75px;font-family:'The Right Thing';-inkscape-font-specification:'The Right Thing';opacity:1;stroke:#1d1d1d;stroke-opacity:1"
         id="path5969"
         inkscape:connector-curvature="0" />
      <path
         d="m 647.17236,554.45933 0,0.0659 0.13184,-0.0659 q 0.95581,0.34607 0.95581,0.8075 l 0.29663,0.65918 q -0.21423,0.29663 -0.36255,0.29663 l 0.21424,0.36255 q -0.95582,0.60974 -2.19178,2.12585 0,0.14832 -0.23071,0.14832 l 0,0.14831 0.51086,-0.0659 0.52735,0 q 1.97754,0.46143 1.97754,0.87342 0.29663,0.28015 0.95581,2.05993 l 0,1.31836 q 0,1.26892 -1.61499,5.80078 -1.41724,2.91687 -1.61499,3.16407 0,0.13183 -0.74158,1.38427 l -1.23596,2.20826 q -1.20301,1.63147 -1.91162,2.86743 -1.63147,2.29065 -2.42249,3.14758 -0.49438,1.12061 -4.11987,4.84497 -2.32361,2.60376 -3.3783,3.16406 -0.44494,0.39551 -2.42248,1.46668 0,0.21423 -1.08765,0.36255 -1.8457,0 -3.52661,-2.78504 -0.44495,-0.93933 -0.44495,-1.61499 l 0,-0.88989 q 0,-1.79626 1.82923,-6.45996 2.53784,-5.68543 6.45996,-11.15662 2.34009,-3.06518 3.67492,-4.61425 0,-0.0659 4.84498,-5.37232 0.11535,0 1.10412,-1.23596 0.11536,0 0.87341,-0.88989 l 1.91163,-1.61499 q 0.72509,-0.51087 1.0382,-0.51087 z m -6.45996,10.94238 q -0.14831,-0.0824 -0.23071,-0.0824 l -0.44495,0.59326 -0.13183,-0.0824 -1.76331,1.99402 q -1.43371,1.56555 -2.14233,2.85095 -1.49964,1.73035 -1.97754,2.94983 -0.36255,0.6427 -1.02173,1.38428 -2.4884,3.8562 -4.11987,8.22327 -1.17005,3.22998 -1.17005,4.48242 l 0,0.51086 q 0,0.59326 0.74158,0.59326 l 0.0659,0 q 2.63672,0 8.37158,-6.39404 1.03821,-1.30188 1.10413,-1.31836 3.54309,-4.44946 6.67419,-9.98657 3.44421,-6.45996 3.44421,-9.60755 -0.0989,-0.3955 -0.57678,-0.65918 -1.48315,0 -2.93335,1.08765 -0.88989,0.52734 -3.88916,3.46069 z"
         style="font-style:normal;font-variant:normal;font-weight:normal;font-stretch:normal;font-size:33.75px;font-family:'The Right Thing';-inkscape-font-specification:'The Right Thing';opacity:1;stroke:#1d1d1d;stroke-opacity:1"
         id="path5971"
         inkscape:connector-curvature="0" />
      <path
         d="m 670.55676,558.48033 0.7251,0 q 2.83447,0 4.15283,2.04345 0.59326,1.31836 0.59326,2.83448 -0.16479,2.27417 -1.77978,4.87793 -1.18652,1.23596 -1.18652,1.45019 -0.47791,0.69214 -0.98877,1.12061 -0.0659,0.42846 -2.24121,2.17529 -1.99402,1.76331 -4.28467,3.2959 -0.97229,0.85693 -2.83448,1.8457 l -1.51611,1.05469 q -0.82397,0.69214 -2.37305,1.31836 -0.79101,0.57678 -1.97753,1.05469 -0.41199,0.3955 -3.03223,1.38427 -0.60974,0.37903 -2.50488,1.05469 -1.4502,0.54382 -1.4502,1.25244 l -1.1206,1.51612 q 0,-0.0659 -0.0659,-0.0659 -1.20301,2.12585 -1.77979,2.83447 -0.41199,0.57678 -0.98877,0.98877 0,0.34607 -0.7251,0.7251 0,0.16479 -0.52734,0.39551 l -0.32959,0 q -0.62622,-0.46143 -0.85693,-0.98877 l 0,-0.0659 q 0,-0.46143 1.91162,-3.16406 0,-0.28016 1.77978,-2.83448 0,-0.19775 0.0659,-0.19775 0,-0.1648 -0.26367,-0.46143 0.36255,-0.19775 0.59326,-0.19775 l -0.13183,-0.19775 q 0.60974,-0.26368 0.72509,-0.26368 l 0,-0.19775 -0.13183,0.0659 0,-0.0659 q 0.79101,-1.00525 0.79101,-1.38428 0.32959,-0.11535 0.65918,-0.98877 0.11536,-0.0165 0.39551,-0.59326 0.31311,-0.32959 0.46143,-0.32959 0,-0.0659 -0.0659,-0.0659 0.13183,-0.65918 0.52734,-0.98877 l 0.13184,0.0659 q 0,-0.4779 0.46142,-0.85693 -0.0659,-0.13184 -0.0659,-0.19776 0.77453,-0.98876 0.85693,-0.98876 l -0.0659,-0.13184 0.79102,-1.18652 0.3955,-0.52735 q 0,-0.18127 0.92286,-1.51611 0,-0.11536 0.65918,-0.92285 0.28015,-0.41199 0.65918,-1.25244 0.80749,-0.77454 1.05468,-1.58204 1.86219,-3.16406 1.97754,-3.62548 l -0.0659,0 q -1.41723,1.1206 -1.51611,1.1206 l -0.0659,-0.13183 q 0.42847,-0.32959 0.52735,-0.32959 l 0,-0.13184 q -2.45545,1.73035 -4.15284,3.22998 l -2.04345,2.17529 q -0.0989,0 -1.05469,1.31836 -0.18127,0 -0.7251,0.79102 -0.16479,0 -0.32959,0.13183 -0.59326,0 -0.92285,-0.85693 l 0,-0.26367 q 0.44495,-2.86743 7.11914,-7.97608 l 2.63672,-1.77978 q 2.58728,-1.64795 2.63672,-1.64795 0.19775,-0.26367 0.65918,-1.51611 l 0.32959,-0.0659 q 0,0.13184 0.92285,0.39551 0.0165,0.13183 0.13184,0.13183 0.42846,-0.0824 2.10937,-0.85693 2.12586,-0.7251 4.54834,-1.18652 l 0.13184,0.0659 q 0.52734,-0.13183 1.1206,-0.13183 z m 0.59326,2.50488 -0.32959,-0.13184 q 0,0.13184 -0.13183,0.13184 l -0.0659,-0.13184 q -0.26367,0.0659 -0.46143,0.19776 -0.36254,-0.0659 -0.52734,-0.0659 -0.41199,0.13184 -0.52734,0.13184 l -0.13184,-0.0659 -0.26367,0.13183 q -0.13184,-0.0659 -0.19775,-0.0659 -0.34607,0.26367 -1.4502,0.52734 0,0.0989 -1.51611,0.46143 -0.0824,0.21423 -0.65918,0.3955 0,-0.13183 -0.13184,-0.13183 0,0.26367 -1.38428,0.65918 -0.36254,0 -0.79101,1.64795 -0.34607,0.23071 -1.31836,2.37304 -0.36255,1.05469 -1.64795,3.09815 -0.5603,0.69214 -0.79102,1.51611 -0.93933,1.07117 -1.1206,1.58203 l -0.79102,0.98877 0.0659,0.13184 0,0.0659 q -0.28015,0 -0.98877,1.31836 0.0659,0.13183 0.0659,0.19775 -0.0989,0 -0.65918,0.92285 -0.42847,0.37903 -1.12061,1.51611 -0.0824,0.0165 -1.97753,2.96631 l 0,0.0659 q 0.28015,0 0.85693,-0.26367 0,0.0659 0.0659,0.0659 0,-0.23072 1.18652,-0.7251 l 0.0659,0 0,0.0659 -0.39551,0.13183 0,0.0659 0.0659,0 q 1.33484,-0.7251 1.51611,-0.7251 l -0.0659,-0.13183 0.0659,0 q 0.13184,0.0659 0.19776,0.0659 l 0.32959,-0.39551 q 0.18127,0 0.79101,-0.39551 0.13184,0.0659 0.19776,0.0659 0,-0.21424 0.65917,-0.39551 0,-0.29663 0.7251,-0.39551 l 0,-0.13183 0.13184,0.0659 q 0.42847,-0.51086 3.09814,-1.91162 0,-0.0659 0.65918,-0.46142 l 0.0659,0 0,0.13183 0.0659,0 q 0,-0.32959 0.39551,-0.32959 0.24719,-0.42846 0.98877,-0.72509 0.95581,-0.8899 1.51611,-1.12061 0,-0.11536 0.79101,-0.52734 0,-0.11536 0.7251,-0.59326 0,-0.1648 0.52735,-0.46143 0.67566,-0.79102 1.18652,-1.05469 0,-0.24719 0.59326,-0.52734 0,-0.24719 0.7251,-0.79102 0,-0.16479 0.26367,-0.26367 0.5603,-0.80749 0.98877,-1.1206 0,-0.21424 0.59326,-0.85694 0.11536,-0.28015 0.92285,-1.45019 1.4502,-2.48841 1.4502,-4.48243 0,-0.65918 -2.70264,-1.05468 l -0.39551,0.19775 z m -13.64502,5.47119 0,0.0659 0.0659,0 q 0.26367,-0.0989 0.26367,-0.19775 l -0.0659,0 q -0.1648,0.13183 -0.26368,0.13183 z m -10.67871,17.20459 0.19776,0 q 0,0.13184 -0.13184,0.13184 l -0.0659,0 0,-0.13184 z"
         style="font-style:normal;font-variant:normal;font-weight:normal;font-stretch:normal;font-size:33.75px;font-family:'The Right Thing';-inkscape-font-specification:'The Right Thing';opacity:1;stroke:#1d1d1d;stroke-opacity:1"
         id="path5973"
         inkscape:connector-curvature="0" />
      <path
         d="m 691.30444,558.29905 q 0.84046,0.70862 0.79102,0.95581 0.13183,0.37903 0.19775,1.20301 -0.21423,0.42846 -0.54382,0.72509 -0.13184,0.37903 -3.59253,2.22474 -1.49963,0.87341 -2.98279,1.86218 -1.86218,1.21948 -1.87866,1.30188 -0.98877,0.5603 -1.87866,1.38428 0.0165,-0.0659 -0.0494,-0.0824 -0.033,0.16479 -0.41199,0.34607 l 0.0494,0.13183 -0.0165,0.0659 q -0.36255,-0.0494 -0.92285,0.59326 -1.33484,1.00525 -1.3678,1.25244 -0.69214,0.39551 -1.23596,1.15357 -0.34607,0.0989 -1.66443,1.68091 l -1.07117,1.03821 -0.033,0.19775 0.13183,0.033 2.53784,-0.79102 0.2472,0.11536 0.34606,-0.0659 0.13184,0.0824 0.41199,0 -0.0165,0.0659 q -0.033,0.13183 -0.23071,0.0989 l -0.0165,0.13184 0.52734,0.0989 -0.0165,0.13183 q -1.51611,1.21948 -1.53259,1.30188 -1.99402,1.21948 -3.14759,1.56555 -0.42846,0.37903 -2.60376,1.23597 -0.4779,-0.0824 -2.60376,3.16406 -0.36254,0.74158 -1.21948,1.54907 -0.0165,0.0824 -0.0989,0.19775 l 0,0.32959 q -0.39551,0.31311 -0.79102,1.43372 -0.42847,0.28015 -1.25244,2.78503 l 0.0165,0.34607 q 1.66443,0.29663 6.11389,-1.86218 1.15356,-0.32959 1.49963,-0.69214 l 0.19776,0.033 -0.033,0.13184 -0.13184,-0.0165 0,0.0659 0.13184,0.0165 q 0,-0.0659 0.46142,-0.31311 l 0.033,-0.19776 q 0.26368,-0.16479 0.36255,-0.14831 0.14832,-0.31311 0.26367,-0.29664 l -0.0165,0.0659 -0.0824,0.11536 0.0659,0.0165 q 0.28016,0.0494 1.00525,-0.29663 0.34607,-0.14832 0.97229,-0.51087 0.0989,0.18128 0.0824,0.29663 l 0.14832,-0.0494 0.0659,0.0165 q 0.13184,0.0165 0.0824,0.28015 l 0.14832,-0.0494 0.0659,0.0165 -0.11536,0.32959 q 0.0989,0.0165 0.21423,0.29663 -0.41198,0.26367 -0.69214,0.84045 l -1.31836,0.85694 q 0.0494,0.14831 0.033,0.21423 -0.3955,0.28015 -0.59326,0.23071 l 0.0494,0.14832 q -0.39551,0.34607 -0.82397,0.39551 -0.033,0.16479 -1.97754,1.15356 l 0.0494,0.14832 -1.12061,0.5603 -0.13184,-0.033 -0.13183,-0.0824 -0.0824,0.11536 q 0.0659,0.0165 0.0494,0.0824 -1.00525,0.36254 -2.14234,0.92285 -0.31311,-0.0659 -1.36779,0.42846 -0.14832,0.0494 -0.62622,0.033 l 0.0165,-0.0659 -0.14832,0.0494 q -1.07117,-0.3955 -1.56555,-1.10412 -0.98877,-1.82923 -1.26892,-2.94983 l -0.033,-0.14832 0.0165,-0.0659 q 0.0824,-0.51087 0.0824,-0.93934 0.3955,-2.19177 4.38354,-8.15734 0.1648,0.033 1.43372,-1.92811 l -0.0494,-0.14831 q 0.69214,-0.54382 2.55432,-2.90039 0.033,-0.13184 0.52734,-0.65918 1.59851,-1.96106 2.80152,-3.04871 1.6809,-1.87866 2.45544,-2.35656 0.5603,-0.84046 4.44946,-3.59253 7.67945,-4.82849 9.42627,-5.09217 z"
         style="font-style:normal;font-variant:normal;font-weight:normal;font-stretch:normal;font-size:33.75px;font-family:'The Right Thing';-inkscape-font-specification:'The Right Thing';opacity:1;stroke:#1d1d1d;stroke-opacity:1"
         id="path5975"
         inkscape:connector-curvature="0" />
      <path
         d="m 700.68127,557.67283 q 5.70191,-0.51086 6.0315,3.22998 l -0.0659,0.0165 q 0.0165,0.0659 0.0824,0.0494 0,0.87341 -0.34607,2.22473 -1.05469,1.76331 -1.74683,2.7356 -1.18652,0.65918 -2.02698,1.82922 -1.10412,0.57678 -1.18652,0.75806 -0.0989,0.19775 -0.74158,0.52734 -0.51086,0.36255 -0.79101,0.87342 0.0165,0.21423 -1.21948,1.08764 -1.00525,0.75806 -1.03821,0.95581 -2.91687,2.24121 -4.68018,3.39478 -2.5708,2.04345 -4.61426,3.97156 -1.81274,1.91162 -1.69738,3.26293 -0.0659,0 -0.0494,0.0659 l 0.0659,0.13184 q -0.0989,0.26367 -0.0824,0.46142 l 0.11536,0.59327 -0.0659,0 q 0.0989,0.46142 0.16479,0.44494 l -0.033,0.34607 0.033,0.44495 q 0.0165,0.14831 0.0989,0.26367 0,0.0659 -0.0659,0.0659 0.92285,4.69665 2.32361,6.95434 0.0165,0.1648 1.26892,2.38953 0.0824,0.0824 0.11536,0.46143 l -0.32959,0.033 q 0,0.0659 -0.36255,0.42847 -0.92285,0.0824 -3.11463,-4.69665 -1.79626,-4.4989 -1.94458,-6.24573 l 0.0659,0 -0.32959,-0.77454 0.0494,-0.13183 -0.0659,0 -0.23071,0.36255 0.0824,0.11535 0,0.0659 q -0.32959,0.0494 -0.31311,0.23071 0.13183,0 0.14831,0.11536 -0.0659,0 -0.4779,0.70862 l -0.13184,-0.0659 -0.0659,0.0165 0.0824,0.11536 q -0.67566,0.5603 -0.6427,1.05468 l -0.0659,0 0.0824,0.13184 -0.60974,1.31836 -0.0659,0 -0.14831,-0.0494 q 0.0165,0.13184 -0.0494,0.13184 l 0.0824,0.13183 0,0.0659 q -0.42846,0.69214 -0.46142,0.69214 l -0.0165,-0.13184 -0.0659,0.0165 0,0.0659 0.0824,0.11536 q -0.19776,0.51086 -0.34607,0.5603 0,-0.0659 -0.0659,-0.0494 -0.0659,0.19775 -1.13708,1.41724 -0.42847,1.1206 -1.2854,1.96106 -0.47791,0.37902 -0.62622,0.3955 -0.62623,-0.28015 -1.2854,-1.02172 l -0.0165,-0.19776 q 1.61499,-2.5708 2.25769,-3.7738 1.9281,-3.60901 2.75207,-4.86145 1.4502,-2.76856 2.19177,-3.70789 0.39551,-0.90637 1.76331,-3.1311 l 0.033,0.19775 q 0.0989,0 0.23071,-0.28015 l 0,-0.0659 -0.13183,0.0659 -0.0659,0.0165 -0.0165,-0.13184 q 1.15356,-1.86218 2.63672,-4.66369 0.84045,-1.63147 1.8457,-3.2135 0.57678,-1.64795 1.69739,-3.31238 -0.033,-0.34607 0.6427,-1.58203 l 0,-0.13184 q -0.47791,0.033 -3.2135,1.86219 -1.54908,1.31835 -1.99402,1.49963 0.0165,0.0824 -0.29663,0.36255 l -0.56031,-0.34607 q -0.85693,-0.97229 -1.1206,-1.49964 l -0.0165,-0.26367 q 1.26892,-1.79626 3.1311,-2.6532 1.17005,-0.90637 4.16931,-2.35656 3.21351,-1.40076 5.57007,-2.07642 l 0.0165,0.0659 q 0.1648,-0.0659 1.15357,-0.29663 l 0.0165,0.0659 q -0.0165,-0.0659 1.0382,-0.21424 z m 2.45545,2.42249 q 0,0.0494 -0.18128,0.21423 l -0.32959,-0.033 q -0.19775,0.0165 -0.19775,0.0824 l -0.32959,-0.033 q -2.93335,0.24719 -5.75134,1.56555 0.11535,1.31836 -1.40076,3.69141 -2.15881,3.88916 -2.4884,4.71313 -1.12061,1.81275 -1.71387,3.13111 0.18128,-0.14832 0.51086,-0.18128 l -0.0824,-0.13183 q 0.62622,-0.37903 0.82397,-0.39551 -0.0165,-0.21423 0.24719,-0.28015 1.77979,-1.54907 2.1753,-1.58203 0.5603,-0.37903 0.54382,-0.51087 0.74158,-0.52734 1.33484,-0.77453 0.16479,-0.47791 0.87341,-0.54383 l -0.0824,-0.13183 q 3.46069,-2.34009 6.22924,-5.3064 1.00525,-1.41724 1.31836,-2.22473 0.0659,-0.62622 0.19776,-0.82398 l -0.0165,-0.13183 q -1.05469,-0.36255 -1.68091,-0.31311 z m -12.4585,13.39783 0.0165,0.13183 q 0.11536,-0.0824 0.18128,-0.0824 l 0,-0.0659 -0.19776,0.0165 z"
         style="font-style:normal;font-variant:normal;font-weight:normal;font-stretch:normal;font-size:33.75px;font-family:'The Right Thing';-inkscape-font-specification:'The Right Thing';opacity:1;stroke:#1d1d1d;stroke-opacity:1"
         id="path5977"
         inkscape:connector-curvature="0" />
      <path
         d="m 717.50684,558.41441 q 1.79626,0.42847 1.79626,1.64795 0.13184,0 0.13184,0.70862 l 0,0.28015 q 0,2.0105 -2.14234,5.50415 -0.18127,0 -1.07116,1.71387 -0.44495,1.07116 -0.70862,1.07116 l -0.36255,0.56031 q -0.11536,0.32959 -0.5603,0.79101 l 0.0659,0.13184 -0.49438,0.79101 0,0.14832 q 0.21423,0 3.2135,-1.07117 4.59778,-1.56555 5.63599,-1.56555 l 0,0.13184 q 0.18127,0 0.6427,-0.13184 0.11535,0.0659 0.28015,0.0659 l 0,0.0659 q -0.34607,0.23071 -0.42847,0.6427 -0.97229,0.6427 -1.07117,0.6427 0,0.41198 -2.07641,1.00525 -0.23071,0.29663 -2.42249,1.07116 0,0.18128 -4.56482,1.63147 l -1.2854,0.7251 q -0.26367,0.32959 -0.49438,0.92285 -0.60974,0.67566 -1.64795,2.27417 l -1.13709,1.3678 q -0.0989,0.34607 -0.21423,0.34607 l 0.0659,0.14831 q -0.18128,0.34607 -0.28015,0.36255 0,-0.0824 -0.0659,-0.0824 -1.4502,2.45545 -2.71912,4.07044 -0.32959,0 -0.85693,1.35132 -0.24719,0.18127 -1.77979,2.50488 -0.0989,0 -0.85693,1.13709 -1.10413,1.31836 -1.64795,1.71386 0,-0.0659 -0.0659,-0.0659 0,0.0989 -0.36255,0.34607 l -0.49438,-0.28015 0,-0.0659 -0.14832,0.0659 q -0.13183,0 -0.13183,-0.13183 l 0,-0.42847 q 0.57678,-1.38428 1.203,-2.14233 0,-0.18128 1.21948,-1.9281 1.18653,-1.92811 1.56556,-2.35657 l -0.0659,-0.14832 q 0.87341,-1.02173 2.14233,-3.27942 0.1648,-0.0165 2.14234,-3.14758 l 0.70861,-1.05469 0,-0.0824 -0.0659,0 q -2.6532,0.85693 -3.57605,1.43371 -2.19178,0.7251 -2.85096,1.07117 l 0,0.0659 -0.0659,0 q -0.0824,0 -0.0824,-0.0659 -2.0929,0.52734 -2.63672,1.49963 -2.02698,3.04871 -4.4165,8.05847 -0.26368,1.35132 -0.7251,1.35132 -0.75806,0 -1.71387,-1.35132 -0.34607,-0.18127 -0.34607,-0.70861 0.42847,-0.7251 0.98877,-2.35657 0.32959,-0.31311 0.85693,-1.64795 l 1.64795,-2.63672 -0.0659,-0.14831 q -0.56031,0.29663 -0.7251,0.29663 l 0,-0.0824 q -0.1648,0 -1.63147,0.6427 -2.20825,0.57678 -3.57605,0.57678 -1.07117,0 -1.77979,-2.07642 l 0,-0.42846 q 0.14832,-0.42847 0.57679,-0.42847 l 0,0.0824 0.13183,-0.0824 q 0.51087,0.14832 0.57678,0.14832 l 0.0659,0 q 2.6532,0 8.93189,-2.20826 2.47192,-3.55957 5.20752,-6.64123 0,-0.21423 2.78503,-3.27942 0.13184,0 0.98877,-1.00525 2.47192,-2.53784 4.77905,-4.4165 1.26892,-1.18653 2.5708,-1.9281 1.61499,-1.35132 3.14759,-1.64795 l 0.34607,-0.0659 z m -15.1941,17.41882 0,0.0659 q 7.48169,-2.50488 8.05848,-2.85095 l 2.5708,-4.13635 q 0.36255,-0.46143 0.36255,-0.79102 0.18127,0 0.92285,-1.2854 1.33484,-2.47192 1.77978,-3.06519 l 0.85694,-2.07641 -0.0659,0 q -1.49964,0.54382 -7.41577,5.93262 -1.5326,1.6809 -2.29065,2.20825 -0.8075,1.2854 -2.91687,3.55957 -0.7251,0.87341 -1.86219,2.43896 z m 19.47876,-6.29516 0.21424,0 0,-0.13184 -0.0659,0 q -0.14832,0.0165 -0.14832,0.13184 z"
         style="font-style:normal;font-variant:normal;font-weight:normal;font-stretch:normal;font-size:33.75px;font-family:'The Right Thing';-inkscape-font-specification:'The Right Thing';opacity:1;stroke:#1d1d1d;stroke-opacity:1"
         id="path5979"
         inkscape:connector-curvature="0" />
      <path
         d="m 741.33618,557.42564 0.24719,0 -0.13183,0.18127 q 0.13183,0.0659 0.19775,0.0659 0.19776,-0.11535 0.29663,-0.11535 l 0.0659,0.11535 q -0.24719,0.21424 -0.24719,0.42847 l 0,0.0659 0.13183,-0.0659 0.0494,0 q 0.13184,0.0165 0.13184,0.13184 l 0,0.0659 -0.67566,0.74158 q 0.0494,0.11536 0.0494,0.18127 -0.36255,0.1648 -0.36255,0.42847 0.0659,0 0.0659,0.0659 l -0.2472,0.24719 0,-0.11535 -0.0659,0 q -0.13184,0.0165 -0.13184,0.11535 l 0.13184,0 0,0.0659 -1.86219,1.12061 q 0,0.28015 -1.30188,0.92285 -4.10339,2.62024 -5.58654,3.79028 -0.74158,0.29663 -0.74158,0.42847 -2.29065,1.30188 -2.29065,1.66443 l 0.0659,0.13183 -1.30188,2.7356 q -0.46143,0.7251 -1.43372,2.58728 -0.93933,1.8457 -1.54907,2.55432 -0.42847,1.48315 -1.17004,2.10937 l 0,0.11536 q 0.0659,0.13184 0.0659,0.18127 -0.3955,0 -0.80749,1.25245 0.0494,0 0.0494,0.0494 -0.2472,0 -1.05469,1.615 -0.92285,1.61499 -2.53784,4.71313 l -1.48316,2.7356 q 0,0.13183 -0.5603,1.05468 -1.30188,2.40601 -1.30188,2.60376 -0.60974,0.7251 -0.60974,0.92285 0.0494,0.11536 0.0494,0.18128 -0.44495,0.46142 -0.5603,0.98877 l -0.0494,0 -0.13184,-0.0494 q 0,0.0494 -0.0659,0.18127 l 0,0.18128 q -0.18127,0 -0.85693,1.18652 0,0.0824 -0.5603,0.5603 0,0.0824 -0.37903,0.36255 -0.14832,0.49439 -0.42847,0.49439 -0.19775,-0.11536 -0.31311,-0.11536 0,0.0824 -0.18127,0.18128 l 0,-0.0659 q 0,-0.14832 0.18127,-0.42847 l -0.0659,0 -0.24719,0.18128 q -0.11536,0 -0.11536,-0.11536 0.18128,-0.0989 0.49439,-0.93933 l 0.24719,-0.31311 -0.0659,-0.11536 0.49439,-0.62622 q -0.0494,0 -0.0494,-0.0494 0.13184,0 0.36255,-0.75805 0.28015,-0.42847 0.42847,-0.42847 l -0.0494,-0.11536 q 0.29663,-0.75805 1.17004,-2.24121 0,-0.21423 0.62622,-1.30188 3.01575,-5.76782 3.27942,-6.37756 0.18128,-0.21424 0.18128,-0.37903 1.71386,-2.88391 2.17529,-4.021 2.07641,-3.74084 3.09814,-5.96557 0.0824,0 0.49439,-1.10413 0.74157,-1.30188 1.1206,-2.35657 l 0,-0.0659 q -1.25244,0.75805 -2.73559,1.79626 -4.69666,2.98279 -5.57007,2.98279 l -0.8075,0 q -0.32959,-0.24719 -0.5603,-0.69214 -0.49438,-0.29663 -0.80749,-1.54907 0.19775,-0.37903 1.86218,-0.85694 1.73035,-0.84045 5.63598,-3.29589 1.08765,-0.77454 4.53187,-2.91687 l 1.23596,-0.67566 q 0,-0.29663 1.86218,-1.23597 0.39551,-0.32958 1.9281,-1.1206 l 0,-0.0659 0.11536,0.0659 0.0659,0 q 0.033,-0.36255 0.37903,-0.36255 l 0,-0.13184 0.0494,0 0.13184,0.0659 q 0,-0.13183 0.80749,-0.49438 l 1.66443,-0.98877 q 0.14832,-0.23071 0.93933,-0.5603 0,-0.11536 0.98877,-0.49439 0.0165,-0.11536 2.53784,-1.43371 0,-0.0659 0.0659,-0.0659 l 0.11536,0 -0.0494,0.13183 0,0.0659 0.11536,0 q 0.13183,0 0.13183,-0.13183 l 0,-0.18128 0.24719,0 0,0.11536 0.74158,-0.42847 z"
         style="font-style:normal;font-variant:normal;font-weight:normal;font-stretch:normal;font-size:33.75px;font-family:'The Right Thing';-inkscape-font-specification:'The Right Thing';opacity:1;stroke:#1d1d1d;stroke-opacity:1"
         id="path5981"
         inkscape:connector-curvature="0" />
      <path
         d="m 752.47632,558.36497 0.0494,0.14832 -0.13184,0.0494 -0.19775,-0.0165 q 0.0165,-0.0989 0.28015,-0.18128 z m -0.34607,0.18128 q 0.0824,0.13183 0.77454,0.19775 -0.0165,0.13184 -0.14832,0.11536 0.0659,0.11535 0.0494,0.26367 l 0.32959,-0.033 q 0,0.0659 0.0659,0.0659 -0.0824,0.3955 -0.1648,0.3955 l 0.0494,0.13184 0,0.0659 q -0.28015,0.46142 -1.69739,1.17004 l 0,0.0659 -0.13183,-0.0659 -0.0659,-0.0165 0.0659,0.14832 q -0.84046,0.44494 -0.97229,0.44494 0,-0.0659 -0.0659,-0.0824 -0.74158,0.5603 -1.79627,0.97229 -0.95581,0.87341 -1.54907,0.98877 -0.16479,0.26367 -1.31836,0.74157 -1.38428,2.24122 -1.41723,2.58728 -0.60975,1.00525 -0.8899,1.77979 -0.46142,0.5603 -2.15881,3.64197 -1.03821,1.43371 -1.35132,1.74682 -1.05469,2.22473 -1.7633,2.818 -1.58204,2.24121 -2.14234,3.31237 -0.93933,1.28541 -1.1206,1.3678 -0.033,0.47791 -0.92286,1.49964 0,0.0659 -0.13183,0.0659 0.0494,0.13184 0.0494,0.19776 -0.0989,0.23071 -0.44495,0.49438 l -0.0165,0.19776 q -1.41724,1.79626 -1.45019,2.10937 l 0.0659,0.0165 q 1.73035,-0.85693 2.68616,-1.08765 0.0659,0 0.0494,0.0659 0.13184,-0.0494 0.21423,-0.0494 l 0,-0.0659 -0.13183,-0.0165 0.0165,-0.13184 0.46142,-0.0824 -0.0659,0.13184 0.26368,0.0165 0.13183,-0.0494 0,0.0659 q 0.21424,-0.11536 0.74158,-0.13184 l -0.0824,0.11536 0.0659,0 q 0.11536,-0.0494 0.26367,-0.033 -0.0165,0.13184 -0.21423,0.11536 l 0,0.13183 0.0659,0 q 0.13183,-0.0494 0.19775,-0.0494 l 0.0494,0.14832 0,0.11536 q -0.0165,0.11535 -0.77454,0.54382 0.0494,0.13183 0.0494,0.19775 -0.0989,-0.0165 -2.17529,1.26892 -0.19776,-0.0165 -2.24121,1.4502 -0.34607,0.14831 -0.34607,0.23071 -1.86219,1.23596 -3.32886,1.76331 -0.75806,0.57678 -2.34009,1.05469 -0.95581,0.57678 -1.63147,0.51086 -0.69214,-0.0494 -1.61499,-2.05994 -0.18127,-0.26367 -0.13183,-0.72509 0.24719,-0.23072 1.96106,-0.42847 l 3.74084,-1.26892 q 0.51086,-0.0824 2.4884,-3.41126 0.51087,-0.59326 1.58204,-2.24121 0.49438,-0.87341 0.84045,-1.31836 l -0.0494,-0.14831 q 0.34607,-0.21424 0.60974,-0.93933 0.21424,0.033 1.46668,-2.30713 0.13183,0 0.51086,-0.69214 0.41199,-0.82398 0.60974,-0.8075 l -0.0494,-0.13183 q 0.49439,-0.54383 1.5326,-2.45545 0.13183,0.0165 0.3955,-0.69214 0.19776,-0.0824 1.07117,-1.74682 0.87341,-1.17005 2.58728,-4.54834 l 0,-0.0659 -0.0659,0 q -0.0165,0.19775 -0.34607,0.1648 0,-0.0659 -0.0659,-0.0659 0,0.11535 -1.08765,0.49438 -0.0165,0.0989 -0.21423,0.18128 l 0,-0.0659 q -0.39551,0.36255 -2.90039,1.33484 -1.54908,0.52734 -2.02698,0.4779 -0.85694,-0.0659 -1.58203,-2.37304 l 0.0165,-0.13184 q 0.033,-0.29663 2.04345,-0.62622 5.57007,-2.05994 8.02552,-3.32886 1.1206,-2.29065 1.40075,-2.25769 0,-0.0659 0.0659,-0.0659 1.26892,0.52735 1.23596,1.03821 l 0.19776,0.0165 q 3.18054,-1.45019 6.09741,-2.43896 z"
         style="font-style:normal;font-variant:normal;font-weight:normal;font-stretch:normal;font-size:33.75px;font-family:'The Right Thing';-inkscape-font-specification:'The Right Thing';opacity:1;stroke:#1d1d1d;stroke-opacity:1"
         id="path5983"
         inkscape:connector-curvature="0" />
      <path
         d="m 761.54004,554.45933 0,0.0659 0.13183,-0.0659 q 0.95582,0.34607 0.95582,0.8075 l 0.29663,0.65918 q -0.21424,0.29663 -0.36255,0.29663 l 0.21423,0.36255 q -0.95581,0.60974 -2.19177,2.12585 0,0.14832 -0.23071,0.14832 l 0,0.14831 0.51086,-0.0659 0.52734,0 q 1.97754,0.46143 1.97754,0.87342 0.29663,0.28015 0.95581,2.05993 l 0,1.31836 q 0,1.26892 -1.61499,5.80078 -1.41723,2.91687 -1.61499,3.16407 0,0.13183 -0.74157,1.38427 l -1.23597,2.20826 q -1.203,1.63147 -1.91162,2.86743 -1.63147,2.29065 -2.42248,3.14758 -0.49439,1.12061 -4.11988,4.84497 -2.3236,2.60376 -3.37829,3.16406 -0.44495,0.39551 -2.42249,1.46668 0,0.21423 -1.08764,0.36255 -1.84571,0 -3.52661,-2.78504 -0.44495,-0.93933 -0.44495,-1.61499 l 0,-0.88989 q 0,-1.79626 1.82922,-6.45996 2.53784,-5.68543 6.45996,-11.15662 2.34009,-3.06518 3.67493,-4.61425 0,-0.0659 4.84497,-5.37232 0.11536,0 1.10413,-1.23596 0.11535,0 0.87341,-0.88989 l 1.91162,-1.61499 q 0.7251,-0.51087 1.03821,-0.51087 z m -6.45996,10.94238 q -0.14832,-0.0824 -0.23071,-0.0824 l -0.44495,0.59326 -0.13184,-0.0824 -1.7633,1.99402 q -1.43372,1.56555 -2.14234,2.85095 -1.49963,1.73035 -1.97754,2.94983 -0.36254,0.6427 -1.02172,1.38428 -2.48841,3.8562 -4.11988,8.22327 -1.17004,3.22998 -1.17004,4.48242 l 0,0.51086 q 0,0.59326 0.74158,0.59326 l 0.0659,0 q 2.63672,0 8.37159,-6.39404 1.0382,-1.30188 1.10412,-1.31836 3.54309,-4.44946 6.6742,-9.98657 3.44421,-6.45996 3.44421,-9.60755 -0.0989,-0.3955 -0.57678,-0.65918 -1.48316,0 -2.93335,1.08765 -0.88989,0.52734 -3.88916,3.46069 z"
         style="font-style:normal;font-variant:normal;font-weight:normal;font-stretch:normal;font-size:33.75px;font-family:'The Right Thing';-inkscape-font-specification:'The Right Thing';opacity:1;stroke:#1d1d1d;stroke-opacity:1"
         id="path5985"
         inkscape:connector-curvature="0" />
      <path
         d="m 775.25098,558.33201 0.36255,-0.0494 q 0.14831,-0.0165 0.16479,0.0989 l 0.13184,-0.0824 0.14831,-0.033 q 1.35132,0.47791 1.53259,1.43372 0.13184,-0.0165 0.39551,0.47791 0.14832,3.82324 -0.90637,7.10266 0.0494,0.32959 -0.77454,3.32885 0.0824,0.31311 -0.49438,2.02698 -0.26367,1.96106 -0.84045,2.88391 l 0.0989,0.11536 0.033,0.19775 q -0.14831,0.23072 -0.13183,0.82398 -0.0824,0 -0.49439,1.68091 -0.37903,0.49438 -0.75806,2.93335 l 0.0989,0.11535 q -0.26367,1.31836 -0.67566,2.6532 -0.26367,1.64795 -0.59326,2.5708 -0.23071,0.033 -0.21423,0.1648 l 0.0494,0.19775 0.0659,-0.0165 -0.0165,-0.13184 0.14832,-0.0165 0.0165,0.0659 q -0.14832,0.29663 -0.31311,1.4502 l -0.14832,0.0165 0.13184,0.31311 q -0.13184,1.00525 -0.37903,1.07117 l 0.033,0.19775 0.14831,-0.033 q -0.18127,1.33484 -0.18127,1.3678 0.32959,-0.34607 2.10938,-4.00452 -0.033,-0.14831 0.21423,-0.51086 1.08765,-2.40601 1.61499,-3.80677 0.28015,-0.3955 0.93933,-2.07641 0.11536,-0.033 0.34607,-0.87341 0.11536,-0.0165 0.32959,-0.57679 0.46142,-0.67566 0.90637,-2.22473 0.13184,-0.0165 0.82398,-1.53259 0.11535,-0.0165 0.42846,-1.13709 0.77454,-1.31836 1.64795,-3.34533 1.68091,-3.24646 1.64795,-3.34534 0.13184,-0.0165 0.52734,-1.08765 0.11536,-0.033 0.7251,-1.31836 0.21424,-0.0659 0.26367,-0.51086 l 0.93934,-1.68091 q -0.0165,-0.0659 0.52734,-0.69214 l -0.033,-0.19775 q 0.0659,0 0.19775,-0.0989 l -0.0989,-0.11535 0.28015,-0.44495 q 0.28015,-0.57678 0.32959,-0.59326 l 0.26367,0.0989 0.0659,-0.0165 q -0.033,-0.49439 0.52734,-1.02173 l 0.0659,-0.47791 0.16479,0.0494 0.033,-0.14832 0,-0.0659 -0.14831,0.033 q 0,-0.13184 0.11535,-0.1648 0.1648,0.0494 0.23072,0.033 0.21423,-0.62622 0.60974,-0.69214 l 0.0165,0.13184 -0.033,0.13183 q 0.21423,-0.033 0.23071,0.0989 -0.0659,0.4779 -0.31311,0.7251 l 0.11536,0.11535 q -0.0824,0.26368 -0.32959,0.65918 l 0.0989,0.11536 -0.32959,0.6427 q 0.0989,0.11536 0.13183,0.24719 -0.0989,0.0165 -0.24719,0.18128 l 0.0824,0.11535 q -0.7251,1.58203 -0.67566,1.84571 -0.14832,0.033 -1.23596,2.406 -0.74158,1.30188 -1.10413,2.38953 l -0.19775,0.033 0.0824,0.11535 q -0.24719,1.03821 -0.52734,1.08765 l 0.0989,0.11536 q -2.12586,4.36706 -3.39478,7.36633 -0.11536,0.0494 -0.77454,1.26892 l -0.92285,2.55432 q -0.36255,1.05469 -0.85693,1.68091 l -2.02698,4.86145 q -0.74158,1.203 -0.6427,1.64795 l -0.0824,0.0165 -0.14831,-0.0494 q -0.0494,0.29663 -0.92285,2.0929 0.0494,0.31311 -0.31311,0.65918 -0.60974,1.48315 -1.86219,3.03222 -1.23596,0.19776 -2.66967,-1.1206 l -0.18128,-0.90638 q -0.0989,-0.54382 0.0824,-1.08764 l -0.0824,-0.11536 -0.033,-0.0659 q 0.54383,-4.10339 1.4502,-8.51989 1.40076,-6.60828 2.63672,-11.66748 0.13183,-0.85694 1.25244,-6.09742 0.34607,-1.66442 0.34607,-2.85095 -1.21948,1.61499 -1.23596,2.12586 -0.62622,0.67566 -1.73035,2.55432 l -1.40076,2.70263 q -0.92285,1.69739 -0.92285,1.74683 -0.34607,0.41199 -1.30188,2.42249 -0.0165,0.29663 -0.54382,1.02172 0.0494,0.23072 -0.44495,0.74158 0.0165,0.11536 -0.54382,1.41724 -3.22998,6.5094 -3.87268,7.97607 -0.49439,0.8075 -0.7251,1.59851 -0.16479,0.13184 -0.92285,2.14234 -1.08765,1.73034 -1.40076,2.63672 l -0.26367,0.24719 -0.21423,0.033 q -1.25244,-0.34607 -1.58203,-0.56031 -0.65918,-0.29663 -0.75806,-0.74157 -0.0165,-0.18128 1.26892,-2.68616 l 4.86145,-9.67346 q 4.10339,-8.50342 7.58057,-14.45252 0.74157,-1.51611 2.43896,-3.87268 1.17004,-1.51611 1.76331,-1.61499 z"
         style="font-style:normal;font-variant:normal;font-weight:normal;font-stretch:normal;font-size:33.75px;font-family:'The Right Thing';-inkscape-font-specification:'The Right Thing';opacity:1;stroke:#1d1d1d;stroke-opacity:1"
         id="path5987"
         inkscape:connector-curvature="0" />
      <path
         d="m 808.57251,558.38145 q 1.58203,0.32959 1.58203,0.79102 0.59326,0.29663 0.59326,1.25244 0.0659,0 0.0659,0.13183 l -0.13184,0.39551 q 0,0.0659 0.0659,0.0659 0,0.14832 -0.46142,1.77978 l -1.18653,2.24122 q -1.41723,2.406 -4.35058,6.13037 0,0.23071 -0.65918,1.05468 -1.07117,1.73035 -5.93262,7.18506 -0.75806,0.7251 -1.1206,0.7251 l -0.0659,0 q -0.19776,0 -0.19776,-0.39551 l -0.32959,0 q -0.13183,-0.0165 -0.59326,-0.65918 -0.19775,-0.14831 -0.19775,-0.19775 l 0,-0.39551 0.19775,-0.32959 -0.26367,0 0,-0.0659 q 2.81799,-2.66967 4.15283,-4.4165 1.76331,-1.96106 3.22998,-4.15283 l 0.92285,-1.05469 0.19776,-0.13184 -0.0659,-0.13183 2.24121,-3.09815 q 0,-0.11535 1.12061,-1.71386 0,-0.32959 0.26367,-0.32959 l -0.0659,-0.13184 q 0.79102,-1.35132 0.79102,-1.51611 -0.1648,0 -2.43897,1.77978 -0.70862,0.34607 -5.40527,5.07569 -0.13184,0 -0.59326,0.65918 -1.86219,1.86218 -3.82325,4.35058 -2.47192,3.41126 -3.09814,4.08692 l -1.4502,2.5708 q -0.72509,1.69738 -0.72509,2.37304 0.70861,0.39551 2.43896,0.65918 3.19702,0.60974 4.15283,1.58203 0.87342,0.90638 1.18653,2.9004 l 0,0.19775 q 0,3.06518 -5.20752,7.11914 -0.92285,0.69214 -0.92285,0.85693 l -0.13184,-0.0659 -0.0659,0 q 0,0.26367 -0.13183,0.26367 0,-0.0659 -0.0659,-0.0659 0,0.41199 -2.83448,1.91162 -2.20825,1.18652 -3.95507,1.18652 l -0.13184,0 q 0,-0.21423 -1.18652,-0.59326 -2.1753,-1.79626 -2.1753,-3.42773 l 0,-0.85694 q 0.19776,-0.80749 0.39551,-1.25244 -0.0659,0 -0.0659,-0.0659 0.13184,0 0.13184,-0.13183 -0.0659,0 -0.0659,-0.0659 0.13184,0 0.32959,-0.46143 0.41199,-0.90637 1.05469,-1.38427 0,-0.26367 0.26367,-0.26367 l -0.0659,-0.13184 0,-0.13184 q 0.26368,-0.44494 0.46143,-0.46142 l 0.0659,-0.13184 -0.13184,-0.19775 0.13184,-0.0659 q 0.0659,0 0.0659,0.0659 0.41198,-0.0165 2.04345,-2.17529 0.13184,0 0.79102,-0.79102 l 0.13183,0 0,0.19775 0.13184,0 q 1.54907,-1.45019 1.71387,-1.45019 l -0.0659,0.13183 q 0.19775,0 0.19775,0.13184 l 0.13184,-0.0659 0.13183,0 -0.0659,0.13184 0.0659,0 0.13184,-0.0659 0,0.13184 q -0.32959,0.32959 -0.32959,0.59326 -0.13184,0 -0.65918,0.7251 -0.18127,0 -1.8457,2.04345 l 0.0659,0.13184 -0.39551,0.52734 0,0.0659 0.13183,0.19775 q -2.65319,3.72437 -2.90039,5.33936 l 0,0.85693 q 0,0.32959 0.46143,0.46143 l 0.32959,-0.0659 0.19775,0 q 0.0659,0 0.0659,0.0659 l 0.32959,-0.13184 0.13184,0.0659 q 0.21423,-0.13184 0.32959,-0.13184 l 0,0.0659 q 0.72509,-0.19775 0.72509,-0.32959 l 0.13184,0.0659 q 0.19775,-0.32959 0.46143,-0.32959 l 0.0659,0 0,0.13184 q 2.15882,-0.8899 2.90039,-1.77979 0.13184,0.0659 0.19776,0.0659 0,-0.13184 0.19775,-0.13184 l 0,-0.0659 -0.0659,-0.13184 0.32959,-0.19775 q 0.11536,0.0659 0.26368,0.0659 0,-0.19775 0.46142,-0.3955 l 0.32959,-0.46143 0.0659,0 0,0.13184 0.13184,0 0,-0.13184 -0.0659,-0.13184 0.59326,-0.3955 q 0.0659,0 0.0659,0.0659 0.11535,0 0.65918,-0.72509 0.0989,0 0.65918,-0.52735 l 0,0.13184 0.0659,0 0,-0.13184 q -0.0659,0 -0.0659,-0.0659 0.24719,-0.033 1.71386,-1.84571 1.12061,-1.61499 1.12061,-2.76855 -0.29663,-0.19776 -2.43897,-0.65918 l 0,-0.0659 q -0.0659,0 -0.0659,0.0659 -2.58728,-0.42847 -3.2959,-1.12061 -1.61499,-1.54907 -2.10938,-3.03222 l -0.0659,-0.32959 0,-0.26368 q 0,-2.25769 4.28466,-7.77832 0.1648,-0.0494 0.85694,-1.1206 0.54382,-0.47791 1.64795,-1.97754 0.24719,0 0.32959,-0.46143 0.0659,0 1.1206,-1.31836 l 0.46143,-0.3955 q 0,0.0659 0.0659,0.0659 0,-0.32959 0.46142,-0.32959 l 0,-0.0659 -0.0659,-0.13184 q 0.69214,-0.32959 0.7251,-0.79102 0.28015,0 0.79102,-0.85693 0.13183,0 1.05468,-0.85693 0,-0.26367 0.46143,-0.46143 0,-0.21423 0.65918,-0.79101 0.65918,-0.90638 1.38428,-1.18653 -0.0659,-0.13183 -0.0659,-0.19775 4.18579,-3.69141 5.80078,-3.95508 z m -3.88916,2.50488 0,0.0659 q 0.13184,0 0.13184,-0.13183 l 0,-0.0659 q -0.13184,0.0165 -0.13184,0.13183 z m -0.52734,0.32959 0,0.19776 q 0.13183,0 0.13183,-0.13184 l -0.13183,-0.0659 z m -15.88623,24.1919 q 0,0.0989 -0.26368,0.26367 l -0.0659,0 0,-0.0659 q 0,-0.14831 0.32959,-0.19775 z m -0.39551,0.32959 0.0659,0 0,0.0659 q -0.46143,0.52734 -0.52735,0.52734 l -0.0659,0 0,-0.0659 q 0,-0.0824 0.52735,-0.52734 z m -1.77979,1.25244 0,0.13184 q 0,0.0989 -0.19775,0.19775 l -0.0659,0 0,-0.0659 q 0,-0.0989 0.26367,-0.26367 z m -0.92285,1.38428 0,0.0659 q 0,0.13184 -0.13184,0.13184 l 0,-0.0659 q 0.0165,-0.13183 0.13184,-0.13183 z m 0.85693,1.91162 q 0.13184,-0.0659 0.19776,-0.0659 l 0,-0.13184 q -0.0989,0 -0.19776,0.19776 z m 4.15284,3.55957 0.0659,0 q 0,0.0989 -0.19775,0.19775 l -0.0659,0 q 0,-0.0989 0.19776,-0.19775 z m -2.5708,1.45019 0.19775,0 q 0,0.13184 -0.13184,0.13184 l -0.0659,0 0,-0.13184 z"
         style="font-style:normal;font-variant:normal;font-weight:normal;font-stretch:normal;font-size:33.75px;font-family:'The Right Thing';-inkscape-font-specification:'The Right Thing';opacity:1;stroke:#1d1d1d;stroke-opacity:1"
         id="path5989"
         inkscape:connector-curvature="0" />
    </g>
  </g>
  <g
     inkscape:groupmode="layer"
     id="layer3"
     inkscape:label="Layer 2"
     transform="translate(0,-248.03151)">
    <path
       style="fill:#1d1d1d;fill-opacity:1;fill-rule:evenodd;stroke:#1d1d1d;stroke-width:1px;stroke-linecap:butt;stroke-linejoin:miter;stroke-opacity:1"
       d="m 107.86165,627.3071 c -26.05719,0.24838 -50.1658,8.08978 -68.35157,27.51172 l 4.75,14.5 c 40.2196,-50.47158 117.08364,-27.92933 169.36329,0.35937 -0.0152,-0.0298 -0.0334,-0.0493 -0.0469,-0.084 0.0837,0.0647 0.16917,0.12736 0.25195,0.19336 0.11449,0.0621 0.2295,0.12538 0.34375,0.1875 -0.0184,-0.0475 -0.002,-0.0156 -0.0293,-0.082 -0.0365,-0.0531 -0.0681,-0.10831 -0.0996,-0.16407 -0.0256,-0.0454 0.0682,0.0807 0.0879,0.12891 0.0131,0.0321 3e-4,0.007 0.0117,0.0352 0.0224,0.0325 0.0441,0.0652 0.0625,0.0996 0.005,0.003 0.009,0.005 0.0137,0.008 0.0523,-0.008 0.10166,-0.0266 0.1543,-0.043 0.005,-0.10534 0.0318,-0.18067 0.13281,-0.14844 0.038,0.0121 0.085,0.0332 0.125,0.0469 0.15132,-0.0766 0.29091,-0.15958 0.39258,-0.22657 0.0443,-0.0292 0.0662,-0.0495 0.10351,-0.0762 -0.0724,-0.11593 -0.13054,-0.23847 -0.15039,-0.37891 -0.011,-0.0775 -6.5e-4,-0.12991 0.0274,-0.1621 -0.99386,-0.0743 -3.19839,0.23176 -1.98633,-0.91797 0.17733,-0.1682 0.29592,-0.44724 0.5332,-0.50586 1.23442,-0.30497 1.23861,-0.23713 1.78906,0.20898 0.0932,0.0359 0.18391,0.074 0.26368,0.13281 0.81695,0.60209 0.82942,0.96819 1.17187,1.78516 -0.52505,-0.1579 -1.57553,-0.92846 -1.77148,-0.70312 0.4618,0.0345 0.66798,0.15176 0.12304,0.54101 0.33609,0.53855 1.15426,0.83501 1.77539,1.05469 0.24375,0.0862 -0.0799,-0.51594 -0.0566,-0.77344 0.008,-0.0935 0.0659,0.17563 0.10352,0.26172 0.57947,1.32827 0.13919,0.21536 0.70508,1.73047 0.0106,0.0284 0.0157,0.054 0.0254,0.082 1.05934,0.59349 2.12598,1.18687 3.16211,1.7832 0.18099,-0.52622 0.74548,-0.91255 1.71679,-0.71093 0.008,0.002 0.0173,0.002 0.0254,0.004 l -0.0996,0.0566 c 0.69652,-0.26028 0.95218,-0.14753 1.55469,0.008 0.26514,0.0684 0.34301,0.0805 0.47266,0.10938 0.0518,-0.0472 0.13123,-0.12044 0.18554,-0.16992 -0.153,-0.29674 -0.24804,-0.68528 -0.24804,-1.16992 l 0,-0.88282 c 0,-2.15307 1.86758,-2.44669 2.38672,-0.89062 0.5095,-0.6274 0.38316,-0.49802 1.01367,-1.13867 0.14975,-0.15216 0.29882,-0.2692 0.44726,-0.3711 -0.007,-0.0467 -0.0174,-0.0925 -0.0176,-0.14062 -0.002,-0.9315 0.49861,-1.15851 1.07422,-1.36328 -31.56276,-19.62094 -71.49328,-36.3494 -108.84571,-39.28711 0.17844,0.91526 0.31925,1.84137 -0.70703,1.1582 -0.10648,-0.0709 -0.22995,-0.12235 -0.32031,-0.21289 -0.0179,-0.0179 -0.0126,-0.0163 -0.0293,-0.0332 -0.55008,-0.18313 -0.97025,-0.58368 -1.30859,-1.08399 -0.10267,-0.006 -0.20597,-0.0172 -0.3086,-0.0234 -0.31033,0.26856 -0.79655,0.45465 -1.4707,0.45508 -0.33807,2.2e-4 -0.6756,8e-4 -1.01367,0 -0.50639,-10e-4 -1.01316,-1.4e-4 -1.51953,0.006 -0.43657,-0.003 -0.87321,-0.0431 -1.3086,-0.0117 -0.51252,0.0801 -0.96207,0.13047 -1.47461,-0.0351 -0.1307,-0.0422 -0.248,-0.11753 -0.36718,-0.1875 -0.0281,0.009 -0.0559,0.0184 -0.084,0.0273 0.0634,0.13661 0.10868,0.26222 0.1543,0.38672 0.96794,0.48318 2.56279,1.08257 1.125,1.52344 l -0.72852,0.22461 c -0.27365,-0.0206 -0.55484,0.007 -0.82031,-0.0625 -0.8335,-0.2182 -1.99755,-1.0865 -2.19336,-1.97852 -0.0144,-0.0657 0.1039,0.0828 0.15625,0.125 -0.20834,-0.25048 -0.34086,-0.48648 -0.42773,-0.71484 z"
       id="path6002"
       inkscape:connector-curvature="0" />
  </g>
</svg>
