{
	"info": {
		"_postman_id": "7ed0c0b9-901c-4aaa-aaca-ff71e938e25f",
		"name": "Dynostore Domain",
		"schema": "https://schema.getpostman.com/json/collection/v2.1.0/collection.json"
	},
	"item": [
		{
			"name": "create scope",
			"event": [
				{
					"listen": "test",
					"script": {
						"exec": [
							"",
							"",
							"var data = JSON.parse(responseBody)",
							"",
							"pm.test(\"response.status is 200\", function () {",
							"    pm.response.to.have.status(200)",
							"})",
							"",
							"pm.test(\"response conforms to schema\", function () {",
							"  pm.response.to.have.jsonSchema(pm.collectionVariables.get(\"scopeSchema\"))",
							"})",
							"",
							"postman.setEnvironmentVariable(\"scope_id\", data.id)"
						],
						"type": "text/javascript"
					}
				}
			],
			"request": {
				"method": "POST",
				"header": [
					{
						"key": "Content-",
						"value": "",
						"type": "text",
						"disabled": true
					}
				],
				"body": {
					"mode": "raw",
					"raw": "{\n    \"name\": \"{{$randomPassword}}\"\n}",
					"options": {
						"raw": {
							"language": "json"
						}
					}
				},
				"url": {
					"raw": "{{base_url}}/domain/scopes",
					"host": [
						"{{base_url}}"
					],
					"path": [
						"domain",
						"scopes"
					]
				}
			},
			"response": []
		},
		{
			"name": "get scope",
			"event": [
				{
					"listen": "test",
					"script": {
						"exec": [
							"",
							"",
							"var data = JSON.parse(responseBody)",
							"",
							"pm.test(\"response.status is 200\", function () {",
							"    pm.response.to.have.status(200)",
							"})",
							"",
							"pm.test(\"response conforms to schema\", function () {",
							"  pm.response.to.have.jsonSchema(pm.collectionVariables.get(\"scopeSchema\"))",
							"})",
							""
						],
						"type": "text/javascript"
					}
				}
			],
			"request": {
				"method": "GET",
				"header": [
					{
						"key": "Content-",
						"value": "",
						"type": "text",
						"disabled": true
					}
				],
				"url": {
					"raw": "{{base_url}}/domain/scopes/{{scope_id}}",
					"host": [
						"{{base_url}}"
					],
					"path": [
						"domain",
						"scopes",
						"{{scope_id}}"
					]
				}
			},
			"response": []
		},
		{
			"name": "get scopes",
			"event": [
				{
					"listen": "test",
					"script": {
						"exec": [
							"const schema = {",
							"    \"type\": \"array\",",
							"    \"items\": [{",
							"        \"type\": \"object\",",
							"        \"properties\":  pm.collectionVariables.get(\"scopeSchema\").properties",
							"    }]",
							"}",
							"",
							"var data = JSON.parse(responseBody)",
							"",
							"pm.test(\"response.status is 200\", function () {",
							"    pm.response.to.have.status(200)",
							"})",
							"",
							"pm.test(\"response conforms to schema\", function () {",
							"  pm.response.to.have.jsonSchema(schema)",
							"})",
							"",
							"pm.test(\"response has at least one result\", function () {",
							"   pm.expect(data.length).to.gte(1);",
							"})",
							"",
							""
						],
						"type": "text/javascript"
					}
				}
			],
			"request": {
				"method": "GET",
				"header": [
					{
						"key": "Content-",
						"value": "",
						"type": "text",
						"disabled": true
					}
				],
				"url": {
					"raw": "{{base_url}}/domain/scopes",
					"host": [
						"{{base_url}}"
					],
					"path": [
						"domain",
						"scopes"
					]
				}
			},
			"response": []
		},
		{
			"name": "create entity",
			"event": [
				{
					"listen": "test",
					"script": {
						"exec": [
							"var data = JSON.parse(responseBody)",
							"var payload = JSON.parse(pm.request.body.raw)",
							"",
							"pm.test(\"response.status is 200\", function () {",
							"    pm.response.to.have.status(200)",
							"})",
							"",
							"pm.test(\"response conforms to schema\", function () {",
							"    pm.response.to.have.jsonSchema(pm.collectionVariables.get(\"entitySchema\"))",
							"})",
							"",
							"pm.test(\"response has at least one result\", function () {",
							"    pm.expect(data.name).to.equal(payload.name)",
							"})",
							"",
							"pm.test(\"fqn conforms to pattern {scope_path}.{entity_name}\", function() {",
							"    var matches = /.*\\.(.*)/.exec(data.fqn)",
							"    pm.expect(matches).to.be.not.null ",
							"    pm.expect(matches).to.have.lengthOf(2)",
							"    pm.expect(matches[1]).to.equal(data.name)",
							"})",
							"",
							"postman.setEnvironmentVariable(\"entity_id\", data.id)",
							"postman.setEnvironmentVariable(\"property_name\", data.properties[0].name)"
						],
						"type": "text/javascript"
					}
				}
			],
			"request": {
				"method": "POST",
				"header": [
					{
						"key": "Content-",
						"value": "",
						"type": "text",
						"disabled": true
					}
				],
				"body": {
					"mode": "raw",
					"raw": "{\n    \"name\": \"{{$randomPassword}}\",\n    \"scopeId\": \"{{scope_id}}\",\n    \"properties\": [{\n        \"name\": \"{{$randomPassword}}\", \n        \"primitiveType\": \"STRING\"\n    }]\n}",
					"options": {
						"raw": {
							"language": "json"
						}
					}
				},
				"url": {
					"raw": "{{base_url}}/domain/scopes/{{scope_id}}/entities",
					"host": [
						"{{base_url}}"
					],
					"path": [
						"domain",
						"scopes",
						"{{scope_id}}",
						"entities"
					]
				}
			},
			"response": []
		},
		{
			"name": "get entity",
			"event": [
				{
					"listen": "test",
					"script": {
						"exec": [
							"var data = JSON.parse(responseBody)",
							"",
							"pm.test(\"response.status is 200\", function () {",
							"    pm.response.to.have.status(200)",
							"})",
							"",
							"pm.test(\"fqn conforms to pattern {scope_path}.{entity_name}\", function() {",
							"    var matches = /.*\\.(.*)/.exec(data.fqn)",
							"    pm.expect(matches).to.be.not.null ",
							"    pm.expect(matches).to.have.lengthOf(2)",
							"    pm.expect(matches[1]).to.equal(data.name)",
							"})",
							"",
							"pm.test(\"response conforms to schema\", function () {",
							"    pm.response.to.have.jsonSchema(pm.collectionVariables.get(\"entitySchema\"))",
							"})",
							""
						],
						"type": "text/javascript"
					}
				}
			],
			"request": {
				"method": "GET",
				"header": [
					{
						"key": "Content-",
						"value": "",
						"type": "text",
						"disabled": true
					}
				],
				"url": {
					"raw": "{{base_url}}/domain/scopes/{{scope_id}}/entities/{{entity_id}}",
					"host": [
						"{{base_url}}"
					],
					"path": [
						"domain",
						"scopes",
						"{{scope_id}}",
						"entities",
						"{{entity_id}}"
					]
				}
			},
			"response": []
		},
		{
			"name": "update scope",
			"event": [
				{
					"listen": "test",
					"script": {
						"exec": [
							"",
							"var data = JSON.parse(responseBody)",
							"var payload = JSON.parse(pm.request.body.raw)",
							"",
							"pm.test(\"response.status is 200\", function () {",
							"    pm.response.to.have.status(200)",
							"})",
							"",
							"pm.test(\"response conforms to schema\", function () {",
							"  pm.response.to.have.jsonSchema(pm.collectionVariables.get(\"scopeSchema\"))",
							"})",
							"",
							"pm.test(\"scope name is set\", function () {",
							"   pm.expect(data.name).to.equal(payload.name)",
							"})",
							""
						],
						"type": "text/javascript"
					}
				}
			],
			"request": {
				"method": "PUT",
				"header": [
					{
						"key": "Content-",
						"value": "",
						"type": "text",
						"disabled": true
					}
				],
				"body": {
					"mode": "raw",
					"raw": "{\n    \"name\": \"{{$randomPassword}}\"\n}",
					"options": {
						"raw": {
							"language": "json"
						}
					}
				},
				"url": {
					"raw": "{{base_url}}/domain/scopes/{{scope_id}}",
					"host": [
						"{{base_url}}"
					],
					"path": [
						"domain",
						"scopes",
						"{{scope_id}}"
					]
				}
			},
			"response": []
		},
		{
			"name": "rename entity",
			"event": [
				{
					"listen": "test",
					"script": {
						"exec": [
							"var data = JSON.parse(responseBody)",
							"var payload = JSON.parse(pm.request.body.raw)",
							"",
							"pm.test(\"response.status is 200\", function () {",
							"    pm.response.to.have.status(200)",
							"})",
							"",
							"pm.test(\"scope name is set\", function () {",
							"   pm.expect(data.name).to.equal(payload.name)",
							"})"
						],
						"type": "text/javascript"
					}
				}
			],
			"request": {
				"method": "PATCH",
				"header": [
					{
						"key": "Content-",
						"value": "",
						"type": "text",
						"disabled": true
					}
				],
				"body": {
					"mode": "raw",
					"raw": "{\n    \"name\":  \"{{$randomPassword}}\"\n}",
					"options": {
						"raw": {
							"language": "json"
						}
					}
				},
				"url": {
					"raw": "{{base_url}}/domain/scopes/{{scope_id}}/entities/{{entity_id}}",
					"host": [
						"{{base_url}}"
					],
					"path": [
						"domain",
						"scopes",
						"{{scope_id}}",
						"entities",
						"{{entity_id}}"
					]
				}
			},
			"response": []
		},
		{
			"name": "create instance",
			"event": [
				{
					"listen": "test",
					"script": {
						"exec": [
							"",
							"var data = JSON.parse(responseBody)",
							"postman.setEnvironmentVariable(\"instance_id\", data.id)",
							"",
							"pm.test(\"response.status is 200\", function () {",
							"    pm.response.to.have.status(200)",
							"})",
							"",
							"pm.test(\"response conforms to schema\", function () {",
							"    pm.response.to.have.jsonSchema(pm.collectionVariables.get(\"instanceSchema\"))",
							"})",
							""
						],
						"type": "text/javascript"
					}
				}
			],
			"request": {
				"method": "POST",
				"header": [],
				"body": {
					"mode": "raw",
					"raw": "{\n    \"name\": \"{{randomPassword}}\",\n    \"scopeId\": \"{{scope_id}}\",\n    \"properties\": [{\n        \"name\": \"{{property_name}}\",\n        \"value\": {\n            \"stringValue\": \"test\"\n        }\n    }]\n}",
					"options": {
						"raw": {
							"language": "json"
						}
					}
				},
				"url": {
					"raw": "{{base_url}}/domain/scopes/{{scope_id}}/entities/{{entity_id}}/instances",
					"host": [
						"{{base_url}}"
					],
					"path": [
						"domain",
						"scopes",
						"{{scope_id}}",
						"entities",
						"{{entity_id}}",
						"instances"
					]
				}
			},
			"response": []
		},
		{
			"name": "get instance",
			"event": [
				{
					"listen": "test",
					"script": {
						"exec": [
							"pm.test(\"response.status is 200\", function () {",
							"    pm.response.to.have.status(200)",
							"})",
							"",
							"pm.test(\"response conforms to schema\", function () {",
							"    pm.response.to.have.jsonSchema(pm.collectionVariables.get(\"instanceSchema\"))",
							"})",
							""
						],
						"type": "text/javascript"
					}
				}
			],
			"request": {
				"method": "GET",
				"header": [],
				"url": {
					"raw": "{{base_url}}/domain/scopes/{{scope_id}}/entities/{{entity_id}}/instances/{{instance_id}}",
					"host": [
						"{{base_url}}"
					],
					"path": [
						"domain",
						"scopes",
						"{{scope_id}}",
						"entities",
						"{{entity_id}}",
						"instances",
						"{{instance_id}}"
					]
				}
			},
			"response": []
		},
		{
			"name": "add properties",
			"event": [
				{
					"listen": "test",
					"script": {
						"exec": [
							"var data = JSON.parse(responseBody)",
							"var payload = JSON.parse(pm.request.body.raw)",
							"",
							"pm.test(\"response.status is 200\", function () {",
							"    pm.response.to.have.status(200)",
							"})",
							"",
							"pm.test(\"response conforms to schema\", function () {",
							"    pm.response.to.have.jsonSchema(pm.collectionVariables.get(\"entitySchema\"))",
							"})",
							"",
							"pm.test(\"fqn conforms to pattern {scope_path}.{entity_name}\", function() {",
							"    var matches = /.*\\.(.*)/.exec(data.fqn)",
							"    pm.expect(matches).to.be.not.null ",
							"    pm.expect(matches).to.have.lengthOf(2)",
							"    pm.expect(matches[1]).to.equal(data.name)",
							"})",
							"",
							"pm.test(\"entity now declares 4 properties\", function() {",
							"    pm.expect(data.properties).to.have.lengthOf(4)",
							"    ",
							"    var mapPropertyName = function(property) { ",
							"        return property.name",
							"    }",
							"",
							"    var expected = payload.map(mapPropertyName)",
							"    expected.push(pm.environment.get(\"property_name\"))",
							"",
							"    //not too smart but works",
							"    for ( var i = 0; i < expected.length; i++ ) {",
							"       pm.expect(data.properties.map(mapPropertyName)).to.contain(expected[i])",
							"    }",
							"})",
							""
						],
						"type": "text/javascript"
					}
				}
			],
			"request": {
				"method": "POST",
				"header": [],
				"body": {
					"mode": "raw",
					"raw": "[{\n    \"name\": \"{{$randomPassword}}\",\n    \"type\": \"STRING\"\n}, {\n    \"name\": \"{{$randomPassword}}\",\n    \"type\": \"INTEGER\"\n}, {\n    \"name\": \"{{$randomPassword}}\",\n    \"type\": \"STRING\",\n    \"multiplicity\": \"*\"\n}]",
					"options": {
						"raw": {
							"language": "json"
						}
					}
				},
				"url": {
					"raw": "{{base_url}}/domain/scopes/{{scope_id}}/entities/{{entity_id}}/properties",
					"host": [
						"{{base_url}}"
					],
					"path": [
						"domain",
						"scopes",
						"{{scope_id}}",
						"entities",
						"{{entity_id}}",
						"properties"
					]
				}
			},
			"response": []
		},
		{
			"name": "set property value",
			"event": [
				{
					"listen": "test",
					"script": {
						"exec": [
							"",
							"pm.test(\"response.status is 200\", function () {",
							"    pm.response.to.have.status(200)",
							"})",
							""
						],
						"type": "text/javascript"
					}
				}
			],
			"request": {
				"method": "PUT",
				"header": [],
				"body": {
					"mode": "raw",
					"raw": "{\n    \"name\": \"{{property_name}}\",\n    \"value\": {\n        \"stringValue\": \"newValue\"\n    }\n}",
					"options": {
						"raw": {
							"language": "json"
						}
					}
				},
				"url": {
					"raw": "{{base_url}}/domain/scopes/{{scope_id}}/entities/{{entity_id}}/instances/{{instance_id}}",
					"host": [
						"{{base_url}}"
					],
					"path": [
						"domain",
						"scopes",
						"{{scope_id}}",
						"entities",
						"{{entity_id}}",
						"instances",
						"{{instance_id}}"
					]
				}
			},
			"response": []
		},
		{
			"name": "delete properties",
			"event": [
				{
					"listen": "test",
					"script": {
						"exec": [
							"pm.test(\"response.status is 204\", function () {",
							"    pm.response.to.have.status(204)",
							"})",
							""
						],
						"type": "text/javascript"
					}
				}
			],
			"request": {
				"method": "DELETE",
				"header": [],
				"body": {
					"mode": "raw",
					"raw": "[\"{{property_name}}\"]",
					"options": {
						"raw": {
							"language": "json"
						}
					}
				},
				"url": {
					"raw": "{{base_url}}/domain/scopes/{{scope_id}}/entities/{{entity_id}}/properties",
					"host": [
						"{{base_url}}"
					],
					"path": [
						"domain",
						"scopes",
						"{{scope_id}}",
						"entities",
						"{{entity_id}}",
						"properties"
					]
				}
			},
			"response": []
		},
		{
			"name": "remove property",
			"event": [
				{
					"listen": "test",
					"script": {
						"exec": [
							"",
							"pm.test(\"response.status is 200\", function () {",
							"    pm.response.to.have.status(200)",
							"})",
							""
						],
						"type": "text/javascript"
					}
				}
			],
			"request": {
				"method": "DELETE",
				"header": [],
				"body": {
					"mode": "raw",
					"raw": "[\"{{property_name}}\"]",
					"options": {
						"raw": {
							"language": "json"
						}
					}
				},
				"url": {
					"raw": "{{base_url}}/domain/scopes/{{scope_id}}/entities/{{entity_id}}/instances/{{instance_id}}/properties",
					"host": [
						"{{base_url}}"
					],
					"path": [
						"domain",
						"scopes",
						"{{scope_id}}",
						"entities",
						"{{entity_id}}",
						"instances",
						"{{instance_id}}",
						"properties"
					]
				}
			},
			"response": []
		},
		{
			"name": "delete instance",
			"event": [
				{
					"listen": "test",
					"script": {
						"exec": [
							"pm.test(\"response.status is 204\", function () {",
							"    pm.response.to.have.status(204)",
							"})",
							""
						],
						"type": "text/javascript"
					}
				}
			],
			"request": {
				"method": "DELETE",
				"header": [],
				"body": {
					"mode": "raw",
					"raw": "{\n    \"name\": \"{{randomPassword}}\",\n    \"scopeId\": \"5d933eb9-c8d7-48cf-b263-7356ca7055ba\",\n    \"properties\": [{\n        \"name\": \"{{property_name}}\",\n        \"value\": {\n            \"stringValue\": \"test\"\n        }\n    }]\n}",
					"options": {
						"raw": {
							"language": "json"
						}
					}
				},
				"url": {
					"raw": "{{base_url}}/domain/scopes/{{scope_id}}/entities/{{entity_id}}/instances/{{instance_id}}",
					"host": [
						"{{base_url}}"
					],
					"path": [
						"domain",
						"scopes",
						"{{scope_id}}",
						"entities",
						"{{entity_id}}",
						"instances",
						"{{instance_id}}"
					]
				}
			},
			"response": []
		},
		{
			"name": "delete entity",
			"event": [
				{
					"listen": "test",
					"script": {
						"exec": [
							"pm.test(\"response.status is 204\", function () {",
							"    pm.response.to.have.status(204)",
							"})",
							""
						],
						"type": "text/javascript"
					}
				}
			],
			"request": {
				"method": "DELETE",
				"header": [
					{
						"key": "Content-",
						"value": "",
						"type": "text",
						"disabled": true
					}
				],
				"url": {
					"raw": "{{base_url}}/domain/scopes/{{scope_id}}/entities/{{entity_id}}",
					"host": [
						"{{base_url}}"
					],
					"path": [
						"domain",
						"scopes",
						"{{scope_id}}",
						"entities",
						"{{entity_id}}"
					]
				}
			},
			"response": []
		},
		{
			"name": "delete scope",
			"event": [
				{
					"listen": "test",
					"script": {
						"exec": [
							"pm.test(\"response.status is 204\", function () {",
							"    pm.response.to.have.status(204)",
							"})",
							""
						],
						"type": "text/javascript"
					}
				}
			],
			"request": {
				"method": "DELETE",
				"header": [
					{
						"key": "Content-",
						"value": "",
						"type": "text",
						"disabled": true
					}
				],
				"url": {
					"raw": "{{base_url}}/domain/scopes/{{scope_id}}",
					"host": [
						"{{base_url}}"
					],
					"path": [
						"domain",
						"scopes",
						"{{scope_id}}"
					]
				}
			},
			"response": []
		},
		{
			"name": "get non existing instance",
			"event": [
				{
					"listen": "test",
					"script": {
						"exec": [
							"pm.test(\"response.status is 204\", function () {",
							"    pm.response.to.have.status(404)",
							"})",
							"var data = JSON.parse(responseBody)",
							"pm.test(\"code is INSTANCE_NOT_FOUND\", function () {",
							"    pm.expect(data.code).to.be.equal(\"INSTANCE_NOT_FOUND\")",
							"})"
						],
						"type": "text/javascript"
					}
				}
			],
			"request": {
				"method": "GET",
				"header": [],
				"url": {
					"raw": "{{base_url}}/domain/scopes/{{scope_id}}/entities/{{entity_id}}/instances/{{instance_id}}",
					"host": [
						"{{base_url}}"
					],
					"path": [
						"domain",
						"scopes",
						"{{scope_id}}",
						"entities",
						"{{entity_id}}",
						"instances",
						"{{instance_id}}"
					]
				}
			},
			"response": []
		},
		{
			"name": "delete non existing instance",
			"event": [
				{
					"listen": "test",
					"script": {
						"exec": [
							"pm.test(\"response.status is 204\", function () {",
							"    pm.response.to.have.status(404)",
							"})",
							"var data = JSON.parse(responseBody)",
							"pm.test(\"code is INSTANCE_NOT_FOUND\", function () {",
							"    pm.expect(data.code).to.be.equal(\"INSTANCE_NOT_FOUND\")",
							"})"
						],
						"type": "text/javascript"
					}
				}
			],
			"request": {
				"method": "DELETE",
				"header": [
					{
						"key": "Content-",
						"value": "",
						"type": "text",
						"disabled": true
					}
				],
				"url": {
					"raw": "{{base_url}}/domain/scopes/{{scope_id}}/entities/{{entity_id}}/instances/{{instance_id}}",
					"host": [
						"{{base_url}}"
					],
					"path": [
						"domain",
						"scopes",
						"{{scope_id}}",
						"entities",
						"{{entity_id}}",
						"instances",
						"{{instance_id}}"
					]
				}
			},
			"response": []
		},
		{
			"name": "get non existing entity",
			"event": [
				{
					"listen": "test",
					"script": {
						"exec": [
							"pm.test(\"response.status is 204\", function () {",
							"    pm.response.to.have.status(404)",
							"})",
							"var data = JSON.parse(responseBody)",
							"pm.test(\"code is ENTITY_NOT_FOUND\", function () {",
							"    pm.expect(data.code).to.be.equal(\"ENTITY_NOT_FOUND\")",
							"})"
						],
						"type": "text/javascript"
					}
				}
			],
			"request": {
				"method": "GET",
				"header": [],
				"url": {
					"raw": "{{base_url}}/domain/scopes/{{scope_id}}/entities/{{entity_id}}",
					"host": [
						"{{base_url}}"
					],
					"path": [
						"domain",
						"scopes",
						"{{scope_id}}",
						"entities",
						"{{entity_id}}"
					]
				}
			},
			"response": []
		},
		{
			"name": "delete non existing entity",
			"event": [
				{
					"listen": "test",
					"script": {
						"exec": [
							"pm.test(\"response.status is 204\", function () {",
							"    pm.response.to.have.status(404)",
							"})",
							"var data = JSON.parse(responseBody)",
							"pm.test(\"code is ENTITY_NOT_FOUND\", function () {",
							"    pm.expect(data.code).to.be.equal(\"ENTITY_NOT_FOUND\")",
							"})"
						],
						"type": "text/javascript"
					}
				}
			],
			"request": {
				"method": "DELETE",
				"header": [
					{
						"key": "Content-",
						"value": "",
						"type": "text",
						"disabled": true
					}
				],
				"url": {
					"raw": "{{base_url}}/domain/scopes/{{scope_id}}/entities/{{entity_id}}",
					"host": [
						"{{base_url}}"
					],
					"path": [
						"domain",
						"scopes",
						"{{scope_id}}",
						"entities",
						"{{entity_id}}"
					]
				}
			},
			"response": []
		},
		{
			"name": "get non existing scope",
			"event": [
				{
					"listen": "test",
					"script": {
						"exec": [
							"pm.test(\"response.status is 404\", function () {",
							"    pm.response.to.have.status(404)",
							"})",
							"var data = JSON.parse(responseBody)",
							"pm.test(\"code is SCOPE_NOT_FOUND\", function () {",
							"    pm.expect(data.code).to.be.equal(\"SCOPE_NOT_FOUND\")",
							"})"
						],
						"type": "text/javascript"
					}
				}
			],
			"request": {
				"method": "GET",
				"header": [
					{
						"key": "Content-",
						"value": "",
						"type": "text",
						"disabled": true
					}
				],
				"url": {
					"raw": "{{base_url}}/domain/scopes/{{scope_id}}",
					"host": [
						"{{base_url}}"
					],
					"path": [
						"domain",
						"scopes",
						"{{scope_id}}"
					]
				}
			},
			"response": []
		},
		{
			"name": "delete non existing scope",
			"event": [
				{
					"listen": "test",
					"script": {
						"exec": [
							"pm.test(\"response.status is 404\", function () {",
							"    pm.response.to.have.status(404)",
							"})",
							"var data = JSON.parse(responseBody)",
							"pm.test(\"code is SCOPE_NOT_FOUND\", function () {",
							"    pm.expect(data.code).to.be.equal(\"SCOPE_NOT_FOUND\")",
							"})"
						],
						"type": "text/javascript"
					}
				}
			],
			"request": {
				"method": "DELETE",
				"header": [
					{
						"key": "Content-",
						"value": "",
						"type": "text",
						"disabled": true
					}
				],
				"url": {
					"raw": "{{base_url}}/domain/scopes/{{scope_id}}",
					"host": [
						"{{base_url}}"
					],
					"path": [
						"domain",
						"scopes",
						"{{scope_id}}"
					]
				}
			},
			"response": []
		},
		{
			"name": "create scope",
			"event": [
				{
					"listen": "test",
					"script": {
						"exec": [
							"",
							"",
							"var data = JSON.parse(responseBody)",
							"",
							"pm.test(\"response.status is 200\", function () {",
							"    pm.response.to.have.status(200)",
							"})",
							"",
							"pm.test(\"response conforms to schema\", function () {",
							"  pm.response.to.have.jsonSchema(pm.collectionVariables.get(\"scopeSchema\"))",
							"})",
							"",
							"postman.setEnvironmentVariable(\"scope_id\", data.id)"
						],
						"type": "text/javascript"
					}
				}
			],
			"request": {
				"method": "POST",
				"header": [
					{
						"key": "Content-",
						"value": "",
						"type": "text",
						"disabled": true
					}
				],
				"body": {
					"mode": "raw",
					"raw": "{\n    \"name\": \"{{$randomPassword}}\"\n}",
					"options": {
						"raw": {
							"language": "json"
						}
					}
				},
				"url": {
					"raw": "{{base_url}}/domain/scopes",
					"host": [
						"{{base_url}}"
					],
					"path": [
						"domain",
						"scopes"
					]
				}
			},
			"response": []
		},
		{
			"name": "create entity",
			"event": [
				{
					"listen": "test",
					"script": {
						"exec": [
							"var data = JSON.parse(responseBody)",
							"var payload = JSON.parse(pm.request.body.raw)",
							"",
							"pm.test(\"response.status is 200\", function () {",
							"    pm.response.to.have.status(200)",
							"})",
							"",
							"pm.test(\"response conforms to schema\", function () {",
							"    pm.response.to.have.jsonSchema(pm.collectionVariables.get(\"entitySchema\"))",
							"})",
							"",
							"pm.test(\"response has at least one result\", function () {",
							"    pm.expect(data.name).to.equal(payload.name)",
							"})",
							"",
							"pm.test(\"fqn conforms to pattern {scope_path}.{entity_name}\", function() {",
							"    var matches = /.*\\.(.*)/.exec(data.fqn)",
							"    pm.expect(matches).to.be.not.null ",
							"    pm.expect(matches).to.have.lengthOf(2)",
							"    pm.expect(matches[1]).to.equal(data.name)",
							"})",
							"",
							"postman.setEnvironmentVariable(\"entity_id\", data.id)",
							"postman.setEnvironmentVariable(\"property_name\", data.properties[0].name)"
						],
						"type": "text/javascript"
					}
				}
			],
			"request": {
				"method": "POST",
				"header": [
					{
						"key": "Content-",
						"value": "",
						"type": "text",
						"disabled": true
					}
				],
				"body": {
					"mode": "raw",
					"raw": "{\n    \"name\": \"{{$randomPassword}}\",\n    \"scopeId\": \"{{scope_id}}\",\n    \"properties\": [{\n        \"name\": \"{{$randomPassword}}\", \n        \"primitiveType\": \"STRING\"\n    }]\n}",
					"options": {
						"raw": {
							"language": "json"
						}
					}
				},
				"url": {
					"raw": "{{base_url}}/domain/scopes/{{scope_id}}/entities",
					"host": [
						"{{base_url}}"
					],
					"path": [
						"domain",
						"scopes",
						"{{scope_id}}",
						"entities"
					]
				}
			},
			"response": []
		},
		{
			"name": "create instance",
			"event": [
				{
					"listen": "test",
					"script": {
						"exec": [
							"",
							"var data = JSON.parse(responseBody)",
							"postman.setEnvironmentVariable(\"instance_id\", data.id)",
							"",
							"pm.test(\"response.status is 200\", function () {",
							"    pm.response.to.have.status(200)",
							"})",
							"",
							"pm.test(\"response conforms to schema\", function () {",
							"    pm.response.to.have.jsonSchema(pm.collectionVariables.get(\"instanceSchema\"))",
							"})",
							""
						],
						"type": "text/javascript"
					}
				}
			],
			"request": {
				"method": "POST",
				"header": [],
				"body": {
					"mode": "raw",
					"raw": "{\n    \"name\": \"{{randomPassword}}\",\n    \"scopeId\": \"5d933eb9-c8d7-48cf-b263-7356ca7055ba\",\n    \"properties\": [{\n        \"name\": \"{{property_name}}\",\n        \"value\": {\n            \"stringValue\": \"test\"\n        }\n    }]\n}",
					"options": {
						"raw": {
							"language": "json"
						}
					}
				},
				"url": {
					"raw": "{{base_url}}/domain/scopes/{{scope_id}}/entities/{{entity_id}}/instances",
					"host": [
						"{{base_url}}"
					],
					"path": [
						"domain",
						"scopes",
						"{{scope_id}}",
						"entities",
						"{{entity_id}}",
						"instances"
					]
				}
			},
			"response": []
		},
		{
			"name": "delete properties",
			"event": [
				{
					"listen": "test",
					"script": {
						"exec": [
							"pm.test(\"response.status is 204\", function () {",
							"    pm.response.to.have.status(204)",
							"})",
							""
						],
						"type": "text/javascript"
					}
				}
			],
			"request": {
				"method": "DELETE",
				"header": [],
				"body": {
					"mode": "raw",
					"raw": "[\"{{property_name}}\"]",
					"options": {
						"raw": {
							"language": "json"
						}
					}
				},
				"url": {
					"raw": "{{base_url}}/domain/scopes/{{scope_id}}/entities/{{entity_id}}/properties",
					"host": [
						"{{base_url}}"
					],
					"path": [
						"domain",
						"scopes",
						"{{scope_id}}",
						"entities",
						"{{entity_id}}",
						"properties"
					]
				}
			},
			"response": []
		},
		{
			"name": "delete entity",
			"event": [
				{
					"listen": "test",
					"script": {
						"exec": [
							"pm.test(\"response.status is 204\", function () {",
							"    pm.response.to.have.status(204)",
							"})",
							""
						],
						"type": "text/javascript"
					}
				}
			],
			"request": {
				"method": "DELETE",
				"header": [
					{
						"key": "Content-",
						"value": "",
						"type": "text",
						"disabled": true
					}
				],
				"url": {
					"raw": "{{base_url}}/domain/scopes/{{scope_id}}/entities/{{entity_id}}",
					"host": [
						"{{base_url}}"
					],
					"path": [
						"domain",
						"scopes",
						"{{scope_id}}",
						"entities",
						"{{entity_id}}"
					]
				}
			},
			"response": []
		},
		{
			"name": "delete instance",
			"event": [
				{
					"listen": "test",
					"script": {
						"exec": [
							"pm.test(\"response.status is 404\", function () {",
							"    //entity type just deleted => instances have been purged",
							"    pm.response.to.have.status(404)",
							"})",
							""
						],
						"type": "text/javascript"
					}
				}
			],
			"request": {
				"method": "DELETE",
				"header": [],
				"body": {
					"mode": "raw",
					"raw": "{\n    \"name\": \"{{randomPassword}}\",\n    \"scopeId\": \"5d933eb9-c8d7-48cf-b263-7356ca7055ba\",\n    \"properties\": [{\n        \"name\": \"{{property_name}}\",\n        \"value\": {\n            \"stringValue\": \"test\"\n        }\n    }]\n}",
					"options": {
						"raw": {
							"language": "json"
						}
					}
				},
				"url": {
					"raw": "{{base_url}}/domain/scopes/{{scope_id}}/entities/{{entity_id}}/instances/{{instance_id}}",
					"host": [
						"{{base_url}}"
					],
					"path": [
						"domain",
						"scopes",
						"{{scope_id}}",
						"entities",
						"{{entity_id}}",
						"instances",
						"{{instance_id}}"
					]
				}
			},
			"response": []
		}
	],
	"auth": {
		"type": "bearer",
		"bearer": [
			{
				"key": "token",
				"value": "{{bearer_token}}",
				"type": "string"
			}
		]
	},
	"event": [
		{
			"listen": "prerequest",
			"script": {
				"type": "text/javascript",
				"exec": [
					"pm.collectionVariables.set(\"scopeSchema\", {",
					"  \"properties\": {",
					"    \"id\": {",
					"      \"type\": \"string\"",
					"    },",
					"    \"name\": {",
					"        \"type\": \"string\"",
					"    }",
					"  },",
					"  \"required\": [",
					"    \"name\",",
					"    \"id\"",
					"  ]",
					"})",
					"",
					"pm.collectionVariables.set(\"entitySchema\", {",
					"  \"type\": \"object\",",
					"  \"properties\": {",
					"    \"name\": {",
					"      \"type\": \"string\"",
					"    },",
					"    \"id\": {",
					"      \"type\": \"string\"",
					"    },",
					"    \"scopeId\": {",
					"      \"type\": \"string\"",
					"    },",
					"    \"fqn\": {",
					"        \"type\": \"string\"",
					"    },",
					"    \"properties\": {",
					"      \"type\": \"array\",",
					"      \"items\": [",
					"        {",
					"          \"type\": \"object\",",
					"          \"properties\": {",
					"            \"name\": {",
					"              \"type\": \"string\"",
					"            },",
					"            \"primitiveType\": {",
					"              \"type\": \"string\"",
					"            },",
					"            \"multiplicity\": {",
					"              \"type\": \"string\"",
					"            }",
					"          },",
					"          \"required\": [",
					"            \"name\"",
					"          ]",
					"        }",
					"      ]",
					"    }",
					"  },",
					"  \"required\": [",
					"    \"name\",",
					"    \"id\"",
					"  ]",
					"})",
					"",
					"pm.collectionVariables.set(\"instanceSchema\", {",
					"  \"type\": \"object\",",
					"  \"properties\": {",
					"    \"id\": {",
					"      \"type\": \"string\"",
					"    },",
					"    \"scopeId\": {",
					"      \"type\": \"string\"",
					"    },",
					"    \"entityId\": {",
					"      \"type\": \"string\"",
					"    },",
					"    \"entity\": {",
					"      \"type\": \"string\"",
					"    },",
					"    \"properties\": {",
					"      \"type\": \"array\",",
					"      \"items\": [",
					"        {",
					"          \"type\": \"object\",",
					"          \"properties\": {",
					"            \"name\": {",
					"              \"type\": \"string\"",
					"            },",
					"            \"value\": {",
					"               \"$ref\": \"#/$defs/value\"",
					"            },",
					"            \"values\": {",
					"              \"type\": \"array\",",
					"              \"items\": [{",
					"                  \"$ref\": \"#/$defs/value\"",
					"              }]",
					"            }",
					"          },",
					"          \"required\": [",
					"            \"name\",",
					"            \"value\"",
					"          ]",
					"        }",
					"      ]",
					"    }",
					"  },",
					"  \"required\": [",
					"    \"id\",",
					"    \"scopeId\",",
					"    \"entityId\",",
					"    \"entity\",",
					"    \"properties\"",
					"  ],",
					"",
					"  \"$defs\": {",
					"    \"value\": { ",
					"        \"type\": \"object\",",
					"        \"properties\": {",
					"            \"stringValue\": {",
					"                \"type\": \"string\"",
					"            },",
					"            \"decimalValue\": {",
					"                \"type\": \"number\"",
					"            },",
					"            \"booleanValue\": {",
					"                \"type\": \"boolean\"",
					"            },",
					"            \"integerValue\": {",
					"                \"type\": \"integer\"",
					"            }",
					"        }",
					"    }",
					"  }",
					"})"
				]
			}
		},
		{
			"listen": "test",
			"script": {
				"type": "text/javascript",
				"exec": [
					""
				]
			}
		}
	],
	"variable": [
		{
			"key": "scopeSchema",
			"value": ""
		},
		{
			"key": "entitySchema",
			"value": ""
		},
		{
			"key": "instanceSchema",
			"value": ""
		}
	]
}