module go-api-echo

go 1.21.4

require (
	github.com/joho/godotenv v1.5.1
	github.com/labstack/echo/v4 v4.11.3
)

require (
	github.com/go-playground/locales v0.14.1 // indirect
	github.com/go-playground/universal-translator v0.18.1 // indirect
	github.com/golang-jwt/jwt/v5 v5.0.0 // indirect
	github.com/leodido/go-urn v1.2.4 // indirect
	golang.org/x/time v0.3.0 // indirect
)

require (
	github.com/go-playground/validator v9.31.0+incompatible
	github.com/go-sql-driver/mysql v1.7.1
	github.com/golang-jwt/jwt v3.2.2+incompatible
	github.com/jmoiron/sqlx v1.3.5
	github.com/labstack/echo-jwt/v4 v4.2.0
	github.com/labstack/gommon v0.4.1 // indirect
	github.com/mattn/go-colorable v0.1.13 // indirect
	github.com/mattn/go-isatty v0.0.20 // indirect
	github.com/mattn/go-sqlite3 v1.14.18
	github.com/valyala/bytebufferpool v1.0.0 // indirect
	github.com/valyala/fasttemplate v1.2.2 // indirect
	golang.org/x/crypto v0.15.0 // indirect
	golang.org/x/net v0.18.0 // indirect
	golang.org/x/sys v0.14.0 // indirect
	golang.org/x/text v0.14.0 // indirect
)
