{
  "restaurants": [
    {
      "id": 1,
      "name": "Chinese Restaurent",
      "address": "Prinsengata 1, 7010 Trondheim",
      "data": [
        {
          "menu": "Pizza",
          "price": 50
        },
        {
          "menu": "Burger",
          "price": 25
        },
        {
          "menu": "Risotto",
          "price": 250
        }
      ]
    },
    {
      "id": 2,
      "name": "Mexican Restaurent",
      "address": "Kongensgata 10, 7020 Trondheim",
      "data": [
        {
          "menu": "French Fries",
          "price": 250
        },
        {
          "menu": "Onion Rings",
          "price": 150
        },
        {
          "menu": "Fried Shrimps",
          "price": 20
        }
      ]
    },
    {
      "id": 3,
      "name": "Indian Restaurent",
      "address": "Munkegata 15, 7030 Trondheim",
      "data": [
        {
          "menu": "Water",
          "price": 15
        },
        {
          "menu": "Coke",
          "price": 150
        },
        {
          "menu": "Beer",
          "price": 50
        }
      ]
    },
    {
      "id": 4,
      "name": "New Chinese Restaurent 1",
      "address": "Prinsengata 21, 7010 Trondheim",
      "data": [
        {
          "menu": "Pizza",
          "price": 50
        },
        {
          "menu": "Burger",
          "price": 25
        },
        {
          "menu": "Risotto",
          "price": 250
        }
      ]
    }
  ],
  "vechiles": [],
  "mobileDevices": [],
  "realstateProperties": [],
  "songs": [
    {
      "id": 57945,
      "title": "song 57945 title",
      "artist": "artist 57945",
      "link": "youtube.com/57945"
    },
    {
      "id": 15117,
      "title": "song 15117 title",
      "artist": "artist 15117",
      "link": "youtube.com/15117"
    },
    {
      "id": 5407,
      "title": "song 5407 title",
      "artist": "artist 5407",
      "link": "youtube.com/5407"
    },
    {
      "id": 97010,
      "title": "song 97010 title",
      "artist": "artist 97010",
      "link": "youtube.com/97010"
    },
    {
      "id": 64420,
      "title": "song 64420 title",
      "artist": "artist 64420",
      "link": "youtube.com/64420"
    },
    {
      "id": 30122,
      "title": "song 30122 title",
      "artist": "artist 30122",
      "link": "youtube.com/30122"
    },
    {
      "id": 5960,
      "title": "song 5960 title",
      "artist": "artist 5960",
      "link": "youtube.com/5960"
    },
    {
      "id": 60501,
      "title": "song 60501 title",
      "artist": "artist 60501",
      "link": "youtube.com/60501"
    }
  ],
  "profilesForDate": []
}