OID_;X;Y;TEMPERATURE
3614;-744984.548999998718500;-1042283.640999998897314;0
3019;-744463.447999998927116;-1042784.646000001579523;0
3568;-744718.817999999970198;-1042588.614999998360872;0
3692;-744525.876499999314547;-1042540.534000001847744;0
3580;-744924.973999999463558;-1042593.699999999254942;0
2605;-745393.842999998480082;-1042860.796000000089407;0
5975;-745052.346999999135733;-1042674.673000000417233;0
118;-745135.000000000000000;-1042687.000000000000000;0
3542;-744575.274000000208616;-1042656.160000000149012;0
2696;-743477.489999998360872;-1042038.000000000000000;0
2520;-741847.000000000000000;-1045324.000000000000000;0
6872;-741751.719999998807907;-1045296.679999999701977;0
2760;-743863.331000000238419;-1043483.304000001400709;0
2755;-744003.879000000655651;-1043471.734000001102686;0
2404;-742179.000000000000000;-1045467.000000000000000;0
3919;-743904.947000000625849;-1043493.929999999701977;0
3107;-743778.888000000268221;-1042682.131999999284744;0
2740;-744042.611999999731779;-1043335.940000001341105;0
1486;-741150.000000000000000;-1044219.000000000000000;0
6828;-741465.309999998658895;-1044768.940000001341105;0
7411;-743529.510000001639128;-1045393.140000000596046;0
8079;-742021.839999999850988;-1045292.179999999701977;0
2070;-742993.000000000000000;-1044723.000000000000000;0
2097;-743143.000000000000000;-1044742.000000000000000;0
7263;-743009.559999998658895;-1044894.379999998956919;0
4238;-742440.263000000268221;-1043528.236000001430511;0
7654;-742242.081000000238419;-1045273.263999998569489;0
2394;-742273.000000000000000;-1045360.000000000000000;0
2160;-742849.000000000000000;-1045147.000000000000000;0
2161;-742876.000000000000000;-1045153.000000000000000;0
8073;-742120.640000000596046;-1045259.500000000000000;0
4075;-742947.934999998658895;-1043903.649999998509884;0
7947;-742030.969999998807907;-1044096.679999999701977;0
524;-742255.000000000000000;-1043913.000000000000000;0
1780;-741214.000000000000000;-1043934.000000000000000;0
738;-741818.000000000000000;-1043024.000000000000000;0
1983;-743474.000000000000000;-1044709.000000000000000;0
748;-741671.000000000000000;-1042971.000000000000000;0
110;-744127.000000000000000;-1042724.000000000000000;0
7022;-743155.660000000149012;-1044074.410000000149012;0
1764;-741163.000000000000000;-1044144.000000000000000;0
735;-741910.000000000000000;-1043014.000000000000000;0
514;-742119.000000000000000;-1043141.000000000000000;0
510;-742048.000000000000000;-1043150.000000000000000;0
2050;-743460.000000000000000;-1045072.000000000000000;0
2008;-743242.000000000000000;-1044759.000000000000000;0
6722;-742357.717000000178814;-1044705.708000000566244;0
1561;-743186.000000000000000;-1045098.000000000000000;0
1251;-742091.000000000000000;-1044690.000000000000000;0
7;-743479.000000000000000;-1042567.000000000000000;0
17;-743587.000000000000000;-1042394.000000000000000;0
5303;-743164.818999998271465;-1043211.078000001609325;0
1492;-741096.000000000000000;-1044331.000000000000000;0
4332;-742410.359000001102686;-1043282.916000001132488;0
3204;-743715.278999999165535;-1042506.118999999016523;0
6;-743464.000000000000000;-1042594.000000000000000;0
2133;-743040.000000000000000;-1045127.000000000000000;0
2151;-742827.000000000000000;-1045047.000000000000000;0
2166;-743016.000000000000000;-1045179.000000000000000;0
7324;-742833.980000000447035;-1044949.109999999403954;0
4162;-742497.193999998271465;-1044160.030000001192093;0
6746;-742405.083999998867512;-1044259.199999999254942;0
1515;-741913.000000000000000;-1044072.000000000000000;0
1371;-742089.000000000000000;-1044807.000000000000000;0
884;-741771.000000000000000;-1042776.000000000000000;0
1013;-742076.000000000000000;-1044595.000000000000000;0
2189;-743472.000000000000000;-1045183.000000000000000;0
727;-742001.000000000000000;-1042962.000000000000000;0
1091;-741531.480000000447035;-1044543.440000001341105;0
728;-741997.000000000000000;-1042918.000000000000000;0
696;-742077.000000000000000;-1042913.000000000000000;0
3326;-744036.002000000327826;-1042922.574999999254942;0
2226;-743057.000000000000000;-1045470.000000000000000;0
504;-741937.000000000000000;-1043164.000000000000000;0
5062;-742798.513999998569489;-1043227.370999999344349;0
1970;-743380.000000000000000;-1044854.000000000000000;0
1987;-743480.000000000000000;-1044820.000000000000000;0
3387;-743960.368000000715256;-1043194.717000000178814;0
2256;-743156.000000000000000;-1045353.000000000000000;0
3233;-744152.962999999523163;-1042686.791999999433756;0
7776;-743089.784000001847744;-1045773.409000001847744;0
4232;-742315.057999998331070;-1043428.918999999761581;0
1915;-743468.000000000000000;-1044494.000000000000000;0
5119;-742850.592999998480082;-1043328.484999999403954;0
7520;-742808.589999999850988;-1045680.519999999552965;0
7087;-743339.940000001341105;-1044536.690000001341105;0
7350;-742556.390000000596046;-1045185.980000000447035;0
1945;-743270.000000000000000;-1044454.000000000000000;0
1058;-741667.000000000000000;-1045072.000000000000000;0
6791;-741047.329999998211861;-1044765.467999998480082;0
1875;-743367.000000000000000;-1044261.000000000000000;0
2262;-742999.000000000000000;-1045686.000000000000000;0
1926;-743301.000000000000000;-1044321.000000000000000;0
5292;-743055.866000000387430;-1043215.710999999195337;0
7188;-742583.839999999850988;-1044742.870000001043081;0
5272;-743000.013999998569489;-1043245.364000000059605;0
4070;-742925.285000000149012;-1043783.565000001341105;0
4342;-742506.473000001162291;-1043301.100000001490116;0
7651;-742295.381000000983477;-1045479.861999999731779;0
4212;-742205.245000001043081;-1043548.410000000149012;0
1238;-742150.000000000000000;-1044384.000000000000000;0
1243;-742122.000000000000000;-1044502.000000000000000;0
5223;-743283.699999999254942;-1043535.940000001341105;0
2491;-742059.000000000000000;-1044251.000000000000000;0
7217;-742516.318999998271465;-1044582.890000000596046;0
1299;-741943.000000000000000;-1044719.000000000000000;0
1052;-741761.000000000000000;-1045002.000000000000000;0
910;-742219.000000000000000;-1042529.000000000000000;0
1171;-741882.000000000000000;-1044375.000000000000000;0
6943;-742902.013999998569489;-1043932.647999998182058;0
6825;-741380.010000001639128;-1044780.089999999850988;0
281;-743045.000000000000000;-1043848.000000000000000;0
8018;-741974.039999999105930;-1044442.870000001043081;0
4006;-743302.763000000268221;-1044052.298999998718500;0
1138;-741500.000000000000000;-1044458.000000000000000;0
4236;-742406.842999998480082;-1043504.015000000596046;0
7026;-743217.644999999552965;-1044082.329999998211861;0
6095;-742082.920000001788139;-1043614.710000000894070;0
7033;-743303.864999998360872;-1044132.750000000000000;0
7180;-742618.809000000357628;-1044646.109000001102686;0
1865;-743458.000000000000000;-1044233.000000000000000;0
3781;-743273.059999998658895;-1042814.050000000745058;0
3752;-743213.949999999254942;-1042902.719999998807907;0
7218;-742534.100000001490116;-1044603.559999998658895;0
1656;-741395.000000000000000;-1044688.000000000000000;0
1922;-743390.000000000000000;-1044308.000000000000000;0
1920;-743384.000000000000000;-1044363.000000000000000;0
1905;-743446.000000000000000;-1044312.000000000000000;0
2513;-742574.000000000000000;-1044441.000000000000000;0
7044;-743400.635000001639128;-1044135.579999998211861;0
2478;-741241.859999999403954;-1044562.089999999850988;0
7104;-743423.739999998360872;-1044624.530000001192093;0
6313;-743936.949999999254942;-1042594.780000001192093;0
3155;-743969.353000000119209;-1042568.828000001609325;0
627;-742223.000000000000000;-1043335.000000000000000;0
4026;-743178.984999999403954;-1043847.989999998360872;0
6821;-741256.649999998509884;-1044796.100000001490116;0
1101;-741339.000000000000000;-1044568.000000000000000;0
4023;-743246.635000001639128;-1043864.364999998360872;0
2300;-742561.000000000000000;-1045413.000000000000000;0
1449;-741533.000000000000000;-1044684.000000000000000;0
1693;-741613.000000000000000;-1044649.000000000000000;0
713;-741800.000000000000000;-1042859.000000000000000;0
1325;-741894.000000000000000;-1044959.000000000000000;0
3976;-743088.861000001430511;-1043707.728000000119209;0
881;-741806.000000000000000;-1042815.000000000000000;0
1611;-742400.000000000000000;-1044442.000000000000000;0
6700;-742298.611000001430511;-1044507.315999999642372;0
6703;-742288.903999999165535;-1044591.625999998301268;0
6721;-742321.052999999374151;-1044705.548000000417233;0
7010;-742857.964999999850988;-1044251.155000001192093;0
4058;-743138.765000000596046;-1043625.405000001192093;0
4057;-743132.184999998658895;-1043648.719999998807907;0
1314;-741695.000000000000000;-1044866.000000000000000;0
1310;-741623.000000000000000;-1044829.000000000000000;0
7516;-742248.390000000596046;-1044368.907999999821186;0
6718;-742339.493000000715256;-1044956.921999998390675;0
1692;-741125.000000000000000;-1044816.000000000000000;0
6662;-741466.800000000745058;-1044192.359999999403954;0
2016;-743230.000000000000000;-1044873.000000000000000;0
5232;-743347.087000001221895;-1043476.425000000745058;0
2575;-742484.000000000000000;-1045453.000000000000000;0
1387;-742155.000000000000000;-1044999.000000000000000;0
1598;-742351.000000000000000;-1045090.000000000000000;0
2375;-742438.000000000000000;-1045570.000000000000000;0
2309;-742322.000000000000000;-1045519.000000000000000;0
1385;-742194.000000000000000;-1044974.000000000000000;0
2329;-742432.000000000000000;-1045508.000000000000000;0
6842;-741574.894000001251698;-1044962.013999998569489;0
1590;-742377.000000000000000;-1044885.000000000000000;0
4064;-742879.655000001192093;-1043647.420000001788139;0
1993;-743483.000000000000000;-1044984.000000000000000;0
2041;-743531.000000000000000;-1044957.000000000000000;0
2419;-742418.000000000000000;-1045101.000000000000000;0
1269;-742246.000000000000000;-1044462.000000000000000;0
6573;-741294.089999999850988;-1044091.679999999701977;0
7736;-742342.260000001639128;-1045113.918000001460314;0
4858;-742955.339999999850988;-1042963.960000000894070;0
4036;-743246.920000001788139;-1043771.574999999254942;0
623;-742254.000000000000000;-1043325.000000000000000;0
3766;-743053.532999999821186;-1042996.631000000983477;0
2017;-743247.000000000000000;-1044884.000000000000000;0
6726;-742476.517999999225140;-1044410.600000001490116;0
2028;-743371.000000000000000;-1045054.000000000000000;0
7315;-742603.960000000894070;-1045022.870000001043081;0
2060;-742659.000000000000000;-1044472.000000000000000;0
1604;-742552.000000000000000;-1044918.000000000000000;0
5241;-743365.063000001013279;-1043245.954999998211861;0
7152;-742867.331999998539686;-1044547.015999998897314;0
5258;-743356.739999998360872;-1043230.039999999105930;0
7156;-742944.515000000596046;-1044546.140000000596046;0
6709;-742264.587999999523163;-1044776.254999998956919;0
7704;-742256.021000001579523;-1044313.592999998480082;0
1553;-741350.000000000000000;-1044268.000000000000000;0
4252;-742124.022999998182058;-1043390.519000001251698;0
1126;-741684.000000000000000;-1044450.000000000000000;0
3837;-743093.699999999254942;-1042577.890000000596046;0
918;-743437.000000000000000;-1043904.000000000000000;0
1459;-741491.000000000000000;-1044340.000000000000000;0
3847;-743122.146999999880791;-1042525.489999998360872;0
3995;-743393.225000001490116;-1043973.719999998807907;0
2247;-743199.000000000000000;-1045400.000000000000000;0
4220;-742214.344999998807907;-1043580.359999999403954;0
3287;-743711.173999998718500;-1042886.515999998897314;0
7141;-742895.629999998956919;-1044470.910000000149012;0
3987;-743311.475000001490116;-1043983.175000000745058;0
1518;-741994.000000000000000;-1044011.000000000000000;0
2286;-742894.000000000000000;-1045440.000000000000000;0
7206;-742559.920000001788139;-1045003.190000001341105;0
4427;-742190.519999999552965;-1043099.440000001341105;0
4323;-742267.879999998956919;-1043190.035000000149012;0
4990;-742657.837999999523163;-1043024.199999999254942;0
1619;-742426.000000000000000;-1044401.000000000000000;0
4062;-742830.460000000894070;-1043654.920000001788139;0
7017;-742571.059999998658895;-1044267.640000000596046;0
3413;-743776.791000001132488;-1043071.675000000745058;0
3747;-743250.879999998956919;-1042956.620000001043081;0
2238;-743372.000000000000000;-1045261.000000000000000;0
2232;-743488.000000000000000;-1045234.000000000000000;0
4794;-743065.828999999910593;-1042673.377000000327826;0
1849;-742732.000000000000000;-1044228.000000000000000;0
557;-742213.000000000000000;-1043713.000000000000000;0
4079;-742836.170000001788139;-1043800.960000000894070;0
1843;-743041.600000001490116;-1044324.489999998360872;0
2320;-742707.000000000000000;-1045477.000000000000000;0
1061;-741586.000000000000000;-1045133.000000000000000;0
2891;-744029.914000000804663;-1043200.478000000119209;0
2888;-744082.749000001698732;-1043174.458999998867512;0
3266;-743585.618999999016523;-1042739.508999999612570;0
3289;-743584.761999998241663;-1042769.188000001013279;0
2213;-743188.000000000000000;-1045298.000000000000000;0
2241;-743319.000000000000000;-1045289.000000000000000;0
3789;-743137.469999998807907;-1042933.670000001788139;0
2526;-741087.000000000000000;-1044616.000000000000000;0
1523;-741679.000000000000000;-1043865.000000000000000;0
7001;-743085.660000000149012;-1044400.420000001788139;0
1435;-741903.000000000000000;-1044306.000000000000000;0
4198;-742192.445000000298023;-1043760.521000001579523;0
4505;-742434.910000000149012;-1042706.170000001788139;0
835;-741950.000000000000000;-1042513.000000000000000;0
7146;-742819.425000000745058;-1044426.225000001490116;0
2487;-742101.000000000000000;-1044308.000000000000000;0
4500;-742315.239999998360872;-1042719.460000000894070;0
7958;-741664.710000000894070;-1044289.879999998956919;0
1455;-741517.000000000000000;-1044468.000000000000000;0
1164;-741055.000000000000000;-1044515.000000000000000;0
7508;-742947.440000001341105;-1045540.690000001341105;0
5323;-743049.401000000536442;-1043038.131000000983477;0
1531;-741782.000000000000000;-1043838.000000000000000;0
6604;-741636.960000000894070;-1043867.217999998480082;0
1498;-741382.000000000000000;-1044310.000000000000000;0
4106;-742664.475000001490116;-1043755.761999998241663;0
3979;-743340.934999998658895;-1043779.414999999105930;0
1396;-741798.000000000000000;-1044263.000000000000000;0
1520;-741777.000000000000000;-1043939.000000000000000;0
4144;-742704.414999999105930;-1043822.484999999403954;0
560;-742181.000000000000000;-1043665.000000000000000;0
4981;-742536.340999998152256;-1043014.929999999701977;0
6854;-741522.427999999374151;-1045038.967999998480082;0
1839;-742994.469999998807907;-1044185.679999999701977;0
1147;-741346.000000000000000;-1044466.000000000000000;0
574;-742068.000000000000000;-1043538.000000000000000;0
3095;-743923.068999998271465;-1042787.789000000804663;0
3303;-743810.967999998480082;-1042865.596000000834465;0
4097;-742806.000000000000000;-1043874.793999999761581;0
3101;-743922.754999998956919;-1042745.195000000298023;0
4925;-742455.502000000327826;-1042923.307000000029802;0
3304;-743786.739000000059605;-1042873.728999998420477;0
5020;-742572.699999999254942;-1042891.372999999672174;0
334;-742631.000000000000000;-1043987.000000000000000;0
581;-741991.000000000000000;-1043457.000000000000000;0
5212;-743283.975000001490116;-1043373.589999999850988;0
5961;-742431.225000001490116;-1044003.574999999254942;0
4904;-742460.050000000745058;-1042796.739999998360872;0
408;-742317.000000000000000;-1044182.000000000000000;0
4793;-743035.089999999850988;-1042650.028000000864267;0
2560;-741251.000000000000000;-1044390.000000000000000;0
591;-741912.000000000000000;-1043346.000000000000000;0
6763;-741117.219999998807907;-1044428.989999998360872;0
3410;-743766.532000001519918;-1043023.280999999493361;0
1328;-742037.000000000000000;-1045043.000000000000000;0
1306;-741783.000000000000000;-1044653.000000000000000;0
7281;-742801.859999999403954;-1044705.300000000745058;0
1831;-742994.000000000000000;-1044105.000000000000000;0
346;-742540.000000000000000;-1043816.000000000000000;0
1261;-742057.000000000000000;-1044894.000000000000000;0
2321;-742679.000000000000000;-1045480.000000000000000;0
1044;-741861.000000000000000;-1044743.000000000000000;0
1008;-741962.000000000000000;-1044568.000000000000000;0
339;-742606.000000000000000;-1043916.000000000000000;0
1790;-742152.000000000000000;-1044138.000000000000000;0
6365;-741979.230000000447035;-1042656.230000000447035;0
1005;-741944.000000000000000;-1044583.000000000000000;0
1027;-741984.000000000000000;-1044660.000000000000000;0
4953;-742431.500999998301268;-1043027.399999998509884;0
826;-742191.000000000000000;-1042616.000000000000000;0
381;-742465.000000000000000;-1043700.000000000000000;0
379;-742479.000000000000000;-1043679.000000000000000;0
4809;-743081.589999999850988;-1042799.800000000745058;0
8050;-742206.719999998807907;-1044915.530000001192093;0
6391;-742109.269999999552965;-1042498.320000000298023;0
1123;-741734.000000000000000;-1044442.000000000000000;0
834;-742049.000000000000000;-1042541.000000000000000;0
7147;-742827.925000000745058;-1044451.385000001639128;0
159;-742965.000000000000000;-1042641.000000000000000;0
1036;-741961.000000000000000;-1044922.000000000000000;0
7248;-742757.960000000894070;-1044826.929999999701977;0
401;-742324.000000000000000;-1043907.000000000000000;0
224;-742904.000000000000000;-1043522.000000000000000;0
795;-741770.000000000000000;-1042577.000000000000000;0
4140;-742831.635999999940395;-1044004.828999999910593;0
5960;-743141.460999999195337;-1043339.964999999850988;0
1546;-742219.000000000000000;-1044147.000000000000000;0
5112;-742942.920000001788139;-1043441.850000001490116;0
5116;-742947.859000001102686;-1043386.767000000923872;0
6656;-741590.160000000149012;-1044150.480000000447035;0
4898;-742571.280000001192093;-1042840.859999999403954;0
6997;-743109.160000000149012;-1044453.600000001490116;0
2501;-742746.000000000000000;-1045430.000000000000000;0
5451;-743276.109000001102686;-1043331.000999998301268;0
217;-742998.000000000000000;-1043554.000000000000000;0
6194;-742315.721000000834465;-1043062.585999999195337;0
4902;-742480.460000000894070;-1042802.989999998360872;0
8281;-742164.160000000149012;-1042778.140000000596046;0
4229;-742146.929000001400709;-1043334.585000000894070;0
5514;-743426.903000000864267;-1043609.252999998629093;0
6300;-741836.949999999254942;-1042698.329999998211861;0
8283;-742198.600000001490116;-1042801.980000000447035;0
2482;-741262.739999998360872;-1044725.530000001192093;0
1122;-741749.000000000000000;-1044455.000000000000000;0
171;-743448.000000000000000;-1043399.000000000000000;0
598;-741853.000000000000000;-1043233.000000000000000;0
4950;-742354.289999999105930;-1042955.670000001788139;0
6004;-742061.723000001162291;-1043300.859999999403954;0
6996;-743116.699999999254942;-1044476.469999998807907;0
1824;-742963.809999998658895;-1044143.929999999701977;0
3352;-743954.622000001370907;-1043015.732999999076128;0
6132;-742310.590999998152256;-1043063.552999999374151;0
498;-741801.000000000000000;-1043199.000000000000000;0
4964;-742390.059999998658895;-1043044.839999999850988;0
5125;-742992.826000001281500;-1043402.497999999672174;0
1545;-742236.000000000000000;-1044234.000000000000000;0
6371;-741972.725000001490116;-1042696.274000000208616;0
3354;-743954.250999998301268;-1043026.024999998509884;0
6136;-742315.081999998539686;-1043070.210000000894070;0
248;-743439.000000000000000;-1043748.000000000000000;0
4649;-742732.228999998420477;-1042525.100000001490116;0
6649;-741731.100000001490116;-1044094.850000001490116;0
4700;-742659.859999999403954;-1042723.210000000894070;0
4810;-743058.420000001788139;-1042810.050000000745058;0
6184;-742315.868999999016523;-1043064.326999999582767;0
6247;-742371.447000000625849;-1043053.739000000059605;0
6611;-741711.614000000059605;-1043979.263999998569489;0
5599;-743411.622999999672174;-1043680.499000001698732;0
1189;-741786.000000000000000;-1044043.000000000000000;0
610;-742011.000000000000000;-1043270.000000000000000;0
5505;-743428.315000001341105;-1043675.633000001311302;0
4592;-742448.190999999642372;-1042642.517999999225140;0
5593;-743418.921000000089407;-1043679.927999999374151;0
1354;-741877.000000000000000;-1044859.000000000000000;0
4743;-742812.449999999254942;-1042729.609999999403954;0
695;-742207.000000000000000;-1043019.000000000000000;0
4773;-742888.429000001400709;-1042839.530000001192093;0
4692;-742681.477000001817942;-1042600.622000001370907;0
5592;-743420.136999998241663;-1043679.831999998539686;0
5662;-743423.271000001579523;-1043710.372000001370907;0
6211;-742317.785000000149012;-1043063.318999998271465;0
6201;-742317.888999998569489;-1043065.035000000149012;0
6191;-742318.017000000923872;-1043066.800999999046326;0
6372;-741988.530000001192093;-1042699.339999999850988;0
6151;-742311.114999998360872;-1043061.451000001281500;0
4622;-742533.901000000536442;-1042569.660000000149012;0
3807;-743008.690000001341105;-1042928.690000001341105;0
393;-742384.000000000000000;-1043819.000000000000000;0
5711;-743422.837999999523163;-1043640.131000000983477;0
325;-742700.000000000000000;-1044114.000000000000000;0
6177;-742313.717999998480082;-1043061.859999999403954;0
1342;-741721.000000000000000;-1044783.000000000000000;0
5691;-743415.714000001549721;-1043637.241000000387430;0
4961;-742309.460000000894070;-1043010.730000000447035;0
4596;-742597.181000001728535;-1042670.653000000864267;0
2447;-742772.000000000000000;-1044159.000000000000000;0
6262;-742370.024999998509884;-1043021.666000001132488;0
6140;-742311.999000001698732;-1043064.638999998569489;0
6000;-741980.750000000000000;-1043285.629999998956919;0
5412;-742582.037000000476837;-1042571.986000001430511;0
4771;-742890.828000001609325;-1042889.975000001490116;0
331;-742664.000000000000000;-1044024.000000000000000;0
2339;-742747.000000000000000;-1045548.000000000000000;0
6275;-742314.603999998420477;-1043016.407999999821186;0
4670;-742810.120000001043081;-1042644.289999999105930;0
6164;-742316.155999999493361;-1043067.784000001847744;0
2084;-742447.000000000000000;-1044797.000000000000000;0
4530;-742732.859999999403954;-1042860.920000001788139;0
4756;-742712.579999998211861;-1042776.829999998211861;0
6240;-742364.495999999344349;-1043067.289999999105930;0
5652;-743429.532999999821186;-1043700.732000000774860;0
987;-741814.000000000000000;-1044493.000000000000000;0
5595;-743416.488000001758337;-1043680.118999999016523;0
6197;-742313.425000000745058;-1043058.370999999344349;0
4764;-742839.835999999195337;-1042859.412999998778105;0
7222;-742428.280000001192093;-1044822.489999998360872;0
5721;-743418.407999999821186;-1043631.800000000745058;0
6154;-742316.324000000953674;-1043069.546000000089407;0
4735;-742686.059999998658895;-1042669.260000001639128;0
694;-742280.000000000000000;-1043043.000000000000000;0
4824;-742918.673000000417233;-1042871.875000000000000;0
4602;-742441.269000001251698;-1042596.320000000298023;0
400;-742356.000000000000000;-1043931.000000000000000;0
671;-742489.000000000000000;-1043245.000000000000000;0
4706;-742728.070000000298023;-1042610.910000000149012;0
4126;-742851.335000000894070;-1044085.449999999254942;0
6648;-741750.510000001639128;-1044080.329999998211861;0
7224;-742399.359999999403954;-1044829.829999998211861;0
6167;-742313.859999999403954;-1043063.607000000774860;0
6196;-742314.190000001341105;-1043059.774999998509884;0
8278;-742119.929999999701977;-1042758.710000000894070;0
6165;-742315.407000001519918;-1043066.436000000685453;0
2318;-742763.000000000000000;-1045470.000000000000000;0
4745;-742840.800000000745058;-1042742.120000001043081;0
4816;-742976.510000001639128;-1042798.309999998658895;0
680;-742402.109999999403954;-1043166.679999999701977;0
6173;-742316.787000000476837;-1043067.471000000834465;0
4115;-742757.210000000894070;-1044109.620000001043081;0
549;-742290.000000000000000;-1043770.000000000000000;0
5187;-743086.927000001072884;-1043435.230999998748302;0
4601;-742631.969999998807907;-1042675.629999998956919;0
544;-742343.910000000149012;-1043796.500000000000000;0
4662;-742819.471000000834465;-1042530.037000000476837;0
462;-741707.000000000000000;-1043294.000000000000000;0
608;-741955.000000000000000;-1043274.000000000000000;0
4734;-742762.920000001788139;-1042698.820000000298023;0
5637;-743428.151000000536442;-1043682.633999999612570;0
465;-741728.000000000000000;-1043309.000000000000000;0
6125;-743428.124000001698732;-1043615.223999999463558;0
4782;-742938.315999999642372;-1042714.212000001221895;0
5234;-743348.486000001430511;-1043412.741999998688698;0
6135;-742308.289000000804663;-1043059.340999998152256;0
760;-741646.000000000000000;-1042623.000000000000000;0
4657;-742806.021999999880791;-1042442.679999999701977;0
6195;-742314.956000000238419;-1043061.181000001728535;0
4648;-742721.809999998658895;-1042535.192000001668930;0
1497;-741332.000000000000000;-1044317.000000000000000;0
3342;-743922.624000001698732;-1043077.261999998241663;0
6189;-742312.041999999433756;-1043057.302000001072884;0
5674;-743409.089999999850988;-1043715.618000000715256;0
6265;-742353.164999999105930;-1043020.054999999701977;0
6650;-741714.296999998390675;-1044110.177000001072884;0
3886;-742385.100000001490116;-1042445.500000000000000;0
756;-741681.000000000000000;-1042695.000000000000000;0
6266;-742349.021000001579523;-1043019.662999998778105;0
5581;-743409.978999998420477;-1043638.324000000953674;0
5677;-743405.545000001788139;-1043716.931000001728535;0
263;-743389.000000000000000;-1043725.000000000000000;0
4694;-742689.272999998182058;-1042626.495999999344349;0
5744;-743412.905999999493361;-1043695.221000000834465;0
6858;-741492.363000001758337;-1044950.462999999523163;0
1110;-741220.730000000447035;-1044598.480000000447035;0
4523;-742703.960000000894070;-1042805.670000001788139;0
5697;-743416.916000001132488;-1043635.342000000178814;0
399;-742339.000000000000000;-1043884.000000000000000;0
5148;-743071.477000001817942;-1043411.539999999105930;0
3871;-742356.649999998509884;-1042420.543999999761581;0
1319;-741788.000000000000000;-1044905.000000000000000;0
4589;-742408.243000000715256;-1042542.631999999284744;0
4878;-742876.434000000357628;-1042964.004000000655651;0
6269;-742337.300000000745058;-1043018.486000001430511;0
7175;-742651.780000001192093;-1044558.149999998509884;0
1223;-742190.000000000000000;-1044277.000000000000000;0
8277;-742111.260000001639128;-1042746.399999998509884;0
5446;-743190.850000001490116;-1043337.008999999612570;0
5682;-743399.638000000268221;-1043719.120999999344349;0
679;-742404.000000000000000;-1043185.000000000000000;0
4581;-742391.460000000894070;-1042586.396999999880791;0
1809;-743160.000000000000000;-1044541.000000000000000;0
7171;-742671.969999998807907;-1044508.219999998807907;0
4529;-742762.920000001788139;-1042885.809999998658895;0
5504;-743428.977000001817942;-1043686.274000000208616;0
4814;-743000.489999998360872;-1042803.920000001788139;0
690;-742306.000000000000000;-1043081.000000000000000;0
4747;-742866.289999999105930;-1042753.390000000596046;0
6137;-742314.326999999582767;-1043068.837000001221895;0
785;-741702.000000000000000;-1042622.000000000000000;0
5645;-743428.886999998241663;-1043692.285999998450279;0
7291;-742809.960000000894070;-1044827.300000000745058;0
3951;-743433.379999998956919;-1043586.600000001490116;0
4739;-742751.690000001341105;-1042699.230000000447035;0
5690;-743415.532999999821186;-1043635.447000000625849;0
1185;-741822.000000000000000;-1044095.000000000000000;0
6145;-742315.708000000566244;-1043069.881999999284744;0
5663;-743422.087999999523163;-1043710.807999998331070;0
480;-741764.000000000000000;-1043342.000000000000000;0
6142;-742310.477000001817942;-1043061.813000001013279;0
1351;-741850.000000000000000;-1044830.000000000000000;0
5584;-743408.885000001639128;-1043643.532000001519918;0
691;-742293.000000000000000;-1043097.000000000000000;0
4630;-742646.271999999880791;-1042652.089999999850988;0
4958;-742349.620000001043081;-1043004.539999999105930;0
6127;-742314.456000000238419;-1043070.548999998718500;0
4129;-742890.405000001192093;-1044048.370000001043081;0
