OID_;X;Y;TEMPERATURE
7077;-743564.359000001102686;-1045385.210000000894070;0
5995;-744441.440999999642372;-1042779.568999998271465;0
3679;-744571.809999998658895;-1042497.875999998301268;0
3527;-744805.695999998599291;-1042671.809000000357628;0
3538;-744616.304000001400709;-1042656.734000001102686;0
3537;-744632.945000000298023;-1042671.657000001519918;0
3585;-744920.065000001341105;-1042522.129999998956919;0
3460;-744993.289000000804663;-1042693.587000001221895;0
3466;-745113.802000001072884;-1042675.725000001490116;0
3612;-744996.545000001788139;-1042292.646000001579523;0
2264;-742977.000000000000000;-1045745.000000000000000;0
7147;-742827.925000000745058;-1044451.385000001639128;0
2222;-743058.000000000000000;-1045420.000000000000000;0
94;-744054.000000000000000;-1042934.000000000000000;0
5;-743466.000000000000000;-1042616.000000000000000;27
3847;-743122.146999999880791;-1042525.489999998360872;0
2346;-742654.000000000000000;-1045546.000000000000000;0
2758;-743919.949999999254942;-1043488.059999998658895;0
1382;-742096.000000000000000;-1045023.000000000000000;0
7259;-742935.280000001192093;-1044869.829999998211861;0
526;-742209.000000000000000;-1043849.000000000000000;0
87;-743857.000000000000000;-1043557.000000000000000;0
2894;-743960.129000000655651;-1043216.409000001847744;0
2696;-743477.489999998360872;-1042038.000000000000000;0
3214;-743628.813000001013279;-1042457.677000001072884;0
1586;-742372.000000000000000;-1044785.000000000000000;0
2361;-742323.000000000000000;-1045576.000000000000000;0
2387;-742118.000000000000000;-1045443.000000000000000;0
466;-741743.000000000000000;-1043331.000000000000000;0
608;-741955.000000000000000;-1043274.000000000000000;0
6946;-742974.765000000596046;-1043929.388000000268221;0
6843;-741569.070000000298023;-1044975.261999998241663;0
5325;-742997.480000000447035;-1043042.289999999105930;0
2301;-742533.000000000000000;-1045416.000000000000000;0
9;-743512.000000000000000;-1042512.000000000000000;133
6875;-741808.350000001490116;-1045257.269999999552965;0
8080;-741989.600000001490116;-1045310.420000001788139;0
6805;-741109.710000000894070;-1044689.170000001788139;0
1532;-741805.000000000000000;-1043858.000000000000000;0
2093;-742915.000000000000000;-1044642.000000000000000;0
3810;-743261.510000001639128;-1042802.960000000894070;145
3269;-743600.679000001400709;-1042731.660000000149012;0
6606;-741654.631999999284744;-1043906.848000001162291;0
5250;-743328.995000001043081;-1043178.495000001043081;0
510;-742048.000000000000000;-1043150.000000000000000;0
926;-741894.000000000000000;-1042999.000000000000000;0
1043;-741872.000000000000000;-1044711.000000000000000;0
725;-741983.000000000000000;-1042939.000000000000000;0
2502;-742750.000000000000000;-1045457.000000000000000;0
1674;-741099.000000000000000;-1044736.000000000000000;0
2740;-744042.611999999731779;-1043335.940000001341105;0
2080;-742685.000000000000000;-1044460.000000000000000;0
1993;-743483.000000000000000;-1044984.000000000000000;0
1966;-743413.000000000000000;-1044746.000000000000000;0
1985;-743478.000000000000000;-1044769.000000000000000;0
1368;-741998.000000000000000;-1044779.000000000000000;0
5124;-742983.513000000268221;-1043417.271999999880791;0
2375;-742438.000000000000000;-1045570.000000000000000;0
7041;-743381.004999998956919;-1044158.699999999254942;0
227;-742846.000000000000000;-1043520.000000000000000;0
1555;-741196.000000000000000;-1044374.000000000000000;0
1127;-741700.000000000000000;-1044440.000000000000000;0
403;-742307.000000000000000;-1043931.000000000000000;0
711;-741828.000000000000000;-1042860.000000000000000;0
5064;-742811.537999998778105;-1043238.886999998241663;0
7514;-742304.866000000387430;-1044375.124000001698732;0
1157;-741172.000000000000000;-1044489.000000000000000;0
2481;-741255.609999999403954;-1044671.179999999701977;0
5409;-743745.201000001281500;-1042902.750000000000000;0
4146;-742666.940000001341105;-1043854.829999998211861;0
4078;-742842.960000000894070;-1043832.824999999254942;0
3975;-743112.984999999403954;-1043716.375999998301268;0
1765;-741159.000000000000000;-1044178.000000000000000;0
5107;-742857.611999999731779;-1043458.278000000864267;0
2889;-744074.103999998420477;-1043194.559999998658895;0
7011;-742831.309999998658895;-1044257.245000001043081;0
1448;-741537.000000000000000;-1044716.000000000000000;0
2284;-742901.000000000000000;-1045502.000000000000000;0
7216;-742500.129999998956919;-1044564.390000000596046;0
2214;-743162.000000000000000;-1045316.000000000000000;0
2166;-743016.000000000000000;-1045179.000000000000000;0
503;-741879.000000000000000;-1043158.000000000000000;0
1768;-741265.000000000000000;-1044133.000000000000000;0
2506;-741267.000000000000000;-1044015.000000000000000;0
1213;-742068.000000000000000;-1044387.000000000000000;0
1794;-742151.000000000000000;-1044190.000000000000000;0
2277;-742826.000000000000000;-1045653.000000000000000;0
1487;-741117.000000000000000;-1044216.000000000000000;0
1317;-741748.000000000000000;-1044884.000000000000000;0
5068;-742837.162999998778105;-1043263.965999998152256;0
1013;-742076.000000000000000;-1044595.000000000000000;0
2198;-743302.000000000000000;-1045194.000000000000000;0
551;-742269.000000000000000;-1043755.000000000000000;0
4083;-742820.771999999880791;-1043708.657000001519918;0
2123;-743299.000000000000000;-1045010.000000000000000;0
5209;-743271.947999998927116;-1043361.392000000923872;0
2486;-741289.250000000000000;-1044848.829999998211861;0
6997;-743109.160000000149012;-1044453.600000001490116;0
1103;-741306.000000000000000;-1044572.000000000000000;0
7782;-743012.350000001490116;-1045871.938999999314547;0
4070;-742925.285000000149012;-1043783.565000001341105;18
6688;-742383.146999999880791;-1045009.361000001430511;0
2246;-743218.000000000000000;-1045379.000000000000000;0
1467;-741808.000000000000000;-1044064.000000000000000;0
1701;-741378.000000000000000;-1044678.000000000000000;0
1928;-743474.000000000000000;-1044409.000000000000000;0
351;-742509.000000000000000;-1043739.000000000000000;0
1719;-741406.760000001639128;-1044866.039999999105930;0
383;-742450.000000000000000;-1043722.000000000000000;0
6722;-742357.717000000178814;-1044705.708000000566244;0
1386;-742158.000000000000000;-1044976.000000000000000;0
3793;-743101.820000000298023;-1042826.379999998956919;0
6701;-742295.142000000923872;-1044533.372000001370907;0
734;-741935.000000000000000;-1043014.000000000000000;0
1413;-741631.000000000000000;-1044621.000000000000000;0
4213;-742218.094999998807907;-1043529.954999998211861;0
6337;-742257.140000000596046;-1042864.820000000298023;0
1821;-742995.000000000000000;-1044239.000000000000000;0
7087;-743339.940000001341105;-1044536.690000001341105;0
6663;-741457.949999999254942;-1044194.329999998211861;0
5144;-743052.642000000923872;-1043488.940000001341105;0
2044;-743445.000000000000000;-1044960.000000000000000;0
574;-742068.000000000000000;-1043538.000000000000000;0
331;-742664.000000000000000;-1044024.000000000000000;0
3995;-743393.225000001490116;-1043973.719999998807907;0
7935;-743156.000000000000000;-1045071.149999998509884;0
4342;-742506.473000001162291;-1043301.100000001490116;0
1628;-742449.000000000000000;-1044494.000000000000000;0
1092;-741549.000000000000000;-1044556.000000000000000;0
5370;-742580.300999999046326;-1042977.140999998897314;0
747;-741690.000000000000000;-1043000.000000000000000;0
2096;-743154.000000000000000;-1044724.000000000000000;0
7088;-743335.559999998658895;-1044546.359999999403954;0
1309;-741611.000000000000000;-1044813.000000000000000;0
8044;-742176.640000000596046;-1044778.420000001788139;0
7743;-741707.912999998778105;-1045072.826999999582767;0
4131;-742844.625000000000000;-1044059.980000000447035;0
1215;-742091.000000000000000;-1044365.000000000000000;0
2071;-743018.000000000000000;-1044733.000000000000000;0
4064;-742879.655000001192093;-1043647.420000001788139;0
800;-741822.000000000000000;-1042588.000000000000000;0
1697;-741495.000000000000000;-1044664.000000000000000;0
2040;-743285.000000000000000;-1044809.000000000000000;0
4238;-742440.263000000268221;-1043528.236000001430511;0
6975;-743116.140000000596046;-1044506.469999998807907;0
7008;-742899.559999998658895;-1044224.074999999254942;0
406;-742366.000000000000000;-1044171.000000000000000;99
2332;-742899.000000000000000;-1045516.000000000000000;0
1457;-741510.000000000000000;-1044411.000000000000000;0
985;-741823.000000000000000;-1044444.000000000000000;0
827;-742218.000000000000000;-1042626.000000000000000;0
563;-742155.000000000000000;-1043660.000000000000000;0
1750;-742045.000000000000000;-1045215.000000000000000;0
1145;-741386.000000000000000;-1044461.000000000000000;0
1178;-741952.000000000000000;-1044311.000000000000000;0
2105;-743158.000000000000000;-1044971.000000000000000;0
4792;-743051.280000001192093;-1042654.962999999523163;0
1350;-741814.000000000000000;-1044844.000000000000000;0
4219;-742243.045000001788139;-1043600.660000000149012;0
4609;-742557.414000000804663;-1042621.583999998867512;0
618;-742203.000000000000000;-1043272.000000000000000;0
7164;-742596.114999998360872;-1044447.173000000417233;0
6854;-741522.427999999374151;-1045038.967999998480082;0
6361;-742016.024999998509884;-1042677.243999999016523;0
4427;-742190.519999999552965;-1043099.440000001341105;0
1007;-741976.000000000000000;-1044586.000000000000000;0
3952;-743407.521999999880791;-1043538.500999998301268;0
3760;-743233.829999998211861;-1042978.739999998360872;0
2262;-742999.000000000000000;-1045686.000000000000000;0
2545;-741723.000000000000000;-1044265.000000000000000;0
4874;-742795.429999999701977;-1042925.910000000149012;0
4639;-742567.399999998509884;-1042548.592999998480082;0
4430;-742235.070000000298023;-1043092.839999999850988;0
8060;-742295.719999998807907;-1045082.859999999403954;0
5420;-742442.920000001788139;-1042740.519999999552965;0
727;-742001.000000000000000;-1042962.000000000000000;0
6726;-742476.517999999225140;-1044410.600000001490116;0
3962;-743407.190000001341105;-1043535.730000000447035;0
4538;-742291.464000001549721;-1042734.344000000506639;0
4174;-742738.230000000447035;-1043763.155000001192093;0
5996;-742061.879000000655651;-1043284.276999998837709;0
1499;-741413.000000000000000;-1044304.000000000000000;0
4251;-742136.420000001788139;-1043379.969999998807907;0
7020;-743104.175000000745058;-1044078.344999998807907;0
6302;-741814.370000001043081;-1042743.910000000149012;0
1463;-741933.000000000000000;-1043968.000000000000000;0
5272;-743000.013999998569489;-1043245.364000000059605;0
5306;-743103.326999999582767;-1043193.129000000655651;0
4237;-742425.385000001639128;-1043517.421000000089407;0
8072;-742148.059999998658895;-1045271.649999998509884;0
2147;-742828.000000000000000;-1044984.000000000000000;0
8262;-742129.620000001043081;-1042698.079999998211861;0
2161;-742876.000000000000000;-1045153.000000000000000;0
394;-742405.000000000000000;-1043863.000000000000000;0
2164;-742966.000000000000000;-1045172.000000000000000;0
4975;-742477.829999998211861;-1043016.923000000417233;0
2364;-742504.000000000000000;-1045563.000000000000000;0
219;-742979.000000000000000;-1043549.000000000000000;0
4008;-743250.114999998360872;-1044043.905999999493361;0
4920;-742444.449999999254942;-1042928.980000000447035;0
281;-743045.000000000000000;-1043848.000000000000000;0
8273;-742057.820000000298023;-1042728.760000001639128;0
4668;-742810.210000000894070;-1042618.969999998807907;0
3352;-743954.622000001370907;-1043015.732999999076128;0
7175;-742651.780000001192093;-1044558.149999998509884;0
787;-741714.000000000000000;-1042620.000000000000000;0
5767;-742424.269999999552965;-1042581.609000001102686;0
3280;-743624.243999999016523;-1042811.839999999850988;0
796;-741771.000000000000000;-1042592.000000000000000;0
3377;-743832.151999998837709;-1042925.721000000834465;0
4676;-742792.579999998211861;-1042771.519999999552965;0
719;-741705.000000000000000;-1042828.000000000000000;0
1903;-743445.000000000000000;-1044281.000000000000000;0
1370;-742061.000000000000000;-1044797.000000000000000;0
908;-742211.000000000000000;-1042501.000000000000000;0
3846;-743149.390000000596046;-1042549.600000001490116;0
600;-741840.000000000000000;-1043212.000000000000000;0
4327;-742333.449000000953674;-1043399.671000000089407;0
2051;-743434.000000000000000;-1045074.000000000000000;0
1170;-741893.000000000000000;-1044403.000000000000000;0
7961;-741602.260000001639128;-1044314.350000001490116;0
3766;-743053.532999999821186;-1042996.631000000983477;0
4141;-742804.644999999552965;-1044008.964999999850988;0
625;-742247.000000000000000;-1043299.000000000000000;0
3181;-743898.234999999403954;-1042567.133000001311302;0
4997;-742492.638000000268221;-1042962.833999998867512;0
7985;-741091.269999999552965;-1044419.039999999105930;0
4046;-743205.699999999254942;-1044009.719999998807907;0
1595;-742313.000000000000000;-1045010.000000000000000;0
822;-742079.000000000000000;-1042598.000000000000000;0
1548;-742220.000000000000000;-1044216.000000000000000;0
3422;-743740.361000001430511;-1043095.657999999821186;0
6692;-742222.114999998360872;-1044818.673000000417233;0
1604;-742552.000000000000000;-1044918.000000000000000;0
7206;-742559.920000001788139;-1045003.190000001341105;0
4925;-742455.502000000327826;-1042923.307000000029802;0
5196;-743199.263000000268221;-1043326.401000000536442;0
110;-744127.000000000000000;-1042724.000000000000000;3
5245;-743368.859999999403954;-1043290.789999999105930;0
6499;-741707.811000000685453;-1044907.068999998271465;0
6268;-742340.850000001490116;-1043018.881000000983477;0
6204;-742315.578999999910593;-1043060.826000001281500;0
6299;-741803.309999998658895;-1042718.690000001341105;0
4520;-742651.079999998211861;-1042798.449999999254942;0
7034;-743299.725999999791384;-1044153.140000000596046;0
3130;-743942.151000000536442;-1042673.475999999791384;0
2192;-743499.000000000000000;-1045199.000000000000000;0
4661;-742816.708000000566244;-1042503.918999999761581;0
4701;-742687.780000001192093;-1042761.660000000149012;0
7006;-742995.760000001639128;-1043976.245000001043081;0
7649;-742319.399999998509884;-1045429.557000000029802;0
6185;-742315.103999998420477;-1043062.923000000417233;0
821;-742048.000000000000000;-1042601.000000000000000;0
7277;-742796.870000001043081;-1044653.429999999701977;0
681;-742383.000000000000000;-1043170.000000000000000;0
1060;-741610.000000000000000;-1045115.000000000000000;0
4944;-742430.605999998748302;-1043013.879000000655651;0
1291;-742205.000000000000000;-1044568.000000000000000;0
941;-742098.000000000000000;-1043132.000000000000000;0
182;-743429.000000000000000;-1043385.000000000000000;0
4332;-742410.359000001102686;-1043282.916000001132488;0
1224;-742174.000000000000000;-1044253.000000000000000;0
202;-743240.000000000000000;-1043597.000000000000000;0
5709;-743420.221999999135733;-1043640.467999998480082;0
4574;-742339.980000000447035;-1042661.570000000298023;0
4893;-742637.320000000298023;-1042818.600999999791384;0
4605;-742489.238000001758337;-1042616.754999998956919;0
1497;-741332.000000000000000;-1044317.000000000000000;0
697;-742101.000000000000000;-1042908.000000000000000;0
4817;-742967.460000000894070;-1042782.559999998658895;0
2326;-742523.000000000000000;-1045498.000000000000000;0
6164;-742316.155999999493361;-1043067.784000001847744;0
683;-742362.000000000000000;-1043155.000000000000000;0
533;-742137.000000000000000;-1043750.000000000000000;0
4966;-742377.289999999105930;-1043071.030000001192093;0
6131;-742311.329999998211861;-1043064.982999999076128;0
6604;-741636.960000000894070;-1043867.217999998480082;0
5024;-742588.655000001192093;-1042886.519000001251698;0
1727;-741495.000000000000000;-1045103.000000000000000;0
4616;-742545.416999999433756;-1042662.541999999433756;0
3339;-743968.859000001102686;-1043058.642000000923872;0
2542;-741813.000000000000000;-1044224.000000000000000;0
7174;-742639.019999999552965;-1044564.949999999254942;0
181;-743421.000000000000000;-1043350.000000000000000;0
1429;-741982.000000000000000;-1044280.000000000000000;0
6707;-742271.293999999761581;-1044721.274999998509884;0
6260;-742377.692999999970198;-1043022.434000000357628;0
6385;-742179.530000001192093;-1042495.359999999403954;0
6654;-741635.289999999105930;-1044140.820000000298023;0
5779;-742907.197999998927116;-1043414.096999999135733;0
4491;-741872.890000000596046;-1042643.989999998360872;0
4022;-743268.934999998658895;-1043870.500000000000000;0
4996;-742488.458999998867512;-1042974.723999999463558;0
7138;-742917.554999999701977;-1044421.774999998509884;0
1296;-742100.000000000000000;-1044473.000000000000000;0
4020;-743160.616000000387430;-1043872.782999999821186;0
3277;-743688.120999999344349;-1042851.743000000715256;0
4166;-742448.504999998956919;-1044046.885000001639128;0
7160;-743028.010999999940395;-1044543.267999999225140;0
4523;-742703.960000000894070;-1042805.670000001788139;0
4566;-742473.846000000834465;-1042545.780000001192093;0
5042;-742731.719000000506639;-1042890.517000000923872;0
4765;-742822.897999998182058;-1042850.499000001698732;0
1819;-743034.000000000000000;-1044350.000000000000000;0
4019;-743157.434999998658895;-1043897.410000000149012;0
8245;-742642.489999998360872;-1045210.670000001788139;0
6478;-741931.429999999701977;-1044453.500000000000000;0
1304;-741810.000000000000000;-1044684.000000000000000;0
5323;-743049.401000000536442;-1043038.131000000983477;0
1040;-741904.000000000000000;-1044623.000000000000000;0
2377;-742390.000000000000000;-1045527.000000000000000;0
4853;-742981.855000000447035;-1042884.537000000476837;0
1935;-743276.000000000000000;-1044289.000000000000000;0
6747;-742410.170000001788139;-1044287.228000000119209;0
1351;-741850.000000000000000;-1044830.000000000000000;0
4898;-742571.280000001192093;-1042840.859999999403954;0
3407;-743772.385999999940395;-1043008.706999998539686;0
1214;-742064.000000000000000;-1044358.000000000000000;0
4707;-742743.519999999552965;-1042600.359999999403954;0
4252;-742124.022999998182058;-1043390.519000001251698;0
6650;-741714.296999998390675;-1044110.177000001072884;0
4712;-742830.309999998658895;-1042614.969999998807907;0
6931;-742050.949999999254942;-1045191.190000001341105;0
5416;-742963.127999998629093;-1042713.598000001162291;0
4788;-742970.409000001847744;-1042588.238000001758337;0
6149;-742312.646000001579523;-1043064.261999998241663;0
2497;-741932.000000000000000;-1044075.000000000000000;0
4136;-742726.225000001490116;-1044089.829999998211861;0
788;-741637.000000000000000;-1042607.000000000000000;0
4629;-742630.986000001430511;-1042626.096000000834465;0
7046;-743398.329999998211861;-1044186.289999999105930;0
3871;-742356.649999998509884;-1042420.543999999761581;0
4803;-743043.410999998450279;-1042699.506000000983477;0
7155;-742920.776999998837709;-1044546.934000000357628;0
4320;-742264.149000000208616;-1043259.541999999433756;0
4164;-742476.478000000119209;-1044110.528000000864267;0
7188;-742583.839999999850988;-1044742.870000001043081;0
6145;-742315.708000000566244;-1043069.881999999284744;0
6233;-742319.057000000029802;-1043072.162999998778105;0
204;-743208.000000000000000;-1043588.000000000000000;0
1615;-742367.000000000000000;-1044434.000000000000000;0
5662;-743423.271000001579523;-1043710.372000001370907;0
1857;-742574.000000000000000;-1044318.000000000000000;0
5016;-742572.212000001221895;-1042955.526999998837709;0
2211;-743248.000000000000000;-1045258.000000000000000;0
7656;-742290.328000001609325;-1045294.499000001698732;0
1921;-743387.000000000000000;-1044335.000000000000000;0
3283;-743632.767000000923872;-1042846.004000000655651;0
7033;-743303.864999998360872;-1044132.750000000000000;0
678;-742421.000000000000000;-1043181.000000000000000;0
5712;-743423.701000001281500;-1043638.675999999046326;0
328;-742670.000000000000000;-1044072.000000000000000;0
7014;-742650.170000001788139;-1044305.010000001639128;0
6092;-742001.309999998658895;-1043482.089999999850988;0
4933;-742437.605000000447035;-1042750.853000000119209;0
516;-742160.000000000000000;-1043135.000000000000000;0
2431;-742498.000000000000000;-1045094.000000000000000;0
3351;-743954.622000001370907;-1043011.489999998360872;0
6458;-743360.644999999552965;-1043919.311999998986721;0
6776;-741098.559999998658895;-1044491.530000001192093;0
7151;-742842.649000000208616;-1044545.307000000029802;0
7958;-741664.710000000894070;-1044289.879999998956919;0
6714;-742287.171000000089407;-1044923.995999999344349;0
4962;-742387.429999999701977;-1043028.129999998956919;0
722;-742139.000000000000000;-1043009.000000000000000;0
1914;-743464.000000000000000;-1044458.000000000000000;0
1326;-741927.000000000000000;-1044976.000000000000000;0
1778;-741032.000000000000000;-1044785.000000000000000;0
3792;-743110.019999999552965;-1042846.530000001192093;0
4822;-742945.579999998211861;-1042879.910000000149012;0
4040;-743224.710000000894070;-1043766.050000000745058;0
3091;-743924.489000000059605;-1042816.170000001788139;0
6952;-743044.730999998748302;-1044106.129999998956919;0
1300;-741917.410000000149012;-1044719.769999999552965;0
3919;-743904.947000000625849;-1043493.929999999701977;0
5146;-743064.554000001400709;-1043452.671999998390675;0
1035;-741963.000000000000000;-1044896.000000000000000;0
1131;-741643.000000000000000;-1044433.000000000000000;0
6658;-741538.879999998956919;-1044165.440000001341105;0
2328;-742459.000000000000000;-1045505.000000000000000;0
6156;-742314.791999999433756;-1043066.736000001430511;0
835;-741950.000000000000000;-1042513.000000000000000;0
5966;-742483.469999998807907;-1043066.721999999135733;0
2537;-741975.000000000000000;-1044131.000000000000000;0
5699;-743416.657000001519918;-1043631.932999998331070;0
2238;-743372.000000000000000;-1045261.000000000000000;0
4200;-742219.350000001490116;-1043727.980999998748302;0
7516;-742248.390000000596046;-1044368.907999999821186;0
570;-742098.000000000000000;-1043582.000000000000000;0
6749;-742418.210999999195337;-1044329.190999999642372;0
7249;-742789.010999999940395;-1044830.250000000000000;0
4903;-742493.579999998211861;-1042816.620000001043081;0
5714;-743423.756000000983477;-1043635.103999998420477;0
2452;-742913.000000000000000;-1044127.000000000000000;0
5324;-743025.329999998211861;-1043045.789999999105930;0
2223;-743053.000000000000000;-1045437.000000000000000;0
4769;-742881.932000000029802;-1042923.590999998152256;0
4697;-742675.329999998211861;-1042689.179999999701977;0
4623;-742533.778999999165535;-1042585.824000000953674;0
344;-742557.000000000000000;-1043847.000000000000000;107
3784;-743187.730000000447035;-1042922.429999999701977;0
3763;-743140.420000001788139;-1042987.649999998509884;0
3971;-743206.815000001341105;-1043721.065000001341105;0
1220;-742147.000000000000000;-1044283.000000000000000;0
4704;-742680.000000000000000;-1042776.750000000000000;0
1424;-742134.000000000000000;-1044171.000000000000000;0
5645;-743428.886999998241663;-1043692.285999998450279;0
4948;-742386.929999999701977;-1042992.239999998360872;0
1000;-741828.000000000000000;-1044502.000000000000000;0
3794;-743091.015000000596046;-1042800.471999999135733;0
4585;-742437.502000000327826;-1042630.243999999016523;0
2316;-742823.000000000000000;-1045463.000000000000000;0
5716;-743423.320999998599291;-1043631.197000000625849;0
4820;-742927.769999999552965;-1042786.710000000894070;0
4615;-742527.811000000685453;-1042658.600999999791384;0
7242;-742691.750000000000000;-1044821.769999999552965;0
4603;-742442.480000000447035;-1042617.250000000000000;0
210;-743112.000000000000000;-1043566.000000000000000;0
4924;-742427.890999998897314;-1042890.581000000238419;0
5011;-742644.307999998331070;-1042994.813999999314547;0
396;-742388.000000000000000;-1043886.000000000000000;0
1840;-742984.379999998956919;-1044155.149999998509884;0
1756;-742165.000000000000000;-1045209.000000000000000;0
6365;-741979.230000000447035;-1042656.230000000447035;0
1456;-741513.000000000000000;-1044437.000000000000000;0
6243;-742367.739999998360872;-1043061.098000001162291;0
169;-743433.000000000000000;-1043334.000000000000000;0
7965;-741515.510000001639128;-1044348.350000001490116;0
5682;-743399.638000000268221;-1043719.120999999344349;0
4680;-742759.370000001043081;-1042864.140000000596046;0
4507;-742472.469999998807907;-1042720.199999999254942;0
8267;-742240.420000001788139;-1042709.160000000149012;0
952;-742274.000000000000000;-1043018.000000000000000;0
5506;-743427.348000001162291;-1043665.644999999552965;0
5167;-743219.324999999254942;-1043405.249000001698732;0
6710;-742260.203000001609325;-1044803.609999999403954;0
4150;-742581.789999999105930;-1044138.429999999701977;0
7809;-741981.809999998658895;-1044560.280000001192093;0
1140;-741475.000000000000000;-1044461.000000000000000;0
4097;-742806.000000000000000;-1043874.793999999761581;0
7212;-742559.410000000149012;-1045073.070000000298023;0
4760;-742826.947000000625849;-1042799.914000000804663;0
675;-742446.000000000000000;-1043215.000000000000000;0
6177;-742313.717999998480082;-1043061.859999999403954;0
4694;-742689.272999998182058;-1042626.495999999344349;0
6201;-742317.888999998569489;-1043065.035000000149012;0
4601;-742631.969999998807907;-1042675.629999998956919;0
5371;-742052.149999998509884;-1043011.940000001341105;0
5708;-743418.927999999374151;-1043640.519000001251698;0
1925;-743331.000000000000000;-1044321.000000000000000;0
1518;-741994.000000000000000;-1044011.000000000000000;0
7537;-742722.660000000149012;-1045361.410000000149012;0
6241;-742365.649999998509884;-1043065.059999998658895;0
1817;-743058.000000000000000;-1044411.000000000000000;0
5170;-743246.743000000715256;-1043425.304000001400709;0
1509;-741741.000000000000000;-1044196.000000000000000;0
6007;-743187.807000000029802;-1043302.019000001251698;0
1926;-743301.000000000000000;-1044321.000000000000000;0
1822;-742986.199999999254942;-1044211.969999998807907;0
7039;-743335.785000000149012;-1044169.030000001192093;0
3276;-743673.931000001728535;-1042836.190999999642372;0
4804;-743020.045000001788139;-1042704.315999999642372;0
4339;-742459.269000001251698;-1043367.923000000417233;0
590;-741935.000000000000000;-1043331.000000000000000;0
4667;-742823.039999999105930;-1042631.620000001043081;0
5681;-743400.820000000298023;-1043718.682000000029802;0
4627;-742601.138999998569489;-1042606.791000001132488;0
7515;-742273.021999999880791;-1044371.543999999761581;0
1949;-743248.000000000000000;-1044491.000000000000000;0
5505;-743428.315000001341105;-1043675.633000001311302;0
6993;-743172.409000001847744;-1044501.339000001549721;0
4733;-742767.890000000596046;-1042671.010000001639128;0
5657;-743429.199999999254942;-1043706.837999999523163;0
7704;-742256.021000001579523;-1044313.592999998480082;0
7661;-742294.495999999344349;-1045349.482000000774860;0
2172;-742886.000000000000000;-1045182.000000000000000;0
612;-742064.000000000000000;-1043270.000000000000000;0
6240;-742364.495999999344349;-1043067.289999999105930;0
7369;-743236.822000000625849;-1045458.699000000953674;0
7218;-742534.100000001490116;-1044603.559999998658895;0
1446;-741545.000000000000000;-1044774.000000000000000;0
6295;-742653.399999998509884;-1042696.070000000298023;0
3210;-743664.019000001251698;-1042478.668999999761581;0
2253;-743250.000000000000000;-1045314.000000000000000;0
6222;-742316.855000000447035;-1043060.109999999403954;0
4051;-743236.329999998211861;-1043889.710000000894070;0
7977;-741271.370000001043081;-1044404.390000000596046;0
6728;-742547.451000001281500;-1044392.396000001579523;0
5637;-743428.151000000536442;-1043682.633999999612570;0
541;-742258.000000000000000;-1043678.000000000000000;0
1545;-742236.000000000000000;-1044234.000000000000000;0
4705;-742714.100000001490116;-1042599.829999998211861;0
710;-741829.000000000000000;-1042878.000000000000000;0
4759;-742842.945999998599291;-1042806.664000000804663;0
2228;-743044.000000000000000;-1045502.000000000000000;0
4052;-743252.954999998211861;-1043843.585000000894070;0
272;-743396.000000000000000;-1043809.000000000000000;0
5228;-743334.289999999105930;-1043545.039999999105930;0
6231;-742316.769000001251698;-1043058.344000000506639;0
2087;-742450.000000000000000;-1044838.000000000000000;0
