OID_;X;Y;TEMPERATURE
5786;-743456.410000000149012;-1042105.250000000000000;0
111;-745351.000000000000000;-1042795.000000000000000;0
3107;-743778.888000000268221;-1042682.131999999284744;0
3208;-743682.739000000059605;-1042488.668999999761581;0
1;-743520.000000000000000;-1042472.000000000000000;0
3068;-744158.921000000089407;-1042812.230999998748302;0
5;-743466.000000000000000;-1042616.000000000000000;0
3309;-743830.328000001609325;-1042834.535000000149012;0
3214;-743628.813000001013279;-1042457.677000001072884;0
8;-743496.000000000000000;-1042539.000000000000000;0
3289;-743584.761999998241663;-1042769.188000001013279;0
6414;-743703.410999998450279;-1042881.958000000566244;0
3918;-743970.258999999612570;-1043539.822999998927116;0
3922;-743844.574999999254942;-1043491.188999999314547;0
3919;-743904.947000000625849;-1043493.929999999701977;0
930;-744068.000000000000000;-1043405.000000000000000;0
928;-744070.000000000000000;-1043299.000000000000000;0
3242;-744191.513000000268221;-1042647.011999998241663;0
3063;-744133.098999999463558;-1042851.478999998420477;0
6448;-744017.179999999701977;-1043123.899999998509884;0
3369;-743878.633000001311302;-1043011.739000000059605;0
2892;-744005.317000001668930;-1043204.537000000476837;0
2891;-744029.914000000804663;-1043200.478000000119209;0
3364;-743855.184999998658895;-1043024.940000001341105;0
3373;-743814.043000001460314;-1043018.168000001460314;0
3410;-743766.532000001519918;-1043023.280999999493361;0
3267;-743587.203000001609325;-1042710.840999998152256;0
3145;-744025.730000000447035;-1042639.432999998331070;0
3182;-743923.576000001281500;-1042554.350000001490116;0
3168;-743928.910000000149012;-1042570.219999998807907;0
3101;-743922.754999998956919;-1042745.195000000298023;0
3306;-743787.127999998629093;-1042847.872999999672174;0
3614;-744984.548999998718500;-1042283.640999998897314;0
3032;-744506.962000001221895;-1042717.704999998211861;0
3045;-744358.401999998837709;-1042788.074999999254942;0
147;-744724.000000000000000;-1042391.000000000000000;0
3480;-745200.488000001758337;-1042779.028999999165535;0
6322;-745097.228000000119209;-1042674.039999999105930;0
3459;-745018.804999999701977;-1042695.640000000596046;0
3584;-744914.094999998807907;-1042552.403999999165535;0
3524;-744816.782999999821186;-1042685.140999998897314;0
3682;-744519.155999999493361;-1042509.840999998152256;0
3561;-744699.155999999493361;-1042614.903999999165535;0
3674;-744609.826999999582767;-1042523.997999999672174;0
3539;-744607.903000000864267;-1042668.236999999731779;0
6870;-741708.260000001639128;-1045321.590999998152256;0
6872;-741751.719999998807907;-1045296.679999999701977;0
7411;-743529.510000001639128;-1045393.140000000596046;0
7260;-742953.010000001639128;-1044873.530000001192093;0
8081;-741974.019999999552965;-1045331.530000001192093;0
2016;-743230.000000000000000;-1044873.000000000000000;0
5296;-743058.934999998658895;-1043177.035000000149012;0
5284;-743041.022999998182058;-1043277.397999998182058;0
5306;-743103.326999999582767;-1043193.129000000655651;0
7252;-742775.109999999403954;-1044855.940000001341105;0
7285;-742806.960000000894070;-1044758.379999998956919;0
7276;-742801.670000001788139;-1044613.309999998658895;0
2108;-743147.000000000000000;-1045086.000000000000000;0
7935;-743156.000000000000000;-1045071.149999998509884;0
2147;-742828.000000000000000;-1044984.000000000000000;0
2156;-742796.000000000000000;-1045184.000000000000000;0
2161;-742876.000000000000000;-1045153.000000000000000;0
2144;-742844.000000000000000;-1045070.000000000000000;0
2168;-743025.000000000000000;-1045134.000000000000000;0
7325;-743032.969999998807907;-1045186.298999998718500;0
884;-741771.000000000000000;-1042776.000000000000000;0
1533;-741832.000000000000000;-1043879.000000000000000;0
2498;-741906.000000000000000;-1044040.000000000000000;0
4119;-742717.223999999463558;-1043999.837999999523163;0
4146;-742666.940000001341105;-1043854.829999998211861;0
1753;-742096.000000000000000;-1045195.000000000000000;0
512;-742063.000000000000000;-1043136.000000000000000;0
514;-742119.000000000000000;-1043141.000000000000000;0
465;-741728.000000000000000;-1043309.000000000000000;0
7011;-742831.309999998658895;-1044257.245000001043081;0
1486;-741150.000000000000000;-1044219.000000000000000;0
1532;-741805.000000000000000;-1043858.000000000000000;0
4088;-742812.114999998360872;-1043580.475000001490116;0
2389;-742076.000000000000000;-1045396.000000000000000;0
7652;-742275.046999998390675;-1045497.052000001072884;0
2402;-742236.000000000000000;-1045408.000000000000000;0
2123;-743299.000000000000000;-1045010.000000000000000;0
2393;-742054.000000000000000;-1045282.000000000000000;0
3811;-743244.620000001043081;-1042809.420000001788139;0
5252;-743283.517000000923872;-1043176.197999998927116;0
7780;-743046.243000000715256;-1045844.168999999761581;0
7147;-742827.925000000745058;-1044451.385000001639128;0
7149;-742823.379000000655651;-1044496.758000001311302;0
7138;-742917.554999999701977;-1044421.774999998509884;0
2059;-742625.000000000000000;-1044459.000000000000000;0
7177;-742643.059999998658895;-1044579.679999999701977;0
7182;-742597.789999999105930;-1044678.260000001639128;0
7183;-742606.379999998956919;-1044692.969999998807907;0
7729;-742623.480999998748302;-1044601.217000000178814;0
7153;-742889.646999999880791;-1044547.438000001013279;0
2072;-743043.000000000000000;-1044743.000000000000000;0
2096;-743154.000000000000000;-1044724.000000000000000;0
7007;-742923.890000000596046;-1044218.879999998956919;0
7216;-742500.129999998956919;-1044564.390000000596046;0
7214;-742470.679999999701977;-1044531.269999999552965;0
2049;-743499.000000000000000;-1045071.000000000000000;0
696;-742077.000000000000000;-1042913.000000000000000;0
744;-741666.000000000000000;-1042994.000000000000000;0
6703;-742288.903999999165535;-1044591.625999998301268;0
504;-741937.000000000000000;-1043164.000000000000000;0
4236;-742406.842999998480082;-1043504.015000000596046;0
4237;-742425.385000001639128;-1043517.421000000089407;0
1759;-741128.000000000000000;-1044097.000000000000000;0
7704;-742256.021000001579523;-1044313.592999998480082;0
725;-741983.000000000000000;-1042939.000000000000000;0
598;-741853.000000000000000;-1043233.000000000000000;0
1725;-741536.000000000000000;-1045136.000000000000000;0
1270;-742242.000000000000000;-1044491.000000000000000;0
6827;-741437.300000000745058;-1044772.629999998956919;0
599;-741837.000000000000000;-1043243.000000000000000;0
318;-742434.000000000000000;-1044213.000000000000000;0
1617;-742384.000000000000000;-1044407.000000000000000;0
2232;-743488.000000000000000;-1045234.000000000000000;0
2233;-743461.000000000000000;-1045218.000000000000000;0
5246;-743373.739999998360872;-1043268.899999998509884;0
7986;-741040.829999998211861;-1044408.250000000000000;0
2238;-743372.000000000000000;-1045261.000000000000000;0
2253;-743250.000000000000000;-1045314.000000000000000;0
4029;-743130.695999998599291;-1043815.427999999374151;0
6823;-741313.910000000149012;-1044788.510000001639128;0
6845;-741527.188000001013279;-1044989.557000000029802;0
2223;-743053.000000000000000;-1045437.000000000000000;0
1607;-742414.000000000000000;-1044379.000000000000000;0
1037;-741958.000000000000000;-1044950.000000000000000;0
7164;-742596.114999998360872;-1044447.173000000417233;0
2514;-742546.000000000000000;-1044431.000000000000000;0
7018;-742577.747000001370907;-1044239.712999999523163;0
1621;-742467.000000000000000;-1044322.000000000000000;0
1624;-742551.000000000000000;-1044318.000000000000000;0
6568;-741292.100000001490116;-1044161.670000001788139;0
7132;-743262.120000001043081;-1044825.699999999254942;0
1776;-741200.000000000000000;-1044007.000000000000000;0
7519;-742850.620000001043081;-1045673.670000001788139;0
6561;-741307.890000000596046;-1043937.809999998658895;0
6558;-741292.800000000745058;-1044013.629999998956919;0
4331;-742391.967999998480082;-1043310.539000000804663;0
5969;-742284.809999998658895;-1044169.578000001609325;0
7514;-742304.866000000387430;-1044375.124000001698732;0
1548;-742220.000000000000000;-1044216.000000000000000;0
1424;-742134.000000000000000;-1044171.000000000000000;0
1795;-742155.000000000000000;-1044231.000000000000000;0
619;-742229.000000000000000;-1043277.000000000000000;0
4046;-743205.699999999254942;-1044009.719999998807907;0
4250;-742144.109999999403954;-1043367.519999999552965;0
736;-741880.000000000000000;-1043017.000000000000000;0
5461;-742442.704999998211861;-1043234.515000000596046;0
4332;-742410.359000001102686;-1043282.916000001132488;0
4245;-742160.210000000894070;-1043410.570000000298023;0
2257;-742956.000000000000000;-1045558.000000000000000;0
4214;-742229.274999998509884;-1043511.745000001043081;0
734;-741935.000000000000000;-1043014.000000000000000;0
1986;-743480.000000000000000;-1044794.000000000000000;0
6829;-741498.170000001788139;-1044764.809999998658895;0
2482;-741262.739999998360872;-1044725.530000001192093;0
2217;-743112.000000000000000;-1045360.000000000000000;0
2247;-743199.000000000000000;-1045400.000000000000000;0
2245;-743239.000000000000000;-1045356.000000000000000;0
4232;-742315.057999998331070;-1043428.918999999761581;0
628;-742217.370000001043081;-1043308.559999998658895;0
4989;-742648.756000000983477;-1043019.318999998271465;0
2263;-742989.000000000000000;-1045714.000000000000000;0
4024;-743223.734999999403954;-1043859.954999998211861;0
2282;-742923.000000000000000;-1045519.000000000000000;0
2332;-742899.000000000000000;-1045516.000000000000000;0
2319;-742734.000000000000000;-1045474.000000000000000;0
2321;-742679.000000000000000;-1045480.000000000000000;0
2464;-743519.000000000000000;-1044697.000000000000000;0
1967;-743405.000000000000000;-1044770.000000000000000;0
2317;-742792.000000000000000;-1045467.000000000000000;0
674;-742463.000000000000000;-1043211.000000000000000;0
1409;-741634.000000000000000;-1044170.000000000000000;0
1467;-741808.000000000000000;-1044064.000000000000000;0
281;-743045.000000000000000;-1043848.000000000000000;0
4075;-742947.934999998658895;-1043903.649999998509884;0
1198;-741636.000000000000000;-1043836.000000000000000;0
6514;-741730.449999999254942;-1044087.109999999403954;0
6606;-741654.631999999284744;-1043906.848000001162291;0
2487;-742101.000000000000000;-1044308.000000000000000;0
4074;-742943.350000001490116;-1043880.304999999701977;0
4070;-742925.285000000149012;-1043783.565000001341105;0
2043;-743471.000000000000000;-1044959.000000000000000;0
4077;-742849.614999998360872;-1043858.745000001043081;0
4067;-742913.594999998807907;-1043714.640000000596046;0
4084;-742817.504999998956919;-1043681.475000001490116;0
7197;-742570.949000000953674;-1044895.548999998718500;0
5002;-742561.190000001341105;-1042977.401999998837709;0
2030;-743400.000000000000000;-1045091.000000000000000;0
1411;-741639.480000000447035;-1044683.019999999552965;0
4972;-742479.962999999523163;-1043052.368999999016523;0
6004;-742061.723000001162291;-1043300.859999999403954;0
1541;-742026.000000000000000;-1044034.000000000000000;0
2536;-742003.000000000000000;-1044113.000000000000000;0
5998;-742019.482000000774860;-1043283.164000000804663;0
2493;-742011.000000000000000;-1044181.000000000000000;0
1432;-741958.000000000000000;-1044285.000000000000000;0
2475;-743411.000000000000000;-1044901.000000000000000;0
7934;-743545.050000000745058;-1044980.559999998658895;0
6721;-742321.052999999374151;-1044705.548000000417233;0
1837;-743015.000000000000000;-1044249.000000000000000;0
342;-742573.000000000000000;-1043878.000000000000000;0
350;-742505.000000000000000;-1043757.000000000000000;0
1396;-741798.000000000000000;-1044263.000000000000000;0
1171;-741882.000000000000000;-1044375.000000000000000;0
1941;-743267.000000000000000;-1044384.000000000000000;0
4203;-742299.442000001668930;-1043608.692000001668930;0
4151;-742573.039999999105930;-1044109.035000000149012;0
1040;-741904.000000000000000;-1044623.000000000000000;0
1025;-741989.000000000000000;-1044602.000000000000000;0
7156;-742944.515000000596046;-1044546.140000000596046;0
6662;-741466.800000000745058;-1044192.359999999403954;0
1501;-741475.000000000000000;-1044292.000000000000000;0
8067;-742257.760000001639128;-1045240.980000000447035;0
7727;-743363.892999999225140;-1044617.146000001579523;0
6952;-743044.730999998748302;-1044106.129999998956919;0
1944;-743280.000000000000000;-1044400.000000000000000;0
7094;-743370.620000001043081;-1044578.289999999105930;0
7206;-742559.920000001788139;-1045003.190000001341105;0
7091;-743361.839999999850988;-1044584.039999999105930;0
1406;-741663.000000000000000;-1044277.000000000000000;0
4130;-742868.460000000894070;-1044055.510000001639128;0
4127;-742837.324999999254942;-1044032.670000001788139;0
1830;-742961.000000000000000;-1044087.000000000000000;0
6015;-742854.607999999076128;-1043226.870999999344349;0
2398;-742150.000000000000000;-1045370.000000000000000;0
7644;-742295.089000001549721;-1045373.164999999105930;0
1698;-741464.000000000000000;-1044668.000000000000000;0
2446;-742750.000000000000000;-1044164.000000000000000;0
307;-742781.000000000000000;-1044143.000000000000000;0
331;-742664.000000000000000;-1044024.000000000000000;0
702;-741961.000000000000000;-1042885.000000000000000;0
882;-741825.000000000000000;-1042788.000000000000000;0
713;-741800.000000000000000;-1042859.000000000000000;0
1553;-741350.000000000000000;-1044268.000000000000000;0
7024;-743182.745000001043081;-1044052.815000001341105;0
4105;-742678.771999999880791;-1043769.206000000238419;0
4040;-743224.710000000894070;-1043766.050000000745058;0
524;-742255.000000000000000;-1043913.000000000000000;0
527;-742186.000000000000000;-1043818.000000000000000;0
3975;-743112.984999999403954;-1043716.375999998301268;0
6488;-741718.210000000894070;-1044532.489999998360872;0
203;-743204.000000000000000;-1043607.000000000000000;0
4427;-742190.519999999552965;-1043099.440000001341105;0
6104;-742208.646999999880791;-1043103.999000001698732;0
3795;-743173.190000001341105;-1042842.170000001788139;0
3750;-743221.379999998956919;-1042925.429999999701977;0
3759;-743267.609999999403954;-1042971.300000000745058;0
1238;-742150.000000000000000;-1044384.000000000000000;0
210;-743112.000000000000000;-1043566.000000000000000;0
1287;-742217.000000000000000;-1044486.000000000000000;0
1291;-742205.000000000000000;-1044568.000000000000000;0
1015;-742126.000000000000000;-1044599.000000000000000;0
6339;-742245.460000000894070;-1042835.780000001192093;0
1584;-742368.000000000000000;-1044717.000000000000000;0
4167;-742438.315000001341105;-1044021.960000000894070;0
591;-741912.000000000000000;-1043346.000000000000000;0
1092;-741549.000000000000000;-1044556.000000000000000;0
7539;-742682.600000001490116;-1045366.339999999850988;0
1674;-741099.000000000000000;-1044736.000000000000000;0
2086;-742404.000000000000000;-1044796.000000000000000;0
4173;-742756.320000000298023;-1043749.629999998956919;0
1454;-741521.000000000000000;-1044499.000000000000000;0
8283;-742198.600000001490116;-1042801.980000000447035;0
4459;-742274.829999998211861;-1042644.269999999552965;0
1390;-742129.000000000000000;-1045069.000000000000000;0
1266;-742052.000000000000000;-1044980.000000000000000;0
2562;-741090.000000000000000;-1044404.000000000000000;0
1042;-741883.000000000000000;-1044682.000000000000000;0
1303;-741865.000000000000000;-1044692.000000000000000;0
1592;-742378.000000000000000;-1044936.000000000000000;0
6686;-742381.967000000178814;-1044961.747000001370907;0
3768;-743006.370000001043081;-1042978.829999998211861;0
352;-742386.000000000000000;-1043914.000000000000000;0
5316;-743075.980000000447035;-1043041.059999998658895;0
4826;-743043.850000001490116;-1042979.600000001490116;0
1123;-741734.000000000000000;-1044442.000000000000000;0
6810;-741106.350999999791384;-1044631.888999998569489;0
5195;-743232.432999998331070;-1043297.890999998897314;0
2326;-742523.000000000000000;-1045498.000000000000000;0
985;-741823.000000000000000;-1044444.000000000000000;0
2376;-742411.000000000000000;-1045554.000000000000000;0
7961;-741602.260000001639128;-1044314.350000001490116;0
1457;-741510.000000000000000;-1044411.000000000000000;0
4002;-743397.818999998271465;-1044054.317999999970198;0
542;-742367.629999998956919;-1043814.379999998956919;0
3988;-743309.704999998211861;-1044008.570000000298023;0
7036;-743316.204999998211861;-1044198.315000001341105;0
1057;-741686.000000000000000;-1045058.000000000000000;0
5117;-742816.081999998539686;-1043298.302999999374151;0
2409;-742363.000000000000000;-1045093.000000000000000;0
4005;-743325.977000001817942;-1044053.392999999225140;0
381;-742465.000000000000000;-1043700.000000000000000;0
7734;-741656.309000000357628;-1044953.727000001817942;0
1418;-741620.000000000000000;-1044458.000000000000000;0
5227;-743318.199999999254942;-1043537.510000001639128;0
226;-742879.000000000000000;-1043516.000000000000000;0
3869;-742407.539999999105930;-1042414.850000001490116;0
5163;-743163.861999999731779;-1043392.113000001758337;0
798;-741797.000000000000000;-1042590.000000000000000;0
792;-741718.000000000000000;-1042599.000000000000000;0
4455;-741714.589000001549721;-1042663.557000000029802;0
872;-741698.000000000000000;-1042669.000000000000000;0
5776;-742933.609000001102686;-1043433.765999998897314;0
3836;-743096.070000000298023;-1042561.879999998956919;0
3838;-743113.550000000745058;-1042543.399999998509884;0
8018;-741974.039999999105930;-1044442.870000001043081;0
8263;-742151.089999999850988;-1042702.239999998360872;0
5121;-742889.114000000059605;-1043362.250000000000000;0
3944;-743390.002000000327826;-1043413.532999999821186;0
2575;-742484.000000000000000;-1045453.000000000000000;0
3992;-743365.899999998509884;-1043881.385000001639128;0
1929;-743440.000000000000000;-1044410.000000000000000;0
5210;-743253.673999998718500;-1043370.440999999642372;0
7981;-741126.370000001043081;-1044401.239999998360872;0
6769;-741281.120000001043081;-1044417.780000001192093;0
1313;-741681.000000000000000;-1044849.000000000000000;0
532;-742114.000000000000000;-1043737.000000000000000;0
5176;-743321.252999998629093;-1043447.495000001043081;0
3793;-743101.820000000298023;-1042826.379999998956919;0
5128;-743040.467000000178814;-1043389.765999998897314;0
8244;-742617.899999998509884;-1045206.480000000447035;0
2479;-741247.800000000745058;-1044609.379999998956919;0
1878;-743324.000000000000000;-1044249.000000000000000;0
7048;-743392.429999999701977;-1044236.170000001788139;0
1310;-741623.000000000000000;-1044829.000000000000000;0
1309;-741611.000000000000000;-1044813.000000000000000;0
3999;-743412.539999999105930;-1043918.725000001490116;0
3994;-743394.864000000059605;-1043949.813999999314547;0
1596;-742323.000000000000000;-1045037.000000000000000;0
4770;-742872.535000000149012;-1042899.679000001400709;0
4709;-742775.800000000745058;-1042600.690000001341105;0
4653;-742788.747999999672174;-1042524.557000000029802;0
547;-742316.910000000149012;-1043790.309999998658895;0
4529;-742762.920000001788139;-1042885.809999998658895;0
1248;-742109.000000000000000;-1044631.000000000000000;0
4772;-742879.881999999284744;-1042872.157000001519918;0
1871;-743440.000000000000000;-1044260.000000000000000;0
4767;-742786.899999998509884;-1042835.736000001430511;0
6979;-743081.460000000894070;-1044413.079999998211861;0
6980;-743071.769999999552965;-1044387.548999998718500;0
3794;-743091.015000000596046;-1042800.471999999135733;0
4729;-742855.690000001341105;-1042695.640000000596046;0
4741;-742787.859999999403954;-1042715.800000000745058;0
2574;-742481.000000000000000;-1045423.000000000000000;0
1909;-743446.000000000000000;-1044375.000000000000000;0
8055;-742223.859999999403954;-1045007.899999998509884;0
8050;-742206.719999998807907;-1044915.530000001192093;0
6478;-741931.429999999701977;-1044453.500000000000000;0
3819;-743120.250000000000000;-1042679.620000001043081;0
1587;-742372.000000000000000;-1044806.000000000000000;0
1252;-742096.000000000000000;-1044711.000000000000000;0
1258;-742076.000000000000000;-1044837.000000000000000;0
4257;-742056.467000000178814;-1043503.657999999821186;0
579;-742006.000000000000000;-1043477.000000000000000;0
2556;-741376.000000000000000;-1044379.000000000000000;0
6694;-742280.806000001728535;-1044814.875999998301268;0
1376;-742165.000000000000000;-1044873.000000000000000;0
1257;-742070.000000000000000;-1044815.000000000000000;0
1098;-741435.000000000000000;-1044571.000000000000000;0
6096;-742098.760000001639128;-1043615.589999999850988;0
4504;-742387.329999998211861;-1042714.820000000298023;0
1145;-741386.000000000000000;-1044461.000000000000000;0
1046;-741838.000000000000000;-1044805.000000000000000;0
1316;-741765.000000000000000;-1044903.000000000000000;0
6977;-743098.949999999254942;-1044459.879999998956919;0
346;-742540.000000000000000;-1043816.000000000000000;0
6399;-742013.379999998956919;-1042502.739999998360872;0
7694;-742486.548999998718500;-1045129.752000000327826;0
7019;-742585.024999998509884;-1044210.725000001490116;0
4503;-742402.579999998211861;-1042702.839999999850988;0
559;-742191.000000000000000;-1043693.000000000000000;0
2304;-742442.000000000000000;-1045429.000000000000000;0
1165;-741037.420000001788139;-1044506.500000000000000;0
877;-741951.000000000000000;-1042610.000000000000000;0
1153;-741245.000000000000000;-1044480.000000000000000;0
1030;-741975.000000000000000;-1044753.000000000000000;0
1356;-741916.000000000000000;-1044874.000000000000000;0
1318;-741838.000000000000000;-1044940.000000000000000;0
3833;-743029.679999999701977;-1042612.300000000745058;0
6706;-742275.234999999403954;-1044689.607999999076128;0
1108;-741261.000000000000000;-1044593.000000000000000;0
3830;-743013.879999998956919;-1042612.359999999403954;0
4583;-742401.482999999076128;-1042625.886999998241663;0
8277;-742111.260000001639128;-1042746.399999998509884;0
6360;-742004.925000000745058;-1042692.804000001400709;0
842;-742101.000000000000000;-1042521.000000000000000;0
4849;-742966.960000000894070;-1042893.583999998867512;0
4927;-742447.969999998807907;-1042874.710000000894070;0
4814;-743000.489999998360872;-1042803.920000001788139;0
4846;-742981.635999999940395;-1042805.254000000655651;0
4959;-742331.289999999105930;-1043002.690000001341105;0
4704;-742680.000000000000000;-1042776.750000000000000;0
4786;-742953.361000001430511;-1042655.886999998241663;0
4519;-742665.160000000149012;-1042790.820000000298023;0
1911;-743449.000000000000000;-1044447.000000000000000;0
4899;-742534.420000001788139;-1042820.899999998509884;0
4632;-742615.638999998569489;-1042624.039999999105930;0
574;-742068.000000000000000;-1043538.000000000000000;0
4589;-742408.243000000715256;-1042542.631999999284744;0
4570;-742347.760000001639128;-1042540.809999998658895;0
6357;-741947.870000001043081;-1042701.129999998956919;0
4198;-742192.445000000298023;-1043760.521000001579523;0
6995;-743129.710000000894070;-1044496.579999998211861;0
4527;-742728.050000000745058;-1042838.719999998807907;0
4723;-742883.429999999701977;-1042644.829999998211861;0
691;-742293.000000000000000;-1043097.000000000000000;0
4900;-742508.089999999850988;-1042815.289999999105930;0
4465;-742180.250000000000000;-1042584.370000001043081;0
4584;-742417.721999999135733;-1042627.620999999344349;0
5143;-743052.232000000774860;-1043454.120000001043081;0
4893;-742637.320000000298023;-1042818.600999999791384;0
3829;-742992.250000000000000;-1042635.140000000596046;0
4608;-742555.160999998450279;-1042637.633999999612570;0
1353;-741862.000000000000000;-1044843.000000000000000;0
5412;-742582.037000000476837;-1042571.986000001430511;0
1445;-741553.000000000000000;-1044757.000000000000000;0
4897;-742560.320000000298023;-1042829.359999999403954;0
4587;-742482.011999998241663;-1042641.392999999225140;0
6374;-741977.035000000149012;-1042674.153999999165535;0
5766;-742429.719999998807907;-1042597.699999999254942;0
4799;-743008.011999998241663;-1042697.245999999344349;0
314;-742585.000000000000000;-1044184.000000000000000;0
6974;-743127.620000001043081;-1044518.800000000745058;0
4890;-742605.287000000476837;-1042838.535000000149012;0
3953;-743407.249000001698732;-1043543.537000000476837;0
7348;-742537.370000001043081;-1045173.839999999850988;0
6293;-742666.339999999850988;-1042695.188999999314547;0
1161;-741106.550000000745058;-1044497.769999999552965;0
6387;-742159.980000000447035;-1042496.210000000894070;0
4565;-742462.576999999582767;-1042533.901999998837709;0
4464;-742182.309999998658895;-1042571.379999998956919;0
5958;-742962.513999998569489;-1043517.497999999672174;0
6261;-742373.956999998539686;-1043022.041999999433756;0
5957;-742962.627000000327826;-1043510.905000001192093;0
5959;-742962.548999998718500;-1043523.155000001192093;0
5681;-743400.820000000298023;-1043718.682000000029802;0
5730;-743418.855999998748302;-1043638.949000000953674;0
5579;-743409.682999998331070;-1043634.574999999254942;0
5712;-743423.701000001281500;-1043638.675999999046326;0
5690;-743415.532999999821186;-1043635.447000000625849;0
5665;-743419.725000001490116;-1043711.682000000029802;0
5658;-743428.059999998658895;-1043708.153000000864267;0
5687;-743415.142000000923872;-1043630.285999998450279;0
5691;-743415.714000001549721;-1043637.241000000387430;0
5583;-743410.274999998509884;-1043642.072000000625849;0
5657;-743429.199999999254942;-1043706.837999999523163;0
5663;-743422.087999999523163;-1043710.807999998331070;0
5717;-743422.208999998867512;-1043629.984000001102686;0
5727;-743422.451999999582767;-1043637.473000001162291;0
5598;-743412.839999999850988;-1043680.403000000864267;0
5656;-743429.752999998629093;-1043705.570000000298023;0
5593;-743418.921000000089407;-1043679.927999999374151;0
5729;-743420.103000000119209;-1043638.901000000536442;0
5721;-743418.407999999821186;-1043631.800000000745058;0
5641;-743428.517000000923872;-1043687.460000000894070;0
5720;-743418.223000001162291;-1043629.960999999195337;0
5676;-743406.725999999791384;-1043716.493000000715256;0
5647;-743429.070999998599291;-1043694.699000000953674;0
5719;-743419.508999999612570;-1043629.817999999970198;0
5724;-743422.230999998748302;-1043632.715999998152256;0
5689;-743415.442000001668930;-1043633.646000001579523;0
5588;-743425.002000000327826;-1043679.451999999582767;0
6258;-742382.381999999284744;-1043032.370999999344349;0
5637;-743428.151000000536442;-1043682.633999999612570;0
5653;-743429.589999999850988;-1043701.940999999642372;0
6256;-742380.723000001162291;-1043035.640000000596046;0
5667;-743417.361999999731779;-1043712.557000000029802;0
6183;-742316.633999999612570;-1043065.732000000774860;0
6195;-742314.956000000238419;-1043061.181000001728535;0
6151;-742311.114999998360872;-1043061.451000001281500;0
6180;-742311.429000001400709;-1043057.635999999940395;0
6212;-742317.006000000983477;-1043061.888000000268221;0
6232;-742316.034000001847744;-1043057.000000000000000;0
6170;-742311.548000000417233;-1043059.381000000983477;0
6191;-742318.017000000923872;-1043066.800999999046326;0
6205;-742314.800000000745058;-1043059.416999999433756;0
6141;-742311.243999999016523;-1043063.195999998599291;0
6150;-742311.879999998956919;-1043062.857000000774860;0
6165;-742315.407000001519918;-1043066.436000000685453;0
6208;-742320.098000001162291;-1043067.458999998867512;0
6222;-742316.855000000447035;-1043060.109999999403954;0
6220;-742318.432999998331070;-1043062.949999999254942;0
6219;-742319.168999999761581;-1043064.293999999761581;0
6156;-742314.791999999433756;-1043066.736000001430511;0
6176;-742314.491000000387430;-1043063.256000000983477;0
6175;-742315.256999999284744;-1043064.660999998450279;0
6223;-742316.076000001281500;-1043058.679000001400709;0
6177;-742313.717999998480082;-1043061.859999999403954;0
6159;-742312.495999999344349;-1043062.521000001579523;0
6172;-742317.552999999374151;-1043068.875999998301268;0
5514;-743426.903000000864267;-1043609.252999998629093;0
6136;-742315.081999998539686;-1043070.210000000894070;0
6200;-742318.653999999165535;-1043066.462000001221895;0
6125;-743428.124000001698732;-1043615.223999999463558;0
6215;-742314.692000001668930;-1043057.682000000029802;0
6152;-742310.348999999463558;-1043060.046999998390675;0
