OID_;X;Y;TEMPERATURE
5786;-743456.410000000149012;-1042105.250000000000000;0
7911;-743564.839999999850988;-1045408.649999998509884;0
7;-743479.000000000000000;-1042567.000000000000000;155
7777;-743079.782999999821186;-1045794.026000000536442;0
2473;-743469.000000000000000;-1044899.000000000000000;0
7277;-742796.870000001043081;-1044653.429999999701977;0
2083;-742588.000000000000000;-1044663.000000000000000;0
4073;-742939.109999999403954;-1043858.504999998956919;0
540;-742144.000000000000000;-1043804.000000000000000;0
5996;-742061.879000000655651;-1043284.276999998837709;0
7515;-742273.021999999880791;-1044371.543999999761581;0
7022;-743155.660000000149012;-1044074.410000000149012;0
510;-742048.000000000000000;-1043150.000000000000000;373
2256;-743156.000000000000000;-1045353.000000000000000;0
2809;-744090.649999998509884;-1043371.184000000357628;0
3537;-744632.945000000298023;-1042671.657000001519918;0
2097;-743143.000000000000000;-1044742.000000000000000;0
4004;-743345.877000000327826;-1044053.135999999940395;0
3919;-743904.947000000625849;-1043493.929999999701977;0
2189;-743472.000000000000000;-1045183.000000000000000;0
3579;-744924.442999999970198;-1042569.135000001639128;0
2482;-741262.739999998360872;-1044725.530000001192093;0
3209;-743668.293999999761581;-1042492.478999998420477;0
2314;-742884.000000000000000;-1045456.000000000000000;0
2321;-742679.000000000000000;-1045480.000000000000000;0
2328;-742459.000000000000000;-1045505.000000000000000;0
4029;-743130.695999998599291;-1043815.427999999374151;0
7519;-742850.620000001043081;-1045673.670000001788139;0
2159;-742822.000000000000000;-1045141.000000000000000;0
2301;-742533.000000000000000;-1045416.000000000000000;0
7247;-742774.480000000447035;-1044839.850000001490116;0
6574;-741292.359999999403954;-1044067.620000001043081;0
6040;-742075.469999998807907;-1043676.809999998658895;0
7822;-743543.072000000625849;-1045082.980000000447035;0
1875;-743367.000000000000000;-1044261.000000000000000;0
4590;-742387.043000001460314;-1042535.971000000834465;0
2024;-743305.000000000000000;-1045000.000000000000000;0
3842;-743141.300000000745058;-1042637.030000001192093;0
3148;-744008.699000000953674;-1042624.668999999761581;0
4333;-742428.420000001788139;-1043255.609999999403954;0
1349;-741824.000000000000000;-1044818.000000000000000;0
1961;-743397.000000000000000;-1044642.000000000000000;0
6706;-742275.234999999403954;-1044689.607999999076128;0
1432;-741958.000000000000000;-1044285.000000000000000;0
8283;-742198.600000001490116;-1042801.980000000447035;0
4461;-742218.370000001043081;-1042583.800000000745058;0
3886;-742385.100000001490116;-1042445.500000000000000;0
6870;-741708.260000001639128;-1045321.590999998152256;0
2535;-742042.000000000000000;-1044071.000000000000000;0
2260;-743019.000000000000000;-1045622.000000000000000;0
3752;-743213.949999999254942;-1042902.719999998807907;0
7025;-743199.914999999105930;-1044070.515000000596046;0
1557;-741193.000000000000000;-1044306.000000000000000;0
7704;-742256.021000001579523;-1044313.592999998480082;0
1325;-741894.000000000000000;-1044959.000000000000000;0
7148;-742828.445000000298023;-1044472.094999998807907;0
3096;-743906.309999998658895;-1042750.539999999105930;0
3838;-743113.550000000745058;-1042543.399999998509884;0
1854;-742675.000000000000000;-1044271.000000000000000;0
2061;-742681.000000000000000;-1044491.000000000000000;0
1427;-742017.000000000000000;-1044256.000000000000000;0
4811;-743040.379999998956919;-1042799.609999999403954;0
1453;-741525.000000000000000;-1044529.000000000000000;0
4837;-742979.105999998748302;-1042672.627999998629093;0
1912;-743461.000000000000000;-1044430.000000000000000;0
6580;-741299.379000000655651;-1044005.879000000655651;0
1468;-741778.000000000000000;-1044082.000000000000000;0
7038;-743316.394999999552965;-1044240.155000001192093;0
4951;-742335.579999998211861;-1042934.429999999701977;0
4178;-742382.640000000596046;-1044160.138000000268221;0
3019;-744463.447999998927116;-1042784.646000001579523;0
1253;-742084.000000000000000;-1044730.000000000000000;0
7801;-742459.168999999761581;-1044490.660000000149012;0
3718;-744739.026999998837709;-1042368.383000001311302;0
2039;-743308.000000000000000;-1044808.000000000000000;0
2224;-743051.000000000000000;-1045450.000000000000000;0
1196;-741677.000000000000000;-1043894.000000000000000;0
226;-742879.000000000000000;-1043516.000000000000000;0
1795;-742155.000000000000000;-1044231.000000000000000;0
4824;-742918.673000000417233;-1042871.875000000000000;0
1729;-741449.000000000000000;-1045068.000000000000000;0
1305;-741826.000000000000000;-1044678.000000000000000;0
3280;-743624.243999999016523;-1042811.839999999850988;0
7351;-742529.339999999850988;-1045181.269999999552965;0
1465;-741870.000000000000000;-1044016.000000000000000;0
1034;-741964.000000000000000;-1044876.000000000000000;0
2253;-743250.000000000000000;-1045314.000000000000000;0
4925;-742455.502000000327826;-1042923.307000000029802;0
6499;-741707.811000000685453;-1044907.068999998271465;0
7538;-742701.420000001788139;-1045364.109999999403954;0
314;-742585.000000000000000;-1044184.000000000000000;0
4238;-742440.263000000268221;-1043528.236000001430511;0
1533;-741832.000000000000000;-1043879.000000000000000;0
1383;-742077.000000000000000;-1045046.000000000000000;0
6823;-741313.910000000149012;-1044788.510000001639128;0
6232;-742316.034000001847744;-1043057.000000000000000;0
8069;-742226.440000001341105;-1045255.949999999254942;0
2356;-742409.000000000000000;-1045589.000000000000000;0
6829;-741498.170000001788139;-1044764.809999998658895;0
208;-743146.000000000000000;-1043573.000000000000000;0
3811;-743244.620000001043081;-1042809.420000001788139;0
2084;-742447.000000000000000;-1044797.000000000000000;0
5171;-743266.124000001698732;-1043419.293999999761581;0
596;-741867.000000000000000;-1043259.000000000000000;0
728;-741997.000000000000000;-1042918.000000000000000;0
4506;-742419.730000000447035;-1042717.019999999552965;0
1296;-742100.000000000000000;-1044473.000000000000000;0
5306;-743103.326999999582767;-1043193.129000000655651;0
5118;-742835.168000001460314;-1043315.074000000953674;0
3063;-744133.098999999463558;-1042851.478999998420477;0
4860;-742964.800999999046326;-1043016.107999999076128;0
5956;-742960.690999999642372;-1043513.846999999135733;0
1620;-742439.000000000000000;-1044323.000000000000000;0
5135;-742979.611000001430511;-1043468.912999998778105;0
1413;-741631.000000000000000;-1044621.000000000000000;0
3960;-743418.563000001013279;-1043583.526000000536442;0
5062;-742798.513999998569489;-1043227.370999999344349;0
541;-742258.000000000000000;-1043678.000000000000000;149
876;-741953.000000000000000;-1042636.000000000000000;0
4651;-742756.375000000000000;-1042524.938000001013279;0
1954;-743372.000000000000000;-1044497.000000000000000;0
5235;-743350.096000000834465;-1043388.881000000983477;0
3371;-743840.392999999225140;-1043010.835000000894070;0
1346;-741769.000000000000000;-1044817.000000000000000;0
6395;-742057.429999999701977;-1042500.809999998658895;0
4159;-742455.734999999403954;-1043898.035000000149012;0
6857;-741503.982999999076128;-1044930.340999998152256;0
3844;-743184.170000001788139;-1042586.949999999254942;0
1591;-742378.000000000000000;-1044910.000000000000000;0
4692;-742681.477000001817942;-1042600.622000001370907;0
1614;-742388.000000000000000;-1044432.000000000000000;0
4221;-742209.576000001281500;-1043499.238000001758337;0
7261;-742970.839999999850988;-1044878.739999998360872;0
450;-741705.000000000000000;-1043312.000000000000000;0
5446;-743190.850000001490116;-1043337.008999999612570;0
4071;-742929.394999999552965;-1043807.585000000894070;0
7959;-741699.170000001788139;-1044292.620000001043081;0
3761;-743202.559999998658895;-1042981.710000000894070;0
8265;-742197.820000000298023;-1042704.260000001639128;0
1101;-741339.000000000000000;-1044568.000000000000000;0
3262;-743572.423999998718500;-1042699.197000000625849;0
4897;-742560.320000000298023;-1042829.359999999403954;0
3456;-745096.247000001370907;-1042705.502999998629093;0
4170;-742407.245000001043081;-1043945.519999999552965;0
568;-742116.000000000000000;-1043604.000000000000000;0
5112;-742942.920000001788139;-1043441.850000001490116;0
5456;-742761.041000001132488;-1043254.350999999791384;0
7647;-742319.918000001460314;-1045405.197999998927116;0
6663;-741457.949999999254942;-1044194.329999998211861;0
2317;-742792.000000000000000;-1045467.000000000000000;0
4962;-742387.429999999701977;-1043028.129999998956919;0
3134;-743932.910999998450279;-1042615.767999999225140;0
5002;-742561.190000001341105;-1042977.401999998837709;0
1123;-741734.000000000000000;-1044442.000000000000000;0
1903;-743445.000000000000000;-1044281.000000000000000;0
8065;-742275.859999999403954;-1045204.550000000745058;0
2307;-742371.000000000000000;-1045477.000000000000000;0
6650;-741714.296999998390675;-1044110.177000001072884;0
1213;-742068.000000000000000;-1044387.000000000000000;0
6961;-743023.579999998211861;-1044221.129999998956919;0
276;-743382.000000000000000;-1043905.000000000000000;0
4331;-742391.967999998480082;-1043310.539000000804663;0
8261;-742108.039999999105930;-1042693.769999999552965;0
7356;-743331.410000000149012;-1045146.359999999403954;0
5307;-743082.182000000029802;-1043190.162000000476837;0
3233;-744152.962999999523163;-1042686.791999999433756;0
679;-742404.000000000000000;-1043185.000000000000000;0
6727;-742522.868000000715256;-1044395.879999998956919;0
2566;-741010.000000000000000;-1044427.000000000000000;0
690;-742306.000000000000000;-1043081.000000000000000;0
6314;-743939.670000001788139;-1042606.239999998360872;0
1662;-741451.000000000000000;-1044403.000000000000000;0
516;-742160.000000000000000;-1043135.000000000000000;0
614;-742111.000000000000000;-1043271.000000000000000;0
6836;-741643.532000001519918;-1044947.486999999731779;0
708;-741854.000000000000000;-1042881.000000000000000;0
3793;-743101.820000000298023;-1042826.379999998956919;0
7295;-743165.010000001639128;-1044947.170000001788139;0
4675;-742805.809999998658895;-1042785.070000000298023;0
673;-742467.000000000000000;-1043230.000000000000000;0
1840;-742984.379999998956919;-1044155.149999998509884;0
6008;-743902.607000000774860;-1042749.771000001579523;0
734;-741935.000000000000000;-1043014.000000000000000;0
4669;-742823.199999999254942;-1042658.309999998658895;0
1723;-741611.000000000000000;-1045092.000000000000000;0
7980;-741198.179999999701977;-1044410.339999999850988;0
3568;-744718.817999999970198;-1042588.614999998360872;0
4806;-743138.429999999701977;-1042771.350000001490116;0
6946;-742974.765000000596046;-1043929.388000000268221;0
4115;-742757.210000000894070;-1044109.620000001043081;0
525;-742233.000000000000000;-1043884.000000000000000;0
6095;-742082.920000001788139;-1043614.710000000894070;0
1697;-741495.000000000000000;-1044664.000000000000000;0
7199;-742570.910000000149012;-1044916.410000000149012;0
4789;-742979.506000000983477;-1042555.324999999254942;0
747;-741690.000000000000000;-1043000.000000000000000;0
3360;-743950.688000001013279;-1042982.188000001013279;0
2393;-742054.000000000000000;-1045282.000000000000000;0
4174;-742738.230000000447035;-1043763.155000001192093;0
4426;-742197.589999999850988;-1043031.679999999701977;0
1657;-741399.000000000000000;-1044717.000000000000000;0
1765;-741159.000000000000000;-1044178.000000000000000;0
2150;-742812.000000000000000;-1045054.000000000000000;0
7242;-742691.750000000000000;-1044821.769999999552965;0
1942;-743283.000000000000000;-1044370.000000000000000;0
4679;-742774.199999999254942;-1042819.160000000149012;0
6806;-741090.381000000983477;-1044706.675999999046326;0
578;-742023.000000000000000;-1043464.000000000000000;0
8081;-741974.019999999552965;-1045331.530000001192093;0
3959;-743417.421999998390675;-1043577.730000000447035;0
1443;-741727.000000000000000;-1044386.000000000000000;0
6707;-742271.293999999761581;-1044721.274999998509884;0
6161;-742310.964999999850988;-1043059.710999999195337;0
701;-742023.000000000000000;-1042885.000000000000000;0
2631;-743269.129999998956919;-1042334.879000000655651;0
1409;-741634.000000000000000;-1044170.000000000000000;0
6218;-742319.947000000625849;-1043065.767999999225140;0
3992;-743365.899999998509884;-1043881.385000001639128;0
8052;-742218.929999999701977;-1044953.719999998807907;0
1105;-741274.000000000000000;-1044576.000000000000000;0
1422;-742199.000000000000000;-1044127.000000000000000;0
5066;-742827.379000000655651;-1043252.267999999225140;0
389;-742408.000000000000000;-1043783.000000000000000;0
4080;-742832.480000000447035;-1043782.030000001192093;0
6977;-743098.949999999254942;-1044459.879999998956919;0
680;-742402.109999999403954;-1043166.679999999701977;0
1522;-741841.000000000000000;-1043893.000000000000000;0
1251;-742091.000000000000000;-1044690.000000000000000;0
547;-742316.910000000149012;-1043790.309999998658895;0
5157;-743178.671999998390675;-1043354.681000001728535;0
3703;-744551.563999999314547;-1042514.760999999940395;0
4142;-742777.425000000745058;-1044013.440000001341105;0
4659;-742803.311000000685453;-1042470.754999998956919;0
6245;-742369.682000000029802;-1043057.377000000327826;0
7146;-742819.425000000745058;-1044426.225000001490116;0
1419;-741603.000000000000000;-1044410.000000000000000;0
1013;-742076.000000000000000;-1044595.000000000000000;0
5246;-743373.739999998360872;-1043268.899999998509884;0
5229;-743327.379999998956919;-1043528.620000001043081;0
5222;-743271.000000000000000;-1043543.149999998509884;0
8149;-743305.579999998211861;-1043204.070000000298023;0
3302;-743795.043999999761581;-1042863.539000000804663;0
8060;-742295.719999998807907;-1045082.859999999403954;0
5504;-743428.977000001817942;-1043686.274000000208616;0
1552;-741351.000000000000000;-1044295.000000000000000;0
3370;-743858.489999998360872;-1043011.370999999344349;0
2459;-741022.000000000000000;-1044591.000000000000000;0
2030;-743400.000000000000000;-1045091.000000000000000;0
3762;-743173.489999998360872;-1042984.559999998658895;0
5700;-743416.574000000953674;-1043630.223999999463558;0
1968;-743397.000000000000000;-1044793.000000000000000;0
1411;-741639.480000000447035;-1044683.019999999552965;0
1492;-741096.000000000000000;-1044331.000000000000000;0
6139;-742312.807000000029802;-1043066.006000000983477;0
2304;-742442.000000000000000;-1045429.000000000000000;0
4779;-742917.822999998927116;-1042727.385000001639128;0
4056;-743125.315000001341105;-1043671.969999998807907;0
406;-742366.000000000000000;-1044171.000000000000000;0
4089;-742812.844999998807907;-1043560.114999998360872;0
6702;-742291.596999999135733;-1044564.116999998688698;687
5316;-743075.980000000447035;-1043041.059999998658895;0
5580;-743409.831000000238419;-1043636.449000000953674;0
6500;-741697.967999998480082;-1044926.364999998360872;0
4455;-741714.589000001549721;-1042663.557000000029802;0
7698;-742389.168000001460314;-1044818.684000000357628;0
330;-742659.000000000000000;-1044043.000000000000000;0
6560;-741301.682000000029802;-1043959.640000000596046;0
4745;-742840.800000000745058;-1042742.120000001043081;0
617;-742179.000000000000000;-1043272.000000000000000;0
2091;-742920.000000000000000;-1044593.000000000000000;0
6354;-741928.410000000149012;-1042711.350000001490116;0
2082;-742569.000000000000000;-1044642.000000000000000;0
6177;-742313.717999998480082;-1043061.859999999403954;0
4888;-742649.925999999046326;-1042830.767000000923872;0
4597;-742620.600000001490116;-1042680.690000001341105;0
1500;-741441.000000000000000;-1044299.000000000000000;0
7188;-742583.839999999850988;-1044742.870000001043081;0
1131;-741643.000000000000000;-1044433.000000000000000;0
6000;-741980.750000000000000;-1043285.629999998956919;0
4241;-742225.929999999701977;-1043394.530000001192093;0
7696;-742416.806000001728535;-1045134.280000001192093;0
1028;-741981.000000000000000;-1044692.000000000000000;0
5282;-743037.090999998152256;-1043297.587999999523163;0
7047;-743395.495000001043081;-1044210.765000000596046;0
639;-741958.000000000000000;-1043294.000000000000000;0
2494;-741985.000000000000000;-1044165.000000000000000;0
4578;-742381.817000001668930;-1042594.177999999374151;0
5369;-742583.364999998360872;-1042976.820999998599291;0
1852;-742739.000000000000000;-1044210.000000000000000;0
1933;-743329.000000000000000;-1044407.000000000000000;0
1818;-743046.000000000000000;-1044380.000000000000000;0
4510;-742483.149999998509884;-1042738.460000000894070;0
4987;-742641.745000001043081;-1043011.309999998658895;0
4782;-742938.315999999642372;-1042714.212000001221895;0
4031;-743135.774000000208616;-1043769.622000001370907;0
3338;-743968.458999998867512;-1043042.706999998539686;0
265;-743344.000000000000000;-1043735.000000000000000;0
4788;-742970.409000001847744;-1042588.238000001758337;0
4232;-742315.057999998331070;-1043428.918999999761581;0
380;-742501.000000000000000;-1043722.000000000000000;0
5228;-743334.289999999105930;-1043545.039999999105930;0
5651;-743429.440999999642372;-1043699.524999998509884;0
2168;-743025.000000000000000;-1045134.000000000000000;0
7315;-742603.960000000894070;-1045022.870000001043081;0
6185;-742315.103999998420477;-1043062.923000000417233;0
4145;-742687.109999999403954;-1043837.125000000000000;0
6414;-743703.410999998450279;-1042881.958000000566244;0
4251;-742136.420000001788139;-1043379.969999998807907;0
6200;-742318.653999999165535;-1043066.462000001221895;0
2128;-743170.000000000000000;-1045080.000000000000000;0
6387;-742159.980000000447035;-1042496.210000000894070;0
1663;-741455.000000000000000;-1044433.000000000000000;0
7089;-743344.149999998509884;-1044558.530000001192093;0
2397;-742181.000000000000000;-1045368.000000000000000;0
4660;-742801.596999999135733;-1042487.965999998152256;0
7957;-741692.839999999850988;-1044277.559999998658895;0
4998;-742514.109000001102686;-1042978.602000001817942;0
1447;-741541.000000000000000;-1044744.000000000000000;0
6810;-741106.350999999791384;-1044631.888999998569489;0
1790;-742152.000000000000000;-1044138.000000000000000;0
4667;-742823.039999999105930;-1042631.620000001043081;0
4208;-742372.416999999433756;-1043503.423000000417233;0
1240;-742145.000000000000000;-1044418.000000000000000;0
6825;-741380.010000001639128;-1044780.089999999850988;0
184;-743445.000000000000000;-1043450.000000000000000;0
2361;-742323.000000000000000;-1045576.000000000000000;0
5146;-743064.554000001400709;-1043452.671999998390675;0
505;-741917.000000000000000;-1043153.000000000000000;400
5022;-742578.440000001341105;-1042849.350000001490116;0
6695;-742306.234000001102686;-1044816.138999998569489;0
7021;-743129.019999999552965;-1044076.230000000447035;0
3806;-743010.089999999850988;-1042912.410000000149012;0
1973;-743394.000000000000000;-1044931.000000000000000;0
4076;-742855.589999999850988;-1043882.670000001788139;0
2544;-741753.000000000000000;-1044252.000000000000000;0
2451;-742884.000000000000000;-1044134.000000000000000;0
6819;-741194.784000001847744;-1044802.818999998271465;0
6267;-742344.767999999225140;-1043019.272999998182058;0
4769;-742881.932000000029802;-1042923.590999998152256;0
5645;-743428.886999998241663;-1043692.285999998450279;0
1178;-741952.000000000000000;-1044311.000000000000000;0
5599;-743411.622999999672174;-1043680.499000001698732;0
6716;-742256.467000000178814;-1044966.368000000715256;0
6142;-742310.477000001817942;-1043061.813000001013279;0
983;-741953.000000000000000;-1044414.000000000000000;49
4054;-743269.304999999701977;-1043797.405000001192093;0
1619;-742426.000000000000000;-1044401.000000000000000;0
4072;-742934.225000001490116;-1043833.899999998509884;0
4625;-742594.258000001311302;-1042576.114000000059605;0
711;-741828.000000000000000;-1042860.000000000000000;0
4838;-742981.304999999701977;-1042697.471000000834465;0
2464;-743519.000000000000000;-1044697.000000000000000;0
4212;-742205.245000001043081;-1043548.410000000149012;0
4680;-742759.370000001043081;-1042864.140000000596046;0
6514;-741730.449999999254942;-1044087.109999999403954;0
4148;-742631.269999999552965;-1043885.870000001043081;0
1254;-742090.000000000000000;-1044750.000000000000000;0
6448;-744017.179999999701977;-1043123.899999998509884;0
731;-741925.000000000000000;-1042997.000000000000000;0
7018;-742577.747000001370907;-1044239.712999999523163;0
622;-742271.000000000000000;-1043302.000000000000000;0
7000;-743096.190000001341105;-1044426.870000001043081;0
4459;-742274.829999998211861;-1042644.269999999552965;0
5143;-743052.232000000774860;-1043454.120000001043081;0
5766;-742429.719999998807907;-1042597.699999999254942;0
875;-741783.000000000000000;-1042677.000000000000000;0
7285;-742806.960000000894070;-1044758.379999998956919;0
988;-741820.000000000000000;-1044516.000000000000000;0
3420;-743739.186000000685453;-1043112.370000001043081;0
1986;-743480.000000000000000;-1044794.000000000000000;0
6768;-741255.769999999552965;-1044419.920000001788139;0
1531;-741782.000000000000000;-1043838.000000000000000;0
580;-742010.000000000000000;-1043443.000000000000000;0
4064;-742879.655000001192093;-1043647.420000001788139;0
1262;-742066.000000000000000;-1044917.000000000000000;0
5679;-743403.182000000029802;-1043717.807000000029802;0
4047;-743210.230000000447035;-1043992.289999999105930;0
352;-742386.000000000000000;-1043914.000000000000000;0
6368;-741940.324999999254942;-1042660.324000000953674;0
2079;-742688.000000000000000;-1044428.000000000000000;0
1808;-743187.000000000000000;-1044539.000000000000000;0
6124;-743427.861999999731779;-1043609.043000001460314;0
4122;-742732.074999999254942;-1043923.995000001043081;0
1361;-742037.000000000000000;-1044911.000000000000000;0
3169;-743932.120000001043081;-1042582.179999999701977;0
1155;-741208.000000000000000;-1044484.000000000000000;0
6191;-742318.017000000923872;-1043066.800999999046326;0
4781;-742926.519000001251698;-1042695.502999998629093;0
6694;-742280.806000001728535;-1044814.875999998301268;0
3916;-743964.037999998778105;-1043492.932999998331070;0
7219;-742443.460000000894070;-1044813.000000000000000;0
7721;-742941.157000001519918;-1044215.368000000715256;0
3321;-743903.500999998301268;-1042936.324999999254942;0
926;-741894.000000000000000;-1042999.000000000000000;0
1246;-742120.000000000000000;-1044570.000000000000000;0
6294;-742653.550000000745058;-1042686.140000000596046;0
379;-742479.000000000000000;-1043679.000000000000000;0
1226;-742204.000000000000000;-1044247.000000000000000;0
6099;-741947.280000001192093;-1043424.289999999105930;0
6310;-744674.719999998807907;-1042585.710000000894070;0
4168;-742423.695000000298023;-1043984.135000001639128;0
1937;-743273.000000000000000;-1044318.000000000000000;0
892;-742946.000000000000000;-1042607.000000000000000;0
573;-742067.000000000000000;-1043561.000000000000000;0
1008;-741962.000000000000000;-1044568.000000000000000;0
7026;-743217.644999999552965;-1044082.329999998211861;0
6860;-741482.129999998956919;-1044991.089999999850988;0
7006;-742995.760000001639128;-1043976.245000001043081;0
1303;-741865.000000000000000;-1044692.000000000000000;0
6015;-742854.607999999076128;-1043226.870999999344349;0
4503;-742402.579999998211861;-1042702.839999999850988;0
341;-742592.000000000000000;-1043889.000000000000000;0
6473;-741931.359999999403954;-1044555.109999999403954;0
5147;-743077.127000000327826;-1043433.221999999135733;0
5591;-743421.353999998420477;-1043679.738000001758337;0
4516;-742588.570000000298023;-1042771.460000000894070;0
3601;-744894.190999999642372;-1042626.861999999731779;0
4121;-742721.160000000149012;-1043948.695000000298023;0
2382;-742242.000000000000000;-1045524.000000000000000;0
5502;-743427.894999999552965;-1043706.885000001639128;0
4526;-742696.690000001341105;-1042823.320000000298023;0
5593;-743418.921000000089407;-1043679.927999999374151;0
845;-742126.000000000000000;-1042505.000000000000000;0
632;-742130.000000000000000;-1043287.000000000000000;0
5704;-743417.484999999403954;-1043635.530999999493361;0
8058;-742263.219999998807907;-1045051.489999998360872;0
6364;-742003.519999999552965;-1042660.690000001341105;0
836;-742006.000000000000000;-1042525.000000000000000;0
6193;-742316.486000001430511;-1043063.991000000387430;0
612;-742064.000000000000000;-1043270.000000000000000;0
2888;-744082.749000001698732;-1043174.458999998867512;0
5680;-743402.000000000000000;-1043718.245000001043081;0
1133;-741604.000000000000000;-1044433.000000000000000;0
2057;-742787.000000000000000;-1044365.000000000000000;0
4677;-742787.309999998658895;-1042797.899999998509884;0
681;-742383.000000000000000;-1043170.000000000000000;0
4003;-743371.839999999850988;-1044053.258999999612570;0
2273;-742895.000000000000000;-1045745.000000000000000;0
4124;-742751.265000000596046;-1043878.414999999105930;0
4579;-742378.747999999672174;-1042626.699999999254942;0
6220;-742318.432999998331070;-1043062.949999999254942;0
4169;-742414.420000001788139;-1043962.329999998211861;0
7153;-742889.646999999880791;-1044547.438000001013279;0
4329;-742363.315000001341105;-1043352.173999998718500;0
6293;-742666.339999999850988;-1042695.188999999314547;0
2185;-743216.000000000000000;-1045130.000000000000000;0
7001;-743085.660000000149012;-1044400.420000001788139;0
1269;-742246.000000000000000;-1044462.000000000000000;0
2131;-743073.000000000000000;-1045134.000000000000000;0
4927;-742447.969999998807907;-1042874.710000000894070;0
1014;-742097.000000000000000;-1044586.000000000000000;0
3768;-743006.370000001043081;-1042978.829999998211861;0
4756;-742712.579999998211861;-1042776.829999998211861;0
1498;-741382.000000000000000;-1044310.000000000000000;0
4325;-742270.679000001400709;-1043141.787999998778105;0
6249;-742373.554999999701977;-1043049.822000000625849;0
4427;-742190.519999999552965;-1043099.440000001341105;0
3411;-743769.885999999940395;-1043038.517000000923872;0
6835;-741618.964000001549721;-1044934.515000000596046;0
4063;-742855.079999998211861;-1043654.695000000298023;0
1493;-741134.000000000000000;-1044328.000000000000000;0
1539;-741977.000000000000000;-1043997.000000000000000;0
1003;-741913.000000000000000;-1044580.000000000000000;0
3346;-743958.802000001072884;-1043049.741000000387430;0
1326;-741927.000000000000000;-1044976.000000000000000;0
3418;-743758.105000000447035;-1043107.024999998509884;0
1932;-743359.000000000000000;-1044408.000000000000000;0
2172;-742886.000000000000000;-1045182.000000000000000;0
3393;-743910.969999998807907;-1043143.960000000894070;0
6272;-742325.379000000655651;-1043017.383000001311302;0
1298;-741964.000000000000000;-1044736.000000000000000;0
719;-741705.000000000000000;-1042828.000000000000000;0
6338;-742247.910000000149012;-1042851.670000001788139;0
522;-742261.000000000000000;-1043122.000000000000000;0
6169;-742312.320000000298023;-1043060.791999999433756;0
5360;-742453.188999999314547;-1042938.521999999880791;0
1687;-741142.120000001043081;-1044817.019999999552965;0
3981;-743341.517000000923872;-1043837.353999998420477;0
6657;-741565.760000001639128;-1044156.980000000447035;0
4707;-742743.519999999552965;-1042600.359999999403954;0
4518;-742623.960000000894070;-1042786.719999998807907;0
1351;-741850.000000000000000;-1044830.000000000000000;0
191;-743424.000000000000000;-1043599.000000000000000;0
4826;-743043.850000001490116;-1042979.600000001490116;0
6305;-741836.559999998658895;-1042745.190000001341105;0
2335;-742825.000000000000000;-1045539.000000000000000;0
7947;-742030.969999998807907;-1044096.679999999701977;0
5661;-743424.451999999582767;-1043709.932999998331070;0
4615;-742527.811000000685453;-1042658.600999999791384;0
6244;-742368.587000001221895;-1043059.245999999344349;0
1122;-741749.000000000000000;-1044455.000000000000000;0
697;-742101.000000000000000;-1042908.000000000000000;0
1604;-742552.000000000000000;-1044918.000000000000000;0
2073;-743069.000000000000000;-1044754.000000000000000;0
4817;-742967.460000000894070;-1042782.559999998658895;0
4771;-742890.828000001609325;-1042889.975000001490116;0
4831;-743041.170000001788139;-1042862.530000001192093;0
4922;-742443.129999998956919;-1042886.510000001639128;0
6213;-742316.227000001817942;-1043060.478999998420477;0
217;-742998.000000000000000;-1043554.000000000000000;0
