OID_;X;Y;TEMPERATURE
3614;-744984.548999998718500;-1042283.640999998897314;0
3019;-744463.447999998927116;-1042784.646000001579523;0
3568;-744718.817999999970198;-1042588.614999998360872;0
3692;-744525.876499999314547;-1042540.534000001847744;0
3580;-744924.973999999463558;-1042593.699999999254942;0
2605;-745393.842999998480082;-1042860.796000000089407;0
5975;-745052.346999999135733;-1042674.673000000417233;0
118;-745135.000000000000000;-1042687.000000000000000;0
3542;-744575.274000000208616;-1042656.160000000149012;0
2696;-743477.489999998360872;-1042038.000000000000000;0
2520;-741847.000000000000000;-1045324.000000000000000;0
6872;-741751.719999998807907;-1045296.679999999701977;0
2760;-743863.331000000238419;-1043483.304000001400709;0
2755;-744003.879000000655651;-1043471.734000001102686;0
2404;-742179.000000000000000;-1045467.000000000000000;0
3919;-743904.947000000625849;-1043493.929999999701977;0
3107;-743778.888000000268221;-1042682.131999999284744;0
2740;-744042.611999999731779;-1043335.940000001341105;0
1486;-741150.000000000000000;-1044219.000000000000000;0
6828;-741465.309999998658895;-1044768.940000001341105;0
7411;-743529.510000001639128;-1045393.140000000596046;0
8079;-742021.839999999850988;-1045292.179999999701977;0
2070;-742993.000000000000000;-1044723.000000000000000;0
2097;-743143.000000000000000;-1044742.000000000000000;0
7263;-743009.559999998658895;-1044894.379999998956919;0
4238;-742440.263000000268221;-1043528.236000001430511;0
7654;-742242.081000000238419;-1045273.263999998569489;0
2394;-742273.000000000000000;-1045360.000000000000000;0
2160;-742849.000000000000000;-1045147.000000000000000;0
2161;-742876.000000000000000;-1045153.000000000000000;0
8073;-742120.640000000596046;-1045259.500000000000000;0
4075;-742947.934999998658895;-1043903.649999998509884;0
7947;-742030.969999998807907;-1044096.679999999701977;0
524;-742255.000000000000000;-1043913.000000000000000;0
1780;-741214.000000000000000;-1043934.000000000000000;0
738;-741818.000000000000000;-1043024.000000000000000;0
1983;-743474.000000000000000;-1044709.000000000000000;0
748;-741671.000000000000000;-1042971.000000000000000;0
110;-744127.000000000000000;-1042724.000000000000000;0
7022;-743155.660000000149012;-1044074.410000000149012;0
1764;-741163.000000000000000;-1044144.000000000000000;0
735;-741910.000000000000000;-1043014.000000000000000;0
514;-742119.000000000000000;-1043141.000000000000000;0
510;-742048.000000000000000;-1043150.000000000000000;0
2050;-743460.000000000000000;-1045072.000000000000000;0
2008;-743242.000000000000000;-1044759.000000000000000;0
6722;-742357.717000000178814;-1044705.708000000566244;0
1561;-743186.000000000000000;-1045098.000000000000000;0
1251;-742091.000000000000000;-1044690.000000000000000;0
7;-743479.000000000000000;-1042567.000000000000000;0
17;-743587.000000000000000;-1042394.000000000000000;0
5303;-743164.818999998271465;-1043211.078000001609325;0
1492;-741096.000000000000000;-1044331.000000000000000;0
4332;-742410.359000001102686;-1043282.916000001132488;0
3204;-743715.278999999165535;-1042506.118999999016523;0
6;-743464.000000000000000;-1042594.000000000000000;0
2133;-743040.000000000000000;-1045127.000000000000000;0
2151;-742827.000000000000000;-1045047.000000000000000;0
2166;-743016.000000000000000;-1045179.000000000000000;0
7324;-742833.980000000447035;-1044949.109999999403954;0
4162;-742497.193999998271465;-1044160.030000001192093;0
6746;-742405.083999998867512;-1044259.199999999254942;0
1515;-741913.000000000000000;-1044072.000000000000000;0
1371;-742089.000000000000000;-1044807.000000000000000;0
884;-741771.000000000000000;-1042776.000000000000000;0
1013;-742076.000000000000000;-1044595.000000000000000;0
2189;-743472.000000000000000;-1045183.000000000000000;0
727;-742001.000000000000000;-1042962.000000000000000;0
1091;-741531.480000000447035;-1044543.440000001341105;0
728;-741997.000000000000000;-1042918.000000000000000;0
696;-742077.000000000000000;-1042913.000000000000000;0
3326;-744036.002000000327826;-1042922.574999999254942;0
2226;-743057.000000000000000;-1045470.000000000000000;0
504;-741937.000000000000000;-1043164.000000000000000;0
5062;-742798.513999998569489;-1043227.370999999344349;0
1970;-743380.000000000000000;-1044854.000000000000000;0
1987;-743480.000000000000000;-1044820.000000000000000;0
3387;-743960.368000000715256;-1043194.717000000178814;0
2256;-743156.000000000000000;-1045353.000000000000000;0
3233;-744152.962999999523163;-1042686.791999999433756;0
7776;-743089.784000001847744;-1045773.409000001847744;0
4232;-742315.057999998331070;-1043428.918999999761581;0
1915;-743468.000000000000000;-1044494.000000000000000;0
5119;-742850.592999998480082;-1043328.484999999403954;0
7520;-742808.589999999850988;-1045680.519999999552965;0
7087;-743339.940000001341105;-1044536.690000001341105;0
7350;-742556.390000000596046;-1045185.980000000447035;0
5111;-742892.337999999523163;-1043424.370999999344349;0
1945;-743270.000000000000000;-1044454.000000000000000;0
1058;-741667.000000000000000;-1045072.000000000000000;0
6791;-741047.329999998211861;-1044765.467999998480082;0
1875;-743367.000000000000000;-1044261.000000000000000;0
2262;-742999.000000000000000;-1045686.000000000000000;0
2887;-744098.480000000447035;-1043192.508000001311302;0
531;-742157.000000000000000;-1043778.000000000000000;0
1926;-743301.000000000000000;-1044321.000000000000000;0
5292;-743055.866000000387430;-1043215.710999999195337;0
7188;-742583.839999999850988;-1044742.870000001043081;0
599;-741837.000000000000000;-1043243.000000000000000;0
5272;-743000.013999998569489;-1043245.364000000059605;0
2344;-742691.000000000000000;-1045541.000000000000000;0
639;-741958.000000000000000;-1043294.000000000000000;0
4070;-742925.285000000149012;-1043783.565000001341105;0
2488;-742083.000000000000000;-1044303.000000000000000;0
496;-741768.000000000000000;-1043197.000000000000000;0
4342;-742506.473000001162291;-1043301.100000001490116;0
7651;-742295.381000000983477;-1045479.861999999731779;0
4212;-742205.245000001043081;-1043548.410000000149012;0
1238;-742150.000000000000000;-1044384.000000000000000;0
1243;-742122.000000000000000;-1044502.000000000000000;0
1433;-741895.000000000000000;-1044328.000000000000000;0
5223;-743283.699999999254942;-1043535.940000001341105;0
826;-742191.000000000000000;-1042616.000000000000000;0
2491;-742059.000000000000000;-1044251.000000000000000;0
7217;-742516.318999998271465;-1044582.890000000596046;0
467;-741757.000000000000000;-1043352.000000000000000;0
463;-741703.000000000000000;-1043287.000000000000000;0
1299;-741943.000000000000000;-1044719.000000000000000;0
1052;-741761.000000000000000;-1045002.000000000000000;0
910;-742219.000000000000000;-1042529.000000000000000;0
1171;-741882.000000000000000;-1044375.000000000000000;0
6943;-742902.013999998569489;-1043932.647999998182058;0
6825;-741380.010000001639128;-1044780.089999999850988;0
281;-743045.000000000000000;-1043848.000000000000000;0
2526;-741087.000000000000000;-1044616.000000000000000;0
226;-742879.000000000000000;-1043516.000000000000000;0
8018;-741974.039999999105930;-1044442.870000001043081;0
583;-741975.000000000000000;-1043434.000000000000000;0
4006;-743302.763000000268221;-1044052.298999998718500;0
1138;-741500.000000000000000;-1044458.000000000000000;0
4236;-742406.842999998480082;-1043504.015000000596046;0
2501;-742746.000000000000000;-1045430.000000000000000;0
6710;-742260.203000001609325;-1044803.609999999403954;0
7026;-743217.644999999552965;-1044082.329999998211861;0
6095;-742082.920000001788139;-1043614.710000000894070;0
7033;-743303.864999998360872;-1044132.750000000000000;0
7180;-742618.809000000357628;-1044646.109000001102686;0
1865;-743458.000000000000000;-1044233.000000000000000;0
3781;-743273.059999998658895;-1042814.050000000745058;0
3752;-743213.949999999254942;-1042902.719999998807907;0
7218;-742534.100000001490116;-1044603.559999998658895;0
1656;-741395.000000000000000;-1044688.000000000000000;0
1922;-743390.000000000000000;-1044308.000000000000000;0
1920;-743384.000000000000000;-1044363.000000000000000;0
1905;-743446.000000000000000;-1044312.000000000000000;0
2513;-742574.000000000000000;-1044441.000000000000000;0
7044;-743400.635000001639128;-1044135.579999998211861;0
2478;-741241.859999999403954;-1044562.089999999850988;0
7104;-743423.739999998360872;-1044624.530000001192093;0
6313;-743936.949999999254942;-1042594.780000001192093;0
3155;-743969.353000000119209;-1042568.828000001609325;0
576;-742054.000000000000000;-1043517.000000000000000;0
6092;-742001.309999998658895;-1043482.089999999850988;0
1707;-741196.219999998807907;-1044702.390000000596046;0
627;-742223.000000000000000;-1043335.000000000000000;0
4026;-743178.984999999403954;-1043847.989999998360872;0
786;-741706.000000000000000;-1042606.000000000000000;0
6821;-741256.649999998509884;-1044796.100000001490116;0
4145;-742687.109999999403954;-1043837.125000000000000;0
1101;-741339.000000000000000;-1044568.000000000000000;0
4023;-743246.635000001639128;-1043864.364999998360872;0
6000;-741980.750000000000000;-1043285.629999998956919;0
2300;-742561.000000000000000;-1045413.000000000000000;0
616;-742153.000000000000000;-1043272.000000000000000;0
613;-742089.000000000000000;-1043271.000000000000000;0
636;-742160.000000000000000;-1043325.000000000000000;0
1449;-741533.000000000000000;-1044684.000000000000000;0
1693;-741613.000000000000000;-1044649.000000000000000;0
713;-741800.000000000000000;-1042859.000000000000000;0
1325;-741894.000000000000000;-1044959.000000000000000;0
3976;-743088.861000001430511;-1043707.728000000119209;0
881;-741806.000000000000000;-1042815.000000000000000;0
1611;-742400.000000000000000;-1044442.000000000000000;0
6700;-742298.611000001430511;-1044507.315999999642372;0
6703;-742288.903999999165535;-1044591.625999998301268;0
6721;-742321.052999999374151;-1044705.548000000417233;0
7010;-742857.964999999850988;-1044251.155000001192093;4
4058;-743138.765000000596046;-1043625.405000001192093;0
4057;-743132.184999998658895;-1043648.719999998807907;0
1314;-741695.000000000000000;-1044866.000000000000000;0
1310;-741623.000000000000000;-1044829.000000000000000;0
1042;-741883.000000000000000;-1044682.000000000000000;0
7516;-742248.390000000596046;-1044368.907999999821186;0
6718;-742339.493000000715256;-1044956.921999998390675;0
1692;-741125.000000000000000;-1044816.000000000000000;0
6507;-741738.839999999850988;-1044541.820000000298023;0
6662;-741466.800000000745058;-1044192.359999999403954;0
4166;-742448.504999998956919;-1044046.885000001639128;0
2016;-743230.000000000000000;-1044873.000000000000000;0
1424;-742134.000000000000000;-1044171.000000000000000;0
5232;-743347.087000001221895;-1043476.425000000745058;0
4175;-742721.254999998956919;-1043775.890000000596046;0
2575;-742484.000000000000000;-1045453.000000000000000;0
1387;-742155.000000000000000;-1044999.000000000000000;0
1598;-742351.000000000000000;-1045090.000000000000000;0
1342;-741721.000000000000000;-1044783.000000000000000;0
1350;-741814.000000000000000;-1044844.000000000000000;0
2375;-742438.000000000000000;-1045570.000000000000000;0
1330;-741817.000000000000000;-1044709.000000000000000;0
2309;-742322.000000000000000;-1045519.000000000000000;0
1385;-742194.000000000000000;-1044974.000000000000000;0
4134;-742772.309999998658895;-1044078.870000001043081;0
2329;-742432.000000000000000;-1045508.000000000000000;0
6842;-741574.894000001251698;-1044962.013999998569489;0
1590;-742377.000000000000000;-1044885.000000000000000;0
2322;-742651.000000000000000;-1045483.000000000000000;0
4064;-742879.655000001192093;-1043647.420000001788139;0
1993;-743483.000000000000000;-1044984.000000000000000;0
8284;-742219.410000000149012;-1042809.500000000000000;0
2086;-742404.000000000000000;-1044796.000000000000000;0
2041;-743531.000000000000000;-1044957.000000000000000;0
8283;-742198.600000001490116;-1042801.980000000447035;0
2419;-742418.000000000000000;-1045101.000000000000000;0
1269;-742246.000000000000000;-1044462.000000000000000;0
6573;-741294.089999999850988;-1044091.679999999701977;0
7736;-742342.260000001639128;-1045113.918000001460314;0
332;-742645.000000000000000;-1044014.000000000000000;0
4656;-742827.763000000268221;-1042494.379999998956919;0
4858;-742955.339999999850988;-1042963.960000000894070;0
6656;-741590.160000000149012;-1044150.480000000447035;0
4481;-741766.089999999850988;-1042627.859999999403954;0
4826;-743043.850000001490116;-1042979.600000001490116;0
4036;-743246.920000001788139;-1043771.574999999254942;0
623;-742254.000000000000000;-1043325.000000000000000;0
3766;-743053.532999999821186;-1042996.631000000983477;0
872;-741698.000000000000000;-1042669.000000000000000;0
4425;-742208.820000000298023;-1043035.230000000447035;0
1397;-741771.000000000000000;-1044236.000000000000000;0
2548;-741672.000000000000000;-1044304.000000000000000;0
2017;-743247.000000000000000;-1044884.000000000000000;0
6726;-742476.517999999225140;-1044410.600000001490116;0
2028;-743371.000000000000000;-1045054.000000000000000;0
7315;-742603.960000000894070;-1045022.870000001043081;0
2060;-742659.000000000000000;-1044472.000000000000000;0
7175;-742651.780000001192093;-1044558.149999998509884;0
4132;-742818.859999999403954;-1044067.969999998807907;0
4099;-742773.870000001043081;-1043846.135999999940395;0
6009;-743896.859000001102686;-1042750.497000001370907;0
3090;-743913.418999999761581;-1042804.416999999433756;0
1604;-742552.000000000000000;-1044918.000000000000000;0
5241;-743365.063000001013279;-1043245.954999998211861;0
7152;-742867.331999998539686;-1044547.015999998897314;0
5258;-743356.739999998360872;-1043230.039999999105930;0
7156;-742944.515000000596046;-1044546.140000000596046;0
4558;-742373.019999999552965;-1042506.949999999254942;0
4463;-742198.989999998360872;-1042569.030000001192093;0
6709;-742264.587999999523163;-1044776.254999998956919;0
1509;-741741.000000000000000;-1044196.000000000000000;0
6647;-741767.690000001341105;-1044068.160000000149012;0
7281;-742801.859999999403954;-1044705.300000000745058;0
7704;-742256.021000001579523;-1044313.592999998480082;0
1189;-741786.000000000000000;-1044043.000000000000000;0
5136;-742992.278000000864267;-1043472.440000001341105;0
1553;-741350.000000000000000;-1044268.000000000000000;0
4252;-742124.022999998182058;-1043390.519000001251698;0
1126;-741684.000000000000000;-1044450.000000000000000;0
3837;-743093.699999999254942;-1042577.890000000596046;0
918;-743437.000000000000000;-1043904.000000000000000;0
1459;-741491.000000000000000;-1044340.000000000000000;0
3847;-743122.146999999880791;-1042525.489999998360872;0
3995;-743393.225000001490116;-1043973.719999998807907;0
2247;-743199.000000000000000;-1045400.000000000000000;0
4220;-742214.344999998807907;-1043580.359999999403954;0
558;-742200.000000000000000;-1043683.000000000000000;0
3287;-743711.173999998718500;-1042886.515999998897314;0
7141;-742895.629999998956919;-1044470.910000000149012;0
3311;-743816.037999998778105;-1042845.728999998420477;0
7143;-742850.414999999105930;-1044473.449999999254942;0
3987;-743311.475000001490116;-1043983.175000000745058;0
1137;-741538.000000000000000;-1044442.000000000000000;0
4169;-742414.420000001788139;-1043962.329999998211861;0
1824;-742963.809999998658895;-1044143.929999999701977;0
1532;-741805.000000000000000;-1043858.000000000000000;0
338;-742602.000000000000000;-1043933.000000000000000;0
4590;-742387.043000001460314;-1042535.971000000834465;0
1821;-742995.000000000000000;-1044239.000000000000000;0
4190;-742301.250000000000000;-1044166.100000001490116;0
1518;-741994.000000000000000;-1044011.000000000000000;0
1838;-743004.480000000447035;-1044216.030000001192093;0
2286;-742894.000000000000000;-1045440.000000000000000;0
3802;-743068.190000001341105;-1042879.710000000894070;0
4705;-742714.100000001490116;-1042599.829999998211861;0
7206;-742559.920000001788139;-1045003.190000001341105;0
544;-742343.910000000149012;-1043796.500000000000000;0
4688;-742676.179000001400709;-1042555.322999998927116;0
2340;-742764.000000000000000;-1045532.000000000000000;0
8259;-742072.089999999850988;-1042687.219999998807907;0
8272;-742042.399999998509884;-1042732.559999998658895;0
3943;-743413.429000001400709;-1043376.822000000625849;0
5135;-742979.611000001430511;-1043468.912999998778105;0
4427;-742190.519999999552965;-1043099.440000001341105;0
403;-742307.000000000000000;-1043931.000000000000000;0
4825;-742908.839999999850988;-1042860.670000001788139;0
393;-742384.000000000000000;-1043819.000000000000000;0
4668;-742810.210000000894070;-1042618.969999998807907;0
818;-741961.000000000000000;-1042598.000000000000000;0
4323;-742267.879999998956919;-1043190.035000000149012;0
4990;-742657.837999999523163;-1043024.199999999254942;0
5042;-742731.719000000506639;-1042890.517000000923872;0
1749;-742065.000000000000000;-1045064.000000000000000;0
1619;-742426.000000000000000;-1044401.000000000000000;0
1148;-741324.000000000000000;-1044481.000000000000000;0
6148;-742313.410999998450279;-1043065.666999999433756;0
893;-742956.000000000000000;-1042572.000000000000000;0
2270;-742954.000000000000000;-1045592.000000000000000;0
1677;-741109.160000000149012;-1044522.699999999254942;0
4062;-742830.460000000894070;-1043654.920000001788139;0
7017;-742571.059999998658895;-1044267.640000000596046;0
819;-741987.000000000000000;-1042599.000000000000000;0
3413;-743776.791000001132488;-1043071.675000000745058;0
6980;-743071.769999999552965;-1044387.548999998718500;0
4905;-742467.730000000447035;-1042815.620000001043081;0
6855;-741501.394999999552965;-1045027.784000001847744;0
3747;-743250.879999998956919;-1042956.620000001043081;0
5213;-743326.385999999940395;-1043368.675999999046326;0
2563;-741065.000000000000000;-1044421.000000000000000;0
5216;-743284.217999998480082;-1043325.638999998569489;0
5165;-743191.168000001460314;-1043398.304000001400709;0
7977;-741271.370000001043081;-1044404.390000000596046;0
4739;-742751.690000001341105;-1042699.230000000447035;0
1423;-742167.000000000000000;-1044150.000000000000000;0
1007;-741976.000000000000000;-1044586.000000000000000;0
5421;-742337.905999999493361;-1042777.837999999523163;0
7001;-743085.660000000149012;-1044400.420000001788139;0
4752;-742774.460000000894070;-1042743.280000001192093;0
5706;-743417.688999999314547;-1043638.852000001817942;0
4602;-742441.269000001251698;-1042596.320000000298023;0
7243;-742724.339999999850988;-1044835.870000001043081;0
1570;-742291.000000000000000;-1044183.000000000000000;0
5024;-742588.655000001192093;-1042886.519000001251698;0
3292;-743576.905000001192093;-1042781.315000001341105;0
6977;-743098.949999999254942;-1044459.879999998956919;0
5702;-743417.206000000238419;-1043631.844999998807907;0
3263;-743570.528999999165535;-1042712.653999999165535;0
4728;-742862.960000000894070;-1042727.210000000894070;0
4933;-742437.605000000447035;-1042750.853000000119209;0
159;-742965.000000000000000;-1042641.000000000000000;0
5646;-743428.978999998420477;-1043693.493000000715256;0
3407;-743772.385999999940395;-1043008.706999998539686;0
5766;-742429.719999998807907;-1042597.699999999254942;0
1439;-741772.000000000000000;-1044379.000000000000000;0
351;-742509.000000000000000;-1043739.000000000000000;0
4935;-742447.241999998688698;-1042699.399000000208616;0
5140;-743035.789999999105930;-1043514.489999998360872;0
2238;-743372.000000000000000;-1045261.000000000000000;0
6244;-742368.587000001221895;-1043059.245999999344349;0
6152;-742310.348999999463558;-1043060.046999998390675;0
6139;-742312.807000000029802;-1043066.006000000983477;0
3368;-743901.462000001221895;-1043012.500999998301268;0
5599;-743411.622999999672174;-1043680.499000001698732;0
2282;-742923.000000000000000;-1045519.000000000000000;0
6368;-741940.324999999254942;-1042660.324000000953674;0
2232;-743488.000000000000000;-1045234.000000000000000;0
4948;-742386.929999999701977;-1042992.239999998360872;0
5584;-743408.885000001639128;-1043643.532000001519918;0
3353;-743954.399999998509884;-1043021.017999999225140;0
673;-742467.000000000000000;-1043230.000000000000000;0
3295;-743595.543000001460314;-1042827.322000000625849;0
6205;-742314.800000000745058;-1043059.416999999433756;0
4955;-742383.649999998509884;-1043019.250000000000000;0
6128;-742313.668999999761581;-1043069.186000000685453;0
6154;-742316.324000000953674;-1043069.546000000089407;0
4772;-742879.881999999284744;-1042872.157000001519918;0
249;-743433.000000000000000;-1043775.000000000000000;0
349;-742524.000000000000000;-1043764.000000000000000;0
4675;-742805.809999998658895;-1042785.070000000298023;0
5023;-742588.899000000208616;-1042870.296999998390675;0
4512;-742515.339999999850988;-1042750.230000000447035;0
952;-742274.000000000000000;-1043018.000000000000000;0
6277;-742304.633999999612570;-1043024.256000000983477;0
4736;-742701.269999999552965;-1042690.000000000000000;0
4764;-742839.835999999195337;-1042859.412999998778105;0
2243;-743292.000000000000000;-1045310.000000000000000;0
3835;-743050.579999998211861;-1042590.109999999403954;0
4516;-742588.570000000298023;-1042771.460000000894070;0
7220;-742418.820000000298023;-1044813.199999999254942;0
5450;-743130.769000001251698;-1043378.403000000864267;0
1520;-741777.000000000000000;-1043939.000000000000000;0
4518;-742623.960000000894070;-1042786.719999998807907;0
1217;-742120.000000000000000;-1044339.000000000000000;0
4982;-742559.320999998599291;-1043012.914000000804663;0
4949;-742369.969999998807907;-1042973.199999999254942;0
5583;-743410.274999998509884;-1043642.072000000625849;0
6171;-742310.780999999493361;-1043057.971000000834465;0
6605;-741648.401999998837709;-1043884.642999999225140;0
3794;-743091.015000000596046;-1042800.471999999135733;0
4848;-742977.940000001341105;-1042862.019999999552965;0
5461;-742442.704999998211861;-1043234.515000000596046;0
5959;-742962.548999998718500;-1043523.155000001192093;0
4594;-742555.890999998897314;-1042650.090999998152256;0
1259;-742064.000000000000000;-1044854.000000000000000;0
1197;-741657.000000000000000;-1043865.000000000000000;0
6275;-742314.603999998420477;-1043016.407999999821186;0
6222;-742316.855000000447035;-1043060.109999999403954;0
6352;-741906.920000001788139;-1042710.609999999403954;0
5689;-743415.442000001668930;-1043633.646000001579523;0
4641;-742591.151999998837709;-1042559.721000000834465;0
4794;-743065.828999999910593;-1042673.377000000327826;0
4773;-742888.429000001400709;-1042839.530000001192093;0
4598;-742602.175000000745058;-1042688.015999998897314;0
382;-742481.000000000000000;-1043751.000000000000000;0
6276;-742310.815999999642372;-1043016.000999998301268;0
4766;-742803.037999998778105;-1042842.532999999821186;0
4596;-742597.181000001728535;-1042670.653000000864267;0
6201;-742317.888999998569489;-1043065.035000000149012;0
5703;-743417.385000001639128;-1043633.592000000178814;0
5733;-743410.142999999225140;-1043688.210999999195337;0
1725;-741536.000000000000000;-1045136.000000000000000;0
6203;-742316.357000000774860;-1043062.256000000983477;0
7249;-742789.010999999940395;-1044830.250000000000000;0
4792;-743051.280000001192093;-1042654.962999999523163;0
6974;-743127.620000001043081;-1044518.800000000745058;0
5666;-743418.543999999761581;-1043712.120000001043081;0
3799;-743117.550000000745058;-1042868.160000000149012;0
5701;-743417.076999999582767;-1043630.140000000596046;0
6270;-742333.412999998778105;-1043018.204999998211861;0
6140;-742311.999000001698732;-1043064.638999998569489;0
4811;-743040.379999998956919;-1042799.609999999403954;0
91;-744044.000000000000000;-1043053.000000000000000;0
6374;-741977.035000000149012;-1042674.153999999165535;0
4996;-742488.458999998867512;-1042974.723999999463558;0
1517;-741964.000000000000000;-1044034.000000000000000;0
5577;-743409.385999999940395;-1043630.826999999582767;0
4609;-742557.414000000804663;-1042621.583999998867512;0
6606;-741654.631999999284744;-1043906.848000001162291;0
5677;-743405.545000001788139;-1043716.931000001728535;0
6145;-742315.708000000566244;-1043069.881999999284744;0
1830;-742961.000000000000000;-1044087.000000000000000;0
4629;-742630.986000001430511;-1042626.096000000834465;0
6190;-742318.782999999821186;-1043068.206000000238419;0
6252;-742378.052000001072884;-1043040.958000000566244;0
1360;-741983.000000000000000;-1044900.000000000000000;0
6133;-742309.820000000298023;-1043062.171999998390675;0
5015;-742575.741000000387430;-1043008.607999999076128;0
5637;-743428.151000000536442;-1043682.633999999612570;0
5660;-743425.633999999612570;-1043709.497000001370907;0
5163;-743163.861999999731779;-1043392.113000001758337;0
6127;-742314.456000000238419;-1043070.548999998718500;0
1006;-741930.000000000000000;-1044565.000000000000000;0
4130;-742868.460000000894070;-1044055.510000001639128;0
6189;-742312.041999999433756;-1043057.302000001072884;0
1268;-742046.000000000000000;-1045021.000000000000000;0
5582;-743410.127000000327826;-1043640.197999998927116;0
4636;-742576.870999999344349;-1042687.116999998688698;0
5506;-743427.348000001162291;-1043665.644999999552965;0
4839;-742984.162000000476837;-1042715.425000000745058;0
1165;-741037.420000001788139;-1044506.500000000000000;0
6232;-742316.034000001847744;-1043057.000000000000000;0
5678;-743404.363000001758337;-1043717.368999999016523;0
569;-742096.000000000000000;-1043601.000000000000000;0
4726;-742863.519999999552965;-1042684.000000000000000;0
5691;-743415.714000001549721;-1043637.241000000387430;0
3761;-743202.559999998658895;-1042981.710000000894070;0
1000;-741828.000000000000000;-1044502.000000000000000;0
6177;-742313.717999998480082;-1043061.859999999403954;0
5648;-743429.164000000804663;-1043695.905999999493361;0
4966;-742377.289999999105930;-1043071.030000001192093;0
5725;-743422.388000000268221;-1043634.186999998986721;0
391;-742395.000000000000000;-1043802.000000000000000;0
5692;-743415.782999999821186;-1043638.765000000596046;0
1849;-742732.000000000000000;-1044228.000000000000000;0
5434;-744042.467999998480082;-1043135.986999999731779;0
6233;-742319.057000000029802;-1043072.162999998778105;0
557;-742213.000000000000000;-1043713.000000000000000;0
2214;-743162.000000000000000;-1045316.000000000000000;0
6196;-742314.190000001341105;-1043059.774999998509884;0
4079;-742836.170000001788139;-1043800.960000000894070;0
7147;-742827.925000000745058;-1044451.385000001639128;0
1264;-742059.000000000000000;-1044942.000000000000000;0
309;-742721.000000000000000;-1044157.000000000000000;0
3757;-743300.960000000894070;-1042956.699999999254942;0
307;-742781.000000000000000;-1044143.000000000000000;0
6979;-743081.460000000894070;-1044413.079999998211861;0
1005;-741944.000000000000000;-1044583.000000000000000;0
5511;-743426.401000000536442;-1043599.129999998956919;0
6273;-742321.806000001728535;-1043017.085000000894070;0
2558;-741286.000000000000000;-1044387.000000000000000;0
4964;-742390.059999998658895;-1043044.839999999850988;0
6250;-742374.638999998569489;-1043047.576999999582767;0
677;-742425.000000000000000;-1043200.000000000000000;0
6138;-742313.561999998986721;-1043067.399000000208616;0
1118;-741807.000000000000000;-1044459.000000000000000;0
1355;-741899.000000000000000;-1044858.000000000000000;0
5591;-743421.353999998420477;-1043679.738000001758337;0
6240;-742364.495999999344349;-1043067.289999999105930;0
842;-742101.000000000000000;-1042521.000000000000000;0
6125;-743428.124000001698732;-1043615.223999999463558;0
5716;-743423.320999998599291;-1043631.197000000625849;0
1339;-741618.000000000000000;-1045067.000000000000000;0
4638;-742553.631999999284744;-1042542.028000000864267;0
5737;-743412.636999998241663;-1043691.631000000983477;0
1648;-741373.000000000000000;-1044431.000000000000000;0
4171;-742796.910000000149012;-1043722.629999998956919;0
2057;-742787.000000000000000;-1044365.000000000000000;0
833;-742050.000000000000000;-1042573.000000000000000;0
5729;-743420.103000000119209;-1043638.901000000536442;0
6158;-742313.261999998241663;-1043063.925999999046326;0
4700;-742659.859999999403954;-1042723.210000000894070;0
390;-742429.000000000000000;-1043827.000000000000000;0
3792;-743110.019999999552965;-1042846.530000001192093;0
