OID_;X;Y;TEMPERATURE
462;-741707.000000000000000;-1043294.000000000000000;0
3783;-743211.559999998658895;-1042920.120000001043081;0
2520;-741847.000000000000000;-1045324.000000000000000;0
2695;-743455.570000000298023;-1042040.780000001192093;0
1774;-741285.000000000000000;-1043941.000000000000000;0
6721;-742321.052999999374151;-1044705.548000000417233;0
709;-741861.000000000000000;-1042862.000000000000000;0
2507;-742427.000000000000000;-1044437.000000000000000;0
1506;-741642.000000000000000;-1044236.000000000000000;0
4455;-741714.589000001549721;-1042663.557000000029802;0
510;-742048.000000000000000;-1043150.000000000000000;0
7723;-741757.929000001400709;-1044043.175000000745058;0
1693;-741613.000000000000000;-1044649.000000000000000;0
1491;-741057.000000000000000;-1044333.000000000000000;0
3782;-743285.429999999701977;-1042842.460000000894070;0
225;-742885.000000000000000;-1043535.000000000000000;0
529;-742162.000000000000000;-1043803.000000000000000;0
7258;-742917.370000001043081;-1044865.420000001788139;0
3990;-743339.489999998360872;-1043987.234999999403954;0
579;-742006.000000000000000;-1043477.000000000000000;0
6111;-742241.054000001400709;-1043365.475999999791384;0
1162;-741087.000000000000000;-1044511.000000000000000;0
4072;-742934.225000001490116;-1043833.899999998509884;0
1924;-743359.000000000000000;-1044320.000000000000000;0
3537;-744632.945000000298023;-1042671.657000001519918;0
1017;-742167.000000000000000;-1044603.000000000000000;0
7034;-743299.725999999791384;-1044153.140000000596046;0
5116;-742947.859000001102686;-1043386.767000000923872;0
1502;-741506.000000000000000;-1044283.000000000000000;0
2757;-743949.300000000745058;-1043488.500000000000000;0
2480;-741251.739999998360872;-1044639.480000000447035;0
2894;-743960.129000000655651;-1043216.409000001847744;0
4428;-742206.750000000000000;-1043097.800000000745058;0
2098;-743134.000000000000000;-1044763.000000000000000;0
2049;-743499.000000000000000;-1045071.000000000000000;0
3017;-744468.008999999612570;-1042806.090999998152256;0
1136;-741520.000000000000000;-1044455.000000000000000;0
1486;-741150.000000000000000;-1044219.000000000000000;0
3761;-743202.559999998658895;-1042981.710000000894070;0
3423;-743731.600000001490116;-1043092.067999999970198;0
4141;-742804.644999999552965;-1044008.964999999850988;0
6852;-741571.519999999552965;-1045065.932999998331070;0
2261;-743009.000000000000000;-1045657.000000000000000;0
1345;-741741.000000000000000;-1044789.000000000000000;0
307;-742781.000000000000000;-1044143.000000000000000;0
512;-742063.000000000000000;-1043136.000000000000000;0
2760;-743863.331000000238419;-1043483.304000001400709;0
3100;-743941.234000001102686;-1042742.857999999076128;0
4860;-742964.800999999046326;-1043016.107999999076128;0
7182;-742597.789999999105930;-1044678.260000001639128;0
1526;-741644.000000000000000;-1043787.000000000000000;0
6510;-741721.960000000894070;-1044461.815000001341105;0
5067;-742813.465999998152256;-1043267.335999999195337;0
4309;-742042.329999998211861;-1043492.329999998211861;0
1756;-742165.000000000000000;-1045209.000000000000000;0
7007;-742923.890000000596046;-1044218.879999998956919;0
2160;-742849.000000000000000;-1045147.000000000000000;0
6746;-742405.083999998867512;-1044259.199999999254942;0
683;-742362.000000000000000;-1043155.000000000000000;0
7077;-743564.359000001102686;-1045385.210000000894070;0
4145;-742687.109999999403954;-1043837.125000000000000;0
1319;-741788.000000000000000;-1044905.000000000000000;0
1808;-743187.000000000000000;-1044539.000000000000000;0
3377;-743832.151999998837709;-1042925.721000000834465;0
326;-742682.000000000000000;-1044102.000000000000000;0
7158;-742984.796999998390675;-1044545.407999999821186;0
758;-741658.000000000000000;-1042666.000000000000000;0
7946;-742007.769999999552965;-1044091.789999999105930;0
4952;-742318.899999998509884;-1042915.589999999850988;0
1590;-742377.000000000000000;-1044885.000000000000000;0
2331;-742895.000000000000000;-1045530.000000000000000;0
2496;-741953.000000000000000;-1044102.000000000000000;0
4893;-742637.320000000298023;-1042818.600999999791384;0
915;-741884.000000000000000;-1043273.000000000000000;0
1375;-742151.000000000000000;-1044887.000000000000000;0
4214;-742229.274999998509884;-1043511.745000001043081;0
6188;-742312.807999998331070;-1043058.706999998539686;0
4921;-742444.739999998360872;-1042908.420000001788139;0
6823;-741313.910000000149012;-1044788.510000001639128;0
7148;-742828.445000000298023;-1044472.094999998807907;0
892;-742946.000000000000000;-1042607.000000000000000;0
743;-741682.000000000000000;-1043020.000000000000000;0
628;-742217.370000001043081;-1043308.559999998658895;0
4029;-743130.695999998599291;-1043815.427999999374151;0
2887;-744098.480000000447035;-1043192.508000001311302;0
347;-742542.000000000000000;-1043795.000000000000000;0
4154;-742544.524999998509884;-1044048.190000001341105;0
2223;-743053.000000000000000;-1045437.000000000000000;0
1760;-741162.000000000000000;-1044101.000000000000000;0
1053;-741768.000000000000000;-1045023.000000000000000;0
1658;-741404.000000000000000;-1044751.000000000000000;0
544;-742343.910000000149012;-1043796.500000000000000;0
7140;-742921.300000000745058;-1044469.335000000894070;0
4619;-742460.010000001639128;-1042480.890000000596046;0
5316;-743075.980000000447035;-1043041.059999998658895;0
1594;-742304.000000000000000;-1044977.000000000000000;0
1228;-742220.539999999105930;-1044250.829999998211861;0
1538;-741948.000000000000000;-1043973.000000000000000;0
6000;-741980.750000000000000;-1043285.629999998956919;0
4933;-742437.605000000447035;-1042750.853000000119209;0
1838;-743004.480000000447035;-1044216.030000001192093;0
6728;-742547.451000001281500;-1044392.396000001579523;0
1554;-741348.000000000000000;-1044238.000000000000000;0
1522;-741841.000000000000000;-1043893.000000000000000;0
6211;-742317.785000000149012;-1043063.318999998271465;0
8052;-742218.929999999701977;-1044953.719999998807907;0
527;-742186.000000000000000;-1043818.000000000000000;0
1027;-741984.000000000000000;-1044660.000000000000000;0
1872;-743422.000000000000000;-1044246.000000000000000;0
7778;-743070.728000000119209;-1045812.342000000178814;0
4593;-742510.820000000298023;-1042652.203999999910593;0
2036;-743404.000000000000000;-1044803.000000000000000;0
7094;-743370.620000001043081;-1044578.289999999105930;0
6242;-742366.677999999374151;-1043062.949000000953674;0
1993;-743483.000000000000000;-1044984.000000000000000;0
3830;-743013.879999998956919;-1042612.359999999403954;0
4690;-742679.162999998778105;-1042583.138999998569489;0
4608;-742555.160999998450279;-1042637.633999999612570;0
1770;-741270.000000000000000;-1044086.000000000000000;0
4342;-742506.473000001162291;-1043301.100000001490116;0
3796;-743161.100000001490116;-1042834.149999998509884;0
5437;-744084.208999998867512;-1043295.061999998986721;0
1369;-742029.000000000000000;-1044788.000000000000000;0
2148;-742835.000000000000000;-1045008.000000000000000;0
7537;-742722.660000000149012;-1045361.410000000149012;0
3596;-744892.267999999225140;-1042497.289000000804663;0
2108;-743147.000000000000000;-1045086.000000000000000;0
1370;-742061.000000000000000;-1044797.000000000000000;0
2393;-742054.000000000000000;-1045282.000000000000000;0
2323;-742622.000000000000000;-1045487.000000000000000;0
2274;-742870.000000000000000;-1045732.000000000000000;0
6764;-741137.519999999552965;-1044426.289999999105930;0
2061;-742681.000000000000000;-1044491.000000000000000;0
558;-742200.000000000000000;-1043683.000000000000000;0
1295;-742082.000000000000000;-1044456.000000000000000;0
5646;-743428.978999998420477;-1043693.493000000715256;0
6140;-742311.999000001698732;-1043064.638999998569489;0
3269;-743600.679000001400709;-1042731.660000000149012;0
6273;-742321.806000001728535;-1043017.085000000894070;0
4458;-742245.679999999701977;-1042633.960000000894070;0
1607;-742414.000000000000000;-1044379.000000000000000;0
6699;-742301.118999999016523;-1044484.282999999821186;0
3805;-743035.760000001639128;-1042913.550000000745058;0
4120;-742715.179999999701977;-1043974.089999999850988;0
4926;-742452.660000000149012;-1042896.190000001341105;0
4233;-742334.782000001519918;-1043445.793000001460314;0
6922;-742056.329999998211861;-1045086.679999999701977;0
1127;-741700.000000000000000;-1044440.000000000000000;0
393;-742384.000000000000000;-1043819.000000000000000;0
1288;-742189.000000000000000;-1044543.000000000000000;0
382;-742481.000000000000000;-1043751.000000000000000;0
7017;-742571.059999998658895;-1044267.640000000596046;0
3984;-743314.570000000298023;-1043905.594999998807907;0
7514;-742304.866000000387430;-1044375.124000001698732;0
734;-741935.000000000000000;-1043014.000000000000000;0
6701;-742295.142000000923872;-1044533.372000001370907;0
2079;-742688.000000000000000;-1044428.000000000000000;0
3792;-743110.019999999552965;-1042846.530000001192093;0
2488;-742083.000000000000000;-1044303.000000000000000;0
1182;-741915.000000000000000;-1044252.000000000000000;0
1830;-742961.000000000000000;-1044087.000000000000000;0
7291;-742809.960000000894070;-1044827.300000000745058;0
7276;-742801.670000001788139;-1044613.309999998658895;0
697;-742101.000000000000000;-1042908.000000000000000;0
503;-741879.000000000000000;-1043158.000000000000000;32
1362;-742017.000000000000000;-1044913.000000000000000;0
4178;-742382.640000000596046;-1044160.138000000268221;0
672;-742484.000000000000000;-1043226.000000000000000;0
8149;-743305.579999998211861;-1043204.070000000298023;0
3355;-743953.881000000983477;-1043031.379999998956919;0
3309;-743830.328000001609325;-1042834.535000000149012;0
1611;-742400.000000000000000;-1044442.000000000000000;0
6167;-742313.859999999403954;-1043063.607000000774860;0
2211;-743248.000000000000000;-1045258.000000000000000;0
3841;-743159.929999999701977;-1042641.120000001043081;0
7678;-742388.550999999046326;-1045109.184000000357628;0
2234;-743425.000000000000000;-1045221.000000000000000;0
1413;-741631.000000000000000;-1044621.000000000000000;0
2210;-743280.000000000000000;-1045237.000000000000000;0
4591;-742426.813000001013279;-1042640.035000000149012;0
5307;-743082.182000000029802;-1043190.162000000476837;0
3063;-744133.098999999463558;-1042851.478999998420477;0
6369;-741962.675000000745058;-1042665.013999998569489;0
3457;-745069.765000000596046;-1042699.907000001519918;0
5224;-743293.449999999254942;-1043542.160000000149012;0
7044;-743400.635000001639128;-1044135.579999998211861;0
4156;-742513.734999999403954;-1043978.035000000149012;0
4426;-742197.589999999850988;-1043031.679999999701977;0
6002;-742018.502000000327826;-1043294.918999999761581;0
6980;-743071.769999999552965;-1044387.548999998718500;0
6180;-742311.429000001400709;-1043057.635999999940395;0
1905;-743446.000000000000000;-1044312.000000000000000;0
8283;-742198.600000001490116;-1042801.980000000447035;0
1042;-741883.000000000000000;-1044682.000000000000000;0
6709;-742264.587999999523163;-1044776.254999998956919;0
3211;-743651.409000001847744;-1042483.458999998867512;0
6995;-743129.710000000894070;-1044496.579999998211861;0
333;-742651.000000000000000;-1043996.000000000000000;0
651;-742490.000000000000000;-1043564.000000000000000;0
1113;-741134.809999998658895;-1044594.289999999105930;0
5016;-742572.212000001221895;-1042955.526999998837709;0
2084;-742447.000000000000000;-1044797.000000000000000;0
2429;-742485.000000000000000;-1045149.000000000000000;0
204;-743208.000000000000000;-1043588.000000000000000;0
4119;-742717.223999999463558;-1043999.837999999523163;0
7260;-742953.010000001639128;-1044873.530000001192093;0
626;-742236.000000000000000;-1043317.000000000000000;0
973;-741908.000000000000000;-1044547.000000000000000;0
5267;-743190.021999999880791;-1043149.807000000029802;0
1934;-743294.000000000000000;-1044407.000000000000000;0
6502;-741658.278999999165535;-1044979.149000000208616;0
1939;-743269.000000000000000;-1044355.000000000000000;0
3275;-743665.002000000327826;-1042826.396999999880791;0
5167;-743219.324999999254942;-1043405.249000001698732;0
2217;-743112.000000000000000;-1045360.000000000000000;0
1919;-743381.000000000000000;-1044393.000000000000000;0
6114;-742234.250000000000000;-1043361.324999999254942;0
7315;-742603.960000000894070;-1045022.870000001043081;0
4062;-742830.460000000894070;-1043654.920000001788139;0
2559;-741323.000000000000000;-1044399.000000000000000;0
2021;-743281.000000000000000;-1044948.000000000000000;0
3951;-743433.379999998956919;-1043586.600000001490116;0
6163;-742316.921000000089407;-1043069.223000001162291;0
1423;-742167.000000000000000;-1044150.000000000000000;0
6792;-741101.151999998837709;-1044754.271000001579523;0
1422;-742199.000000000000000;-1044127.000000000000000;0
6479;-741969.831000000238419;-1044454.850000001490116;0
1663;-741455.000000000000000;-1044433.000000000000000;0
4047;-743210.230000000447035;-1043992.289999999105930;0
4563;-742461.379999998956919;-1042526.230000000447035;0
6846;-741505.875000000000000;-1044995.949000000953674;0
5174;-743296.331000000238419;-1043439.800000000745058;0
1892;-743525.000000000000000;-1044425.000000000000000;0
917;-742121.000000000000000;-1043008.000000000000000;0
1984;-743476.000000000000000;-1044743.000000000000000;0
4494;-741874.920000001788139;-1042616.660000000149012;0
4662;-742819.471000000834465;-1042530.037000000476837;0
2132;-743058.000000000000000;-1045118.000000000000000;0
1263;-742048.000000000000000;-1044929.000000000000000;0
2327;-742491.000000000000000;-1045502.000000000000000;0
1172;-741869.000000000000000;-1044348.000000000000000;0
4779;-742917.822999998927116;-1042727.385000001639128;0
1095;-741452.000000000000000;-1044553.000000000000000;0
269;-743248.000000000000000;-1043725.000000000000000;0
6280;-742306.918999999761581;-1043038.083000000566244;0
6856;-741514.510999999940395;-1044912.175999999046326;0
4595;-742574.953000001609325;-1042659.344000000506639;0
5370;-742580.300999999046326;-1042977.140999998897314;0
574;-742068.000000000000000;-1043538.000000000000000;0
1091;-741531.480000000447035;-1044543.440000001341105;0
885;-741739.000000000000000;-1042777.000000000000000;0
8270;-742019.480000000447035;-1042725.870000001043081;0
4071;-742929.394999999552965;-1043807.585000000894070;0
1109;-741204.100000001490116;-1044585.460000000894070;0
4022;-743268.934999998658895;-1043870.500000000000000;0
4995;-742476.986000001430511;-1042961.239000000059605;0
5323;-743049.401000000536442;-1043038.131000000983477;0
5681;-743400.820000000298023;-1043718.682000000029802;0
4249;-742151.910000000149012;-1043354.719999998807907;0
4708;-742755.420000001788139;-1042611.309999998658895;0
4067;-742913.594999998807907;-1043714.640000000596046;0
4024;-743223.734999999403954;-1043859.954999998211861;0
6232;-742316.034000001847744;-1043057.000000000000000;0
4184;-742311.379999998956919;-1044164.660000000149012;0
3172;-743927.828999999910593;-1042607.649000000208616;0
2403;-742211.000000000000000;-1045436.000000000000000;0
5205;-743251.475000001490116;-1043328.679000001400709;0
7325;-743032.969999998807907;-1045186.298999998718500;0
707;-741897.000000000000000;-1042863.000000000000000;0
1531;-741782.000000000000000;-1043838.000000000000000;0
7088;-743335.559999998658895;-1044546.359999999403954;0
5959;-742962.548999998718500;-1043523.155000001192093;0
2401;-742253.000000000000000;-1045390.000000000000000;0
3974;-743140.660000000149012;-1043725.350000001490116;0
6203;-742316.357000000774860;-1043062.256000000983477;0
2369;-742503.000000000000000;-1045427.000000000000000;0
2040;-743285.000000000000000;-1044809.000000000000000;0
3838;-743113.550000000745058;-1042543.399999998509884;0
4465;-742180.250000000000000;-1042584.370000001043081;0
4902;-742480.460000000894070;-1042802.989999998360872;0
3238;-744159.147999998182058;-1042638.964000001549721;0
7176;-742630.820000000298023;-1044585.809999998658895;0
7046;-743398.329999998211861;-1044186.289999999105930;0
6665;-741433.260000001639128;-1044189.760000001639128;0
5186;-743270.949999999254942;-1043526.039999999105930;0
1602;-742507.000000000000000;-1044924.000000000000000;0
3204;-743715.278999999165535;-1042506.118999999016523;0
4531;-742746.070000000298023;-1042885.980000000447035;0
6977;-743098.949999999254942;-1044459.879999998956919;0
5593;-743418.921000000089407;-1043679.927999999374151;0
5172;-743274.383999999612570;-1043432.322999998927116;0
6659;-741515.070000000298023;-1044171.070000000298023;0
2317;-742792.000000000000000;-1045467.000000000000000;0
1193;-741740.000000000000000;-1043981.000000000000000;0
4772;-742879.881999999284744;-1042872.157000001519918;0
1093;-741494.000000000000000;-1044548.000000000000000;0
7006;-742995.760000001639128;-1043976.245000001043081;0
576;-742054.000000000000000;-1043517.000000000000000;0
169;-743433.000000000000000;-1043334.000000000000000;0
216;-743023.000000000000000;-1043539.000000000000000;0
7801;-742459.168999999761581;-1044490.660000000149012;0
4696;-742682.817000001668930;-1042658.543999999761581;0
6996;-743116.699999999254942;-1044476.469999998807907;0
7994;-741529.219999998807907;-1045148.010000001639128;0
4966;-742377.289999999105930;-1043071.030000001192093;0
4827;-743046.359999999403954;-1042958.140000000596046;0
1037;-741958.000000000000000;-1044950.000000000000000;0
4824;-742918.673000000417233;-1042871.875000000000000;0
4815;-742992.210000000894070;-1042788.359999999403954;0
5143;-743052.232000000774860;-1043454.120000001043081;0
2465;-743493.000000000000000;-1044697.000000000000000;0
1306;-741783.000000000000000;-1044653.000000000000000;0
111;-745351.000000000000000;-1042795.000000000000000;0
792;-741718.000000000000000;-1042599.000000000000000;0
7003;-743074.140000000596046;-1044350.280000001192093;0
3950;-743426.829999998211861;-1043556.070000000298023;0
7175;-742651.780000001192093;-1044558.149999998509884;0
2092;-742917.000000000000000;-1044617.000000000000000;0
4989;-742648.756000000983477;-1043019.318999998271465;0
1621;-742467.000000000000000;-1044322.000000000000000;0
3521;-744869.699000000953674;-1042677.925999999046326;0
2361;-742323.000000000000000;-1045576.000000000000000;0
1444;-741559.000000000000000;-1044786.000000000000000;0
696;-742077.000000000000000;-1042913.000000000000000;0
2045;-743418.000000000000000;-1044961.000000000000000;0
2475;-743411.000000000000000;-1044901.000000000000000;0
4774;-742900.078999999910593;-1042854.859000001102686;0
1398;-741753.000000000000000;-1044201.000000000000000;0
2330;-742403.000000000000000;-1045511.000000000000000;0
7645;-742305.313000001013279;-1045383.625000000000000;0
1266;-742052.000000000000000;-1044980.000000000000000;0
4592;-742448.190999999642372;-1042642.517999999225140;0
1396;-741798.000000000000000;-1044263.000000000000000;0
1852;-742739.000000000000000;-1044210.000000000000000;0
183;-743438.000000000000000;-1043422.000000000000000;0
4998;-742514.109000001102686;-1042978.602000001817942;0
5296;-743058.934999998658895;-1043177.035000000149012;0
2424;-742476.000000000000000;-1045132.000000000000000;0
7215;-742484.320000000298023;-1044546.620000001043081;0
5022;-742578.440000001341105;-1042849.350000001490116;0
5722;-743419.659000001847744;-1043631.798000000417233;0
4906;-742448.370000001043081;-1042815.789999999105930;0
4243;-742194.050000000745058;-1043431.899999998509884;0
2244;-743264.000000000000000;-1045331.000000000000000;0
5245;-743368.859999999403954;-1043290.789999999105930;0
577;-742038.000000000000000;-1043521.000000000000000;0
248;-743439.000000000000000;-1043748.000000000000000;0
4572;-742343.539999999105930;-1042598.289999999105930;0
7677;-742383.142000000923872;-1045124.221000000834465;0
2332;-742899.000000000000000;-1045516.000000000000000;0
3701;-744582.008000001311302;-1042507.443999998271465;0
5698;-743416.785999998450279;-1043633.638000000268221;0
1813;-743118.000000000000000;-1044528.000000000000000;0
4814;-743000.489999998360872;-1042803.920000001788139;0
5118;-742835.168000001460314;-1043315.074000000953674;0
3802;-743068.190000001341105;-1042879.710000000894070;0
5171;-743266.124000001698732;-1043419.293999999761581;0
7026;-743217.644999999552965;-1044082.329999998211861;0
2543;-741788.000000000000000;-1044237.000000000000000;0
6183;-742316.633999999612570;-1043065.732000000774860;0
5173;-743291.175999999046326;-1043426.754999998956919;0
6771;-741345.015999998897314;-1044413.647999998182058;0
4207;-742354.105999998748302;-1043530.157999999821186;0
1790;-742152.000000000000000;-1044138.000000000000000;0
1617;-742384.000000000000000;-1044407.000000000000000;0
2495;-741982.000000000000000;-1044140.000000000000000;0
324;-742694.000000000000000;-1044132.000000000000000;0
5411;-742776.079999998211861;-1042905.300000000745058;0
4736;-742701.269999999552965;-1042690.000000000000000;0
5275;-743019.763000000268221;-1043300.774999998509884;0
381;-742465.000000000000000;-1043700.000000000000000;0
731;-741925.000000000000000;-1042997.000000000000000;0
4037;-743205.375000000000000;-1043771.175000000745058;0
280;-743053.000000000000000;-1043875.000000000000000;0
1198;-741636.000000000000000;-1043836.000000000000000;0
6248;-742372.506000000983477;-1043051.769999999552965;0
1400;-741719.000000000000000;-1044132.000000000000000;0
4429;-742222.260000001639128;-1043102.250000000000000;0
3263;-743570.528999999165535;-1042712.653999999165535;0
1070;-741665.000000000000000;-1044736.000000000000000;0
1094;-741513.000000000000000;-1044561.000000000000000;0
7041;-743381.004999998956919;-1044158.699999999254942;0
6040;-742075.469999998807907;-1043676.809999998658895;0
2029;-743393.000000000000000;-1045068.000000000000000;0
648;-742246.000000000000000;-1043363.000000000000000;0
3961;-743419.609999999403954;-1043589.497000001370907;0
740;-741759.000000000000000;-1043031.000000000000000;0
7033;-743303.864999998360872;-1044132.750000000000000;0
555;-742230.000000000000000;-1043726.000000000000000;0
1687;-741142.120000001043081;-1044817.019999999552965;0
4747;-742866.289999999105930;-1042753.390000000596046;0
2346;-742654.000000000000000;-1045546.000000000000000;0
5975;-745052.346999999135733;-1042674.673000000417233;0
3810;-743261.510000001639128;-1042802.960000000894070;0
1224;-742174.000000000000000;-1044253.000000000000000;0
8260;-742091.730000000447035;-1042690.769999999552965;0
6362;-742039.230999998748302;-1042680.660000000149012;0
7132;-743262.120000001043081;-1044825.699999999254942;0
7976;-741301.260000001639128;-1044401.750000000000000;0
7;-743479.000000000000000;-1042567.000000000000000;155
2334;-742872.000000000000000;-1045519.000000000000000;0
6143;-742309.690999999642372;-1043060.385000001639128;0
6231;-742316.769000001251698;-1043058.344000000506639;0
4750;-742784.420000001788139;-1042733.429999999701977;0
1472;-741677.000000000000000;-1044145.000000000000000;0
3570;-744649.160000000149012;-1042588.129999998956919;0
1505;-741606.000000000000000;-1044248.000000000000000;0
206;-743179.000000000000000;-1043581.000000000000000;0
4876;-742826.449999999254942;-1042944.910000000149012;0
5002;-742561.190000001341105;-1042977.401999998837709;0
1000;-741828.000000000000000;-1044502.000000000000000;0
5360;-742453.188999999314547;-1042938.521999999880791;0
3760;-743233.829999998211861;-1042978.739999998360872;0
5409;-743745.201000001281500;-1042902.750000000000000;0
5700;-743416.574000000953674;-1043630.223999999463558;0
5231;-743342.107000000774860;-1043497.627000000327826;0
430;-742185.000000000000000;-1043888.000000000000000;0
2233;-743461.000000000000000;-1045218.000000000000000;0
5683;-743398.456000000238419;-1043719.557999998331070;0
3886;-742385.100000001490116;-1042445.500000000000000;0
6297;-742506.859999999403954;-1042634.250000000000000;0
1300;-741917.410000000149012;-1044719.769999999552965;0
1421;-741587.000000000000000;-1044356.000000000000000;0
1752;-742070.000000000000000;-1045197.000000000000000;0
824;-742142.000000000000000;-1042596.000000000000000;0
4636;-742576.870999999344349;-1042687.116999998688698;0
1449;-741533.000000000000000;-1044684.000000000000000;0
4898;-742571.280000001192093;-1042840.859999999403954;0
402;-742342.000000000000000;-1043952.000000000000000;0
3811;-743244.620000001043081;-1042809.420000001788139;0
2060;-742659.000000000000000;-1044472.000000000000000;0
2090;-742923.000000000000000;-1044566.000000000000000;0
4332;-742410.359000001102686;-1043282.916000001132488;0
6365;-741979.230000000447035;-1042656.230000000447035;0
3369;-743878.633000001311302;-1043011.739000000059605;0
6139;-742312.807000000029802;-1043066.006000000983477;0
6360;-742004.925000000745058;-1042692.804000001400709;0
3520;-744858.912000000476837;-1042688.364000000059605;0
836;-742006.000000000000000;-1042525.000000000000000;0
4143;-742750.925000000745058;-1044017.960000000894070;0
4504;-742387.329999998211861;-1042714.820000000298023;0
575;-742053.000000000000000;-1043541.000000000000000;0
6095;-742082.920000001788139;-1043614.710000000894070;0
4706;-742728.070000000298023;-1042610.910000000149012;0
4990;-742657.837999999523163;-1043024.199999999254942;0
5639;-743428.337999999523163;-1043685.046999998390675;0
7542;-742623.890000000596046;-1045372.899999998509884;0
2020;-743260.000000000000000;-1044941.000000000000000;0
2515;-742517.000000000000000;-1044420.000000000000000;0
4620;-742539.574000000953674;-1042537.307999998331070;0
536;-742085.000000000000000;-1043673.000000000000000;0
506;-741980.000000000000000;-1043158.000000000000000;0
2560;-741251.000000000000000;-1044390.000000000000000;0
4878;-742876.434000000357628;-1042964.004000000655651;0
4478;-741867.359999999403954;-1042693.289999999105930;0
2360;-742331.000000000000000;-1045596.000000000000000;0
2389;-742076.000000000000000;-1045396.000000000000000;0
5209;-743271.947999998927116;-1043361.392000000923872;0
1310;-741623.000000000000000;-1044829.000000000000000;0
1237;-742144.000000000000000;-1044365.000000000000000;0
4039;-743159.070000000298023;-1043772.795000001788139;0
4833;-743036.859999999403954;-1042820.050000000745058;0
1311;-741646.000000000000000;-1044831.000000000000000;0
3995;-743393.225000001490116;-1043973.719999998807907;0
6256;-742380.723000001162291;-1043035.640000000596046;0
2435;-742452.000000000000000;-1044222.000000000000000;0
4107;-742652.458999998867512;-1043744.934000000357628;0
6278;-742305.421999998390675;-1043028.918000001460314;0
6296;-742543.019999999552965;-1042643.350000001490116;0
5003;-742589.811999998986721;-1042974.888999998569489;0
2093;-742915.000000000000000;-1044642.000000000000000;0
4006;-743302.763000000268221;-1044052.298999998718500;0
7157;-742964.840999998152256;-1044545.681000001728535;0
4341;-742488.855000000447035;-1043325.412999998778105;0
3364;-743855.184999998658895;-1043024.940000001341105;0
6963;-743004.519999999552965;-1044166.870000001043081;0
6204;-742315.578999999910593;-1043060.826000001281500;0
700;-742008.000000000000000;-1042895.000000000000000;0
250;-743428.000000000000000;-1043794.000000000000000;0
4969;-742465.059999998658895;-1043095.034000001847744;0
4892;-742663.079999998211861;-1042817.344999998807907;0
4742;-742822.300000000745058;-1042747.920000001788139;0
5139;-743032.489999998360872;-1043533.679999999701977;0
5648;-743429.164000000804663;-1043695.905999999493361;0
5125;-742992.826000001281500;-1043402.497999999672174;0
6722;-742357.717000000178814;-1044705.708000000566244;0
5969;-742284.809999998658895;-1044169.578000001609325;0
6492;-742174.054000001400709;-1044455.534000001847744;0
4935;-742447.241999998688698;-1042699.399000000208616;0
825;-742171.000000000000000;-1042598.000000000000000;0
7281;-742801.859999999403954;-1044705.300000000745058;0
533;-742137.000000000000000;-1043750.000000000000000;0
6811;-741110.469999998807907;-1044663.493000000715256;0
3464;-745066.756000000983477;-1042677.120999999344349;0
2503;-742753.000000000000000;-1045484.000000000000000;0
679;-742404.000000000000000;-1043185.000000000000000;0
4570;-742347.760000001639128;-1042540.809999998658895;0
941;-742098.000000000000000;-1043132.000000000000000;0
219;-742979.000000000000000;-1043549.000000000000000;0
591;-741912.000000000000000;-1043346.000000000000000;0
