OID_;X;Y;TEMPERATURE
2696;-743477.489999998360872;-1042038.000000000000000;0
2258;-742974.000000000000000;-1045574.000000000000000;0
1584;-742368.000000000000000;-1044717.000000000000000;0
3582;-744914.405999999493361;-1042603.405999999493361;0
2265;-742972.000000000000000;-1045774.000000000000000;0
3836;-743096.070000000298023;-1042561.879999998956919;0
466;-741743.000000000000000;-1043331.000000000000000;0
2886;-744104.953999999910593;-1043172.171999998390675;0
6872;-741751.719999998807907;-1045296.679999999701977;0
4086;-742813.079999998211861;-1043631.730000000447035;0
227;-742846.000000000000000;-1043520.000000000000000;0
3238;-744159.147999998182058;-1042638.964000001549721;0
1765;-741159.000000000000000;-1044178.000000000000000;0
603;-741810.000000000000000;-1043205.000000000000000;0
7515;-742273.021999999880791;-1044371.543999999761581;0
2097;-743143.000000000000000;-1044742.000000000000000;0
3457;-745069.765000000596046;-1042699.907000001519918;0
1703;-741320.000000000000000;-1044686.000000000000000;0
3019;-744463.447999998927116;-1042784.646000001579523;0
732;-741860.000000000000000;-1043003.000000000000000;0
7943;-742063.449999999254942;-1044055.260000001639128;0
2403;-742211.000000000000000;-1045436.000000000000000;0
6705;-742279.050999999046326;-1044655.923000000417233;0
6747;-742410.170000001788139;-1044287.228000000119209;0
1448;-741537.000000000000000;-1044716.000000000000000;0
2503;-742753.000000000000000;-1045484.000000000000000;0
6688;-742383.146999999880791;-1045009.361000001430511;0
507;-741953.000000000000000;-1043148.000000000000000;0
1873;-743410.000000000000000;-1044260.000000000000000;0
5225;-743277.453999999910593;-1043558.087999999523163;0
7137;-742916.074999999254942;-1044400.230000000447035;0
4178;-742382.640000000596046;-1044160.138000000268221;0
4068;-742917.125000000000000;-1043734.535000000149012;0
2026;-743351.000000000000000;-1045022.000000000000000;0
1938;-743289.000000000000000;-1044306.000000000000000;0
2286;-742894.000000000000000;-1045440.000000000000000;0
3997;-743395.094999998807907;-1044031.109999999403954;24
3212;-743646.699000000953674;-1042469.458999998867512;0
1005;-741944.000000000000000;-1044583.000000000000000;0
579;-742006.000000000000000;-1043477.000000000000000;0
1250;-742103.000000000000000;-1044672.000000000000000;0
2758;-743919.949999999254942;-1043488.059999998658895;0
7149;-742823.379000000655651;-1044496.758000001311302;0
1053;-741768.000000000000000;-1045023.000000000000000;0
1523;-741679.000000000000000;-1043865.000000000000000;0
8079;-742021.839999999850988;-1045292.179999999701977;0
2355;-742465.000000000000000;-1045568.000000000000000;0
6;-743464.000000000000000;-1042594.000000000000000;0
6195;-742314.956000000238419;-1043061.181000001728535;0
2537;-741975.000000000000000;-1044131.000000000000000;0
526;-742209.000000000000000;-1043849.000000000000000;0
7199;-742570.910000000149012;-1044916.410000000149012;0
2748;-743933.984000001102686;-1043445.734000001102686;0
5139;-743032.489999998360872;-1043533.679999999701977;0
741;-741730.000000000000000;-1043035.000000000000000;0
2378;-742372.000000000000000;-1045503.000000000000000;0
7661;-742294.495999999344349;-1045349.482000000774860;0
711;-741828.000000000000000;-1042860.000000000000000;95
1148;-741324.000000000000000;-1044481.000000000000000;0
1266;-742052.000000000000000;-1044980.000000000000000;0
343;-742575.000000000000000;-1043857.000000000000000;0
6295;-742653.399999998509884;-1042696.070000000298023;0
910;-742219.000000000000000;-1042529.000000000000000;0
1984;-743476.000000000000000;-1044743.000000000000000;0
2247;-743199.000000000000000;-1045400.000000000000000;0
1522;-741841.000000000000000;-1043893.000000000000000;0
2092;-742917.000000000000000;-1044617.000000000000000;0
3612;-744996.545000001788139;-1042292.646000001579523;0
597;-741855.000000000000000;-1043268.000000000000000;0
8061;-742290.579999998211861;-1045109.600000001490116;0
727;-742001.000000000000000;-1042962.000000000000000;0
389;-742408.000000000000000;-1043783.000000000000000;0
728;-741997.000000000000000;-1042918.000000000000000;0
7801;-742459.168999999761581;-1044490.660000000149012;0
6977;-743098.949999999254942;-1044459.879999998956919;0
7260;-742953.010000001639128;-1044873.530000001192093;0
7209;-742570.339999999850988;-1045040.429999999701977;0
6982;-743055.109999999403954;-1044342.629999998956919;0
3377;-743832.151999998837709;-1042925.721000000834465;0
3128;-743948.160000000149012;-1042657.320000000298023;0
4224;-742139.756000000983477;-1043462.488000001758337;0
1348;-741801.000000000000000;-1044829.000000000000000;0
4239;-742454.206000000238419;-1043538.927999999374151;0
4890;-742605.287000000476837;-1042838.535000000149012;0
7249;-742789.010999999940395;-1044830.250000000000000;0
2465;-743493.000000000000000;-1044697.000000000000000;0
7132;-743262.120000001043081;-1044825.699999999254942;0
6692;-742222.114999998360872;-1044818.673000000417233;0
7183;-742606.379999998956919;-1044692.969999998807907;0
4649;-742732.228999998420477;-1042525.100000001490116;0
6778;-741060.820000000298023;-1044484.339999999850988;0
4075;-742947.934999998658895;-1043903.649999998509884;0
2474;-743439.000000000000000;-1044900.000000000000000;0
7011;-742831.309999998658895;-1044257.245000001043081;0
2048;-743528.000000000000000;-1045069.000000000000000;0
4743;-742812.449999999254942;-1042729.609999999403954;0
2193;-743531.000000000000000;-1045204.000000000000000;0
4208;-742372.416999999433756;-1043503.423000000417233;0
2558;-741286.000000000000000;-1044387.000000000000000;0
4084;-742817.504999998956919;-1043681.475000001490116;0
3065;-744092.028999999165535;-1042868.519000001251698;0
587;-741944.000000000000000;-1043391.000000000000000;0
1303;-741865.000000000000000;-1044692.000000000000000;0
928;-744070.000000000000000;-1043299.000000000000000;0
5124;-742983.513000000268221;-1043417.271999999880791;0
3999;-743412.539999999105930;-1043918.725000001490116;0
1235;-742150.000000000000000;-1044330.000000000000000;0
1088;-741617.000000000000000;-1044547.000000000000000;0
339;-742606.000000000000000;-1043916.000000000000000;0
1376;-742165.000000000000000;-1044873.000000000000000;0
7221;-742394.890000000596046;-1044813.550000000745058;0
5117;-742816.081999998539686;-1043298.302999999374151;0
4712;-742830.309999998658895;-1042614.969999998807907;0
3781;-743273.059999998658895;-1042814.050000000745058;0
4174;-742738.230000000447035;-1043763.155000001192093;0
3761;-743202.559999998658895;-1042981.710000000894070;0
4210;-742178.550000000745058;-1043586.035000000149012;0
4501;-742368.980000000447035;-1042705.100000001490116;0
6835;-741618.964000001549721;-1044934.515000000596046;0
7077;-743564.359000001102686;-1045385.210000000894070;0
5957;-742962.627000000327826;-1043510.905000001192093;0
4332;-742410.359000001102686;-1043282.916000001132488;0
3371;-743840.392999999225140;-1043010.835000000894070;0
3561;-744699.155999999493361;-1042614.903999999165535;0
2254;-743235.000000000000000;-1045290.000000000000000;0
509;-741991.000000000000000;-1043143.000000000000000;0
1127;-741700.000000000000000;-1044440.000000000000000;0
6665;-741433.260000001639128;-1044189.760000001639128;0
1342;-741721.000000000000000;-1044783.000000000000000;0
2300;-742561.000000000000000;-1045413.000000000000000;0
390;-742429.000000000000000;-1043827.000000000000000;0
178;-743389.000000000000000;-1043251.000000000000000;0
5998;-742019.482000000774860;-1043283.164000000804663;0
5230;-743335.399999998509884;-1043517.670000001788139;0
6846;-741505.875000000000000;-1044995.949000000953674;0
7682;-742503.329999998211861;-1045169.949999999254942;0
3799;-743117.550000000745058;-1042868.160000000149012;0
1723;-741611.000000000000000;-1045092.000000000000000;0
558;-742200.000000000000000;-1043683.000000000000000;0
7970;-741444.739999998360872;-1044384.980000000447035;0
7026;-743217.644999999552965;-1044082.329999998211861;0
6820;-741224.105999998748302;-1044799.311999998986721;0
1368;-741998.000000000000000;-1044779.000000000000000;0
1116;-741125.980000000447035;-1044610.410000000149012;0
2379;-742291.000000000000000;-1045388.000000000000000;0
1650;-741371.000000000000000;-1044490.000000000000000;0
4844;-742977.256000000983477;-1042754.953000001609325;0
7966;-741489.800000000745058;-1044356.219999998807907;0
2138;-742958.000000000000000;-1045095.000000000000000;0
2512;-743070.000000000000000;-1044052.000000000000000;0
5766;-742429.719999998807907;-1042597.699999999254942;0
2320;-742707.000000000000000;-1045477.000000000000000;0
1772;-741277.000000000000000;-1044012.000000000000000;0
731;-741925.000000000000000;-1042997.000000000000000;0
1263;-742048.000000000000000;-1044929.000000000000000;0
1287;-742217.000000000000000;-1044486.000000000000000;0
6157;-742314.026999998837709;-1043065.331000000238419;0
5410;-742572.837000001221895;-1042981.173999998718500;0
2397;-742181.000000000000000;-1045368.000000000000000;0
516;-742160.000000000000000;-1043135.000000000000000;0
515;-742176.000000000000000;-1043121.000000000000000;0
5396;-744557.436000000685453;-1042656.633000001311302;0
7215;-742484.320000000298023;-1044546.620000001043081;0
1377;-742146.969999998807907;-1044922.489999998360872;0
7017;-742571.059999998658895;-1044267.640000000596046;0
7176;-742630.820000000298023;-1044585.809999998658895;0
538;-742113.000000000000000;-1043652.000000000000000;0
3340;-743960.212999999523163;-1043080.166999999433756;0
6146;-742314.942000001668930;-1043068.475999999791384;0
4073;-742939.109999999403954;-1043858.504999998956919;0
6765;-741163.449999999254942;-1044427.199999999254942;0
3677;-744603.943999998271465;-1042491.761999998241663;0
323;-742711.000000000000000;-1044140.000000000000000;21
1094;-741513.000000000000000;-1044561.000000000000000;0
2490;-742063.000000000000000;-1044273.000000000000000;0
5641;-743428.517000000923872;-1043687.460000000894070;0
4608;-742555.160999998450279;-1042637.633999999612570;0
3359;-743951.136999998241663;-1043051.339000001549721;0
4124;-742751.265000000596046;-1043878.414999999105930;0
1911;-743449.000000000000000;-1044447.000000000000000;0
827;-742218.000000000000000;-1042626.000000000000000;0
7138;-742917.554999999701977;-1044421.774999998509884;0
3887;-742347.760000001639128;-1042449.881000000983477;0
1701;-741378.000000000000000;-1044678.000000000000000;0
4080;-742832.480000000447035;-1043782.030000001192093;0
3289;-743584.761999998241663;-1042769.188000001013279;0
8257;-742149.809999998658895;-1045048.399999998509884;0
8284;-742219.410000000149012;-1042809.500000000000000;0
5316;-743075.980000000447035;-1043041.059999998658895;0
4775;-742898.375999998301268;-1042802.914000000804663;0
4905;-742467.730000000447035;-1042815.620000001043081;0
1142;-741437.000000000000000;-1044466.000000000000000;0
1921;-743387.000000000000000;-1044335.000000000000000;0
4949;-742369.969999998807907;-1042973.199999999254942;0
5684;-743397.274000000208616;-1043719.995999999344349;0
1516;-741928.000000000000000;-1044062.000000000000000;0
3985;-743312.765000000596046;-1043928.164999999105930;0
1147;-741346.000000000000000;-1044466.000000000000000;0
4710;-742796.730000000447035;-1042611.769999999552965;0
4831;-743041.170000001788139;-1042862.530000001192093;0
4242;-742214.469999998807907;-1043415.800000000745058;0
6651;-741697.910000000149012;-1044123.329999998211861;0
1439;-741772.000000000000000;-1044379.000000000000000;0
203;-743204.000000000000000;-1043607.000000000000000;0
2108;-743147.000000000000000;-1045086.000000000000000;0
2223;-743053.000000000000000;-1045437.000000000000000;0
382;-742481.000000000000000;-1043751.000000000000000;0
314;-742585.000000000000000;-1044184.000000000000000;0
676;-742442.000000000000000;-1043196.000000000000000;0
2159;-742822.000000000000000;-1045141.000000000000000;0
694;-742280.000000000000000;-1043043.000000000000000;0
3519;-744889.844999998807907;-1042681.971000000834465;0
2508;-742961.000000000000000;-1044050.000000000000000;0
5444;-743183.024000000208616;-1043210.600000001490116;0
650;-742263.000000000000000;-1043381.000000000000000;0
753;-741692.000000000000000;-1042713.000000000000000;0
5295;-743047.995000001043081;-1043185.530000001192093;0
4895;-742596.936999998986721;-1042829.168000001460314;0
4233;-742334.782000001519918;-1043445.793000001460314;0
5082;-742925.114000000059605;-1043348.883999999612570;0
8259;-742072.089999999850988;-1042687.219999998807907;0
1513;-741852.000000000000000;-1044118.000000000000000;0
4130;-742868.460000000894070;-1044055.510000001639128;0
6170;-742311.548000000417233;-1043059.381000000983477;0
3976;-743088.861000001430511;-1043707.728000000119209;0
4964;-742390.059999998658895;-1043044.839999999850988;0
6649;-741731.100000001490116;-1044094.850000001490116;0
3233;-744152.962999999523163;-1042686.791999999433756;0
159;-742965.000000000000000;-1042641.000000000000000;0
6190;-742318.782999999821186;-1043068.206000000238419;0
4638;-742553.631999999284744;-1042542.028000000864267;0
833;-742050.000000000000000;-1042573.000000000000000;0
6354;-741928.410000000149012;-1042711.350000001490116;0
810;-741934.000000000000000;-1042519.000000000000000;0
7091;-743361.839999999850988;-1044584.039999999105930;0
6306;-741842.129999998956919;-1042752.739999998360872;0
625;-742247.000000000000000;-1043299.000000000000000;0
4716;-742893.160000000149012;-1042622.780000001192093;0
616;-742153.000000000000000;-1043272.000000000000000;0
7973;-741347.850000001490116;-1044381.850000001490116;0
4512;-742515.339999999850988;-1042750.230000000447035;0
6486;-741772.072999998927116;-1044516.256000000983477;0
3820;-743111.699999999254942;-1042659.320000000298023;0
2235;-743401.000000000000000;-1045221.000000000000000;0
4584;-742417.721999999135733;-1042627.620999999344349;0
223;-742920.000000000000000;-1043542.000000000000000;0
183;-743438.000000000000000;-1043422.000000000000000;0
1061;-741586.000000000000000;-1045133.000000000000000;0
1768;-741265.000000000000000;-1044133.000000000000000;0
6365;-741979.230000000447035;-1042656.230000000447035;0
395;-742369.000000000000000;-1043840.000000000000000;0
1286;-742221.460000000894070;-1044465.969999998807907;0
5229;-743327.379999998956919;-1043528.620000001043081;0
2325;-742559.000000000000000;-1045494.000000000000000;0
4773;-742888.429000001400709;-1042839.530000001192093;0
4029;-743130.695999998599291;-1043815.427999999374151;0
4197;-742179.633999999612570;-1043776.899000000208616;0
7047;-743395.495000001043081;-1044210.765000000596046;0
5999;-741991.910000000149012;-1043282.079999998211861;0
383;-742450.000000000000000;-1043722.000000000000000;0
1521;-741808.000000000000000;-1043917.000000000000000;0
6233;-742319.057000000029802;-1043072.162999998778105;0
2331;-742895.000000000000000;-1045530.000000000000000;0
7033;-743303.864999998360872;-1044132.750000000000000;0
6363;-742027.344999998807907;-1042665.324000000953674;0
3092;-743909.377999998629093;-1042780.322999998927116;0
1434;-741931.000000000000000;-1044293.000000000000000;0
6414;-743703.410999998450279;-1042881.958000000566244;0
3752;-743213.949999999254942;-1042902.719999998807907;0
1622;-742495.000000000000000;-1044321.000000000000000;0
2167;-743021.000000000000000;-1045154.000000000000000;0
1036;-741961.000000000000000;-1044922.000000000000000;0
5174;-743296.331000000238419;-1043439.800000000745058;0
4058;-743138.765000000596046;-1043625.405000001192093;0
993;-741977.000000000000000;-1044436.000000000000000;0
6706;-742275.234999999403954;-1044689.607999999076128;0
5036;-742666.855999998748302;-1042990.710000000894070;0
4875;-742814.660000000149012;-1042937.800000000745058;0
2514;-742546.000000000000000;-1044431.000000000000000;0
4140;-742831.635999999940395;-1044004.828999999910593;0
695;-742207.000000000000000;-1043019.000000000000000;0
1505;-741606.000000000000000;-1044248.000000000000000;0
6389;-742141.199999999254942;-1042497.030000001192093;0
6824;-741347.350000001490116;-1044784.280000001192093;0
699;-742067.000000000000000;-1042896.000000000000000;0
1572;-742265.000000000000000;-1044184.000000000000000;0
1171;-741882.000000000000000;-1044375.000000000000000;0
3418;-743758.105000000447035;-1043107.024999998509884;0
1333;-741781.000000000000000;-1044777.000000000000000;0
5163;-743163.861999999731779;-1043392.113000001758337;0
847;-742155.000000000000000;-1042504.000000000000000;0
5724;-743422.230999998748302;-1043632.715999998152256;0
730;-741948.000000000000000;-1042998.000000000000000;0
4142;-742777.425000000745058;-1044013.440000001341105;0
914;-741715.000000000000000;-1042583.000000000000000;0
1973;-743394.000000000000000;-1044931.000000000000000;0
7;-743479.000000000000000;-1042567.000000000000000;0
6172;-742317.552999999374151;-1043068.875999998301268;0
4048;-743218.050000000745058;-1043961.320000000298023;0
1815;-743083.000000000000000;-1044478.000000000000000;0
3268;-743594.046999998390675;-1042721.412999998778105;0
4465;-742180.250000000000000;-1042584.370000001043081;0
1795;-742155.000000000000000;-1044231.000000000000000;0
5165;-743191.168000001460314;-1043398.304000001400709;0
6699;-742301.118999999016523;-1044484.282999999821186;0
1496;-741253.000000000000000;-1044321.000000000000000;0
1181;-741920.000000000000000;-1044230.000000000000000;0
6504;-741755.193999998271465;-1044619.083000000566244;0
1013;-742076.000000000000000;-1044595.000000000000000;0
4888;-742649.925999999046326;-1042830.767000000923872;0
1832;-743024.000000000000000;-1044100.000000000000000;0
7950;-741950.460000000894070;-1044150.710000000894070;0
5087;-742847.622999999672174;-1043250.081000000238419;0
7654;-742242.081000000238419;-1045273.263999998569489;0
1335;-741752.000000000000000;-1044833.000000000000000;0
1611;-742400.000000000000000;-1044442.000000000000000;0
5000;-742542.798000000417233;-1042978.486999999731779;0
6191;-742318.017000000923872;-1043066.800999999046326;0
1223;-742190.000000000000000;-1044277.000000000000000;0
2239;-743345.000000000000000;-1045263.000000000000000;0
673;-742467.000000000000000;-1043230.000000000000000;0
6830;-741526.739999998360872;-1044761.309000000357628;0
1489;-741055.000000000000000;-1044209.000000000000000;0
6478;-741931.429999999701977;-1044453.500000000000000;0
5235;-743350.096000000834465;-1043388.881000000983477;0
1957;-743402.000000000000000;-1044519.000000000000000;0
6817;-741052.879000000655651;-1044823.684999998658895;0
647;-742216.000000000000000;-1043375.000000000000000;0
5;-743466.000000000000000;-1042616.000000000000000;0
1755;-742144.000000000000000;-1045199.000000000000000;0
6273;-742321.806000001728535;-1043017.085000000894070;0
5726;-743422.414000000804663;-1043635.760999999940395;0
7275;-742794.339999999850988;-1044627.140000000596046;0
6212;-742317.006000000983477;-1043061.888000000268221;0
5688;-743415.267000000923872;-1043631.945000000298023;0
1953;-743344.000000000000000;-1044500.000000000000000;0
4056;-743125.315000001341105;-1043671.969999998807907;0
619;-742229.000000000000000;-1043277.000000000000000;0
3310;-743829.561999998986721;-1042854.063000001013279;0
3432;-743687.646000001579523;-1042976.611999999731779;0
4933;-742437.605000000447035;-1042750.853000000119209;0
1467;-741808.000000000000000;-1044064.000000000000000;0
262;-743408.000000000000000;-1043731.000000000000000;0
6448;-744017.179999999701977;-1043123.899999998509884;0
7965;-741515.510000001639128;-1044348.350000001490116;0
4776;-742909.276000000536442;-1042820.587000001221895;0
1229;-742244.000000000000000;-1044253.000000000000000;0
3763;-743140.420000001788139;-1042987.649999998509884;0
6174;-742316.021999999880791;-1043066.065000001341105;0
4127;-742837.324999999254942;-1044032.670000001788139;0
5746;-743415.399000000208616;-1043698.644000001251698;0
4680;-742759.370000001043081;-1042864.140000000596046;0
6352;-741906.920000001788139;-1042710.609999999403954;0
3810;-743261.510000001639128;-1042802.960000000894070;0
6691;-742386.879000000655651;-1045082.589000001549721;0
2398;-742150.000000000000000;-1045370.000000000000000;0
7985;-741091.269999999552965;-1044419.039999999105930;0
2483;-741266.219999998807907;-1044755.030000001192093;0
4726;-742863.519999999552965;-1042684.000000000000000;0
1378;-742161.000000000000000;-1044904.000000000000000;0
1754;-742120.000000000000000;-1045193.000000000000000;0
5703;-743417.385000001639128;-1043633.592000000178814;0
6603;-741616.600000001490116;-1043854.019999999552965;0
1298;-741964.000000000000000;-1044736.000000000000000;0
5651;-743429.440999999642372;-1043699.524999998509884;0
825;-742171.000000000000000;-1042598.000000000000000;0
3797;-743147.989999998360872;-1042854.129999998956919;0
5148;-743071.477000001817942;-1043411.539999999105930;0
3839;-743112.140000000596046;-1042558.280000001192093;0
4143;-742750.925000000745058;-1044017.960000000894070;0
1418;-741620.000000000000000;-1044458.000000000000000;0
6280;-742306.918999999761581;-1043038.083000000566244;0
3160;-743959.590999998152256;-1042557.386999998241663;0
2080;-742685.000000000000000;-1044460.000000000000000;0
3979;-743340.934999998658895;-1043779.414999999105930;0
402;-742342.000000000000000;-1043952.000000000000000;0
4161;-742506.254999998956919;-1044181.925000000745058;0
7290;-742819.100000001490116;-1044794.800000000745058;0
4529;-742762.920000001788139;-1042885.809999998658895;0
1460;-741482.000000000000000;-1044302.000000000000000;0
5690;-743415.532999999821186;-1043635.447000000625849;0
6514;-741730.449999999254942;-1044087.109999999403954;0
2544;-741753.000000000000000;-1044252.000000000000000;0
4957;-742366.010000001639128;-1043006.059999998658895;0
4107;-742652.458999998867512;-1043744.934000000357628;0
4788;-742970.409000001847744;-1042588.238000001758337;0
5283;-743032.892000000923872;-1043284.399000000208616;0
1702;-741348.000000000000000;-1044682.000000000000000;0
5581;-743409.978999998420477;-1043638.324000000953674;0
3410;-743766.532000001519918;-1043023.280999999493361;0
8266;-742220.320000000298023;-1042706.760000001639128;0
208;-743146.000000000000000;-1043573.000000000000000;0
4947;-742399.918000001460314;-1042993.458000000566244;0
4860;-742964.800999999046326;-1043016.107999999076128;0
5172;-743274.383999999612570;-1043432.322999998927116;0
3949;-743420.780000001192093;-1043527.820000000298023;0
2149;-742819.000000000000000;-1045024.000000000000000;0
1098;-741435.000000000000000;-1044571.000000000000000;0
1164;-741055.000000000000000;-1044515.000000000000000;0
7087;-743339.940000001341105;-1044536.690000001341105;0
4900;-742508.089999999850988;-1042815.289999999105930;0
758;-741658.000000000000000;-1042666.000000000000000;0
4920;-742444.449999999254942;-1042928.980000000447035;0
876;-741953.000000000000000;-1042636.000000000000000;0
2693;-743425.660000000149012;-1042065.250000000000000;0
7721;-742941.157000001519918;-1044215.368000000715256;0
6205;-742314.800000000745058;-1043059.416999999433756;0
5678;-743404.363000001758337;-1043717.368999999016523;0
7704;-742256.021000001579523;-1044313.592999998480082;0
4889;-742621.425000000745058;-1042831.109999999403954;0
4218;-742263.436999998986721;-1043615.100999999791384;0
1946;-743281.000000000000000;-1044437.000000000000000;0
1257;-742070.000000000000000;-1044815.000000000000000;0
7150;-742820.427000001072884;-1044516.962000001221895;0
4152;-742564.589999999850988;-1044089.934999998658895;0
6499;-741707.811000000685453;-1044907.068999998271465;0
6207;-742313.287000000476837;-1043056.642000000923872;0
5303;-743164.818999998271465;-1043211.078000001609325;0
6717;-742311.105999998748302;-1044960.396999999880791;0
4024;-743223.734999999403954;-1043859.954999998211861;0
8281;-742164.160000000149012;-1042778.140000000596046;0
6997;-743109.160000000149012;-1044453.600000001490116;0
5505;-743428.315000001341105;-1043675.633000001311302;0
1150;-741290.000000000000000;-1044485.000000000000000;0
1260;-742070.000000000000000;-1044876.000000000000000;0
735;-741910.000000000000000;-1043014.000000000000000;0
5371;-742052.149999998509884;-1043011.940000001341105;0
4843;-742975.057000000029802;-1042729.682000000029802;0
4996;-742488.458999998867512;-1042974.723999999463558;0
6946;-742974.765000000596046;-1043929.388000000268221;0
2417;-742421.000000000000000;-1045135.000000000000000;0
4595;-742574.953000001609325;-1042659.344000000506639;0
2020;-743260.000000000000000;-1044941.000000000000000;0
6324;-745068.543000001460314;-1042720.445999998599291;0
1561;-743186.000000000000000;-1045098.000000000000000;0
5149;-743072.195999998599291;-1043377.370999999344349;0
6240;-742364.495999999344349;-1043067.289999999105930;0
3211;-743651.409000001847744;-1042483.458999998867512;0
1963;-743410.000000000000000;-1044689.000000000000000;0
4952;-742318.899999998509884;-1042915.589999999850988;0
3806;-743010.089999999850988;-1042912.410000000149012;0
1217;-742120.000000000000000;-1044339.000000000000000;0
4751;-742791.629999998956919;-1042751.460000000894070;0
1915;-743468.000000000000000;-1044494.000000000000000;0
6767;-741223.949999999254942;-1044422.059999998658895;0
952;-742274.000000000000000;-1043018.000000000000000;0
6168;-742313.092999998480082;-1043062.208999998867512;0
1420;-741596.000000000000000;-1044382.000000000000000;0
6151;-742311.114999998360872;-1043061.451000001281500;0
2453;-742941.000000000000000;-1044121.000000000000000;0
1925;-743331.000000000000000;-1044321.000000000000000;0
7197;-742570.949000000953674;-1044895.548999998718500;0
6253;-742378.725000001490116;-1043039.690000001341105;0
6351;-741874.269999999552965;-1042706.859999999403954;0
1956;-743397.000000000000000;-1044501.000000000000000;0
3303;-743810.967999998480082;-1042865.596000000834465;0
1817;-743058.000000000000000;-1044411.000000000000000;0
585;-741960.000000000000000;-1043413.000000000000000;0
6223;-742316.076000001281500;-1043058.679000001400709;0
3870;-742381.989999998360872;-1042417.679999999701977;0
2536;-742003.000000000000000;-1044113.000000000000000;0
3356;-743953.732000000774860;-1043037.083000000566244;0
4807;-743122.570000000298023;-1042767.850000001490116;0
1271;-742240.000000000000000;-1044521.000000000000000;0
5208;-743237.954999998211861;-1043368.065999999642372;0
1122;-741749.000000000000000;-1044455.000000000000000;0
7044;-743400.635000001639128;-1044135.579999998211861;0
921;-743338.000000000000000;-1043818.000000000000000;0
1854;-742675.000000000000000;-1044271.000000000000000;0
5282;-743037.090999998152256;-1043297.587999999523163;0
6228;-742319.103999998420477;-1043062.592000000178814;0
4841;-742989.993999999016523;-1042765.850999999791384;0
2242;-743321.000000000000000;-1045313.000000000000000;0
3973;-743161.204999998211861;-1043723.574999999254942;0
6185;-742315.103999998420477;-1043062.923000000417233;0
7003;-743074.140000000596046;-1044350.280000001192093;0
4833;-743036.859999999403954;-1042820.050000000745058;0
1172;-741869.000000000000000;-1044348.000000000000000;0
5081;-742917.046000000089407;-1043356.515999998897314;0
6485;-741795.653999999165535;-1044513.458000000566244;0
8151;-743319.030000001192093;-1043194.940000001341105;0
7171;-742671.969999998807907;-1044508.219999998807907;0
7177;-742643.059999998658895;-1044579.679999999701977;0
5326;-742969.850000001490116;-1043038.800000000745058;0
266;-743321.000000000000000;-1043735.000000000000000;0
2761;-743859.467000000178814;-1043468.017000000923872;0
4629;-742630.986000001430511;-1042626.096000000834465;0
5411;-742776.079999998211861;-1042905.300000000745058;0
4672;-742811.831999998539686;-1042675.907999999821186;0
7518;-742829.780000001192093;-1045693.210000000894070;0
1224;-742174.000000000000000;-1044253.000000000000000;0
1149;-741311.000000000000000;-1044471.000000000000000;0
1288;-742189.000000000000000;-1044543.000000000000000;0
1133;-741604.000000000000000;-1044433.000000000000000;0
6277;-742304.633999999612570;-1043024.256000000983477;0
1256;-742084.000000000000000;-1044787.000000000000000;0
6000;-741980.750000000000000;-1043285.629999998956919;0
5756;-743426.113000001758337;-1043680.102000001817942;0
2369;-742503.000000000000000;-1045427.000000000000000;0
3424;-743725.243000000715256;-1043089.951999999582767;0
