OID_;X;Y;TEMPERATURE
3614;-744984.548999998718500;-1042283.640999998897314;0
110;-744127.000000000000000;-1042724.000000000000000;0
3019;-744463.447999998927116;-1042784.646000001579523;0
3568;-744718.817999999970198;-1042588.614999998360872;0
3692;-744525.876499999314547;-1042540.534000001847744;0
3580;-744924.973999999463558;-1042593.699999999254942;0
2605;-745393.842999998480082;-1042860.796000000089407;0
5975;-745052.346999999135733;-1042674.673000000417233;0
118;-745135.000000000000000;-1042687.000000000000000;0
3542;-744575.274000000208616;-1042656.160000000149012;0
2696;-743477.489999998360872;-1042038.000000000000000;0
2520;-741847.000000000000000;-1045324.000000000000000;0
696;-742077.000000000000000;-1042913.000000000000000;0
7259;-742935.280000001192093;-1044869.829999998211861;0
1524;-741710.000000000000000;-1043844.000000000000000;0
2070;-742993.000000000000000;-1044723.000000000000000;0
1521;-741808.000000000000000;-1043917.000000000000000;0
3066;-744075.627000000327826;-1042883.837000001221895;0
725;-741983.000000000000000;-1042939.000000000000000;0
2149;-742819.000000000000000;-1045024.000000000000000;0
6;-743464.000000000000000;-1042594.000000000000000;0
3216;-743615.890999998897314;-1042451.129999998956919;0
8077;-742038.989999998360872;-1045265.309999998658895;0
2154;-742805.000000000000000;-1045147.000000000000000;0
509;-741991.000000000000000;-1043143.000000000000000;0
1780;-741214.000000000000000;-1043934.000000000000000;0
2103;-743182.000000000000000;-1044931.000000000000000;0
7278;-742803.899999998509884;-1044636.800000000745058;0
4331;-742391.967999998480082;-1043310.539000000804663;0
7410;-743525.730000000447035;-1045377.420000001788139;0
651;-742490.000000000000000;-1043564.000000000000000;0
2185;-743216.000000000000000;-1045130.000000000000000;0
2193;-743531.000000000000000;-1045204.000000000000000;0
6946;-742974.765000000596046;-1043929.388000000268221;0
6556;-741290.410000000149012;-1044041.471000000834465;0
4098;-742789.157000001519918;-1043861.918999999761581;0
2226;-743057.000000000000000;-1045470.000000000000000;0
3211;-743651.409000001847744;-1042483.458999998867512;0
4208;-742372.416999999433756;-1043503.423000000417233;0
7716;-743023.190999999642372;-1045843.241999998688698;0
6872;-741751.719999998807907;-1045296.679999999701977;0
7397;-743021.859999999403954;-1045682.989999998360872;0
1756;-742165.000000000000000;-1045209.000000000000000;0
2275;-742845.000000000000000;-1045719.000000000000000;0
4080;-742832.480000000447035;-1043782.030000001192093;0
7656;-742290.328000001609325;-1045294.499000001698732;0
2397;-742181.000000000000000;-1045368.000000000000000;0
7744;-742941.256999999284744;-1045533.171000000089407;0
2760;-743863.331000000238419;-1043483.304000001400709;0
7347;-742557.690000001341105;-1045177.440000001341105;0
2095;-743178.000000000000000;-1044734.000000000000000;0
2755;-744003.879000000655651;-1043471.734000001102686;0
2316;-742823.000000000000000;-1045463.000000000000000;0
2334;-742872.000000000000000;-1045519.000000000000000;0
1584;-742368.000000000000000;-1044717.000000000000000;0
2218;-743091.000000000000000;-1045372.000000000000000;0
6448;-744017.179999999701977;-1043123.899999998509884;0
2404;-742179.000000000000000;-1045467.000000000000000;0
350;-742505.000000000000000;-1043757.000000000000000;0
2274;-742870.000000000000000;-1045732.000000000000000;0
2044;-743445.000000000000000;-1044960.000000000000000;0
2418;-742410.000000000000000;-1045109.000000000000000;0
4025;-743202.881000000983477;-1043852.008000001311302;0
3919;-743904.947000000625849;-1043493.929999999701977;0
1600;-742418.000000000000000;-1044944.000000000000000;0
2049;-743499.000000000000000;-1045071.000000000000000;0
1587;-742372.000000000000000;-1044806.000000000000000;0
1382;-742096.000000000000000;-1045023.000000000000000;0
7740;-742301.949999999254942;-1045061.239000000059605;0
5303;-743164.818999998271465;-1043211.078000001609325;0
7189;-742588.486999999731779;-1044766.690999999642372;0
3760;-743233.829999998211861;-1042978.739999998360872;0
1767;-741261.000000000000000;-1044168.000000000000000;0
6746;-742405.083999998867512;-1044259.199999999254942;0
1760;-741162.000000000000000;-1044101.000000000000000;0
5969;-742284.809999998658895;-1044169.578000001609325;0
2060;-742659.000000000000000;-1044472.000000000000000;0
7245;-742748.780000001192093;-1044837.699999999254942;0
1036;-741961.000000000000000;-1044922.000000000000000;0
3128;-743948.160000000149012;-1042657.320000000298023;0
568;-742116.000000000000000;-1043604.000000000000000;0
6823;-741313.910000000149012;-1044788.510000001639128;0
524;-742255.000000000000000;-1043913.000000000000000;0
6314;-743939.670000001788139;-1042606.239999998360872;0
7202;-742561.410000000149012;-1044949.640000000596046;0
3781;-743273.059999998658895;-1042814.050000000745058;0
7325;-743032.969999998807907;-1045186.298999998718500;0
3107;-743778.888000000268221;-1042682.131999999284744;0
2322;-742651.000000000000000;-1045483.000000000000000;0
4145;-742687.109999999403954;-1043837.125000000000000;0
7026;-743217.644999999552965;-1044082.329999998211861;0
3233;-744152.962999999523163;-1042686.791999999433756;0
340;-742588.000000000000000;-1043906.000000000000000;0
334;-742631.000000000000000;-1043987.000000000000000;0
7355;-743348.309999998658895;-1045148.329999998211861;0
2134;-743028.000000000000000;-1045111.000000000000000;0
2142;-742883.000000000000000;-1045078.000000000000000;0
1518;-741994.000000000000000;-1044011.000000000000000;0
6659;-741515.070000000298023;-1044171.070000000298023;0
1824;-742963.809999998658895;-1044143.929999999701977;0
4142;-742777.425000000745058;-1044013.440000001341105;0
2487;-742101.000000000000000;-1044308.000000000000000;0
7024;-743182.745000001043081;-1044052.815000001341105;0
7742;-741703.945999998599291;-1045067.738000001758337;0
5271;-742995.381999999284744;-1043229.673000000417233;0
6962;-743011.489999998360872;-1044196.070000000298023;0
5961;-742431.225000001490116;-1044003.574999999254942;0
4332;-742410.359000001102686;-1043282.916000001132488;0
2009;-743221.000000000000000;-1044770.000000000000000;0
6506;-741743.019999999552965;-1044571.050000000745058;0
5241;-743365.063000001013279;-1043245.954999998211861;0
7516;-742248.390000000596046;-1044368.907999999821186;0
7003;-743074.140000000596046;-1044350.280000001192093;0
2326;-742523.000000000000000;-1045498.000000000000000;0
5048;-742867.500000000000000;-1043381.899999998509884;0
1852;-742739.000000000000000;-1044210.000000000000000;0
6996;-743116.699999999254942;-1044476.469999998807907;0
2255;-743181.000000000000000;-1045372.000000000000000;0
8284;-742219.410000000149012;-1042809.500000000000000;0
1472;-741677.000000000000000;-1044145.000000000000000;0
382;-742481.000000000000000;-1043751.000000000000000;0
2495;-741982.000000000000000;-1044140.000000000000000;0
7538;-742701.420000001788139;-1045364.109999999403954;0
391;-742395.000000000000000;-1043802.000000000000000;0
1655;-741391.000000000000000;-1044651.000000000000000;0
1311;-741646.000000000000000;-1044831.000000000000000;0
6014;-742844.000000000000000;-1043239.482999999076128;0
2740;-744042.611999999731779;-1043335.940000001341105;0
2641;-743432.578999999910593;-1042583.418999999761581;0
4175;-742721.254999998956919;-1043775.890000000596046;0
1243;-742122.000000000000000;-1044502.000000000000000;0
4151;-742573.039999999105930;-1044109.035000000149012;0
1811;-743175.000000000000000;-1044525.000000000000000;0
3971;-743206.815000001341105;-1043721.065000001341105;0
1448;-741537.000000000000000;-1044716.000000000000000;15
1516;-741928.000000000000000;-1044062.000000000000000;0
4876;-742826.449999999254942;-1042944.910000000149012;0
1530;-741753.000000000000000;-1043814.000000000000000;0
6610;-741694.364999998360872;-1043961.170000001788139;0
4067;-742913.594999998807907;-1043714.640000000596046;0
3268;-743594.046999998390675;-1042721.412999998778105;0
7140;-742921.300000000745058;-1044469.335000000894070;0
398;-742372.000000000000000;-1043909.000000000000000;0
6845;-741527.188000001013279;-1044989.557000000029802;0
1007;-741976.000000000000000;-1044586.000000000000000;0
6647;-741767.690000001341105;-1044068.160000000149012;0
1469;-741752.000000000000000;-1044100.000000000000000;0
283;-743026.000000000000000;-1043788.000000000000000;0
3818;-743130.217999998480082;-1042703.293000001460314;0
5408;-743696.881000000983477;-1042878.024999998509884;0
1042;-741883.000000000000000;-1044682.000000000000000;0
2123;-743299.000000000000000;-1045010.000000000000000;0
4020;-743160.616000000387430;-1043872.782999999821186;0
907;-742211.000000000000000;-1042511.000000000000000;0
2244;-743264.000000000000000;-1045331.000000000000000;0
2241;-743319.000000000000000;-1045289.000000000000000;0
7000;-743096.190000001341105;-1044426.870000001043081;0
5251;-743317.296000000089407;-1043180.037999998778105;0
7008;-742899.559999998658895;-1044224.074999999254942;0
1291;-742205.000000000000000;-1044568.000000000000000;0
2234;-743425.000000000000000;-1045221.000000000000000;0
4056;-743125.315000001341105;-1043671.969999998807907;0
5434;-744042.467999998480082;-1043135.986999999731779;0
706;-741897.000000000000000;-1042881.000000000000000;0
599;-741837.000000000000000;-1043243.000000000000000;0
6705;-742279.050999999046326;-1044655.923000000417233;0
7016;-742557.515000000596046;-1044334.074999999254942;0
1250;-742103.000000000000000;-1044672.000000000000000;0
6710;-742260.203000001609325;-1044803.609999999403954;0
3269;-743600.679000001400709;-1042731.660000000149012;0
1950;-743271.000000000000000;-1044490.000000000000000;0
5309;-743033.405000001192093;-1043187.043999999761581;0
1045;-741849.000000000000000;-1044775.000000000000000;0
758;-741658.000000000000000;-1042666.000000000000000;0
1346;-741769.000000000000000;-1044817.000000000000000;0
1171;-741882.000000000000000;-1044375.000000000000000;0
324;-742694.000000000000000;-1044132.000000000000000;0
1050;-741785.000000000000000;-1044952.000000000000000;0
3994;-743394.864000000059605;-1043949.813999999314547;0
7661;-742294.495999999344349;-1045349.482000000774860;0
4131;-742844.625000000000000;-1044059.980000000447035;0
1342;-741721.000000000000000;-1044783.000000000000000;0
747;-741690.000000000000000;-1043000.000000000000000;0
6714;-742287.171000000089407;-1044923.995999999344349;0
1212;-742038.000000000000000;-1044383.000000000000000;0
1145;-741386.000000000000000;-1044461.000000000000000;0
2036;-743404.000000000000000;-1044803.000000000000000;0
1368;-741998.000000000000000;-1044779.000000000000000;0
2337;-742783.000000000000000;-1045544.000000000000000;0
1720;-741436.000000000000000;-1044862.000000000000000;0
1460;-741482.000000000000000;-1044302.000000000000000;0
316;-742490.000000000000000;-1044202.000000000000000;0
5323;-743049.401000000536442;-1043038.131000000983477;0
4309;-742042.329999998211861;-1043492.329999998211861;0
2433;-742514.000000000000000;-1045081.000000000000000;0
4983;-742587.776000000536442;-1043013.068999998271465;0
3838;-743113.550000000745058;-1042543.399999998509884;0
732;-741860.000000000000000;-1043003.000000000000000;0
513;-742083.000000000000000;-1043145.000000000000000;0
6726;-742476.517999999225140;-1044410.600000001490116;0
1430;-741993.000000000000000;-1044260.000000000000000;173
3948;-743409.451999999582767;-1043515.662000000476837;0
1604;-742552.000000000000000;-1044918.000000000000000;0
1142;-741437.000000000000000;-1044466.000000000000000;0
4709;-742775.800000000745058;-1042600.690000001341105;0
7090;-743353.289999999105930;-1044571.760000001639128;0
4322;-742266.414000000804663;-1043213.907999999821186;0
1414;-741627.000000000000000;-1044593.000000000000000;0
7043;-743398.899999998509884;-1044106.629999998956919;0
1025;-741989.000000000000000;-1044602.000000000000000;0
4537;-742303.159000001847744;-1042752.293000001460314;0
1618;-742405.000000000000000;-1044404.000000000000000;0
7985;-741091.269999999552965;-1044419.039999999105930;0
8049;-742198.890000000596046;-1044891.600000001490116;0
4460;-742216.600000001490116;-1042598.850000001490116;0
7217;-742516.318999998271465;-1044582.890000000596046;0
5324;-743025.329999998211861;-1043045.789999999105930;0
735;-741910.000000000000000;-1043014.000000000000000;0
5640;-743428.425000000745058;-1043686.254000000655651;0
7986;-741040.829999998211861;-1044408.250000000000000;0
2083;-742588.000000000000000;-1044663.000000000000000;0
6114;-742234.250000000000000;-1043361.324999999254942;0
1388;-742152.000000000000000;-1045026.000000000000000;0
7995;-741545.920000001788139;-1045160.100000001490116;0
224;-742904.000000000000000;-1043522.000000000000000;0
1260;-742070.000000000000000;-1044876.000000000000000;0
6848;-741619.096999999135733;-1045007.451999999582767;0
6841;-741583.443999998271465;-1044946.208000000566244;0
4075;-742947.934999998658895;-1043903.649999998509884;0
4021;-743293.295000001788139;-1043876.995000001043081;0
190;-743443.000000000000000;-1043597.000000000000000;0
463;-741703.000000000000000;-1043287.000000000000000;0
6142;-742310.477000001817942;-1043061.813000001013279;0
3409;-743790.434999998658895;-1043040.907999999821186;0
2466;-743460.000000000000000;-1044740.000000000000000;0
526;-742209.000000000000000;-1043849.000000000000000;0
6391;-742109.269999999552965;-1042498.320000000298023;0
7166;-742741.322000000625849;-1044519.208999998867512;0
6702;-742291.596999999135733;-1044564.116999998688698;0
6202;-742317.124000001698732;-1043063.651999998837709;0
4062;-742830.460000000894070;-1043654.920000001788139;0
884;-741771.000000000000000;-1042776.000000000000000;0
7156;-742944.515000000596046;-1044546.140000000596046;0
8043;-742180.050000000745058;-1044750.160000000149012;0
8265;-742197.820000000298023;-1042704.260000001639128;0
222;-742939.000000000000000;-1043526.000000000000000;0
5086;-742856.307999998331070;-1043239.488000001758337;0
3846;-743149.390000000596046;-1042549.600000001490116;0
1160;-741114.859999999403954;-1044508.120000001043081;0
5148;-743071.477000001817942;-1043411.539999999105930;0
1488;-741088.000000000000000;-1044212.000000000000000;0
6196;-742314.190000001341105;-1043059.774999998509884;0
881;-741806.000000000000000;-1042815.000000000000000;0
6168;-742313.092999998480082;-1043062.208999998867512;0
4227;-742108.530000001192093;-1043326.289999999105930;0
4558;-742373.019999999552965;-1042506.949999999254942;0
4003;-743371.839999999850988;-1044053.258999999612570;0
1791;-742157.000000000000000;-1044163.000000000000000;0
3342;-743922.624000001698732;-1043077.261999998241663;0
675;-742446.000000000000000;-1043215.000000000000000;0
4214;-742229.274999998509884;-1043511.745000001043081;0
1108;-741261.000000000000000;-1044593.000000000000000;0
4634;-742635.980000000447035;-1042656.144999999552965;0
4950;-742354.289999999105930;-1042955.670000001788139;0
7933;-743544.570000000298023;-1044950.370000001043081;0
1970;-743380.000000000000000;-1044854.000000000000000;0
2526;-741087.000000000000000;-1044616.000000000000000;0
1422;-742199.000000000000000;-1044127.000000000000000;0
218;-743006.000000000000000;-1043537.000000000000000;0
7118;-743468.750000000000000;-1044677.690000001341105;0
4810;-743058.420000001788139;-1042810.050000000745058;0
1404;-741692.000000000000000;-1044355.000000000000000;0
4660;-742801.596999999135733;-1042487.965999998152256;0
1394;-741822.000000000000000;-1044310.000000000000000;0
2478;-741241.859999999403954;-1044562.089999999850988;0
4526;-742696.690000001341105;-1042823.320000000298023;0
5636;-743427.432000000029802;-1043681.359999999403954;0
630;-742179.000000000000000;-1043289.000000000000000;0
500;-741861.000000000000000;-1043174.000000000000000;0
1297;-742120.000000000000000;-1044453.000000000000000;0
1222;-742157.000000000000000;-1044266.000000000000000;0
833;-742050.000000000000000;-1042573.000000000000000;0
4903;-742493.579999998211861;-1042816.620000001043081;0
1867;-743474.000000000000000;-1044257.000000000000000;0
6225;-742314.519999999552965;-1043055.927000001072884;0
4429;-742222.260000001639128;-1043102.250000000000000;0
1114;-741151.059999998658895;-1044607.410000000149012;0
1158;-741152.320000000298023;-1044503.030000001192093;0
2309;-742322.000000000000000;-1045519.000000000000000;0
1875;-743367.000000000000000;-1044261.000000000000000;0
6195;-742314.956000000238419;-1043061.181000001728535;0
5643;-743428.701999999582767;-1043689.872999999672174;0
609;-741984.000000000000000;-1043272.000000000000000;0
5124;-742983.513000000268221;-1043417.271999999880791;0
3980;-743339.260000001639128;-1043798.940000001341105;0
5597;-743414.056000001728535;-1043680.309000000357628;0
4738;-742733.910000000149012;-1042704.890000000596046;0
6260;-742377.692999999970198;-1043022.434000000357628;0
4566;-742473.846000000834465;-1042545.780000001192093;0
3379;-743806.728000000119209;-1042934.574999999254942;0
1265;-742047.000000000000000;-1044960.000000000000000;0
7721;-742941.157000001519918;-1044215.368000000715256;0
6205;-742314.800000000745058;-1043059.416999999433756;0
4625;-742594.258000001311302;-1042576.114000000059605;0
4425;-742208.820000000298023;-1043035.230000000447035;0
4251;-742136.420000001788139;-1043379.969999998807907;0
203;-743204.000000000000000;-1043607.000000000000000;0
1684;-741136.379999998956919;-1044735.140000000596046;0
1100;-741397.000000000000000;-1044576.000000000000000;0
671;-742489.000000000000000;-1043245.000000000000000;0
6013;-743372.780000001192093;-1043377.921999998390675;0
2576;-742487.000000000000000;-1045483.000000000000000;0
6791;-741047.329999998211861;-1044765.467999998480082;0
1494;-741173.000000000000000;-1044326.000000000000000;0
5689;-743415.442000001668930;-1043633.646000001579523;0
4965;-742383.620000001043081;-1043057.500000000000000;0
3761;-743202.559999998658895;-1042981.710000000894070;0
5695;-743417.217999998480082;-1043638.749000001698732;0
6151;-742311.114999998360872;-1043061.451000001281500;0
581;-741991.000000000000000;-1043457.000000000000000;0
688;-742284.000000000000000;-1043125.000000000000000;0
1942;-743283.000000000000000;-1044370.000000000000000;0
5665;-743419.725000001490116;-1043711.682000000029802;0
877;-741951.000000000000000;-1042610.000000000000000;0
4812;-743027.170000001788139;-1042810.219999998807907;0
8270;-742019.480000000447035;-1042725.870000001043081;0
3354;-743954.250999998301268;-1043026.024999998509884;0
5217;-743306.870999999344349;-1043323.228000000119209;0
6511;-741291.670000001788139;-1044319.690000001341105;0
4788;-742970.409000001847744;-1042588.238000001758337;0
4494;-741874.920000001788139;-1042616.660000000149012;0
3364;-743855.184999998658895;-1043024.940000001341105;0
5156;-743160.188999999314547;-1043355.291999999433756;0
7173;-742660.850000001490116;-1044535.730000000447035;0
4591;-742426.813000001013279;-1042640.035000000149012;0
1910;-743460.000000000000000;-1044391.000000000000000;0
3802;-743068.190000001341105;-1042879.710000000894070;0
3810;-743261.510000001639128;-1042802.960000000894070;0
5230;-743335.399999998509884;-1043517.670000001788139;0
872;-741698.000000000000000;-1042669.000000000000000;0
5664;-743420.907000001519918;-1043711.245999999344349;0
4585;-742437.502000000327826;-1042630.243999999016523;0
5598;-743412.839999999850988;-1043680.403000000864267;0
5688;-743415.267000000923872;-1043631.945000000298023;0
4888;-742649.925999999046326;-1042830.767000000923872;0
4997;-742492.638000000268221;-1042962.833999998867512;0
4737;-742718.399999998509884;-1042684.079999998211861;0
4735;-742686.059999998658895;-1042669.260000001639128;0
8281;-742164.160000000149012;-1042778.140000000596046;0
4754;-742745.359999999403954;-1042759.160000000149012;0
1451;-741522.000000000000000;-1044602.000000000000000;0
4823;-742936.660000000149012;-1042868.949999999254942;0
5109;-742850.925999999046326;-1043483.024999998509884;0
7963;-741608.199999999254942;-1044329.510000001639128;0
2355;-742465.000000000000000;-1045568.000000000000000;0
4761;-742810.285000000149012;-1042793.122000001370907;0
5694;-743417.339999999850988;-1043640.361000001430511;0
4703;-742697.859000001102686;-1042783.011999998241663;0
4676;-742792.579999998211861;-1042771.519999999552965;0
5413;-742651.872000001370907;-1042662.627999998629093;0
531;-742157.000000000000000;-1043778.000000000000000;0
7147;-742827.925000000745058;-1044451.385000001639128;0
515;-742176.000000000000000;-1043121.000000000000000;0
6216;-742313.892000000923872;-1043056.272999998182058;0
225;-742885.000000000000000;-1043535.000000000000000;0
5002;-742561.190000001341105;-1042977.401999998837709;0
4905;-742467.730000000447035;-1042815.620000001043081;0
4599;-742625.879999998956919;-1042698.820000000298023;0
4514;-742555.050000000745058;-1042761.809999998658895;0
5293;-743043.969999998807907;-1043208.554000001400709;0
1089;-741567.949999999254942;-1044538.820000000298023;0
4574;-742339.980000000447035;-1042661.570000000298023;0
6233;-742319.057000000029802;-1043072.162999998778105;0
3416;-743754.546000000089407;-1043086.953000001609325;0
549;-742290.000000000000000;-1043770.000000000000000;0
582;-741994.000000000000000;-1043417.000000000000000;0
4813;-743013.550000000745058;-1042793.390000000596046;0
4762;-742854.192000001668930;-1042825.931000001728535;0
1917;-743374.000000000000000;-1044458.000000000000000;0
1874;-743379.000000000000000;-1044247.000000000000000;0
4663;-742820.800000000745058;-1042560.039999999105930;0
7270;-743152.309999998658895;-1044962.469999998807907;0
6262;-742370.024999998509884;-1043021.666000001132488;0
4619;-742460.010000001639128;-1042480.890000000596046;0
6244;-742368.587000001221895;-1043059.245999999344349;0
4794;-743065.828999999910593;-1042673.377000000327826;0
4780;-742928.596000000834465;-1042747.480000000447035;0
4701;-742687.780000001192093;-1042761.660000000149012;0
4756;-742712.579999998211861;-1042776.829999998211861;0
579;-742006.000000000000000;-1043477.000000000000000;0
4926;-742452.660000000149012;-1042896.190000001341105;0
3090;-743913.418999999761581;-1042804.416999999433756;0
4746;-742867.769999999552965;-1042768.570000000298023;0
5409;-743745.201000001281500;-1042902.750000000000000;0
2306;-742392.000000000000000;-1045461.000000000000000;0
6171;-742310.780999999493361;-1043057.971000000834465;0
6194;-742315.721000000834465;-1043062.585999999195337;0
5518;-743427.500999998301268;-1043621.975000001490116;0
2464;-743519.000000000000000;-1044697.000000000000000;0
7705;-742283.471999999135733;-1044316.339999999850988;0
5730;-743418.855999998748302;-1043638.949000000953674;0
5693;-743415.905000001192093;-1043640.377000000327826;0
5195;-743232.432999998331070;-1043297.890999998897314;0
5207;-743208.434999998658895;-1043365.236999999731779;0
6210;-742318.541000001132488;-1043064.662999998778105;0
559;-742191.000000000000000;-1043693.000000000000000;0
1943;-743264.000000000000000;-1044421.000000000000000;0
284;-743022.000000000000000;-1043758.000000000000000;0
6265;-742353.164999999105930;-1043020.054999999701977;0
5642;-743428.609999999403954;-1043688.666999999433756;0
5226;-743310.730000000447035;-1043553.269999999552965;0
4944;-742430.605999998748302;-1043013.879000000655651;0
4328;-742347.322000000625849;-1043375.796999998390675;0
3955;-743412.653000000864267;-1043555.727000001817942;0
1130;-741624.000000000000000;-1044446.000000000000000;0
5997;-742040.579999998211861;-1043282.651999998837709;0
6821;-741256.649999998509884;-1044796.100000001490116;0
5758;-743420.897999998182058;-1043635.921999998390675;0
6723;-742592.894999999552965;-1044408.905000001192093;0
571;-742082.000000000000000;-1043581.000000000000000;0
5711;-743422.837999999523163;-1043640.131000000983477;0
6698;-742304.160999998450279;-1044462.195999998599291;217
6300;-741836.949999999254942;-1042698.329999998211861;0
5155;-743140.712999999523163;-1043357.901999998837709;0
795;-741770.000000000000000;-1042577.000000000000000;0
6188;-742312.807999998331070;-1043058.706999998539686;0
5414;-742582.574999999254942;-1042677.478999998420477;0
4512;-742515.339999999850988;-1042750.230000000447035;0
3311;-743816.037999998778105;-1042845.728999998420477;0
6224;-742315.320000000298023;-1043057.335000000894070;0
5996;-742061.879000000655651;-1043284.276999998837709;0
4774;-742900.078999999910593;-1042854.859000001102686;0
2090;-742923.000000000000000;-1044566.000000000000000;0
4782;-742938.315999999642372;-1042714.212000001221895;0
3808;-742987.050000000745058;-1042925.350000001490116;0
759;-741659.000000000000000;-1042650.000000000000000;0
2091;-742920.000000000000000;-1044593.000000000000000;0
1125;-741728.000000000000000;-1044435.000000000000000;0
577;-742038.000000000000000;-1043521.000000000000000;0
1933;-743329.000000000000000;-1044407.000000000000000;0
692;-742292.000000000000000;-1043084.000000000000000;0
6488;-741718.210000000894070;-1044532.489999998360872;0
4963;-742396.510000001639128;-1043031.829999998211861;0
6158;-742313.261999998241663;-1043063.925999999046326;0
7647;-742319.918000001460314;-1045405.197999998927116;0
6121;-742069.784000001847744;-1043299.828000001609325;0
191;-743424.000000000000000;-1043599.000000000000000;0
5720;-743418.223000001162291;-1043629.960999999195337;0
7084;-743318.609999999403954;-1044521.789999999105930;0
1918;-743377.000000000000000;-1044428.000000000000000;0
250;-743428.000000000000000;-1043794.000000000000000;0
6818;-741163.460000000894070;-1044806.616999998688698;0
4939;-742448.866999998688698;-1043072.822999998927116;0
1906;-743459.000000000000000;-1044325.000000000000000;0
6146;-742314.942000001668930;-1043068.475999999791384;0
7094;-743370.620000001043081;-1044578.289999999105930;0
7215;-742484.320000000298023;-1044546.620000001043081;0
2507;-742427.000000000000000;-1044437.000000000000000;0
4995;-742476.986000001430511;-1042961.239000000059605;0
4424;-742225.300000000745058;-1043033.250000000000000;0
6212;-742317.006000000983477;-1043061.888000000268221;0
4479;-741782.780000001192093;-1042660.359999999403954;0
1459;-741491.000000000000000;-1044340.000000000000000;0
1355;-741899.000000000000000;-1044858.000000000000000;0
3790;-743140.809999998658895;-1042908.210000000894070;0
6366;-741957.399999998509884;-1042652.609999999403954;0
4203;-742299.442000001668930;-1043608.692000001668930;0
4725;-742875.100000001490116;-1042678.230000000447035;0
6214;-742315.447999998927116;-1043059.026000000536442;0
6162;-742310.199999999254942;-1043058.306000001728535;0
3844;-743184.170000001788139;-1042586.949999999254942;0
5658;-743428.059999998658895;-1043708.153000000864267;0
4936;-742454.684000000357628;-1042685.620999999344349;0
5580;-743409.831000000238419;-1043636.449000000953674;0
1147;-741346.000000000000000;-1044466.000000000000000;0
1455;-741517.000000000000000;-1044468.000000000000000;0
1500;-741441.000000000000000;-1044299.000000000000000;0
4809;-743081.589999999850988;-1042799.800000000745058;0
4325;-742270.679000001400709;-1043141.787999998778105;0
1223;-742190.000000000000000;-1044277.000000000000000;0
6223;-742316.076000001281500;-1043058.679000001400709;0
1144;-741402.000000000000000;-1044470.000000000000000;0
7957;-741692.839999999850988;-1044277.559999998658895;0
4635;-742575.561999998986721;-1042702.701000001281500;0
779;-741708.000000000000000;-1042533.000000000000000;0
4204;-742312.750999998301268;-1043589.962999999523163;0
6655;-741614.039999999105930;-1044145.320000000298023;0
6765;-741163.449999999254942;-1044427.199999999254942;0
1458;-741506.000000000000000;-1044384.000000000000000;0
8272;-742042.399999998509884;-1042732.559999998658895;0
5081;-742917.046000000089407;-1043356.515999998897314;0
557;-742213.000000000000000;-1043713.000000000000000;0
5125;-742992.826000001281500;-1043402.497999999672174;0
3372;-743823.475000001490116;-1043010.432999998331070;0
4745;-742840.800000000745058;-1042742.120000001043081;0
5641;-743428.517000000923872;-1043687.460000000894070;0
3974;-743140.660000000149012;-1043725.350000001490116;0
6245;-742369.682000000029802;-1043057.377000000327826;0
3885;-742418.339999999850988;-1042442.059999998658895;0
921;-743338.000000000000000;-1043818.000000000000000;0
