OID_;X;Y;TEMPERATURE
3752;-743213.949999999254942;-1042902.719999998807907;0
3614;-744984.548999998718500;-1042283.640999998897314;0
7;-743479.000000000000000;-1042567.000000000000000;0
5790;-743521.019999999552965;-1042064.280000001192093;0
1486;-741150.000000000000000;-1044219.000000000000000;0
381;-742465.000000000000000;-1043700.000000000000000;0
3578;-744924.046000000089407;-1042547.359000001102686;0
3209;-743668.293999999761581;-1042492.478999998420477;0
4334;-742384.170000001788139;-1043468.820000000298023;0
3233;-744152.962999999523163;-1042686.791999999433756;0
3110;-743743.295000001788139;-1042640.627000000327826;0
1251;-742091.000000000000000;-1044690.000000000000000;0
1269;-742246.000000000000000;-1044462.000000000000000;0
512;-742063.000000000000000;-1043136.000000000000000;0
7410;-743525.730000000447035;-1045377.420000001788139;0
6705;-742279.050999999046326;-1044655.923000000417233;0
8076;-742050.429999999701977;-1045256.199999999254942;0
6826;-741405.300000000745058;-1044777.199999999254942;0
4180;-742368.370000001043081;-1044115.471999999135733;0
2155;-742797.000000000000000;-1045124.000000000000000;0
8043;-742180.050000000745058;-1044750.160000000149012;0
4062;-742830.460000000894070;-1043654.920000001788139;0
3923;-743845.660000000149012;-1043512.260000001639128;0
3917;-743967.182999998331070;-1043516.284000001847744;0
4072;-742934.225000001490116;-1043833.899999998509884;0
4099;-742773.870000001043081;-1043846.135999999940395;0
3750;-743221.379999998956919;-1042925.429999999701977;0
2211;-743248.000000000000000;-1045258.000000000000000;0
2059;-742625.000000000000000;-1044459.000000000000000;0
2809;-744090.649999998509884;-1043371.184000000357628;0
2194;-743448.000000000000000;-1045193.000000000000000;0
884;-741771.000000000000000;-1042776.000000000000000;0
6870;-741708.260000001639128;-1045321.590999998152256;0
3310;-743829.561999998986721;-1042854.063000001013279;57
2147;-742828.000000000000000;-1044984.000000000000000;0
7018;-742577.747000001370907;-1044239.712999999523163;0
5252;-743283.517000000923872;-1043176.197999998927116;0
1520;-741777.000000000000000;-1043939.000000000000000;0
2885;-744122.791999999433756;-1043190.208000000566244;0
4651;-742756.375000000000000;-1042524.938000001013279;0
6982;-743055.109999999403954;-1044342.629999998956919;0
1684;-741136.379999998956919;-1044735.140000000596046;0
1794;-742151.000000000000000;-1044190.000000000000000;0
7935;-743156.000000000000000;-1045071.149999998509884;0
2072;-743043.000000000000000;-1044743.000000000000000;0
2049;-743499.000000000000000;-1045071.000000000000000;0
4068;-742917.125000000000000;-1043734.535000000149012;0
3844;-743184.170000001788139;-1042586.949999999254942;0
224;-742904.000000000000000;-1043522.000000000000000;0
6946;-742974.765000000596046;-1043929.388000000268221;0
6805;-741109.710000000894070;-1044689.170000001788139;0
1992;-743482.000000000000000;-1044954.000000000000000;0
2024;-743305.000000000000000;-1045000.000000000000000;0
7118;-743468.750000000000000;-1044677.690000001341105;0
1987;-743480.000000000000000;-1044820.000000000000000;0
332;-742645.000000000000000;-1044014.000000000000000;0
1669;-741077.000000000000000;-1044092.000000000000000;0
1015;-742126.000000000000000;-1044599.000000000000000;0
1587;-742372.000000000000000;-1044806.000000000000000;0
2046;-743382.000000000000000;-1044968.000000000000000;0
2016;-743230.000000000000000;-1044873.000000000000000;0
4426;-742197.589999999850988;-1043031.679999999701977;0
2249;-743211.000000000000000;-1045443.000000000000000;0
2036;-743404.000000000000000;-1044803.000000000000000;0
1178;-741952.000000000000000;-1044311.000000000000000;0
5461;-742442.704999998211861;-1043234.515000000596046;0
3388;-743940.289999999105930;-1043154.210000000894070;0
8267;-742240.420000001788139;-1042709.160000000149012;0
514;-742119.000000000000000;-1043141.000000000000000;0
5293;-743043.969999998807907;-1043208.554000001400709;0
7015;-742554.570000000298023;-1044360.725000001490116;0
599;-741837.000000000000000;-1043243.000000000000000;0
1040;-741904.000000000000000;-1044623.000000000000000;0
6823;-741313.910000000149012;-1044788.510000001639128;0
1318;-741838.000000000000000;-1044940.000000000000000;0
3364;-743855.184999998658895;-1043024.940000001341105;0
4039;-743159.070000000298023;-1043772.795000001788139;0
1359;-742000.000000000000000;-1044897.000000000000000;0
6556;-741290.410000000149012;-1044041.471000000834465;0
6699;-742301.118999999016523;-1044484.282999999821186;0
283;-743026.000000000000000;-1043788.000000000000000;0
5778;-742917.131000000983477;-1043419.723000001162291;0
873;-741728.000000000000000;-1042672.000000000000000;0
504;-741937.000000000000000;-1043164.000000000000000;0
7515;-742273.021999999880791;-1044371.543999999761581;0
2548;-741672.000000000000000;-1044304.000000000000000;0
3287;-743711.173999998718500;-1042886.515999998897314;0
817;-741937.000000000000000;-1042586.000000000000000;0
8084;-741928.710000000894070;-1045393.339999999850988;0
3769;-742978.969999998807907;-1042975.300000000745058;0
1172;-741869.000000000000000;-1044348.000000000000000;0
926;-741894.000000000000000;-1042999.000000000000000;0
7203;-742571.300000000745058;-1044963.219999998807907;0
1860;-743472.000000000000000;-1044155.000000000000000;0
2090;-742923.000000000000000;-1044566.000000000000000;0
7809;-741981.809999998658895;-1044560.280000001192093;0
882;-741825.000000000000000;-1042788.000000000000000;0
4987;-742641.745000001043081;-1043011.309999998658895;0
2402;-742236.000000000000000;-1045408.000000000000000;0
7146;-742819.425000000745058;-1044426.225000001490116;0
7176;-742630.820000000298023;-1044585.809999998658895;0
569;-742096.000000000000000;-1043601.000000000000000;0
2220;-743075.000000000000000;-1045396.000000000000000;0
561;-742172.000000000000000;-1043675.000000000000000;0
1161;-741106.550000000745058;-1044497.769999999552965;0
1517;-741964.000000000000000;-1044034.000000000000000;0
1584;-742368.000000000000000;-1044717.000000000000000;0
4639;-742567.399999998509884;-1042548.592999998480082;0
201;-743229.000000000000000;-1043614.000000000000000;0
5172;-743274.383999999612570;-1043432.322999998927116;0
725;-741983.000000000000000;-1042939.000000000000000;0
1809;-743160.000000000000000;-1044541.000000000000000;0
4236;-742406.842999998480082;-1043504.015000000596046;0
4999;-742534.149999998509884;-1042966.892999999225140;0
3705;-744508.056000001728535;-1042525.197000000625849;0
3018;-744443.368000000715256;-1042805.962000001221895;0
7003;-743074.140000000596046;-1044350.280000001192093;0
1423;-742167.000000000000000;-1044150.000000000000000;0
4674;-742806.475999999791384;-1042703.594999998807907;0
1831;-742994.000000000000000;-1044105.000000000000000;0
7147;-742827.925000000745058;-1044451.385000001639128;0
462;-741707.000000000000000;-1043294.000000000000000;0
406;-742366.000000000000000;-1044171.000000000000000;0
3433;-743896.050000000745058;-1042546.662000000476837;0
3570;-744649.160000000149012;-1042588.129999998956919;0
3834;-743079.190000001341105;-1042579.899999998509884;0
4198;-742192.445000000298023;-1043760.521000001579523;0
3065;-744092.028999999165535;-1042868.519000001251698;0
1601;-742452.000000000000000;-1044939.000000000000000;29
1030;-741975.000000000000000;-1044753.000000000000000;0
1361;-742037.000000000000000;-1044911.000000000000000;0
6943;-742902.013999998569489;-1043932.647999998182058;0
4036;-743246.920000001788139;-1043771.574999999254942;0
6647;-741767.690000001341105;-1044068.160000000149012;0
7284;-742811.789999999105930;-1044718.210000000894070;0
1628;-742449.000000000000000;-1044494.000000000000000;0
7019;-742585.024999998509884;-1044210.725000001490116;0
6503;-741647.706000000238419;-1044996.008999999612570;0
3033;-744483.675000000745058;-1042733.627000000327826;0
576;-742054.000000000000000;-1043517.000000000000000;0
1299;-741943.000000000000000;-1044719.000000000000000;0
1879;-743302.000000000000000;-1044264.000000000000000;0
6122;-742071.870000001043081;-1043283.660000000149012;0
4222;-742187.096999999135733;-1043485.890000000596046;0
5324;-743025.329999998211861;-1043045.789999999105930;0
4427;-742190.519999999552965;-1043099.440000001341105;0
525;-742233.000000000000000;-1043884.000000000000000;247
1940;-743286.000000000000000;-1044339.000000000000000;0
4746;-742867.769999999552965;-1042768.570000000298023;0
7022;-743155.660000000149012;-1044074.410000000149012;0
4026;-743178.984999999403954;-1043847.989999998360872;0
1728;-741473.000000000000000;-1045087.000000000000000;0
5513;-743426.734999999403954;-1043606.184000000357628;0
1246;-742120.000000000000000;-1044570.000000000000000;0
2536;-742003.000000000000000;-1044113.000000000000000;0
8056;-742242.379999998956919;-1045023.460000000894070;0
4201;-742269.000000000000000;-1043651.563000001013279;0
4331;-742391.967999998480082;-1043310.539000000804663;0
6810;-741106.350999999791384;-1044631.888999998569489;0
7706;-742313.239999998360872;-1044319.611999999731779;0
8263;-742151.089999999850988;-1042702.239999998360872;0
5993;-743947.829999998211861;-1042646.350000001490116;0
4949;-742369.969999998807907;-1042973.199999999254942;0
1815;-743083.000000000000000;-1044478.000000000000000;0
618;-742203.000000000000000;-1043272.000000000000000;0
395;-742369.000000000000000;-1043840.000000000000000;0
202;-743240.000000000000000;-1043597.000000000000000;0
4874;-742795.429999999701977;-1042925.910000000149012;0
2562;-741090.000000000000000;-1044404.000000000000000;0
4859;-742966.710000000894070;-1042996.302999999374151;0
4878;-742876.434000000357628;-1042964.004000000655651;0
2007;-743231.000000000000000;-1044741.000000000000000;0
1092;-741549.000000000000000;-1044556.000000000000000;0
4735;-742686.059999998658895;-1042669.260000001639128;0
6200;-742318.653999999165535;-1043066.462000001221895;0
1524;-741710.000000000000000;-1043844.000000000000000;0
627;-742223.000000000000000;-1043335.000000000000000;0
3794;-743091.015000000596046;-1042800.471999999135733;0
1612;-742429.000000000000000;-1044425.000000000000000;0
4169;-742414.420000001788139;-1043962.329999998211861;0
1961;-743397.000000000000000;-1044642.000000000000000;0
5744;-743412.905999999493361;-1043695.221000000834465;0
6830;-741526.739999998360872;-1044761.309000000357628;0
2400;-742087.000000000000000;-1045374.000000000000000;0
345;-742559.000000000000000;-1043826.000000000000000;0
7216;-742500.129999998956919;-1044564.390000000596046;0
2432;-742549.000000000000000;-1045078.000000000000000;0
7654;-742242.081000000238419;-1045273.263999998569489;0
184;-743445.000000000000000;-1043450.000000000000000;0
4894;-742610.888999998569489;-1042819.686999998986721;0
2508;-742961.000000000000000;-1044050.000000000000000;0
5198;-743259.600999999791384;-1043302.061000000685453;0
1596;-742323.000000000000000;-1045037.000000000000000;0
7026;-743217.644999999552965;-1044082.329999998211861;0
7008;-742899.559999998658895;-1044224.074999999254942;28
634;-742117.000000000000000;-1043309.000000000000000;0
7397;-743021.859999999403954;-1045682.989999998360872;0
5245;-743368.859999999403954;-1043290.789999999105930;0
515;-742176.000000000000000;-1043121.000000000000000;0
6487;-741745.798000000417233;-1044519.414999999105930;0
2408;-742369.000000000000000;-1045125.000000000000000;0
1622;-742495.000000000000000;-1044321.000000000000000;0
4852;-742992.449999999254942;-1042849.890000000596046;0
6262;-742370.024999998509884;-1043021.666000001132488;0
678;-742421.000000000000000;-1043181.000000000000000;0
4134;-742772.309999998658895;-1044078.870000001043081;0
8049;-742198.890000000596046;-1044891.600000001490116;0
878;-741947.000000000000000;-1042573.000000000000000;0
1084;-741698.000000000000000;-1044537.000000000000000;0
3153;-743993.857999999076128;-1042576.355000000447035;0
380;-742501.000000000000000;-1043722.000000000000000;0
4516;-742588.570000000298023;-1042771.460000000894070;0
4845;-742978.655999999493361;-1042776.048000000417233;0
1699;-741435.000000000000000;-1044671.000000000000000;0
2225;-743041.000000000000000;-1045477.000000000000000;0
2488;-742083.000000000000000;-1044303.000000000000000;0
683;-742362.000000000000000;-1043155.000000000000000;0
1313;-741681.000000000000000;-1044849.000000000000000;0
4245;-742160.210000000894070;-1043410.570000000298023;0
308;-742754.000000000000000;-1044149.000000000000000;0
4089;-742812.844999998807907;-1043560.114999998360872;0
6568;-741292.100000001490116;-1044161.670000001788139;0
4246;-742193.159000001847744;-1043412.537000000476837;0
7260;-742953.010000001639128;-1044873.530000001192093;0
6268;-742340.850000001490116;-1043018.881000000983477;0
5139;-743032.489999998360872;-1043533.679999999701977;0
1380;-742156.000000000000000;-1044947.000000000000000;0
5026;-742631.168999999761581;-1042903.938999999314547;0
1329;-742062.000000000000000;-1045046.000000000000000;0
1903;-743445.000000000000000;-1044281.000000000000000;0
8259;-742072.089999999850988;-1042687.219999998807907;0
2342;-742726.000000000000000;-1045537.000000000000000;0
1238;-742150.000000000000000;-1044384.000000000000000;0
7518;-742829.780000001192093;-1045693.210000000894070;0
4459;-742274.829999998211861;-1042644.269999999552965;0
7160;-743028.010999999940395;-1044543.267999999225140;0
1360;-741983.000000000000000;-1044900.000000000000000;0
4757;-742873.984000001102686;-1042820.212000001221895;0
6370;-741968.780000001192093;-1042685.250000000000000;0
4963;-742396.510000001639128;-1043031.829999998211861;0
2166;-743016.000000000000000;-1045179.000000000000000;0
206;-743179.000000000000000;-1043581.000000000000000;0
6364;-742003.519999999552965;-1042660.690000001341105;0
3337;-743968.771999999880791;-1043021.756999999284744;0
4761;-742810.285000000149012;-1042793.122000001370907;0
1395;-741799.000000000000000;-1044291.000000000000000;0
5295;-743047.995000001043081;-1043185.530000001192093;0
745;-741649.000000000000000;-1042968.000000000000000;0
5579;-743409.682999998331070;-1043634.574999999254942;0
2142;-742883.000000000000000;-1045078.000000000000000;0
8285;-742232.780000001192093;-1042821.149999998509884;0
6160;-742311.730999998748302;-1043061.116000000387430;0
4665;-742824.410000000149012;-1042592.260000001639128;0
23;-743544.000000000000000;-1042505.000000000000000;0
6219;-742319.168999999761581;-1043064.293999999761581;0
7088;-743335.559999998658895;-1044546.359999999403954;0
1704;-741289.000000000000000;-1044690.000000000000000;0
846;-742175.000000000000000;-1042517.000000000000000;0
1122;-741749.000000000000000;-1044455.000000000000000;0
6604;-741636.960000000894070;-1043867.217999998480082;0
7184;-742592.399999998509884;-1044704.010000001639128;0
6153;-742309.583999998867512;-1043058.640999998897314;0
5204;-743246.423999998718500;-1043308.298999998718500;0
7047;-743395.495000001043081;-1044210.765000000596046;0
4955;-742383.649999998509884;-1043019.250000000000000;0
4739;-742751.690000001341105;-1042699.230000000447035;0
6001;-742006.079999998211861;-1043292.300000000745058;0
5230;-743335.399999998509884;-1043517.670000001788139;0
1135;-741572.000000000000000;-1044437.000000000000000;0
570;-742098.000000000000000;-1043582.000000000000000;0
340;-742588.000000000000000;-1043906.000000000000000;0
2265;-742972.000000000000000;-1045774.000000000000000;0
1919;-743381.000000000000000;-1044393.000000000000000;0
758;-741658.000000000000000;-1042666.000000000000000;0
7746;-742234.789999999105930;-1045549.890000000596046;0
274;-743359.000000000000000;-1043833.000000000000000;0
3784;-743187.730000000447035;-1042922.429999999701977;0
5725;-743422.388000000268221;-1043634.186999998986721;0
7344;-742653.460000000894070;-1045190.980000000447035;0
6215;-742314.692000001668930;-1043057.682000000029802;0
1693;-741613.000000000000000;-1044649.000000000000000;0
6300;-741836.949999999254942;-1042698.329999998211861;0
1943;-743264.000000000000000;-1044421.000000000000000;0
4847;-742981.100000001490116;-1042831.059999998658895;0
4729;-742855.690000001341105;-1042695.640000000596046;0
5134;-742995.984000001102686;-1043497.364000000059605;0
1422;-742199.000000000000000;-1044127.000000000000000;0
6960;-743030.260000001639128;-1044242.870000001043081;0
3996;-743394.274999998509884;-1044004.254999998956919;0
5129;-743046.677000001072884;-1043376.409000001847744;0
4175;-742721.254999998956919;-1043775.890000000596046;0
5069;-742829.063999999314547;-1043280.938000001013279;0
4906;-742448.370000001043081;-1042815.789999999105930;0
4958;-742349.620000001043081;-1043004.539999999105930;0
3989;-743307.815000001341105;-1044034.914999999105930;0
6242;-742366.677999999374151;-1043062.949000000953674;0
5410;-742572.837000001221895;-1042981.173999998718500;0
7243;-742724.339999999850988;-1044835.870000001043081;0
1449;-741533.000000000000000;-1044684.000000000000000;0
7699;-742381.114000000059605;-1044818.644000001251698;0
7729;-742623.480999998748302;-1044601.217000000178814;0
2372;-742466.000000000000000;-1045488.000000000000000;0
1739;-741831.780000001192093;-1045213.809999998658895;0
1139;-741487.000000000000000;-1044447.000000000000000;0
7153;-742889.646999999880791;-1044547.438000001013279;0
4167;-742438.315000001341105;-1044021.960000000894070;0
3293;-743596.793000001460314;-1042814.440000001341105;0
2356;-742409.000000000000000;-1045589.000000000000000;0
4754;-742745.359999999403954;-1042759.160000000149012;0
6532;-741593.359999999403954;-1044141.059999998658895;0
2275;-742845.000000000000000;-1045719.000000000000000;0
4718;-742933.730000000447035;-1042628.039999999105930;0
4839;-742984.162000000476837;-1042715.425000000745058;0
1723;-741611.000000000000000;-1045092.000000000000000;0
5067;-742813.465999998152256;-1043267.335999999195337;0
1181;-741920.000000000000000;-1044230.000000000000000;0
1462;-741464.000000000000000;-1044225.000000000000000;0
6194;-742315.721000000834465;-1043062.585999999195337;0
4219;-742243.045000001788139;-1043600.660000000149012;0
1099;-741376.000000000000000;-1044563.000000000000000;0
4560;-742427.079999998211861;-1042500.829999998211861;0
7734;-741656.309000000357628;-1044953.727000001817942;0
3810;-743261.510000001639128;-1042802.960000000894070;0
1307;-741803.000000000000000;-1044663.000000000000000;0
1107;-741239.260000001639128;-1044580.940000001341105;0
1461;-741473.000000000000000;-1044266.000000000000000;0
6499;-741707.811000000685453;-1044907.068999998271465;0
2377;-742390.000000000000000;-1045527.000000000000000;0
877;-741951.000000000000000;-1042610.000000000000000;0
728;-741997.000000000000000;-1042918.000000000000000;0
6858;-741492.363000001758337;-1044950.462999999523163;0
5449;-743124.745000001043081;-1043406.449000000953674;0
4505;-742434.910000000149012;-1042706.170000001788139;0
1214;-742064.000000000000000;-1044358.000000000000000;0
6008;-743902.607000000774860;-1042749.771000001579523;0
4611;-742532.804999999701977;-1042593.420000001788139;0
1478;-741443.000000000000000;-1044220.000000000000000;0
3267;-743587.203000001609325;-1042710.840999998152256;0
6504;-741755.193999998271465;-1044619.083000000566244;0
2133;-743040.000000000000000;-1045127.000000000000000;0
4555;-742337.140000000596046;-1042512.379999998956919;0
7745;-742933.037000000476837;-1045523.714999999850988;0
4838;-742981.304999999701977;-1042697.471000000834465;0
1424;-742134.000000000000000;-1044171.000000000000000;0
2319;-742734.000000000000000;-1045474.000000000000000;0
4478;-741867.359999999403954;-1042693.289999999105930;0
3335;-743976.318999998271465;-1042991.258999999612570;0
1391;-742117.000000000000000;-1045084.000000000000000;0
4627;-742601.138999998569489;-1042606.791000001132488;0
6693;-742248.197000000625849;-1044816.127000000327826;0
6224;-742315.320000000298023;-1043057.335000000894070;0
505;-741917.000000000000000;-1043153.000000000000000;0
4074;-742943.350000001490116;-1043880.304999999701977;0
5171;-743266.124000001698732;-1043419.293999999761581;0
4712;-742830.309999998658895;-1042614.969999998807907;0
537;-742099.000000000000000;-1043663.000000000000000;0
1350;-741814.000000000000000;-1044844.000000000000000;0
2369;-742503.000000000000000;-1045427.000000000000000;0
337;-742621.000000000000000;-1043941.000000000000000;0
5166;-743202.493000000715256;-1043412.614999998360872;0
5730;-743418.855999998748302;-1043638.949000000953674;0
4700;-742659.859999999403954;-1042723.210000000894070;0
582;-741994.000000000000000;-1043417.000000000000000;0
5220;-743247.339999999850988;-1043589.050000000745058;0
4672;-742811.831999998539686;-1042675.907999999821186;0
1463;-741933.000000000000000;-1043968.000000000000000;0
5022;-742578.440000001341105;-1042849.350000001490116;0
3359;-743951.136999998241663;-1043051.339000001549721;0
844;-742138.000000000000000;-1042519.000000000000000;0
4641;-742591.151999998837709;-1042559.721000000834465;0
1440;-741782.000000000000000;-1044362.000000000000000;0
6158;-742313.261999998241663;-1043063.925999999046326;0
8265;-742197.820000000298023;-1042704.260000001639128;0
4945;-742422.162999998778105;-1043009.861000001430511;0
4896;-742589.649999998509884;-1042838.989999998360872;0
4969;-742465.059999998658895;-1043095.034000001847744;0
6356;-741962.699999999254942;-1042712.320000000298023;0
7154;-742908.467000000178814;-1044547.784000001847744;0
2392;-742057.000000000000000;-1045310.000000000000000;0
2335;-742825.000000000000000;-1045539.000000000000000;0
5645;-743428.886999998241663;-1043692.285999998450279;0
4529;-742762.920000001788139;-1042885.809999998658895;0
4514;-742555.050000000745058;-1042761.809999998658895;0
6270;-742333.412999998778105;-1043018.204999998211861;0
1035;-741963.000000000000000;-1044896.000000000000000;0
7750;-742972.960000000894070;-1044053.329999998211861;0
5169;-743240.785000000149012;-1043411.081999998539686;0
7120;-743351.160000000149012;-1044618.460000000894070;0
682;-742380.000000000000000;-1043151.000000000000000;0
219;-742979.000000000000000;-1043549.000000000000000;0
1775;-741246.000000000000000;-1044012.000000000000000;0
4577;-742376.686000000685453;-1042590.309999998658895;0
6783;-741340.728000000119209;-1044457.412000000476837;0
6148;-742313.410999998450279;-1043065.666999999433756;0
551;-742269.000000000000000;-1043755.000000000000000;0
5704;-743417.484999999403954;-1043635.530999999493361;0
2345;-742636.000000000000000;-1045561.000000000000000;0
6768;-741255.769999999552965;-1044419.920000001788139;0
7961;-741602.260000001639128;-1044314.350000001490116;0
6771;-741345.015999998897314;-1044413.647999998182058;0
3262;-743572.423999998718500;-1042699.197000000625849;0
4922;-742443.129999998956919;-1042886.510000001639128;0
4602;-742441.269000001251698;-1042596.320000000298023;0
1453;-741525.000000000000000;-1044529.000000000000000;0
2295;-742707.000000000000000;-1045396.000000000000000;0
5414;-742582.574999999254942;-1042677.478999998420477;0
1663;-741455.000000000000000;-1044433.000000000000000;0
4515;-742607.100000001490116;-1042765.780000001192093;0
5209;-743271.947999998927116;-1043361.392000000923872;0
3529;-744773.962999999523163;-1042673.491999998688698;0
4807;-743122.570000000298023;-1042767.850000001490116;0
4121;-742721.160000000149012;-1043948.695000000298023;0
8122;-742826.149999998509884;-1045713.260000001639128;0
6488;-741718.210000000894070;-1044532.489999998360872;0
7956;-741777.379999998956919;-1044260.170000001788139;0
6501;-741689.493000000715256;-1044942.905000001192093;0
3438;-743746.833000000566244;-1043057.962000001221895;0
3465;-745090.089999999850988;-1042676.664999999105930;0
7084;-743318.609999999403954;-1044521.789999999105930;0
4601;-742631.969999998807907;-1042675.629999998956919;0
590;-741935.000000000000000;-1043331.000000000000000;0
1212;-742038.000000000000000;-1044383.000000000000000;0
4973;-742480.098000001162291;-1043031.443999998271465;0
4153;-742555.934999998658895;-1044073.285000000149012;0
7166;-742741.322000000625849;-1044519.208999998867512;0
1430;-741993.000000000000000;-1044260.000000000000000;0
4920;-742444.449999999254942;-1042928.980000000447035;0
4592;-742448.190999999642372;-1042642.517999999225140;0
6767;-741223.949999999254942;-1044422.059999998658895;0
2891;-744029.914000000804663;-1043200.478000000119209;0
1598;-742351.000000000000000;-1045090.000000000000000;0
5592;-743420.136999998241663;-1043679.831999998539686;0
1934;-743294.000000000000000;-1044407.000000000000000;0
8066;-742286.199999999254942;-1045237.250000000000000;0
4668;-742810.210000000894070;-1042618.969999998807907;0
3349;-743960.629000000655651;-1042997.258999999612570;0
1913;-743453.000000000000000;-1044482.000000000000000;0
3993;-743345.100000001490116;-1043930.980000000447035;0
2368;-742507.000000000000000;-1045456.000000000000000;0
5413;-742651.872000001370907;-1042662.627999998629093;0
541;-742258.000000000000000;-1043678.000000000000000;0
5014;-742563.771999999880791;-1042993.241999998688698;0
5059;-742853.796000000089407;-1043168.151999998837709;0
7197;-742570.949000000953674;-1044895.548999998718500;0
6263;-742365.719000000506639;-1043021.282999999821186;0
3988;-743309.704999998211861;-1044008.570000000298023;0
398;-742372.000000000000000;-1043909.000000000000000;0
6704;-742282.179999999701977;-1044623.793999999761581;0
6274;-742318.392999999225140;-1043016.747000001370907;0
6770;-741306.423999998718500;-1044414.120999999344349;0
4425;-742208.820000000298023;-1043035.230000000447035;0
6167;-742313.859999999403954;-1043063.607000000774860;0
6650;-741714.296999998390675;-1044110.177000001072884;0
5651;-743429.440999999642372;-1043699.524999998509884;0
1687;-741142.120000001043081;-1044817.019999999552965;0
3692;-744525.876499999314547;-1042540.534000001847744;0
4600;-742647.000000000000000;-1042709.000000000000000;0
5001;-742560.092999998480082;-1042966.206999998539686;0
1776;-741200.000000000000000;-1044007.000000000000000;0
4722;-742878.030000001192093;-1042626.550000000745058;0
5648;-743429.164000000804663;-1043695.905999999493361;0
1179;-741934.000000000000000;-1044251.000000000000000;0
840;-742067.000000000000000;-1042522.000000000000000;0
734;-741935.000000000000000;-1043014.000000000000000;0
5284;-743041.022999998182058;-1043277.397999998182058;0
1947;-743286.000000000000000;-1044465.000000000000000;0
1492;-741096.000000000000000;-1044331.000000000000000;0
630;-742179.000000000000000;-1043289.000000000000000;0
2308;-742345.000000000000000;-1045499.000000000000000;0
1344;-741750.000000000000000;-1044808.000000000000000;0
2240;-743343.000000000000000;-1045290.000000000000000;0
2479;-741247.800000000745058;-1044609.379999998956919;0
303;-742895.000000000000000;-1044116.000000000000000;0
699;-742067.000000000000000;-1042896.000000000000000;0
4995;-742476.986000001430511;-1042961.239000000059605;0
4591;-742426.813000001013279;-1042640.035000000149012;0
818;-741961.000000000000000;-1042598.000000000000000;0
3323;-743934.361999999731779;-1042945.002999998629093;0
1969;-743376.000000000000000;-1044829.000000000000000;0
1950;-743271.000000000000000;-1044490.000000000000000;0
3960;-743418.563000001013279;-1043583.526000000536442;0
3848;-743094.383999999612570;-1042505.245000001043081;0
2189;-743472.000000000000000;-1045183.000000000000000;0
4528;-742714.350000001490116;-1042840.010000001639128;0
4621;-742536.945999998599291;-1042552.296000000089407;0
5712;-743423.701000001281500;-1043638.675999999046326;0
6573;-741294.089999999850988;-1044091.679999999701977;0
5506;-743427.348000001162291;-1043665.644999999552965;0
1330;-741817.000000000000000;-1044709.000000000000000;0
6327;-745070.166000001132488;-1042705.697000000625849;0
2302;-742507.000000000000000;-1045419.000000000000000;0
6765;-741163.449999999254942;-1044427.199999999254942;0
2498;-741906.000000000000000;-1044040.000000000000000;0
6136;-742315.081999998539686;-1043070.210000000894070;0
203;-743204.000000000000000;-1043607.000000000000000;0
6506;-741743.019999999552965;-1044571.050000000745058;0
1557;-741193.000000000000000;-1044306.000000000000000;0
2263;-742989.000000000000000;-1045714.000000000000000;0
4040;-743224.710000000894070;-1043766.050000000745058;0
262;-743408.000000000000000;-1043731.000000000000000;0
