OID_;X;Y;TEMPERATURE
3614;-744984.548999998718500;-1042283.640999998897314;0
3019;-744463.447999998927116;-1042784.646000001579523;0
3568;-744718.817999999970198;-1042588.614999998360872;0
3692;-744525.876499999314547;-1042540.534000001847744;0
3580;-744924.973999999463558;-1042593.699999999254942;0
2605;-745393.842999998480082;-1042860.796000000089407;0
5975;-745052.346999999135733;-1042674.673000000417233;0
118;-745135.000000000000000;-1042687.000000000000000;0
3542;-744575.274000000208616;-1042656.160000000149012;0
2696;-743477.489999998360872;-1042038.000000000000000;0
2520;-741847.000000000000000;-1045324.000000000000000;0
6872;-741751.719999998807907;-1045296.679999999701977;0
2760;-743863.331000000238419;-1043483.304000001400709;0
2755;-744003.879000000655651;-1043471.734000001102686;0
2404;-742179.000000000000000;-1045467.000000000000000;0
3919;-743904.947000000625849;-1043493.929999999701977;0
3107;-743778.888000000268221;-1042682.131999999284744;0
2740;-744042.611999999731779;-1043335.940000001341105;0
1486;-741150.000000000000000;-1044219.000000000000000;0
6828;-741465.309999998658895;-1044768.940000001341105;0
7411;-743529.510000001639128;-1045393.140000000596046;0
8079;-742021.839999999850988;-1045292.179999999701977;0
2070;-742993.000000000000000;-1044723.000000000000000;0
2097;-743143.000000000000000;-1044742.000000000000000;0
7263;-743009.559999998658895;-1044894.379999998956919;0
4238;-742440.263000000268221;-1043528.236000001430511;0
7654;-742242.081000000238419;-1045273.263999998569489;0
2394;-742273.000000000000000;-1045360.000000000000000;0
2160;-742849.000000000000000;-1045147.000000000000000;0
2161;-742876.000000000000000;-1045153.000000000000000;0
8073;-742120.640000000596046;-1045259.500000000000000;0
4075;-742947.934999998658895;-1043903.649999998509884;0
7947;-742030.969999998807907;-1044096.679999999701977;0
524;-742255.000000000000000;-1043913.000000000000000;0
1780;-741214.000000000000000;-1043934.000000000000000;0
738;-741818.000000000000000;-1043024.000000000000000;0
1983;-743474.000000000000000;-1044709.000000000000000;0
748;-741671.000000000000000;-1042971.000000000000000;0
110;-744127.000000000000000;-1042724.000000000000000;0
1764;-741163.000000000000000;-1044144.000000000000000;0
735;-741910.000000000000000;-1043014.000000000000000;0
2050;-743460.000000000000000;-1045072.000000000000000;0
2008;-743242.000000000000000;-1044759.000000000000000;0
6722;-742357.717000000178814;-1044705.708000000566244;0
1561;-743186.000000000000000;-1045098.000000000000000;0
1251;-742091.000000000000000;-1044690.000000000000000;0
7;-743479.000000000000000;-1042567.000000000000000;0
17;-743587.000000000000000;-1042394.000000000000000;0
5303;-743164.818999998271465;-1043211.078000001609325;0
1492;-741096.000000000000000;-1044331.000000000000000;0
4332;-742410.359000001102686;-1043282.916000001132488;0
3204;-743715.278999999165535;-1042506.118999999016523;0
6;-743464.000000000000000;-1042594.000000000000000;0
2133;-743040.000000000000000;-1045127.000000000000000;0
2151;-742827.000000000000000;-1045047.000000000000000;0
2166;-743016.000000000000000;-1045179.000000000000000;0
7324;-742833.980000000447035;-1044949.109999999403954;0
4162;-742497.193999998271465;-1044160.030000001192093;0
6746;-742405.083999998867512;-1044259.199999999254942;0
1515;-741913.000000000000000;-1044072.000000000000000;0
884;-741771.000000000000000;-1042776.000000000000000;0
1013;-742076.000000000000000;-1044595.000000000000000;0
2189;-743472.000000000000000;-1045183.000000000000000;0
727;-742001.000000000000000;-1042962.000000000000000;0
728;-741997.000000000000000;-1042918.000000000000000;0
696;-742077.000000000000000;-1042913.000000000000000;0
3326;-744036.002000000327826;-1042922.574999999254942;0
2226;-743057.000000000000000;-1045470.000000000000000;0
5062;-742798.513999998569489;-1043227.370999999344349;0
1970;-743380.000000000000000;-1044854.000000000000000;0
1987;-743480.000000000000000;-1044820.000000000000000;0
3387;-743960.368000000715256;-1043194.717000000178814;0
2256;-743156.000000000000000;-1045353.000000000000000;0
3233;-744152.962999999523163;-1042686.791999999433756;0
7776;-743089.784000001847744;-1045773.409000001847744;0
4232;-742315.057999998331070;-1043428.918999999761581;0
1915;-743468.000000000000000;-1044494.000000000000000;0
5119;-742850.592999998480082;-1043328.484999999403954;0
7520;-742808.589999999850988;-1045680.519999999552965;0
7087;-743339.940000001341105;-1044536.690000001341105;0
7350;-742556.390000000596046;-1045185.980000000447035;0
1945;-743270.000000000000000;-1044454.000000000000000;0
1058;-741667.000000000000000;-1045072.000000000000000;0
6791;-741047.329999998211861;-1044765.467999998480082;0
2262;-742999.000000000000000;-1045686.000000000000000;0
1926;-743301.000000000000000;-1044321.000000000000000;0
5292;-743055.866000000387430;-1043215.710999999195337;0
5272;-743000.013999998569489;-1043245.364000000059605;0
4070;-742925.285000000149012;-1043783.565000001341105;0
4342;-742506.473000001162291;-1043301.100000001490116;0
7651;-742295.381000000983477;-1045479.861999999731779;0
1238;-742150.000000000000000;-1044384.000000000000000;0
1243;-742122.000000000000000;-1044502.000000000000000;0
2491;-742059.000000000000000;-1044251.000000000000000;0
7217;-742516.318999998271465;-1044582.890000000596046;0
910;-742219.000000000000000;-1042529.000000000000000;0
1171;-741882.000000000000000;-1044375.000000000000000;0
6943;-742902.013999998569489;-1043932.647999998182058;0
6825;-741380.010000001639128;-1044780.089999999850988;0
281;-743045.000000000000000;-1043848.000000000000000;0
8018;-741974.039999999105930;-1044442.870000001043081;0
1138;-741500.000000000000000;-1044458.000000000000000;0
4236;-742406.842999998480082;-1043504.015000000596046;0
6095;-742082.920000001788139;-1043614.710000000894070;0
3781;-743273.059999998658895;-1042814.050000000745058;0
3752;-743213.949999999254942;-1042902.719999998807907;0
7218;-742534.100000001490116;-1044603.559999998658895;0
1656;-741395.000000000000000;-1044688.000000000000000;0
1922;-743390.000000000000000;-1044308.000000000000000;0
1920;-743384.000000000000000;-1044363.000000000000000;0
1905;-743446.000000000000000;-1044312.000000000000000;0
2513;-742574.000000000000000;-1044441.000000000000000;0
7044;-743400.635000001639128;-1044135.579999998211861;0
7104;-743423.739999998360872;-1044624.530000001192093;0
6313;-743936.949999999254942;-1042594.780000001192093;0
3155;-743969.353000000119209;-1042568.828000001609325;0
4026;-743178.984999999403954;-1043847.989999998360872;0
6821;-741256.649999998509884;-1044796.100000001490116;0
1101;-741339.000000000000000;-1044568.000000000000000;0
4023;-743246.635000001639128;-1043864.364999998360872;0
2300;-742561.000000000000000;-1045413.000000000000000;0
1693;-741613.000000000000000;-1044649.000000000000000;0
713;-741800.000000000000000;-1042859.000000000000000;0
3976;-743088.861000001430511;-1043707.728000000119209;0
881;-741806.000000000000000;-1042815.000000000000000;0
1611;-742400.000000000000000;-1044442.000000000000000;0
6700;-742298.611000001430511;-1044507.315999999642372;0
6703;-742288.903999999165535;-1044591.625999998301268;0
7010;-742857.964999999850988;-1044251.155000001192093;4
4058;-743138.765000000596046;-1043625.405000001192093;0
4057;-743132.184999998658895;-1043648.719999998807907;0
1310;-741623.000000000000000;-1044829.000000000000000;0
6718;-742339.493000000715256;-1044956.921999998390675;0
1692;-741125.000000000000000;-1044816.000000000000000;0
6662;-741466.800000000745058;-1044192.359999999403954;0
2016;-743230.000000000000000;-1044873.000000000000000;0
2575;-742484.000000000000000;-1045453.000000000000000;0
2375;-742438.000000000000000;-1045570.000000000000000;0
2309;-742322.000000000000000;-1045519.000000000000000;0
2329;-742432.000000000000000;-1045508.000000000000000;0
6842;-741574.894000001251698;-1044962.013999998569489;0
1590;-742377.000000000000000;-1044885.000000000000000;0
4064;-742879.655000001192093;-1043647.420000001788139;0
1993;-743483.000000000000000;-1044984.000000000000000;0
2041;-743531.000000000000000;-1044957.000000000000000;0
1269;-742246.000000000000000;-1044462.000000000000000;0
6573;-741294.089999999850988;-1044091.679999999701977;0
4036;-743246.920000001788139;-1043771.574999999254942;0
3766;-743053.532999999821186;-1042996.631000000983477;0
2017;-743247.000000000000000;-1044884.000000000000000;0
6726;-742476.517999999225140;-1044410.600000001490116;0
2028;-743371.000000000000000;-1045054.000000000000000;0
1604;-742552.000000000000000;-1044918.000000000000000;0
5241;-743365.063000001013279;-1043245.954999998211861;0
7152;-742867.331999998539686;-1044547.015999998897314;0
5258;-743356.739999998360872;-1043230.039999999105930;0
7156;-742944.515000000596046;-1044546.140000000596046;0
1553;-741350.000000000000000;-1044268.000000000000000;0
1126;-741684.000000000000000;-1044450.000000000000000;0
1459;-741491.000000000000000;-1044340.000000000000000;0
3995;-743393.225000001490116;-1043973.719999998807907;0
2247;-743199.000000000000000;-1045400.000000000000000;0
3287;-743711.173999998718500;-1042886.515999998897314;0
7141;-742895.629999998956919;-1044470.910000000149012;0
1518;-741994.000000000000000;-1044011.000000000000000;0
4990;-742657.837999999523163;-1043024.199999999254942;0
1619;-742426.000000000000000;-1044401.000000000000000;0
4062;-742830.460000000894070;-1043654.920000001788139;0
7017;-742571.059999998658895;-1044267.640000000596046;0
2238;-743372.000000000000000;-1045261.000000000000000;0
2232;-743488.000000000000000;-1045234.000000000000000;0
1849;-742732.000000000000000;-1044228.000000000000000;0
4079;-742836.170000001788139;-1043800.960000000894070;0
1061;-741586.000000000000000;-1045133.000000000000000;0
2891;-744029.914000000804663;-1043200.478000000119209;0
2888;-744082.749000001698732;-1043174.458999998867512;0
3266;-743585.618999999016523;-1042739.508999999612570;0
3289;-743584.761999998241663;-1042769.188000001013279;0
2213;-743188.000000000000000;-1045298.000000000000000;0
2241;-743319.000000000000000;-1045289.000000000000000;0
2526;-741087.000000000000000;-1044616.000000000000000;0
1435;-741903.000000000000000;-1044306.000000000000000;0
4198;-742192.445000000298023;-1043760.521000001579523;0
7146;-742819.425000000745058;-1044426.225000001490116;0
2487;-742101.000000000000000;-1044308.000000000000000;0
4500;-742315.239999998360872;-1042719.460000000894070;0
7958;-741664.710000000894070;-1044289.879999998956919;0
1455;-741517.000000000000000;-1044468.000000000000000;0
1164;-741055.000000000000000;-1044515.000000000000000;0
5323;-743049.401000000536442;-1043038.131000000983477;0
1531;-741782.000000000000000;-1043838.000000000000000;0
1520;-741777.000000000000000;-1043939.000000000000000;0
560;-742181.000000000000000;-1043665.000000000000000;0
4981;-742536.340999998152256;-1043014.929999999701977;0
6854;-741522.427999999374151;-1045038.967999998480082;0
1839;-742994.469999998807907;-1044185.679999999701977;0
574;-742068.000000000000000;-1043538.000000000000000;0
3095;-743923.068999998271465;-1042787.789000000804663;0
3101;-743922.754999998956919;-1042745.195000000298023;0
4925;-742455.502000000327826;-1042923.307000000029802;0
334;-742631.000000000000000;-1043987.000000000000000;0
581;-741991.000000000000000;-1043457.000000000000000;0
5961;-742431.225000001490116;-1044003.574999999254942;0
591;-741912.000000000000000;-1043346.000000000000000;0
1328;-742037.000000000000000;-1045043.000000000000000;0
346;-742540.000000000000000;-1043816.000000000000000;0
2321;-742679.000000000000000;-1045480.000000000000000;0
1008;-741962.000000000000000;-1044568.000000000000000;0
1005;-741944.000000000000000;-1044583.000000000000000;0
826;-742191.000000000000000;-1042616.000000000000000;0
7147;-742827.925000000745058;-1044451.385000001639128;0
401;-742324.000000000000000;-1043907.000000000000000;0
8281;-742164.160000000149012;-1042778.140000000596046;0
8283;-742198.600000001490116;-1042801.980000000447035;0
2084;-742447.000000000000000;-1044797.000000000000000;0
3886;-742385.100000001490116;-1042445.500000000000000;0
1705;-741257.219999998807907;-1044695.690000001341105;0
2079;-742688.000000000000000;-1044428.000000000000000;0
5419;-742434.690000001341105;-1042846.280000001192093;0
555;-742230.000000000000000;-1043726.000000000000000;0
7175;-742651.780000001192093;-1044558.149999998509884;0
2082;-742569.000000000000000;-1044642.000000000000000;0
3769;-742978.969999998807907;-1042975.300000000745058;0
2320;-742707.000000000000000;-1045477.000000000000000;0
5020;-742572.699999999254942;-1042891.372999999672174;0
6509;-741724.809999998658895;-1044485.162000000476837;0
1824;-742963.809999998658895;-1044143.929999999701977;0
7190;-742577.989999998360872;-1044771.690000001341105;0
6705;-742279.050999999046326;-1044655.923000000417233;0
6604;-741636.960000000894070;-1043867.217999998480082;0
4033;-743319.719999998807907;-1043793.300000000745058;0
6783;-741340.728000000119209;-1044457.412000000476837;0
3794;-743091.015000000596046;-1042800.471999999135733;0
4510;-742483.149999998509884;-1042738.460000000894070;0
1109;-741204.100000001490116;-1044585.460000000894070;0
6693;-742248.197000000625849;-1044816.127000000327826;0
5996;-742061.879000000655651;-1043284.276999998837709;0
6002;-742018.502000000327826;-1043294.918999999761581;0
1529;-741727.000000000000000;-1043794.000000000000000;0
7233;-742606.750000000000000;-1044827.379999998956919;0
2334;-742872.000000000000000;-1045519.000000000000000;0
551;-742269.000000000000000;-1043755.000000000000000;0
392;-742418.000000000000000;-1043843.000000000000000;0
399;-742339.000000000000000;-1043884.000000000000000;0
6839;-741723.412000000476837;-1044988.993000000715256;0
3992;-743365.899999998509884;-1043881.385000001639128;0
3797;-743147.989999998360872;-1042854.129999998956919;0
6836;-741643.532000001519918;-1044947.486999999731779;0
381;-742465.000000000000000;-1043700.000000000000000;0
378;-742514.000000000000000;-1043703.000000000000000;0
1323;-741859.000000000000000;-1044941.000000000000000;0
793;-741697.000000000000000;-1042588.000000000000000;0
4105;-742678.771999999880791;-1043769.206000000238419;0
4821;-742966.550000000745058;-1042877.969999998807907;0
2270;-742954.000000000000000;-1045592.000000000000000;0
6789;-741187.510000001639128;-1044470.660000000149012;0
5167;-743219.324999999254942;-1043405.249000001698732;0
1495;-741215.000000000000000;-1044324.000000000000000;0
4944;-742430.605999998748302;-1043013.879000000655651;0
600;-741840.000000000000000;-1043212.000000000000000;0
7022;-743155.660000000149012;-1044074.410000000149012;0
2557;-741318.000000000000000;-1044384.000000000000000;0
7736;-742342.260000001639128;-1045113.918000001460314;0
1167;-741836.000000000000000;-1044429.000000000000000;0
3989;-743307.815000001341105;-1044034.914999999105930;0
7026;-743217.644999999552965;-1044082.329999998211861;0
512;-742063.000000000000000;-1043136.000000000000000;0
3306;-743787.127999998629093;-1042847.872999999672174;0
1344;-741750.000000000000000;-1044808.000000000000000;0
4774;-742900.078999999910593;-1042854.859000001102686;0
3305;-743801.410000000149012;-1042874.962999999523163;0
4425;-742208.820000000298023;-1043035.230000000447035;0
516;-742160.000000000000000;-1043135.000000000000000;0
506;-741980.000000000000000;-1043158.000000000000000;0
7515;-742273.021999999880791;-1044371.543999999761581;0
7681;-742501.629999998956919;-1045152.870000001043081;0
7706;-742313.239999998360872;-1044319.611999999731779;0
1440;-741782.000000000000000;-1044362.000000000000000;0
1035;-741963.000000000000000;-1044896.000000000000000;0
1827;-743033.000000000000000;-1044080.000000000000000;0
4127;-742837.324999999254942;-1044032.670000001788139;0
4574;-742339.980000000447035;-1042661.570000000298023;0
7287;-742809.579999998211861;-1044785.789999999105930;0
7031;-743301.824999999254942;-1044080.774999998509884;0
2546;-741750.000000000000000;-1044271.000000000000000;0
2286;-742894.000000000000000;-1045440.000000000000000;0
1399;-741736.000000000000000;-1044167.000000000000000;0
650;-742263.000000000000000;-1043381.000000000000000;0
1447;-741541.000000000000000;-1044744.000000000000000;0
4323;-742267.879999998956919;-1043190.035000000149012;0
8271;-742030.649999998509884;-1042720.129999998956919;0
4956;-742383.579999998211861;-1043007.739999998360872;0
787;-741714.000000000000000;-1042620.000000000000000;0
754;-741676.000000000000000;-1042727.000000000000000;0
4813;-743013.550000000745058;-1042793.390000000596046;0
8056;-742242.379999998956919;-1045023.460000000894070;0
3836;-743096.070000000298023;-1042561.879999998956919;0
7037;-743316.085000000894070;-1044222.170000001788139;0
1089;-741567.949999999254942;-1044538.820000000298023;0
889;-742000.000000000000000;-1042770.000000000000000;0
1474;-741604.000000000000000;-1044172.000000000000000;0
1368;-741998.000000000000000;-1044779.000000000000000;0
3845;-743172.920000001788139;-1042573.210000000894070;0
4938;-742469.324999999254942;-1042658.263000000268221;0
7004;-743069.289999999105930;-1044326.469999998807907;0
3747;-743250.879999998956919;-1042956.620000001043081;0
505;-741917.000000000000000;-1043153.000000000000000;0
627;-742223.000000000000000;-1043335.000000000000000;0
876;-741953.000000000000000;-1042636.000000000000000;0
1298;-741964.000000000000000;-1044736.000000000000000;0
2562;-741090.000000000000000;-1044404.000000000000000;0
4875;-742814.660000000149012;-1042937.800000000745058;0
6104;-742208.646999999880791;-1043103.999000001698732;0
4726;-742863.519999999552965;-1042684.000000000000000;0
4222;-742187.096999999135733;-1043485.890000000596046;0
1378;-742161.000000000000000;-1044904.000000000000000;0
1260;-742070.000000000000000;-1044876.000000000000000;0
4659;-742803.311000000685453;-1042470.754999998956919;0
4589;-742408.243000000715256;-1042542.631999999284744;0
3834;-743079.190000001341105;-1042579.899999998509884;0
5244;-743361.021000001579523;-1043374.999000001698732;0
5142;-743039.870000001043081;-1043473.929999999701977;0
3439;-743751.594000000506639;-1043080.798999998718500;0
6611;-741711.614000000059605;-1043979.263999998569489;0
4761;-742810.285000000149012;-1042793.122000001370907;0
1187;-741805.000000000000000;-1044071.000000000000000;0
7276;-742801.670000001788139;-1044613.309999998658895;0
7283;-742804.480000000447035;-1044732.769999999552965;0
3413;-743776.791000001132488;-1043071.675000000745058;0
4959;-742331.289999999105930;-1043002.690000001341105;0
5186;-743270.949999999254942;-1043526.039999999105930;0
301;-742613.000000000000000;-1043903.000000000000000;0
3369;-743878.633000001311302;-1043011.739000000059605;0
4223;-742161.556000001728535;-1043473.138999998569489;0
4099;-742773.870000001043081;-1043846.135999999940395;0
6712;-742273.328000001609325;-1044860.912000000476837;0
307;-742781.000000000000000;-1044143.000000000000000;0
408;-742317.000000000000000;-1044182.000000000000000;0
3355;-743953.881000000983477;-1043031.379999998956919;0
4479;-741782.780000001192093;-1042660.359999999403954;0
5446;-743190.850000001490116;-1043337.008999999612570;0
2294;-742754.000000000000000;-1045391.000000000000000;0
182;-743429.000000000000000;-1043385.000000000000000;0
4116;-742740.429999999701977;-1044064.789999999105930;0
674;-742463.000000000000000;-1043211.000000000000000;0
6403;-741971.879999998956919;-1042504.289999999105930;0
4640;-742588.572999998927116;-1042544.848999999463558;0
677;-742425.000000000000000;-1043200.000000000000000;0
462;-741707.000000000000000;-1043294.000000000000000;0
4592;-742448.190999999642372;-1042642.517999999225140;0
4667;-742823.039999999105930;-1042631.620000001043081;0
5679;-743403.182000000029802;-1043717.807000000029802;0
4895;-742596.936999998986721;-1042829.168000001460314;0
5143;-743052.232000000774860;-1043454.120000001043081;0
5678;-743404.363000001758337;-1043717.368999999016523;0
4202;-742285.475999999791384;-1043627.734999999403954;0
4478;-741867.359999999403954;-1042693.289999999105930;0
226;-742879.000000000000000;-1043516.000000000000000;0
1408;-741647.000000000000000;-1044201.000000000000000;0
222;-742939.000000000000000;-1043526.000000000000000;0
3962;-743407.190000001341105;-1043535.730000000447035;0
5723;-743420.903000000864267;-1043631.703999999910593;0
5504;-743428.977000001817942;-1043686.274000000208616;0
5738;-743410.412999998778105;-1043691.800000000745058;0
7209;-742570.339999999850988;-1045040.429999999701977;0
5147;-743077.127000000327826;-1043433.221999999135733;0
5506;-743427.348000001162291;-1043665.644999999552965;0
3746;-743261.420000001788139;-1042982.839999999850988;0
4732;-742777.550000000745058;-1042653.539999999105930;0
6166;-742314.649999998509884;-1043065.006999999284744;0
5776;-742933.609000001102686;-1043433.765999998897314;0
4792;-743051.280000001192093;-1042654.962999999523163;0
4632;-742615.638999998569489;-1042624.039999999105930;0
4529;-742762.920000001788139;-1042885.809999998658895;0
5724;-743422.230999998748302;-1043632.715999998152256;0
4218;-742263.436999998986721;-1043615.100999999791384;0
1791;-742157.000000000000000;-1044163.000000000000000;0
6675;-742272.140000000596046;-1044167.469999998807907;0
1866;-743456.000000000000000;-1044201.000000000000000;0
5510;-743424.346000000834465;-1043626.458999998867512;0
4638;-742553.631999999284744;-1042542.028000000864267;0
497;-741780.000000000000000;-1043214.000000000000000;0
1381;-742115.000000000000000;-1044999.000000000000000;0
4521;-742681.440000001341105;-1042792.960000000894070;0
3830;-743013.879999998956919;-1042612.359999999403954;0
5747;-743413.175999999046326;-1043698.811000000685453;0
4525;-742716.719999998807907;-1042823.219999998807907;0
4837;-742979.105999998748302;-1042672.627999998629093;0
6979;-743081.460000000894070;-1044413.079999998211861;0
845;-742126.000000000000000;-1042505.000000000000000;0
6230;-742317.590999998152256;-1043059.730999998748302;0
6280;-742306.918999999761581;-1043038.083000000566244;0
5695;-743417.217999998480082;-1043638.749000001698732;0
1352;-741840.000000000000000;-1044854.000000000000000;0
5661;-743424.451999999582767;-1043709.932999998331070;0
1307;-741803.000000000000000;-1044663.000000000000000;0
4739;-742751.690000001341105;-1042699.230000000447035;0
6977;-743098.949999999254942;-1044459.879999998956919;0
6145;-742315.708000000566244;-1043069.881999999284744;0
6282;-742308.337999999523163;-1043045.984000001102686;0
5714;-743423.756000000983477;-1043635.103999998420477;0
6209;-742319.320000000298023;-1043066.114999998360872;0
6188;-742312.807999998331070;-1043058.706999998539686;0
5691;-743415.714000001549721;-1043637.241000000387430;0
6142;-742310.477000001817942;-1043061.813000001013279;0
323;-742711.000000000000000;-1044140.000000000000000;0
5595;-743416.488000001758337;-1043680.118999999016523;0
465;-741728.000000000000000;-1043309.000000000000000;0
1902;-743459.000000000000000;-1044269.000000000000000;0
1424;-742134.000000000000000;-1044171.000000000000000;0
1351;-741850.000000000000000;-1044830.000000000000000;0
5667;-743417.361999999731779;-1043712.557000000029802;0
328;-742670.000000000000000;-1044072.000000000000000;0
1262;-742066.000000000000000;-1044917.000000000000000;0
6996;-743116.699999999254942;-1044476.469999998807907;0
4803;-743043.410999998450279;-1042699.506000000983477;0
6250;-742374.638999998569489;-1043047.576999999582767;0
4247;-742154.829999998211861;-1043394.660000000149012;0
4795;-743049.835000000894070;-1042669.013000000268221;0
7207;-742570.620000001043081;-1045016.149999998509884;0
6219;-742319.168999999761581;-1043064.293999999761581;0
3958;-743416.328000001609325;-1043572.265999998897314;0
6504;-741755.193999998271465;-1044619.083000000566244;0
6975;-743116.140000000596046;-1044506.469999998807907;0
4616;-742545.416999999433756;-1042662.541999999433756;0
4613;-742506.557000000029802;-1042597.938000001013279;0
6125;-743428.124000001698732;-1043615.223999999463558;0
4964;-742390.059999998658895;-1043044.839999999850988;0
4098;-742789.157000001519918;-1043861.918999999761581;0
1473;-741642.000000000000000;-1044158.000000000000000;0
1386;-742158.000000000000000;-1044976.000000000000000;0
5643;-743428.701999999582767;-1043689.872999999672174;0
6220;-742318.432999998331070;-1043062.949999999254942;0
337;-742621.000000000000000;-1043941.000000000000000;0
4532;-742760.140000000596046;-1042899.600000001490116;0
4793;-743035.089999999850988;-1042650.028000000864267;0
5222;-743271.000000000000000;-1043543.149999998509884;0
840;-742067.000000000000000;-1042522.000000000000000;0
5733;-743410.142999999225140;-1043688.210999999195337;0
6226;-742320.660999998450279;-1043065.366999998688698;0
1377;-742146.969999998807907;-1044922.489999998360872;0
690;-742306.000000000000000;-1043081.000000000000000;0
463;-741703.000000000000000;-1043287.000000000000000;0
6128;-742313.668999999761581;-1043069.186000000685453;0
6218;-742319.947000000625849;-1043065.767999999225140;0
6222;-742316.855000000447035;-1043060.109999999403954;0
4608;-742555.160999998450279;-1042637.633999999612570;0
6215;-742314.692000001668930;-1043057.682000000029802;0
5598;-743412.839999999850988;-1043680.403000000864267;0
6268;-742340.850000001490116;-1043018.881000000983477;0
6205;-742314.800000000745058;-1043059.416999999433756;0
3354;-743954.250999998301268;-1043026.024999998509884;0
6162;-742310.199999999254942;-1043058.306000001728535;0
6763;-741117.219999998807907;-1044428.989999998360872;0
5108;-742876.219999998807907;-1043431.129999998956919;0
5197;-743222.513000000268221;-1043313.989999998360872;0
6138;-742313.561999998986721;-1043067.399000000208616;0
6187;-742313.572999998927116;-1043060.111999999731779;0
6651;-741697.910000000149012;-1044123.329999998211861;0
4891;-742595.048999998718500;-1042857.274999998509884;0
6393;-742076.660000000149012;-1042499.879999998956919;0
4649;-742732.228999998420477;-1042525.100000001490116;0
6212;-742317.006000000983477;-1043061.888000000268221;0
4623;-742533.778999999165535;-1042585.824000000953674;0
3759;-743267.609999999403954;-1042971.300000000745058;0
679;-742404.000000000000000;-1043185.000000000000000;0
632;-742130.000000000000000;-1043287.000000000000000;0
6152;-742310.348999999463558;-1043060.046999998390675;0
4249;-742151.910000000149012;-1043354.719999998807907;0
4117;-742733.614999998360872;-1044043.129999998956919;0
6163;-742316.921000000089407;-1043069.223000001162291;0
4954;-742405.539999999105930;-1043024.640000000596046;0
4689;-742688.114999998360872;-1042568.859999999403954;0
6169;-742312.320000000298023;-1043060.791999999433756;0
4785;-742943.613000001758337;-1042632.072999998927116;0
4641;-742591.151999998837709;-1042559.721000000834465;0
5227;-743318.199999999254942;-1043537.510000001639128;0
1305;-741826.000000000000000;-1044678.000000000000000;0
1088;-741617.000000000000000;-1044547.000000000000000;0
4668;-742810.210000000894070;-1042618.969999998807907;0
6141;-742311.243999999016523;-1043063.195999998599291;0
5642;-743428.609999999403954;-1043688.666999999433756;0
6298;-741804.910000000149012;-1042692.300000000745058;0
6170;-742311.548000000417233;-1043059.381000000983477;0
5600;-743410.407000001519918;-1043680.594000000506639;0
6224;-742315.320000000298023;-1043057.335000000894070;0
4146;-742666.940000001341105;-1043854.829999998211861;0
6191;-742318.017000000923872;-1043066.800999999046326;0
4614;-742493.800000000745058;-1042636.896000001579523;0
4874;-742795.429999999701977;-1042925.910000000149012;0
4669;-742823.199999999254942;-1042658.309999998658895;0
5580;-743409.831000000238419;-1043636.449000000953674;0
6221;-742317.633000001311302;-1043061.541000001132488;0
6243;-742367.739999998360872;-1043061.098000001162291;0
5757;-743420.747999999672174;-1043633.940999999642372;0
2503;-742753.000000000000000;-1045484.000000000000000;0
1544;-742236.000000000000000;-1044198.000000000000000;0
5450;-743130.769000001251698;-1043378.403000000864267;0
6189;-742312.041999999433756;-1043057.302000001072884;0
5734;-743412.366999998688698;-1043688.041999999433756;0
