OID_;X;Y;TEMPERATURE
3614;-744984.548999998718500;-1042283.640999998897314;0
110;-744127.000000000000000;-1042724.000000000000000;0
3019;-744463.447999998927116;-1042784.646000001579523;0
3568;-744718.817999999970198;-1042588.614999998360872;0
3692;-744525.876499999314547;-1042540.534000001847744;0
3580;-744924.973999999463558;-1042593.699999999254942;0
2605;-745393.842999998480082;-1042860.796000000089407;0
5975;-745052.346999999135733;-1042674.673000000417233;0
118;-745135.000000000000000;-1042687.000000000000000;0
3542;-744575.274000000208616;-1042656.160000000149012;0
2696;-743477.489999998360872;-1042038.000000000000000;0
2520;-741847.000000000000000;-1045324.000000000000000;0
7011;-742831.309999998658895;-1044257.245000001043081;0
1760;-741162.000000000000000;-1044101.000000000000000;0
7780;-743046.243000000715256;-1045844.168999999761581;0
4070;-742925.285000000149012;-1043783.565000001341105;0
6946;-742974.765000000596046;-1043929.388000000268221;0
2262;-742999.000000000000000;-1045686.000000000000000;0
3795;-743173.190000001341105;-1042842.170000001788139;0
8079;-742021.839999999850988;-1045292.179999999701977;0
2277;-742826.000000000000000;-1045653.000000000000000;0
6874;-741789.789999999105930;-1045272.100000001490116;0
3783;-743211.559999998658895;-1042920.120000001043081;0
1584;-742368.000000000000000;-1044717.000000000000000;0
467;-741757.000000000000000;-1043352.000000000000000;0
7279;-742799.399999998509884;-1044679.829999998211861;0
1334;-741769.000000000000000;-1044799.000000000000000;0
1020;-742293.000000000000000;-1044615.000000000000000;0
651;-742490.000000000000000;-1043564.000000000000000;0
6722;-742357.717000000178814;-1044705.708000000566244;0
6726;-742476.517999999225140;-1044410.600000001490116;0
4163;-742487.695000000298023;-1044138.535000000149012;0
696;-742077.000000000000000;-1042913.000000000000000;0
7215;-742484.320000000298023;-1044546.620000001043081;0
1309;-741611.000000000000000;-1044813.000000000000000;0
384;-742471.000000000000000;-1043766.000000000000000;0
7146;-742819.425000000745058;-1044426.225000001490116;0
7171;-742671.969999998807907;-1044508.219999998807907;0
3109;-743754.403999999165535;-1042652.872000001370907;0
6930;-742046.030000001192093;-1045191.489999998360872;0
8152;-743293.600000001490116;-1043190.510000001639128;0
6794;-741124.372999999672174;-1044792.221000000834465;0
5244;-743361.021000001579523;-1043374.999000001698732;0
7259;-742935.280000001192093;-1044869.829999998211861;0
7187;-742595.019999999552965;-1044739.962000001221895;0
885;-741739.000000000000000;-1042777.000000000000000;0
1214;-742064.000000000000000;-1044358.000000000000000;0
5068;-742837.162999998778105;-1043263.965999998152256;0
3760;-743233.829999998211861;-1042978.739999998360872;0
5292;-743055.866000000387430;-1043215.710999999195337;0
7246;-742736.730000000447035;-1044825.399999998509884;0
5067;-742813.465999998152256;-1043267.335999999195337;0
7201;-742571.190000001341105;-1044939.320000000298023;0
1286;-742221.460000000894070;-1044465.969999998807907;0
2131;-743073.000000000000000;-1045134.000000000000000;0
1255;-742077.000000000000000;-1044770.000000000000000;0
2433;-742514.000000000000000;-1045081.000000000000000;0
3269;-743600.679000001400709;-1042731.660000000149012;0
1524;-741710.000000000000000;-1043844.000000000000000;0
598;-741853.000000000000000;-1043233.000000000000000;0
985;-741823.000000000000000;-1044444.000000000000000;0
4826;-743043.850000001490116;-1042979.600000001490116;0
4002;-743397.818999998271465;-1044054.317999999970198;0
1267;-742040.000000000000000;-1044999.000000000000000;0
744;-741666.000000000000000;-1042994.000000000000000;0
4502;-742349.309999998658895;-1042718.199999999254942;0
5307;-743082.182000000029802;-1043190.162000000476837;0
2575;-742484.000000000000000;-1045453.000000000000000;0
7;-743479.000000000000000;-1042567.000000000000000;0
7705;-742283.471999999135733;-1044316.339999999850988;0
1388;-742152.000000000000000;-1045026.000000000000000;0
6711;-742266.486000001430511;-1044832.896000001579523;0
1487;-741117.000000000000000;-1044216.000000000000000;0
6701;-742295.142000000923872;-1044533.372000001370907;0
1014;-742097.000000000000000;-1044586.000000000000000;0
1317;-741748.000000000000000;-1044884.000000000000000;0
524;-742255.000000000000000;-1043913.000000000000000;0
3387;-743960.368000000715256;-1043194.717000000178814;0
1042;-741883.000000000000000;-1044682.000000000000000;0
1087;-741605.000000000000000;-1044533.000000000000000;0
2255;-743181.000000000000000;-1045372.000000000000000;0
4237;-742425.385000001639128;-1043517.421000000089407;0
3207;-743687.458999998867512;-1042502.859000001102686;0
4170;-742407.245000001043081;-1043945.519999999552965;0
2009;-743221.000000000000000;-1044770.000000000000000;0
7362;-743205.807000000029802;-1045156.089999999850988;0
5204;-743246.423999998718500;-1043308.298999998718500;0
8050;-742206.719999998807907;-1044915.530000001192093;0
1994;-743483.000000000000000;-1045010.000000000000000;0
8150;-743304.219999998807907;-1043217.539999999105930;0
527;-742186.000000000000000;-1043818.000000000000000;0
1128;-741655.000000000000000;-1044448.000000000000000;0
1321;-741825.000000000000000;-1044923.000000000000000;0
4212;-742205.245000001043081;-1043548.410000000149012;0
2016;-743230.000000000000000;-1044873.000000000000000;0
7514;-742304.866000000387430;-1044375.124000001698732;0
3306;-743787.127999998629093;-1042847.872999999672174;0
1299;-741943.000000000000000;-1044719.000000000000000;0
4996;-742488.458999998867512;-1042974.723999999463558;0
7661;-742294.495999999344349;-1045349.482000000774860;0
4190;-742301.250000000000000;-1044166.100000001490116;0
839;-742021.000000000000000;-1042510.000000000000000;0
2151;-742827.000000000000000;-1045047.000000000000000;0
1248;-742109.000000000000000;-1044631.000000000000000;0
1621;-742467.000000000000000;-1044322.000000000000000;0
4048;-743218.050000000745058;-1043961.320000000298023;0
3141;-744035.420000001788139;-1042680.460000000894070;0
1482;-741289.000000000000000;-1044232.000000000000000;0
2516;-742500.000000000000000;-1044414.000000000000000;0
601;-741823.000000000000000;-1043224.000000000000000;0
6181;-742318.164999999105930;-1043068.541999999433756;0
7350;-742556.390000000596046;-1045185.980000000447035;0
2398;-742150.000000000000000;-1045370.000000000000000;0
5172;-743274.383999999612570;-1043432.322999998927116;0
1757;-742189.000000000000000;-1045219.000000000000000;0
2334;-742872.000000000000000;-1045519.000000000000000;0
2070;-742993.000000000000000;-1044723.000000000000000;0
2160;-742849.000000000000000;-1045147.000000000000000;0
2021;-743281.000000000000000;-1044948.000000000000000;0
7411;-743529.510000001639128;-1045393.140000000596046;0
1600;-742418.000000000000000;-1044944.000000000000000;0
2409;-742363.000000000000000;-1045093.000000000000000;0
7156;-742944.515000000596046;-1044546.140000000596046;0
550;-742276.000000000000000;-1043746.000000000000000;0
3839;-743112.140000000596046;-1042558.280000001192093;0
3415;-743772.855999998748302;-1043081.368000000715256;0
509;-741991.000000000000000;-1043143.000000000000000;0
1359;-742000.000000000000000;-1044897.000000000000000;0
2291;-742850.000000000000000;-1045401.000000000000000;0
1318;-741838.000000000000000;-1044940.000000000000000;0
4580;-742393.905000001192093;-1042551.807000000029802;0
2343;-742674.000000000000000;-1045557.000000000000000;0
390;-742429.000000000000000;-1043827.000000000000000;0
7153;-742889.646999999880791;-1044547.438000001013279;0
351;-742509.000000000000000;-1043739.000000000000000;0
1429;-741982.000000000000000;-1044280.000000000000000;0
2485;-741285.420000001788139;-1044820.140000000596046;0
555;-742230.000000000000000;-1043726.000000000000000;0
735;-741910.000000000000000;-1043014.000000000000000;0
201;-743229.000000000000000;-1043614.000000000000000;0
1772;-741277.000000000000000;-1044012.000000000000000;0
724;-741987.000000000000000;-1042981.000000000000000;0
1943;-743264.000000000000000;-1044421.000000000000000;0
209;-743108.000000000000000;-1043583.000000000000000;0
1720;-741436.000000000000000;-1044862.000000000000000;0
3364;-743855.184999998658895;-1043024.940000001341105;0
731;-741925.000000000000000;-1042997.000000000000000;0
5134;-742995.984000001102686;-1043497.364000000059605;0
4257;-742056.467000000178814;-1043503.657999999821186;0
2480;-741251.739999998360872;-1044639.480000000447035;0
708;-741854.000000000000000;-1042881.000000000000000;0
537;-742099.000000000000000;-1043663.000000000000000;0
4169;-742414.420000001788139;-1043962.329999998211861;0
7030;-743291.859999999403954;-1044128.440000001341105;0
4135;-742747.719999998807907;-1044085.660000000149012;0
1586;-742372.000000000000000;-1044785.000000000000000;0
1182;-741915.000000000000000;-1044252.000000000000000;0
634;-742117.000000000000000;-1043309.000000000000000;0
2256;-743156.000000000000000;-1045353.000000000000000;0
4465;-742180.250000000000000;-1042584.370000001043081;0
2537;-741975.000000000000000;-1044131.000000000000000;0
7653;-742255.225000001490116;-1045513.048000000417233;0
6100;-741950.760000001639128;-1043408.109999999403954;0
4793;-743035.089999999850988;-1042650.028000000864267;0
2079;-742688.000000000000000;-1044428.000000000000000;0
2357;-742388.000000000000000;-1045577.000000000000000;0
2242;-743321.000000000000000;-1045313.000000000000000;0
6716;-742256.467000000178814;-1044966.368000000715256;0
1363;-742095.000000000000000;-1044934.000000000000000;0
1663;-741455.000000000000000;-1044433.000000000000000;0
629;-742200.000000000000000;-1043289.000000000000000;0
6695;-742306.234000001102686;-1044816.138999998569489;0
3348;-743960.361000001430511;-1043015.629999998956919;0
2326;-742523.000000000000000;-1045498.000000000000000;0
3065;-744092.028999999165535;-1042868.519000001251698;0
3290;-743573.385000001639128;-1042757.348999999463558;0
8;-743496.000000000000000;-1042539.000000000000000;0
4749;-742884.420000001788139;-1042760.329999998211861;0
7166;-742741.322000000625849;-1044519.208999998867512;0
3869;-742407.539999999105930;-1042414.850000001490116;0
1762;-741227.000000000000000;-1044108.000000000000000;0
7721;-742941.157000001519918;-1044215.368000000715256;0
4455;-741714.589000001549721;-1042663.557000000029802;0
1614;-742388.000000000000000;-1044432.000000000000000;0
339;-742606.000000000000000;-1043916.000000000000000;0
1702;-741348.000000000000000;-1044682.000000000000000;0
4875;-742814.660000000149012;-1042937.800000000745058;0
2081;-742551.000000000000000;-1044621.000000000000000;0
7022;-743155.660000000149012;-1044074.410000000149012;279
3812;-743231.179999999701977;-1042815.199999999254942;0
7992;-741480.739999998360872;-1045117.620000001043081;0
4563;-742461.379999998956919;-1042526.230000000447035;0
1369;-742029.000000000000000;-1044788.000000000000000;0
1250;-742103.000000000000000;-1044672.000000000000000;0
17;-743587.000000000000000;-1042394.000000000000000;0
2582;-741030.372999999672174;-1044607.635000001639128;0
1449;-741533.000000000000000;-1044684.000000000000000;0
8258;-742053.760000001639128;-1042683.769999999552965;0
1304;-741810.000000000000000;-1044684.000000000000000;0
6339;-742245.460000000894070;-1042835.780000001192093;0
1113;-741134.809999998658895;-1044594.289999999105930;0
6753;-742485.511999998241663;-1044950.206999998539686;0
1057;-741686.000000000000000;-1045058.000000000000000;0
2466;-743460.000000000000000;-1044740.000000000000000;0
8265;-742197.820000000298023;-1042704.260000001639128;0
4727;-742869.390000000596046;-1042700.829999998211861;0
272;-743396.000000000000000;-1043809.000000000000000;0
5187;-743086.927000001072884;-1043435.230999998748302;0
1861;-743457.000000000000000;-1044175.000000000000000;0
284;-743022.000000000000000;-1043758.000000000000000;0
1653;-741384.000000000000000;-1044592.000000000000000;0
6610;-741694.364999998360872;-1043961.170000001788139;0
1854;-742675.000000000000000;-1044271.000000000000000;0
6040;-742075.469999998807907;-1043676.809999998658895;0
4220;-742214.344999998807907;-1043580.359999999403954;0
1818;-743046.000000000000000;-1044380.000000000000000;0
6268;-742340.850000001490116;-1043018.881000000983477;0
1238;-742150.000000000000000;-1044384.000000000000000;0
5792;-743363.984999999403954;-1043442.513999998569489;0
3784;-743187.730000000447035;-1042922.429999999701977;0
649;-742233.000000000000000;-1043382.000000000000000;0
6853;-741548.899000000208616;-1045052.295000001788139;0
2225;-743041.000000000000000;-1045477.000000000000000;0
5326;-742969.850000001490116;-1043038.800000000745058;0
1795;-742155.000000000000000;-1044231.000000000000000;0
1521;-741808.000000000000000;-1043917.000000000000000;0
4114;-742764.195000000298023;-1044131.760000001639128;0
3984;-743314.570000000298023;-1043905.594999998807907;0
2889;-744074.103999998420477;-1043194.559999998658895;0
4127;-742837.324999999254942;-1044032.670000001788139;0
7356;-743331.410000000149012;-1045146.359999999403954;0
4077;-742849.614999998360872;-1043858.745000001043081;0
1695;-741550.000000000000000;-1044656.000000000000000;0
1000;-741828.000000000000000;-1044502.000000000000000;0
910;-742219.000000000000000;-1042529.000000000000000;0
4245;-742160.210000000894070;-1043410.570000000298023;0
1909;-743446.000000000000000;-1044375.000000000000000;0
1507;-741673.000000000000000;-1044223.000000000000000;0
1452;-741519.000000000000000;-1044574.000000000000000;0
4145;-742687.109999999403954;-1043837.125000000000000;0
3820;-743111.699999999254942;-1042659.320000000298023;0
6952;-743044.730999998748302;-1044106.129999998956919;0
7084;-743318.609999999403954;-1044521.789999999105930;0
2467;-743434.000000000000000;-1044742.000000000000000;0
4083;-742820.771999999880791;-1043708.657000001519918;0
2189;-743472.000000000000000;-1045183.000000000000000;0
614;-742111.000000000000000;-1043271.000000000000000;0
6479;-741969.831000000238419;-1044454.850000001490116;0
6675;-742272.140000000596046;-1044167.469999998807907;0
5701;-743417.076999999582767;-1043630.140000000596046;0
517;-742207.000000000000000;-1043117.000000000000000;0
3792;-743110.019999999552965;-1042846.530000001192093;0
4707;-742743.519999999552965;-1042600.359999999403954;0
575;-742053.000000000000000;-1043541.000000000000000;0
1476;-741531.000000000000000;-1044196.000000000000000;0
3996;-743394.274999998509884;-1044004.254999998956919;0
222;-742939.000000000000000;-1043526.000000000000000;0
1498;-741382.000000000000000;-1044310.000000000000000;0
6131;-742311.329999998211861;-1043064.982999999076128;0
1831;-742994.000000000000000;-1044105.000000000000000;0
7016;-742557.515000000596046;-1044334.074999999254942;0
226;-742879.000000000000000;-1043516.000000000000000;0
5001;-742560.092999998480082;-1042966.206999998539686;0
7828;-743537.940000001341105;-1045170.530000001192093;0
6192;-742317.252000000327826;-1043065.394999999552965;0
1192;-741801.000000000000000;-1044083.000000000000000;0
2028;-743371.000000000000000;-1045054.000000000000000;0
622;-742271.000000000000000;-1043302.000000000000000;0
4822;-742945.579999998211861;-1042879.910000000149012;0
1987;-743480.000000000000000;-1044820.000000000000000;0
515;-742176.000000000000000;-1043121.000000000000000;0
2139;-742936.000000000000000;-1045103.000000000000000;0
5267;-743190.021999999880791;-1043149.807000000029802;0
4018;-743153.285000000149012;-1043925.850000001490116;0
3769;-742978.969999998807907;-1042975.300000000745058;0
4508;-742449.140000000596046;-1042725.980000000447035;0
6783;-741340.728000000119209;-1044457.412000000476837;0
4151;-742573.039999999105930;-1044109.035000000149012;0
4740;-742757.410000000149012;-1042715.589999999850988;0
4039;-743159.070000000298023;-1043772.795000001788139;0
1821;-742995.000000000000000;-1044239.000000000000000;0
6838;-741701.057999998331070;-1044977.087000001221895;0
6337;-742257.140000000596046;-1042864.820000000298023;0
1454;-741521.000000000000000;-1044499.000000000000000;0
4121;-742721.160000000149012;-1043948.695000000298023;0
1538;-741948.000000000000000;-1043973.000000000000000;0
6996;-743116.699999999254942;-1044476.469999998807907;0
6649;-741731.100000001490116;-1044094.850000001490116;0
5081;-742917.046000000089407;-1043356.515999998897314;0
2259;-743001.000000000000000;-1045599.000000000000000;0
1003;-741913.000000000000000;-1044580.000000000000000;0
5408;-743696.881000000983477;-1042878.024999998509884;0
1439;-741772.000000000000000;-1044379.000000000000000;0
280;-743053.000000000000000;-1043875.000000000000000;0
4902;-742480.460000000894070;-1042802.989999998360872;0
882;-741825.000000000000000;-1042788.000000000000000;0
7541;-742644.280000001192093;-1045370.789999999105930;0
5999;-741991.910000000149012;-1043282.079999998211861;0
5447;-743129.958999998867512;-1043365.166000001132488;0
6232;-742316.034000001847744;-1043057.000000000000000;0
3975;-743112.984999999403954;-1043716.375999998301268;0
4073;-742939.109999999403954;-1043858.504999998956919;0
4851;-742991.500000000000000;-1042818.243000000715256;0
4627;-742601.138999998569489;-1042606.791000001132488;0
3916;-743964.037999998778105;-1043492.932999998331070;0
2037;-743373.000000000000000;-1044805.000000000000000;0
5662;-743423.271000001579523;-1043710.372000001370907;0
266;-743321.000000000000000;-1043735.000000000000000;0
1408;-741647.000000000000000;-1044201.000000000000000;0
2558;-741286.000000000000000;-1044387.000000000000000;0
1992;-743482.000000000000000;-1044954.000000000000000;0
1505;-741606.000000000000000;-1044248.000000000000000;0
4726;-742863.519999999552965;-1042684.000000000000000;0
4476;-741849.620000001043081;-1042690.190000001341105;0
6169;-742312.320000000298023;-1043060.791999999433756;0
6764;-741137.519999999552965;-1044426.289999999105930;0
1596;-742323.000000000000000;-1045037.000000000000000;0
4938;-742469.324999999254942;-1042658.263000000268221;0
5937;-744081.739000000059605;-1043323.396999999880791;0
2494;-741985.000000000000000;-1044165.000000000000000;0
2563;-741065.000000000000000;-1044421.000000000000000;0
7649;-742319.399999998509884;-1045429.557000000029802;0
5513;-743426.734999999403954;-1043606.184000000357628;0
7966;-741489.800000000745058;-1044356.219999998807907;0
4845;-742978.655999999493361;-1042776.048000000417233;0
4925;-742455.502000000327826;-1042923.307000000029802;0
6136;-742315.081999998539686;-1043070.210000000894070;0
6261;-742373.956999998539686;-1043022.041999999433756;0
6842;-741574.894000001251698;-1044962.013999998569489;0
4939;-742448.866999998688698;-1043072.822999998927116;0
5224;-743293.449999999254942;-1043542.160000000149012;0
5697;-743416.916000001132488;-1043635.342000000178814;0
5591;-743421.353999998420477;-1043679.738000001758337;0
3378;-743818.598999999463558;-1042922.491999998688698;0
6154;-742316.324000000953674;-1043069.546000000089407;0
1996;-743484.000000000000000;-1045063.000000000000000;0
6222;-742316.855000000447035;-1043060.109999999403954;0
6174;-742316.021999999880791;-1043066.065000001341105;0
4331;-742391.967999998480082;-1043310.539000000804663;0
2321;-742679.000000000000000;-1045480.000000000000000;0
4599;-742625.879999998956919;-1042698.820000000298023;0
3829;-742992.250000000000000;-1042635.140000000596046;0
2276;-742865.000000000000000;-1045649.000000000000000;0
1929;-743440.000000000000000;-1044410.000000000000000;0
4677;-742787.309999998658895;-1042797.899999998509884;0
6975;-743116.140000000596046;-1044506.469999998807907;0
4064;-742879.655000001192093;-1043647.420000001788139;0
1497;-741332.000000000000000;-1044317.000000000000000;0
2185;-743216.000000000000000;-1045130.000000000000000;0
4991;-742675.414999999105930;-1043031.236000001430511;0
4820;-742927.769999999552965;-1042786.710000000894070;0
7746;-742234.789999999105930;-1045549.890000000596046;0
7090;-743353.289999999105930;-1044571.760000001639128;0
7140;-742921.300000000745058;-1044469.335000000894070;0
4708;-742755.420000001788139;-1042611.309999998658895;0
954;-742231.000000000000000;-1043024.000000000000000;0
5721;-743418.407999999821186;-1043631.800000000745058;0
3825;-743056.390000000596046;-1042570.079999998211861;0
5209;-743271.947999998927116;-1043361.392000000923872;0
3095;-743923.068999998271465;-1042787.789000000804663;87
6311;-743930.489999998360872;-1042569.390000000596046;0
709;-741861.000000000000000;-1042862.000000000000000;0
385;-742436.000000000000000;-1043742.000000000000000;0
678;-742421.000000000000000;-1043181.000000000000000;0
5507;-743426.703000001609325;-1043656.230999998748302;0
606;-741906.000000000000000;-1043273.000000000000000;0
1540;-742005.000000000000000;-1044009.000000000000000;0
4207;-742354.105999998748302;-1043530.157999999821186;0
4688;-742676.179000001400709;-1042555.322999998927116;0
6156;-742314.791999999433756;-1043066.736000001430511;0
5042;-742731.719000000506639;-1042890.517000000923872;0
4494;-741874.920000001788139;-1042616.660000000149012;0
8274;-742065.089999999850988;-1042742.109999999403954;0
3919;-743904.947000000625849;-1043493.929999999701977;0
2324;-742589.000000000000000;-1045490.000000000000000;0
6202;-742317.124000001698732;-1043063.651999998837709;0
5020;-742572.699999999254942;-1042891.372999999672174;0
4601;-742631.969999998807907;-1042675.629999998956919;0
516;-742160.000000000000000;-1043135.000000000000000;0
6473;-741931.359999999403954;-1044555.109999999403954;0
8019;-741972.039999999105930;-1044557.089999999850988;0
808;-741921.000000000000000;-1042542.000000000000000;0
3959;-743417.421999998390675;-1043577.730000000447035;0
4704;-742680.000000000000000;-1042776.750000000000000;0
722;-742139.000000000000000;-1043009.000000000000000;0
389;-742408.000000000000000;-1043783.000000000000000;0
4750;-742784.420000001788139;-1042733.429999999701977;0
4860;-742964.800999999046326;-1043016.107999999076128;0
2756;-743984.276999998837709;-1043475.763000000268221;0
4741;-742787.859999999403954;-1042715.800000000745058;0
4062;-742830.460000000894070;-1043654.920000001788139;0
4614;-742493.800000000745058;-1042636.896000001579523;0
4604;-742463.967999998480082;-1042613.381999999284744;0
6788;-741212.809999998658895;-1044473.129999998956919;0
5282;-743037.090999998152256;-1043297.587999999523163;0
683;-742362.000000000000000;-1043155.000000000000000;0
4581;-742391.460000000894070;-1042586.396999999880791;0
1855;-742642.000000000000000;-1044286.000000000000000;0
4474;-741831.079999998211861;-1042685.068999998271465;0
1116;-741125.980000000447035;-1044610.410000000149012;0
5112;-742942.920000001788139;-1043441.850000001490116;0
6197;-742313.425000000745058;-1043058.370999999344349;0
6242;-742366.677999999374151;-1043062.949000000953674;0
4664;-742806.739999998360872;-1042547.980000000447035;0
4736;-742701.269999999552965;-1042690.000000000000000;0
5664;-743420.907000001519918;-1043711.245999999344349;0
8273;-742057.820000000298023;-1042728.760000001639128;0
2559;-741323.000000000000000;-1044399.000000000000000;0
6121;-742069.784000001847744;-1043299.828000001609325;0
1392;-742104.000000000000000;-1045067.000000000000000;0
4054;-743269.304999999701977;-1043797.405000001192093;0
5666;-743418.543999999761581;-1043712.120000001043081;0
5690;-743415.532999999821186;-1043635.447000000625849;0
6224;-742315.320000000298023;-1043057.335000000894070;0
4734;-742762.920000001788139;-1042698.820000000298023;0
2135;-743006.000000000000000;-1045119.000000000000000;0
1428;-742028.000000000000000;-1044235.000000000000000;0
7723;-741757.929000001400709;-1044043.175000000745058;0
1872;-743422.000000000000000;-1044246.000000000000000;0
7037;-743316.085000000894070;-1044222.170000001788139;0
794;-741746.000000000000000;-1042595.000000000000000;0
680;-742402.109999999403954;-1043166.679999999701977;0
6395;-742057.429999999701977;-1042500.809999998658895;0
994;-741946.000000000000000;-1044433.000000000000000;0
4570;-742347.760000001639128;-1042540.809999998658895;0
4510;-742483.149999998509884;-1042738.460000000894070;0
4766;-742803.037999998778105;-1042842.532999999821186;0
5129;-743046.677000001072884;-1043376.409000001847744;0
4927;-742447.969999998807907;-1042874.710000000894070;0
1543;-742235.000000000000000;-1044164.000000000000000;0
1416;-741628.000000000000000;-1044523.000000000000000;0
2542;-741813.000000000000000;-1044224.000000000000000;0
6300;-741836.949999999254942;-1042698.329999998211861;0
1816;-743070.000000000000000;-1044444.000000000000000;0
1558;-741192.000000000000000;-1044273.000000000000000;0
6858;-741492.363000001758337;-1044950.462999999523163;0
5659;-743426.815000001341105;-1043709.059000000357628;0
6264;-742357.280000001192093;-1043020.445999998599291;0
6824;-741347.350000001490116;-1044784.280000001192093;0
4637;-742572.578000001609325;-1042742.510999999940395;0
7136;-742914.329999998211861;-1044374.469999998807907;0
3132;-743939.052000001072884;-1042650.916999999433756;0
6185;-742315.103999998420477;-1043062.923000000417233;0
5461;-742442.704999998211861;-1043234.515000000596046;0
7143;-742850.414999999105930;-1044473.449999999254942;0
4665;-742824.410000000149012;-1042592.260000001639128;0
4841;-742989.993999999016523;-1042765.850999999791384;0
520;-742225.000000000000000;-1043127.000000000000000;0
1926;-743301.000000000000000;-1044321.000000000000000;0
1092;-741549.000000000000000;-1044556.000000000000000;0
4997;-742492.638000000268221;-1042962.833999998867512;0
1607;-742414.000000000000000;-1044379.000000000000000;0
4765;-742822.897999998182058;-1042850.499000001698732;0
6251;-742377.396999999880791;-1043042.284000001847744;0
7961;-741602.260000001639128;-1044314.350000001490116;0
6658;-741538.879999998956919;-1044165.440000001341105;0
3979;-743340.934999998658895;-1043779.414999999105930;0
6149;-742312.646000001579523;-1043064.261999998241663;0
1426;-742056.000000000000000;-1044228.000000000000000;0
301;-742613.000000000000000;-1043903.000000000000000;0
1510;-741764.000000000000000;-1044180.000000000000000;0
1534;-741849.000000000000000;-1043893.000000000000000;0
5683;-743398.456000000238419;-1043719.557999998331070;0
4778;-742918.024999998509884;-1042786.565000001341105;0
4472;-741816.140000000596046;-1042675.499000001698732;0
6244;-742368.587000001221895;-1043059.245999999344349;0
5716;-743423.320999998599291;-1043631.197000000625849;0
2050;-743460.000000000000000;-1045072.000000000000000;0
1039;-741914.000000000000000;-1044595.000000000000000;0
6118;-743652.447000000625849;-1042857.607999999076128;0
3154;-743984.818999998271465;-1042573.844999998807907;0
1178;-741952.000000000000000;-1044311.000000000000000;0
704;-741929.000000000000000;-1042879.000000000000000;0
4330;-742377.440999999642372;-1043332.162999998778105;0
6275;-742314.603999998420477;-1043016.407999999821186;0
619;-742229.000000000000000;-1043277.000000000000000;0
6228;-742319.103999998420477;-1043062.592000000178814;0
5696;-743417.096000000834465;-1043637.135999999940395;0
6255;-742379.991999998688698;-1043037.068999998271465;0
3344;-743932.276000000536442;-1043064.493999999016523;0
4506;-742419.730000000447035;-1042717.019999999552965;0
4954;-742405.539999999105930;-1043024.640000000596046;0
5674;-743409.089999999850988;-1043715.618000000715256;0
6293;-742666.339999999850988;-1042695.188999999314547;0
4724;-742870.089999999850988;-1042658.210000000894070;0
1941;-743267.000000000000000;-1044384.000000000000000;0
4743;-742812.449999999254942;-1042729.609999999403954;0
2748;-743933.984000001102686;-1043445.734000001102686;0
4026;-743178.984999999403954;-1043847.989999998360872;0
4775;-742898.375999998301268;-1042802.914000000804663;0
5275;-743019.763000000268221;-1043300.774999998509884;0
5680;-743402.000000000000000;-1043718.245000001043081;0
4818;-742949.140000000596046;-1042791.660000000149012;0
4097;-742806.000000000000000;-1043874.793999999761581;0
5725;-743422.388000000268221;-1043634.186999998986721;0
4952;-742318.899999998509884;-1042915.589999999850988;0
6219;-742319.168999999761581;-1043064.293999999761581;0
5685;-743396.092999998480082;-1043720.434000000357628;0
1917;-743374.000000000000000;-1044458.000000000000000;0
2007;-743231.000000000000000;-1044741.000000000000000;0
