OID_;X;Y;TEMPERATURE
3614;-744984.548999998718500;-1042283.640999998897314;0
5790;-743521.019999999552965;-1042064.280000001192093;0
3917;-743967.182999998331070;-1043516.284000001847744;0
2194;-743448.000000000000000;-1045193.000000000000000;0
2265;-742972.000000000000000;-1045774.000000000000000;0
1532;-741805.000000000000000;-1043858.000000000000000;0
2809;-744090.649999998509884;-1043371.184000000357628;0
748;-741671.000000000000000;-1042971.000000000000000;0
3811;-743244.620000001043081;-1042809.420000001788139;0
2246;-743218.000000000000000;-1045379.000000000000000;0
1561;-743186.000000000000000;-1045098.000000000000000;0
1310;-741623.000000000000000;-1044829.000000000000000;0
2020;-743260.000000000000000;-1044941.000000000000000;0
5293;-743043.969999998807907;-1043208.554000001400709;0
2150;-742812.000000000000000;-1045054.000000000000000;0
7652;-742275.046999998390675;-1045497.052000001072884;0
2466;-743460.000000000000000;-1044740.000000000000000;0
1751;-742046.000000000000000;-1045235.000000000000000;0
4060;-742896.530000001192093;-1043699.219999998807907;0
110;-744127.000000000000000;-1042724.000000000000000;0
2167;-743021.000000000000000;-1045154.000000000000000;0
5068;-742837.162999998778105;-1043263.965999998152256;0
1247;-742104.000000000000000;-1044609.000000000000000;0
2270;-742954.000000000000000;-1045592.000000000000000;0
7007;-742923.890000000596046;-1044218.879999998956919;0
6824;-741347.350000001490116;-1044784.280000001192093;0
2761;-743859.467000000178814;-1043468.017000000923872;0
226;-742879.000000000000000;-1043516.000000000000000;0
1852;-742739.000000000000000;-1044210.000000000000000;0
7143;-742850.414999999105930;-1044473.449999999254942;0
7138;-742917.554999999701977;-1044421.774999998509884;0
1760;-741162.000000000000000;-1044101.000000000000000;0
1040;-741904.000000000000000;-1044623.000000000000000;0
2085;-742426.000000000000000;-1044797.000000000000000;0
2520;-741847.000000000000000;-1045324.000000000000000;0
6776;-741098.559999998658895;-1044491.530000001192093;0
3702;-744567.984999999403954;-1042510.802000001072884;0
3111;-743727.034000001847744;-1042625.182999998331070;0
4331;-742391.967999998480082;-1043310.539000000804663;0
6827;-741437.300000000745058;-1044772.629999998956919;0
732;-741860.000000000000000;-1043003.000000000000000;0
350;-742505.000000000000000;-1043757.000000000000000;0
4141;-742804.644999999552965;-1044008.964999999850988;0
6749;-742418.210999999195337;-1044329.190999999642372;0
462;-741707.000000000000000;-1043294.000000000000000;0
328;-742670.000000000000000;-1044072.000000000000000;0
4099;-742773.870000001043081;-1043846.135999999940395;0
408;-742317.000000000000000;-1044182.000000000000000;0
1939;-743269.000000000000000;-1044355.000000000000000;0
2885;-744122.791999999433756;-1043190.208000000566244;0
1924;-743359.000000000000000;-1044320.000000000000000;0
2401;-742253.000000000000000;-1045390.000000000000000;0
2893;-743977.276000000536442;-1043208.923999998718500;0
1674;-741099.000000000000000;-1044736.000000000000000;0
4168;-742423.695000000298023;-1043984.135000001639128;0
4144;-742704.414999999105930;-1043822.484999999403954;0
3752;-743213.949999999254942;-1042902.719999998807907;0
1411;-741639.480000000447035;-1044683.019999999552965;0
1993;-743483.000000000000000;-1044984.000000000000000;0
524;-742255.000000000000000;-1043913.000000000000000;96
4236;-742406.842999998480082;-1043504.015000000596046;0
7004;-743069.289999999105930;-1044326.469999998807907;0
2075;-743114.000000000000000;-1044772.000000000000000;0
7259;-742935.280000001192093;-1044869.829999998211861;0
3757;-743300.960000000894070;-1042956.699999999254942;0
8044;-742176.640000000596046;-1044778.420000001788139;0
1330;-741817.000000000000000;-1044709.000000000000000;0
4074;-742943.350000001490116;-1043880.304999999701977;0
7132;-743262.120000001043081;-1044825.699999999254942;0
6580;-741299.379000000655651;-1044005.879000000655651;0
6870;-741708.260000001639128;-1045321.590999998152256;0
2523;-742181.000000000000000;-1044140.000000000000000;0
7516;-742248.390000000596046;-1044368.907999999821186;0
1548;-742220.000000000000000;-1044216.000000000000000;0
6385;-742179.530000001192093;-1042495.359999999403954;0
1991;-743482.000000000000000;-1044929.000000000000000;0
5135;-742979.611000001430511;-1043468.912999998778105;0
1172;-741869.000000000000000;-1044348.000000000000000;0
6338;-742247.910000000149012;-1042851.670000001788139;0
7282;-742809.410000000149012;-1044693.629999998956919;0
4161;-742506.254999998956919;-1044181.925000000745058;0
1020;-742293.000000000000000;-1044615.000000000000000;0
1428;-742028.000000000000000;-1044235.000000000000000;0
283;-743026.000000000000000;-1043788.000000000000000;0
1319;-741788.000000000000000;-1044905.000000000000000;0
7180;-742618.809000000357628;-1044646.109000001102686;0
342;-742573.000000000000000;-1043878.000000000000000;0
3412;-743772.947000000625849;-1043053.557999998331070;0
7944;-742086.969999998807907;-1044063.079999998211861;0
1654;-741387.000000000000000;-1044621.000000000000000;0
6692;-742222.114999998360872;-1044818.673000000417233;0
1916;-743371.000000000000000;-1044484.000000000000000;0
6945;-742955.907000001519918;-1043932.182999998331070;0
1265;-742047.000000000000000;-1044960.000000000000000;0
6450;-743166.964999999850988;-1043776.383999999612570;0
2361;-742323.000000000000000;-1045576.000000000000000;0
4797;-743049.140999998897314;-1042689.576999999582767;0
1539;-741977.000000000000000;-1043997.000000000000000;0
3766;-743053.532999999821186;-1042996.631000000983477;0
4080;-742832.480000000447035;-1043782.030000001192093;0
884;-741771.000000000000000;-1042776.000000000000000;0
1057;-741686.000000000000000;-1045058.000000000000000;0
927;-742021.000000000000000;-1043498.000000000000000;0
3830;-743013.879999998956919;-1042612.359999999403954;0
5309;-743033.405000001192093;-1043187.043999999761581;0
2543;-741788.000000000000000;-1044237.000000000000000;0
207;-743142.000000000000000;-1043590.000000000000000;0
7163;-743099.541999999433756;-1044532.261999998241663;0
7175;-742651.780000001192093;-1044558.149999998509884;0
3092;-743909.377999998629093;-1042780.322999998927116;0
2160;-742849.000000000000000;-1045147.000000000000000;0
1487;-741117.000000000000000;-1044216.000000000000000;0
2408;-742369.000000000000000;-1045125.000000000000000;0
2214;-743162.000000000000000;-1045316.000000000000000;0
1211;-742034.000000000000000;-1044412.000000000000000;0
1452;-741519.000000000000000;-1044574.000000000000000;0
827;-742218.000000000000000;-1042626.000000000000000;0
7961;-741602.260000001639128;-1044314.350000001490116;0
6;-743464.000000000000000;-1042594.000000000000000;0
4235;-742390.041999999433756;-1043492.094999998807907;0
3544;-744891.706999998539686;-1042640.835999999195337;0
724;-741987.000000000000000;-1042981.000000000000000;0
502;-741901.000000000000000;-1043169.000000000000000;0
1293;-742037.000000000000000;-1044462.000000000000000;0
6698;-742304.160999998450279;-1044462.195999998599291;0
3838;-743113.550000000745058;-1042543.399999998509884;0
7217;-742516.318999998271465;-1044582.890000000596046;0
1127;-741700.000000000000000;-1044440.000000000000000;0
7234;-742594.870000001043081;-1044815.140000000596046;0
529;-742162.000000000000000;-1043803.000000000000000;0
1766;-741257.000000000000000;-1044204.000000000000000;0
6728;-742547.451000001281500;-1044392.396000001579523;0
7518;-742829.780000001192093;-1045693.210000000894070;0
1855;-742642.000000000000000;-1044286.000000000000000;0
1336;-741737.000000000000000;-1044860.000000000000000;0
4088;-742812.114999998360872;-1043580.475000001490116;0
559;-742191.000000000000000;-1043693.000000000000000;0
5240;-743364.164000000804663;-1043254.934000000357628;0
7151;-742842.649000000208616;-1044545.307000000029802;0
5323;-743049.401000000536442;-1043038.131000000983477;0
3808;-742987.050000000745058;-1042925.350000001490116;0
7981;-741126.370000001043081;-1044401.239999998360872;0
515;-742176.000000000000000;-1043121.000000000000000;0
1257;-742070.000000000000000;-1044815.000000000000000;0
588;-741950.000000000000000;-1043352.000000000000000;0
7801;-742459.168999999761581;-1044490.660000000149012;0
674;-742463.000000000000000;-1043211.000000000000000;0
7994;-741529.219999998807907;-1045148.010000001639128;0
6861;-741491.429999999701977;-1045010.300000000745058;0
1814;-743095.000000000000000;-1044510.000000000000000;0
1818;-743046.000000000000000;-1044380.000000000000000;0
1592;-742378.000000000000000;-1044936.000000000000000;0
3291;-743588.212999999523163;-1042790.916999999433756;0
5303;-743164.818999998271465;-1043211.078000001609325;0
4519;-742665.160000000149012;-1042790.820000000298023;0
7318;-742578.910000000149012;-1045033.530000001192093;0
4558;-742373.019999999552965;-1042506.949999999254942;0
917;-742121.000000000000000;-1043008.000000000000000;0
2222;-743058.000000000000000;-1045420.000000000000000;0
5122;-742902.166999999433756;-1043373.543999999761581;0
1865;-743458.000000000000000;-1044233.000000000000000;0
3366;-743913.831000000238419;-1043002.796999998390675;0
6753;-742485.511999998241663;-1044950.206999998539686;0
1910;-743460.000000000000000;-1044391.000000000000000;0
2051;-743434.000000000000000;-1045074.000000000000000;0
7034;-743299.725999999791384;-1044153.140000000596046;0
5187;-743086.927000001072884;-1043435.230999998748302;0
2164;-742966.000000000000000;-1045172.000000000000000;0
3730;-744714.653000000864267;-1042576.567999999970198;0
1515;-741913.000000000000000;-1044072.000000000000000;0
3207;-743687.458999998867512;-1042502.859000001102686;0
3314;-743758.675999999046326;-1042905.688999999314547;0
3839;-743112.140000000596046;-1042558.280000001192093;0
4006;-743302.763000000268221;-1044052.298999998718500;0
5186;-743270.949999999254942;-1043526.039999999105930;0
6284;-742309.677999999374151;-1043054.043999999761581;0
1530;-741753.000000000000000;-1043814.000000000000000;0
4771;-742890.828000001609325;-1042889.975000001490116;0
8273;-742057.820000000298023;-1042728.760000001639128;0
2398;-742150.000000000000000;-1045370.000000000000000;0
6373;-741992.809999998658895;-1042677.000000000000000;0
8056;-742242.379999998956919;-1045023.460000000894070;0
8152;-743293.600000001490116;-1043190.510000001639128;0
6316;-743949.877999998629093;-1042656.561999998986721;0
1236;-742156.000000000000000;-1044348.000000000000000;0
4638;-742553.631999999284744;-1042542.028000000864267;0
7798;-743468.929999999701977;-1045091.809999998658895;0
1477;-741482.750000000000000;-1044212.480000000447035;0
514;-742119.000000000000000;-1043141.000000000000000;0
1393;-742083.000000000000000;-1045067.000000000000000;0
1752;-742070.000000000000000;-1045197.000000000000000;0
547;-742316.910000000149012;-1043790.309999998658895;0
276;-743382.000000000000000;-1043905.000000000000000;0
536;-742085.000000000000000;-1043673.000000000000000;0
172;-743456.000000000000000;-1043433.000000000000000;0
1465;-741870.000000000000000;-1044016.000000000000000;0
5167;-743219.324999999254942;-1043405.249000001698732;0
1945;-743270.000000000000000;-1044454.000000000000000;0
351;-742509.000000000000000;-1043739.000000000000000;0
1449;-741533.000000000000000;-1044684.000000000000000;0
4199;-742205.142999999225140;-1043745.868000000715256;0
4024;-743223.734999999403954;-1043859.954999998211861;0
6952;-743044.730999998748302;-1044106.129999998956919;0
4584;-742417.721999999135733;-1042627.620999999344349;0
5689;-743415.442000001668930;-1043633.646000001579523;0
274;-743359.000000000000000;-1043833.000000000000000;0
4228;-742132.969999998807907;-1043331.449999999254942;0
1387;-742155.000000000000000;-1044999.000000000000000;0
5449;-743124.745000001043081;-1043406.449000000953674;0
1123;-741734.000000000000000;-1044442.000000000000000;0
23;-743544.000000000000000;-1042505.000000000000000;0
1474;-741604.000000000000000;-1044172.000000000000000;0
4127;-742837.324999999254942;-1044032.670000001788139;0
1435;-741903.000000000000000;-1044306.000000000000000;0
6126;-743428.385999999940395;-1043621.800000000745058;0
7409;-743521.629999998956919;-1045356.570000000298023;0
6001;-742006.079999998211861;-1043292.300000000745058;0
4693;-742691.399999998509884;-1042612.399999998509884;0
3795;-743173.190000001341105;-1042842.170000001788139;0
6805;-741109.710000000894070;-1044689.170000001788139;0
2479;-741247.800000000745058;-1044609.379999998956919;0
699;-742067.000000000000000;-1042896.000000000000000;0
1043;-741872.000000000000000;-1044711.000000000000000;0
6751;-742426.350000001490116;-1044371.070000000298023;0
6836;-741643.532000001519918;-1044947.486999999731779;0
3790;-743140.809999998658895;-1042908.210000000894070;0
1493;-741134.000000000000000;-1044328.000000000000000;0
391;-742395.000000000000000;-1043802.000000000000000;0
710;-741829.000000000000000;-1042878.000000000000000;0
2237;-743368.000000000000000;-1045238.000000000000000;0
6763;-741117.219999998807907;-1044428.989999998360872;0
5370;-742580.300999999046326;-1042977.140999998897314;0
4999;-742534.149999998509884;-1042966.892999999225140;0
5709;-743420.221999999135733;-1043640.467999998480082;0
6768;-741255.769999999552965;-1044419.920000001788139;0
1372;-742118.000000000000000;-1044815.000000000000000;0
3457;-745069.765000000596046;-1042699.907000001519918;0
2576;-742487.000000000000000;-1045483.000000000000000;0
4991;-742675.414999999105930;-1043031.236000001430511;0
6702;-742291.596999999135733;-1044564.116999998688698;0
6205;-742314.800000000745058;-1043059.416999999433756;0
7027;-743237.269999999552965;-1044095.524999998509884;0
4978;-742491.822999998927116;-1043028.688000001013279;0
500;-741861.000000000000000;-1043174.000000000000000;0
6508;-741728.552999999374151;-1044508.050999999046326;0
8066;-742286.199999999254942;-1045237.250000000000000;0
5194;-743205.761999998241663;-1043310.581999998539686;0
1981;-743406.000000000000000;-1044627.000000000000000;0
2424;-742476.000000000000000;-1045132.000000000000000;0
4709;-742775.800000000745058;-1042600.690000001341105;0
4729;-742855.690000001341105;-1042695.640000000596046;0
6313;-743936.949999999254942;-1042594.780000001192093;0
756;-741681.000000000000000;-1042695.000000000000000;0
3215;-743616.699000000953674;-1042464.539000000804663;0
1090;-741581.000000000000000;-1044552.000000000000000;0
1012;-742060.000000000000000;-1044582.000000000000000;0
1607;-742414.000000000000000;-1044379.000000000000000;0
4170;-742407.245000001043081;-1043945.519999999552965;0
1095;-741452.000000000000000;-1044553.000000000000000;0
4798;-743028.991999998688698;-1042693.375000000000000;0
7155;-742920.776999998837709;-1044546.934000000357628;0
1250;-742103.000000000000000;-1044672.000000000000000;0
5117;-742816.081999998539686;-1043298.302999999374151;0
4813;-743013.550000000745058;-1042793.390000000596046;0
3065;-744092.028999999165535;-1042868.519000001251698;0
4148;-742631.269999999552965;-1043885.870000001043081;0
518;-742194.000000000000000;-1043131.000000000000000;0
3408;-743789.511999998241663;-1043022.425000000745058;0
4958;-742349.620000001043081;-1043004.539999999105930;0
4651;-742756.375000000000000;-1042524.938000001013279;0
7171;-742671.969999998807907;-1044508.219999998807907;0
1137;-741538.000000000000000;-1044442.000000000000000;0
5120;-742868.383999999612570;-1043343.986000001430511;0
4945;-742422.162999998778105;-1043009.861000001430511;0
4947;-742399.918000001460314;-1042993.458000000566244;0
1570;-742291.000000000000000;-1044183.000000000000000;0
4508;-742449.140000000596046;-1042725.980000000447035;0
2093;-742915.000000000000000;-1044642.000000000000000;0
6100;-741950.760000001639128;-1043408.109999999403954;0
4340;-742473.662000000476837;-1043349.048999998718500;0
512;-742063.000000000000000;-1043136.000000000000000;0
5133;-742976.300000000745058;-1043502.951999999582767;0
6124;-743427.861999999731779;-1043609.043000001460314;0
4790;-743036.497999999672174;-1042635.973999999463558;0
833;-742050.000000000000000;-1042573.000000000000000;0
4859;-742966.710000000894070;-1042996.302999999374151;0
3578;-744924.046000000089407;-1042547.359000001102686;0
1199;-741615.000000000000000;-1043807.000000000000000;0
6204;-742315.578999999910593;-1043060.826000001281500;0
4740;-742757.410000000149012;-1042715.589999999850988;0
1025;-741989.000000000000000;-1044602.000000000000000;0
7982;-741163.039999999105930;-1044413.210000000894070;0
1554;-741348.000000000000000;-1044238.000000000000000;0
184;-743445.000000000000000;-1043450.000000000000000;0
6099;-741947.280000001192093;-1043424.289999999105930;0
3294;-743583.046999998390675;-1042805.258000001311302;0
6963;-743004.519999999552965;-1044166.870000001043081;0
6505;-741746.570000000298023;-1044600.429999999701977;0
4897;-742560.320000000298023;-1042829.359999999403954;0
6277;-742304.633999999612570;-1043024.256000000983477;0
7223;-742409.149999998509884;-1044822.649999998509884;0
4603;-742442.480000000447035;-1042617.250000000000000;0
649;-742233.000000000000000;-1043382.000000000000000;0
4051;-743236.329999998211861;-1043889.710000000894070;0
3335;-743976.318999998271465;-1042991.258999999612570;0
2284;-742901.000000000000000;-1045502.000000000000000;0
6682;-742329.804000001400709;-1044319.611999999731779;0
1427;-742017.000000000000000;-1044256.000000000000000;0
6095;-742082.920000001788139;-1043614.710000000894070;0
4494;-741874.920000001788139;-1042616.660000000149012;0
4004;-743345.877000000327826;-1044053.135999999940395;0
1113;-741134.809999998658895;-1044594.289999999105930;0
8267;-742240.420000001788139;-1042709.160000000149012;0
4922;-742443.129999998956919;-1042886.510000001639128;0
4522;-742668.079999998211861;-1042813.780000001192093;0
3540;-744595.842000000178814;-1042655.640999998897314;0
2254;-743235.000000000000000;-1045290.000000000000000;0
4810;-743058.420000001788139;-1042810.050000000745058;0
6819;-741194.784000001847744;-1044802.818999998271465;0
5171;-743266.124000001698732;-1043419.293999999761581;0
677;-742425.000000000000000;-1043200.000000000000000;0
4250;-742144.109999999403954;-1043367.519999999552965;0
4746;-742867.769999999552965;-1042768.570000000298023;0
1516;-741928.000000000000000;-1044062.000000000000000;0
4097;-742806.000000000000000;-1043874.793999999761581;0
1194;-741721.000000000000000;-1043955.000000000000000;0
3262;-743572.423999998718500;-1042699.197000000625849;0
6722;-742357.717000000178814;-1044705.708000000566244;0
6256;-742380.723000001162291;-1043035.640000000596046;0
4888;-742649.925999999046326;-1042830.767000000923872;0
4674;-742806.475999999791384;-1042703.594999998807907;0
4995;-742476.986000001430511;-1042961.239000000059605;0
731;-741925.000000000000000;-1042997.000000000000000;0
7976;-741301.260000001639128;-1044401.750000000000000;0
5042;-742731.719000000506639;-1042890.517000000923872;0
1323;-741859.000000000000000;-1044941.000000000000000;0
3228;-744128.969999998807907;-1042651.059000000357628;0
7022;-743155.660000000149012;-1044074.410000000149012;0
7728;-743360.581999998539686;-1044610.631000000983477;0
1301;-741896.000000000000000;-1044703.000000000000000;0
834;-742049.000000000000000;-1042541.000000000000000;0
5593;-743418.921000000089407;-1043679.927999999374151;0
2322;-742651.000000000000000;-1045483.000000000000000;0
4527;-742728.050000000745058;-1042838.719999998807907;0
4964;-742390.059999998658895;-1043044.839999999850988;0
4135;-742747.719999998807907;-1044085.660000000149012;0
5716;-743423.320999998599291;-1043631.197000000625849;0
4754;-742745.359999999403954;-1042759.160000000149012;0
796;-741771.000000000000000;-1042592.000000000000000;0
1357;-741935.000000000000000;-1044871.000000000000000;0
4213;-742218.094999998807907;-1043529.954999998211861;238
3206;-743702.239000000059605;-1042499.019000001251698;0
4504;-742387.329999998211861;-1042714.820000000298023;0
6249;-742373.554999999701977;-1043049.822000000625849;0
4904;-742460.050000000745058;-1042796.739999998360872;0
7219;-742443.460000000894070;-1044813.000000000000000;0
4482;-741768.079999998211861;-1042606.449999999254942;0
1824;-742963.809999998658895;-1044143.929999999701977;0
2336;-742837.000000000000000;-1045523.000000000000000;0
6129;-742312.925000000745058;-1043067.717000000178814;0
1675;-741059.000000000000000;-1044754.000000000000000;0
250;-743428.000000000000000;-1043794.000000000000000;0
4466;-742177.620000001043081;-1042567.899999998509884;0
5389;-744380.177000001072884;-1042796.489000000059605;0
6296;-742543.019999999552965;-1042643.350000001490116;0
4961;-742309.460000000894070;-1043010.730000000447035;0
6782;-741303.329999998211861;-1044447.660000000149012;0
874;-741755.000000000000000;-1042675.000000000000000;0
7288;-742817.019999999552965;-1044773.399999998509884;0
6142;-742310.477000001817942;-1043061.813000001013279;0
1192;-741801.000000000000000;-1044083.000000000000000;0
7033;-743303.864999998360872;-1044132.750000000000000;0
2318;-742763.000000000000000;-1045470.000000000000000;0
7243;-742724.339999999850988;-1044835.870000001043081;0
6492;-742174.054000001400709;-1044455.534000001847744;0
1969;-743376.000000000000000;-1044829.000000000000000;0
4696;-742682.817000001668930;-1042658.543999999761581;0
4834;-742972.708000000566244;-1042657.809000000357628;0
2277;-742826.000000000000000;-1045653.000000000000000;0
520;-742225.000000000000000;-1043127.000000000000000;0
4205;-742325.267999999225140;-1043571.951000001281500;0
1239;-742138.000000000000000;-1044401.000000000000000;0
892;-742946.000000000000000;-1042607.000000000000000;0
4969;-742465.059999998658895;-1043095.034000001847744;0
3322;-743927.326000001281500;-1042934.425999999046326;0
5583;-743410.274999998509884;-1043642.072000000625849;0
1662;-741451.000000000000000;-1044403.000000000000000;0
4889;-742621.425000000745058;-1042831.109999999403954;0
1228;-742220.539999999105930;-1044250.829999998211861;0
5669;-743414.997999999672174;-1043713.431000001728535;0
706;-741897.000000000000000;-1042881.000000000000000;0
1860;-743472.000000000000000;-1044155.000000000000000;0
6172;-742317.552999999374151;-1043068.875999998301268;0
3568;-744718.817999999970198;-1042588.614999998360872;0
5221;-743263.820000000298023;-1043556.920000001788139;0
7514;-742304.866000000387430;-1044375.124000001698732;0
2189;-743472.000000000000000;-1045183.000000000000000;0
1956;-743397.000000000000000;-1044501.000000000000000;0
8274;-742065.089999999850988;-1042742.109999999403954;0
4630;-742646.271999999880791;-1042652.089999999850988;0
5722;-743419.659000001847744;-1043631.798000000417233;0
1013;-742076.000000000000000;-1044595.000000000000000;0
3019;-744463.447999998927116;-1042784.646000001579523;0
623;-742254.000000000000000;-1043325.000000000000000;0
6197;-742313.425000000745058;-1043058.370999999344349;0
4847;-742981.100000001490116;-1042831.059999998658895;0
5684;-743397.274000000208616;-1043719.995999999344349;0
631;-742153.000000000000000;-1043288.000000000000000;0
2365;-742516.000000000000000;-1045540.000000000000000;0
3886;-742385.100000001490116;-1042445.500000000000000;0
626;-742236.000000000000000;-1043317.000000000000000;0
6303;-741823.820000000298023;-1042750.410000000149012;0
6170;-742311.548000000417233;-1043059.381000000983477;0
5317;-743063.690000001341105;-1043053.769999999552965;0
379;-742479.000000000000000;-1043679.000000000000000;0
6239;-742363.504999998956919;-1043069.298000000417233;0
1498;-741382.000000000000000;-1044310.000000000000000;0
546;-742323.640000000596046;-1043781.429999999701977;0
5503;-743427.870000001043081;-1043698.647999998182058;0
2488;-742083.000000000000000;-1044303.000000000000000;0
2343;-742674.000000000000000;-1045557.000000000000000;0
265;-743344.000000000000000;-1043735.000000000000000;0
4248;-742157.039999999105930;-1043376.699999999254942;0
4031;-743135.774000000208616;-1043769.622000001370907;0
2550;-741576.000000000000000;-1044342.000000000000000;0
7285;-742806.960000000894070;-1044758.379999998956919;0
4791;-743022.245000001043081;-1042633.714000001549721;0
2288;-742936.000000000000000;-1045436.000000000000000;0
6234;-742324.105000000447035;-1043076.613000001758337;0
1930;-743415.000000000000000;-1044409.000000000000000;0
6297;-742506.859999999403954;-1042634.250000000000000;0
5668;-743416.179999999701977;-1043712.995000001043081;0
1056;-741707.000000000000000;-1045042.000000000000000;0
2299;-742592.000000000000000;-1045409.000000000000000;0
7177;-742643.059999998658895;-1044579.679999999701977;0
7344;-742653.460000000894070;-1045190.980000000447035;0
690;-742306.000000000000000;-1043081.000000000000000;0
4151;-742573.039999999105930;-1044109.035000000149012;0
4979;-742507.703000001609325;-1043016.118000000715256;0
1142;-741437.000000000000000;-1044466.000000000000000;0
4781;-742926.519000001251698;-1042695.502999998629093;0
1086;-741659.000000000000000;-1044542.000000000000000;0
563;-742155.000000000000000;-1043660.000000000000000;0
6663;-741457.949999999254942;-1044194.329999998211861;0
4935;-742447.241999998688698;-1042699.399000000208616;0
5730;-743418.855999998748302;-1043638.949000000953674;0
7315;-742603.960000000894070;-1045022.870000001043081;0
4613;-742506.557000000029802;-1042597.938000001013279;0
5590;-743422.570000000298023;-1043679.642000000923872;0
3958;-743416.328000001609325;-1043572.265999998897314;0
4676;-742792.579999998211861;-1042771.519999999552965;0
1757;-742189.000000000000000;-1045219.000000000000000;0
6153;-742309.583999998867512;-1043058.640999998897314;0
3956;-743414.039999999105930;-1043561.081999998539686;0
1484;-741219.000000000000000;-1044224.000000000000000;0
6241;-742365.649999998509884;-1043065.059999998658895;0
4721;-742883.219999998807907;-1042605.010000001639128;0
5162;-743180.460999999195337;-1043323.660000000149012;0
6651;-741697.910000000149012;-1044123.329999998211861;0
4874;-742795.429999999701977;-1042925.910000000149012;0
5598;-743412.839999999850988;-1043680.403000000864267;0
6916;-742011.701000001281500;-1045042.927000001072884;0
1514;-741882.000000000000000;-1044096.000000000000000;0
3982;-743325.135000001639128;-1043857.684999998658895;0
7925;-743541.780000001192093;-1044709.149999998509884;0
6198;-742312.659000001847744;-1043056.964999999850988;0
757;-741673.000000000000000;-1042678.000000000000000;0
1263;-742048.000000000000000;-1044929.000000000000000;0
4520;-742651.079999998211861;-1042798.449999999254942;0
5660;-743425.633999999612570;-1043709.497000001370907;0
1624;-742551.000000000000000;-1044318.000000000000000;0
4698;-742673.530000001192093;-1042715.780000001192093;0
191;-743424.000000000000000;-1043599.000000000000000;0
4895;-742596.936999998986721;-1042829.168000001460314;0
6225;-742314.519999999552965;-1043055.927000001072884;0
504;-741937.000000000000000;-1043164.000000000000000;0
4792;-743051.280000001192093;-1042654.962999999523163;0
3532;-744710.912999998778105;-1042677.949999999254942;0
2476;-741234.809999998658895;-1044506.690000001341105;0
7040;-743356.140000000596046;-1044164.359999999403954;0
691;-742293.000000000000000;-1043097.000000000000000;0
5591;-743421.353999998420477;-1043679.738000001758337;0
2016;-743230.000000000000000;-1044873.000000000000000;0
4900;-742508.089999999850988;-1042815.289999999105930;0
6141;-742311.243999999016523;-1043063.195999998599291;0
4927;-742447.969999998807907;-1042874.710000000894070;0
5692;-743415.782999999821186;-1043638.765000000596046;0
6712;-742273.328000001609325;-1044860.912000000476837;0
5118;-742835.168000001460314;-1043315.074000000953674;0
612;-742064.000000000000000;-1043270.000000000000000;0
5225;-743277.453999999910593;-1043558.087999999523163;0
5461;-742442.704999998211861;-1043234.515000000596046;0
1432;-741958.000000000000000;-1044285.000000000000000;0
4561;-742458.059999998658895;-1042497.190000001341105;0
6351;-741874.269999999552965;-1042706.859999999403954;0
6281;-742307.629000000655651;-1043042.113000001758337;0
4951;-742335.579999998211861;-1042934.429999999701977;0
6611;-741711.614000000059605;-1043979.263999998569489;0
2356;-742409.000000000000000;-1045589.000000000000000;0
2565;-741043.000000000000000;-1044424.000000000000000;0
