OID_;X;Y;TEMPERATURE
3614;-744984.548999998718500;-1042283.640999998897314;0
110;-744127.000000000000000;-1042724.000000000000000;3
3019;-744463.447999998927116;-1042784.646000001579523;0
3568;-744718.817999999970198;-1042588.614999998360872;0
3692;-744525.876499999314547;-1042540.534000001847744;0
3580;-744924.973999999463558;-1042593.699999999254942;0
2605;-745393.842999998480082;-1042860.796000000089407;0
5975;-745052.346999999135733;-1042674.673000000417233;0
8;-743496.000000000000000;-1042539.000000000000000;0
118;-745135.000000000000000;-1042687.000000000000000;0
7911;-743564.839999999850988;-1045408.649999998509884;0
3210;-743664.019000001251698;-1042478.668999999761581;0
3542;-744575.274000000208616;-1042656.160000000149012;0
1196;-741677.000000000000000;-1043894.000000000000000;0
2073;-743069.000000000000000;-1044754.000000000000000;0
7146;-742819.425000000745058;-1044426.225000001490116;0
2741;-744016.675000000745058;-1043336.642999999225140;0
2007;-743231.000000000000000;-1044741.000000000000000;0
1584;-742368.000000000000000;-1044717.000000000000000;0
8079;-742021.839999999850988;-1045292.179999999701977;0
2189;-743472.000000000000000;-1045183.000000000000000;0
2696;-743477.489999998360872;-1042038.000000000000000;0
528;-742187.000000000000000;-1043838.000000000000000;0
3919;-743904.947000000625849;-1043493.929999999701977;0
4237;-742425.385000001639128;-1043517.421000000089407;0
281;-743045.000000000000000;-1043848.000000000000000;0
1696;-741529.000000000000000;-1044660.000000000000000;0
7263;-743009.559999998658895;-1044894.379999998956919;0
5087;-742847.622999999672174;-1043250.081000000238419;0
7164;-742596.114999998360872;-1044447.173000000417233;0
6977;-743098.949999999254942;-1044459.879999998956919;0
7143;-742850.414999999105930;-1044473.449999999254942;0
4078;-742842.960000000894070;-1043832.824999999254942;0
6726;-742476.517999999225140;-1044410.600000001490116;0
6656;-741590.160000000149012;-1044150.480000000447035;0
5118;-742835.168000001460314;-1043315.074000000953674;0
2520;-741847.000000000000000;-1045324.000000000000000;0
1586;-742372.000000000000000;-1044785.000000000000000;0
4085;-742812.431000001728535;-1043657.114000000059605;0
3921;-743909.208999998867512;-1043541.574000000953674;0
2061;-742681.000000000000000;-1044491.000000000000000;0
227;-742846.000000000000000;-1043520.000000000000000;0
1793;-742166.000000000000000;-1044246.000000000000000;0
1197;-741657.000000000000000;-1043865.000000000000000;0
6509;-741724.809999998658895;-1044485.162000000476837;0
1971;-743385.000000000000000;-1044881.000000000000000;0
5110;-742876.271999999880791;-1043449.013000000268221;0
1701;-741378.000000000000000;-1044678.000000000000000;0
2386;-742139.000000000000000;-1045460.000000000000000;0
4178;-742382.640000000596046;-1044160.138000000268221;0
1759;-741128.000000000000000;-1044097.000000000000000;0
1608;-742391.000000000000000;-1044383.000000000000000;0
7933;-743544.570000000298023;-1044950.370000001043081;0
2017;-743247.000000000000000;-1044884.000000000000000;0
3996;-743394.274999998509884;-1044004.254999998956919;0
2027;-743374.000000000000000;-1045032.000000000000000;0
6504;-741755.193999998271465;-1044619.083000000566244;0
3838;-743113.550000000745058;-1042543.399999998509884;0
4010;-743200.372999999672174;-1044041.177999999374151;0
2148;-742835.000000000000000;-1045008.000000000000000;0
5135;-742979.611000001430511;-1043468.912999998778105;0
2237;-743368.000000000000000;-1045238.000000000000000;0
1874;-743379.000000000000000;-1044247.000000000000000;0
7968;-741473.980000000447035;-1044379.839999999850988;0
1963;-743410.000000000000000;-1044689.000000000000000;0
7157;-742964.840999998152256;-1044545.681000001728535;0
2360;-742331.000000000000000;-1045596.000000000000000;0
1419;-741603.000000000000000;-1044410.000000000000000;0
7248;-742757.960000000894070;-1044826.929999999701977;0
7649;-742319.399999998509884;-1045429.557000000029802;0
1090;-741581.000000000000000;-1044552.000000000000000;0
7118;-743468.750000000000000;-1044677.690000001341105;0
917;-742121.000000000000000;-1043008.000000000000000;0
2496;-741953.000000000000000;-1044102.000000000000000;0
5409;-743745.201000001281500;-1042902.750000000000000;0
457;-741732.000000000000000;-1043333.000000000000000;0
7086;-743333.149999998509884;-1044527.250000000000000;0
720;-741671.000000000000000;-1042815.000000000000000;0
3812;-743231.179999999701977;-1042815.199999999254942;0
1693;-741613.000000000000000;-1044649.000000000000000;0
6747;-742410.170000001788139;-1044287.228000000119209;0
3107;-743778.888000000268221;-1042682.131999999284744;0
8151;-743319.030000001192093;-1043194.940000001341105;0
7281;-742801.859999999403954;-1044705.300000000745058;0
6649;-741731.100000001490116;-1044094.850000001490116;0
2366;-742513.000000000000000;-1045512.000000000000000;0
503;-741879.000000000000000;-1043158.000000000000000;0
7216;-742500.129999998956919;-1044564.390000000596046;0
7018;-742577.747000001370907;-1044239.712999999523163;0
7185;-742600.515000000596046;-1044717.333999998867512;0
1988;-743481.000000000000000;-1044849.000000000000000;0
306;-742809.000000000000000;-1044137.000000000000000;0
1488;-741088.000000000000000;-1044212.000000000000000;0
725;-741983.000000000000000;-1042939.000000000000000;0
1720;-741436.000000000000000;-1044862.000000000000000;0
2399;-742121.000000000000000;-1045372.000000000000000;0
5306;-743103.326999999582767;-1043193.129000000655651;0
5138;-743030.936000000685453;-1043483.587999999523163;0
4952;-742318.899999998509884;-1042915.589999999850988;0
3759;-743267.609999999403954;-1042971.300000000745058;0
7282;-742809.410000000149012;-1044693.629999998956919;0
7945;-742063.179999999701977;-1044077.379999998956919;0
6923;-742061.469999998807907;-1045089.760000001639128;0
4056;-743125.315000001341105;-1043671.969999998807907;0
6560;-741301.682000000029802;-1043959.640000000596046;0
1298;-741964.000000000000000;-1044736.000000000000000;0
1533;-741832.000000000000000;-1043879.000000000000000;0
512;-742063.000000000000000;-1043136.000000000000000;0
8284;-742219.410000000149012;-1042809.500000000000000;0
6556;-741290.410000000149012;-1044041.471000000834465;0
2050;-743460.000000000000000;-1045072.000000000000000;0
7735;-742196.594999998807907;-1045243.149999998509884;0
973;-741908.000000000000000;-1044547.000000000000000;0
4029;-743130.695999998599291;-1043815.427999999374151;0
2314;-742884.000000000000000;-1045456.000000000000000;0
4068;-742917.125000000000000;-1043734.535000000149012;0
7171;-742671.969999998807907;-1044508.219999998807907;0
669;-742510.000000000000000;-1043260.000000000000000;0
1628;-742449.000000000000000;-1044494.000000000000000;0
205;-743173.000000000000000;-1043599.000000000000000;0
1172;-741869.000000000000000;-1044348.000000000000000;0
7181;-742612.239999998360872;-1044670.160000000149012;0
2161;-742876.000000000000000;-1045153.000000000000000;0
270;-743230.000000000000000;-1043721.000000000000000;0
881;-741806.000000000000000;-1042815.000000000000000;0
6859;-741483.522999998182058;-1044967.043999999761581;0
4152;-742564.589999999850988;-1044089.934999998658895;0
2887;-744098.480000000447035;-1043192.508000001311302;0
333;-742651.000000000000000;-1043996.000000000000000;0
4071;-742929.394999999552965;-1043807.585000000894070;0
586;-741966.000000000000000;-1043374.000000000000000;0
7011;-742831.309999998658895;-1044257.245000001043081;0
7027;-743237.269999999552965;-1044095.524999998509884;0
1270;-742242.000000000000000;-1044491.000000000000000;0
679;-742404.000000000000000;-1043185.000000000000000;0
1464;-741899.000000000000000;-1043994.000000000000000;0
2255;-743181.000000000000000;-1045372.000000000000000;0
3326;-744036.002000000327826;-1042922.574999999254942;0
343;-742575.000000000000000;-1043857.000000000000000;0
1334;-741769.000000000000000;-1044799.000000000000000;0
1726;-741516.000000000000000;-1045120.000000000000000;0
4791;-743022.245000001043081;-1042633.714000001549721;0
379;-742479.000000000000000;-1043679.000000000000000;0
1548;-742220.000000000000000;-1044216.000000000000000;0
4138;-742883.587000001221895;-1043997.287999998778105;0
6704;-742282.179999999701977;-1044623.793999999761581;0
1042;-741883.000000000000000;-1044682.000000000000000;0
4214;-742229.274999998509884;-1043511.745000001043081;0
7986;-741040.829999998211861;-1044408.250000000000000;0
543;-742361.000000000000000;-1043823.000000000000000;0
4559;-742400.530000001192093;-1042503.760000001639128;70
4824;-742918.673000000417233;-1042871.875000000000000;0
6258;-742382.381999999284744;-1043032.370999999344349;0
2345;-742636.000000000000000;-1045561.000000000000000;0
2893;-743977.276000000536442;-1043208.923999998718500;0
6814;-741118.537999998778105;-1044802.493000000715256;0
2526;-741087.000000000000000;-1044616.000000000000000;0
6823;-741313.910000000149012;-1044788.510000001639128;0
641;-742008.000000000000000;-1043304.000000000000000;0
1822;-742986.199999999254942;-1044211.969999998807907;0
743;-741682.000000000000000;-1043020.000000000000000;0
4238;-742440.263000000268221;-1043528.236000001430511;0
1162;-741087.000000000000000;-1044511.000000000000000;0
2221;-743076.000000000000000;-1045412.000000000000000;0
4963;-742396.510000001639128;-1043031.829999998211861;0
4622;-742533.901000000536442;-1042569.660000000149012;0
1553;-741350.000000000000000;-1044268.000000000000000;0
610;-742011.000000000000000;-1043270.000000000000000;0
5196;-743199.263000000268221;-1043326.401000000536442;0
4135;-742747.719999998807907;-1044085.660000000149012;0
2487;-742101.000000000000000;-1044308.000000000000000;0
380;-742501.000000000000000;-1043722.000000000000000;0
532;-742114.000000000000000;-1043737.000000000000000;0
4630;-742646.271999999880791;-1042652.089999999850988;0
1485;-741184.000000000000000;-1044223.000000000000000;0
1602;-742507.000000000000000;-1044924.000000000000000;0
4321;-742265.214999999850988;-1043235.418999999761581;0
3787;-743130.989999998360872;-1042979.320000000298023;0
5246;-743373.739999998360872;-1043268.899999998509884;0
826;-742191.000000000000000;-1042616.000000000000000;0
1651;-741374.000000000000000;-1044519.000000000000000;0
1750;-742045.000000000000000;-1045215.000000000000000;0
3090;-743913.418999999761581;-1042804.416999999433756;0
4339;-742459.269000001251698;-1043367.923000000417233;0
1192;-741801.000000000000000;-1044083.000000000000000;0
1875;-743367.000000000000000;-1044261.000000000000000;0
1809;-743160.000000000000000;-1044541.000000000000000;0
1269;-742246.000000000000000;-1044462.000000000000000;0
6682;-742329.804000001400709;-1044319.611999999731779;0
2275;-742845.000000000000000;-1045719.000000000000000;0
7808;-741986.629999998956919;-1044440.109999999403954;0
4755;-742734.960000000894070;-1042778.019999999552965;0
563;-742155.000000000000000;-1043660.000000000000000;0
1287;-742217.000000000000000;-1044486.000000000000000;0
1012;-742060.000000000000000;-1044582.000000000000000;0
1038;-741956.000000000000000;-1044977.000000000000000;0
1431;-741926.000000000000000;-1044313.000000000000000;0
4257;-742056.467000000178814;-1043503.657999999821186;0
7136;-742914.329999998211861;-1044374.469999998807907;0
6186;-742314.337999999523163;-1043061.517000000923872;0
352;-742386.000000000000000;-1043914.000000000000000;0
1624;-742551.000000000000000;-1044318.000000000000000;0
708;-741854.000000000000000;-1042881.000000000000000;0
2576;-742487.000000000000000;-1045483.000000000000000;0
7809;-741981.809999998658895;-1044560.280000001192093;0
1032;-741970.000000000000000;-1044813.000000000000000;0
2491;-742059.000000000000000;-1044251.000000000000000;0
4168;-742423.695000000298023;-1043984.135000001639128;0
4501;-742368.980000000447035;-1042705.100000001490116;0
4801;-742998.943999998271465;-1042721.118000000715256;0
7539;-742682.600000001490116;-1045366.339999999850988;0
271;-743417.000000000000000;-1043795.000000000000000;0
5303;-743164.818999998271465;-1043211.078000001609325;0
7355;-743348.309999998658895;-1045148.329999998211861;0
4122;-742732.074999999254942;-1043923.995000001043081;0
6137;-742314.326999999582767;-1043068.837000001221895;0
2219;-743094.000000000000000;-1045386.000000000000000;0
779;-741708.000000000000000;-1042533.000000000000000;0
6111;-742241.054000001400709;-1043365.475999999791384;0
1053;-741768.000000000000000;-1045023.000000000000000;0
736;-741880.000000000000000;-1043017.000000000000000;0
6176;-742314.491000000387430;-1043063.256000000983477;0
2270;-742954.000000000000000;-1045592.000000000000000;0
3820;-743111.699999999254942;-1042659.320000000298023;0
700;-742008.000000000000000;-1042895.000000000000000;0
4873;-742775.690000001341105;-1042931.829999998211861;0
5323;-743049.401000000536442;-1043038.131000000983477;0
4232;-742315.057999998331070;-1043428.918999999761581;0
2480;-741251.739999998360872;-1044639.480000000447035;0
5302;-743090.423999998718500;-1043070.048999998718500;0
3369;-743878.633000001311302;-1043011.739000000059605;0
1250;-742103.000000000000000;-1044672.000000000000000;0
4981;-742536.340999998152256;-1043014.929999999701977;0
5175;-743313.734999999403954;-1043433.749000001698732;0
554;-742238.000000000000000;-1043717.000000000000000;0
1595;-742313.000000000000000;-1045010.000000000000000;0
6836;-741643.532000001519918;-1044947.486999999731779;0
7005;-742998.190000001341105;-1043944.824999999254942;49
1324;-741943.000000000000000;-1044994.000000000000000;0
616;-742153.000000000000000;-1043272.000000000000000;0
6383;-742199.620000001043081;-1042494.440000001341105;0
4584;-742417.721999999135733;-1042627.620999999344349;0
5128;-743040.467000000178814;-1043389.765999998897314;0
4244;-742179.410000000149012;-1043422.000000000000000;0
8257;-742149.809999998658895;-1045048.399999998509884;0
6369;-741962.675000000745058;-1042665.013999998569489;0
4026;-743178.984999999403954;-1043847.989999998360872;0
5518;-743427.500999998301268;-1043621.975000001490116;0
2446;-742750.000000000000000;-1044164.000000000000000;0
3811;-743244.620000001043081;-1042809.420000001788139;0
837;-741990.000000000000000;-1042511.000000000000000;0
1263;-742048.000000000000000;-1044929.000000000000000;0
5737;-743412.636999998241663;-1043691.631000000983477;0
4854;-742971.159000001847744;-1042912.429000001400709;0
545;-742337.000000000000000;-1043805.000000000000000;0
4426;-742197.589999999850988;-1043031.679999999701977;0
4741;-742787.859999999403954;-1042715.800000000745058;0
3746;-743261.420000001788139;-1042982.839999999850988;0
2151;-742827.000000000000000;-1045047.000000000000000;0
6677;-742304.892999999225140;-1044202.831999998539686;0
872;-741698.000000000000000;-1042669.000000000000000;0
1933;-743329.000000000000000;-1044407.000000000000000;0
4531;-742746.070000000298023;-1042885.980000000447035;0
3989;-743307.815000001341105;-1044034.914999999105930;0
634;-742117.000000000000000;-1043309.000000000000000;0
1601;-742452.000000000000000;-1044939.000000000000000;0
3353;-743954.399999998509884;-1043021.017999999225140;0
6170;-742311.548000000417233;-1043059.381000000983477;0
7985;-741091.269999999552965;-1044419.039999999105930;0
1219;-742137.000000000000000;-1044315.000000000000000;0
1916;-743371.000000000000000;-1044484.000000000000000;0
2502;-742750.000000000000000;-1045457.000000000000000;0
3793;-743101.820000000298023;-1042826.379999998956919;0
4846;-742981.635999999940395;-1042805.254000000655651;0
1446;-741545.000000000000000;-1044774.000000000000000;0
578;-742023.000000000000000;-1043464.000000000000000;0
3273;-743642.442999999970198;-1042796.677999999374151;0
1151;-741279.000000000000000;-1044475.000000000000000;0
4651;-742756.375000000000000;-1042524.938000001013279;0
6197;-742313.425000000745058;-1043058.370999999344349;0
4934;-742433.807000000029802;-1042730.874000001698732;0
8282;-742183.519999999552965;-1042790.890000000596046;0
3991;-743363.940000001341105;-1043857.699999999254942;0
5516;-743427.133000001311302;-1043615.250999998301268;0
1509;-741741.000000000000000;-1044196.000000000000000;0
3819;-743120.250000000000000;-1042679.620000001043081;0
4714;-742856.359999999403954;-1042618.210000000894070;0
6876;-741825.559999998658895;-1045240.469999998807907;0
3312;-743789.184999998658895;-1042904.234000001102686;0
8274;-742065.089999999850988;-1042742.109999999403954;0
4211;-742193.190000001341105;-1043565.660000000149012;0
4106;-742664.475000001490116;-1043755.761999998241663;0
1502;-741506.000000000000000;-1044283.000000000000000;0
3824;-743038.059999998658895;-1042573.800000000745058;0
4222;-742187.096999999135733;-1043485.890000000596046;0
1353;-741862.000000000000000;-1044843.000000000000000;0
1364;-742077.000000000000000;-1044936.000000000000000;0
4692;-742681.477000001817942;-1042600.622000001370907;0
7043;-743398.899999998509884;-1044106.629999998956919;0
7659;-742336.048000000417233;-1045327.868000000715256;0
8060;-742295.719999998807907;-1045082.859999999403954;0
4947;-742399.918000001460314;-1042993.458000000566244;0
3792;-743110.019999999552965;-1042846.530000001192093;0
5271;-742995.381999999284744;-1043229.673000000417233;0
2544;-741753.000000000000000;-1044252.000000000000000;0
1820;-743006.000000000000000;-1044272.000000000000000;0
5167;-743219.324999999254942;-1043405.249000001698732;0
4332;-742410.359000001102686;-1043282.916000001132488;0
6717;-742311.105999998748302;-1044960.396999999880791;0
5;-743466.000000000000000;-1042616.000000000000000;0
4699;-742676.469999998807907;-1042731.760000001639128;0
6366;-741957.399999998509884;-1042652.609999999403954;0
8044;-742176.640000000596046;-1044778.420000001788139;0
1952;-743316.000000000000000;-1044495.000000000000000;0
527;-742186.000000000000000;-1043818.000000000000000;0
1544;-742236.000000000000000;-1044198.000000000000000;0
3292;-743576.905000001192093;-1042781.315000001341105;0
2423;-742482.000000000000000;-1045106.000000000000000;0
6125;-743428.124000001698732;-1043615.223999999463558;0
1588;-742390.000000000000000;-1044837.000000000000000;0
4837;-742979.105999998748302;-1042672.627999998629093;0
6252;-742378.052000001072884;-1043040.958000000566244;0
1910;-743460.000000000000000;-1044391.000000000000000;0
798;-741797.000000000000000;-1042590.000000000000000;0
1338;-741629.000000000000000;-1045045.000000000000000;0
6357;-741947.870000001043081;-1042701.129999998956919;0
6312;-743933.359999999403954;-1042580.719999998807907;0
5579;-743409.682999998331070;-1043634.574999999254942;0
5224;-743293.449999999254942;-1043542.160000000149012;0
4048;-743218.050000000745058;-1043961.320000000298023;0
7541;-742644.280000001192093;-1045370.789999999105930;0
4083;-742820.771999999880791;-1043708.657000001519918;0
1336;-741737.000000000000000;-1044860.000000000000000;0
3407;-743772.385999999940395;-1043008.706999998539686;0
4476;-741849.620000001043081;-1042690.190000001341105;0
6960;-743030.260000001639128;-1044242.870000001043081;0
2385;-742167.000000000000000;-1045479.000000000000000;0
2264;-742977.000000000000000;-1045745.000000000000000;0
915;-741884.000000000000000;-1043273.000000000000000;0
1823;-742973.000000000000000;-1044174.000000000000000;0
1120;-741778.000000000000000;-1044457.000000000000000;0
2274;-742870.000000000000000;-1045732.000000000000000;0
4750;-742784.420000001788139;-1042733.429999999701977;0
1059;-741637.000000000000000;-1045095.000000000000000;0
1376;-742165.000000000000000;-1044873.000000000000000;0
5003;-742589.811999998986721;-1042974.888999998569489;0
7208;-742560.289999999105930;-1045023.789999999105930;0
3159;-743996.506000000983477;-1042545.605000000447035;0
1827;-743033.000000000000000;-1044080.000000000000000;0
3420;-743739.186000000685453;-1043112.370000001043081;0
2342;-742726.000000000000000;-1045537.000000000000000;0
4987;-742641.745000001043081;-1043011.309999998658895;0
516;-742160.000000000000000;-1043135.000000000000000;0
4638;-742553.631999999284744;-1042542.028000000864267;0
1242;-742137.000000000000000;-1044481.000000000000000;0
2548;-741672.000000000000000;-1044304.000000000000000;0
1014;-742097.000000000000000;-1044586.000000000000000;0
6713;-742278.905999999493361;-1044887.284000001847744;0
4774;-742900.078999999910593;-1042854.859000001102686;0
4428;-742206.750000000000000;-1043097.800000000745058;0
6397;-742033.839999999850988;-1042501.859999999403954;0
2132;-743058.000000000000000;-1045118.000000000000000;0
6268;-742340.850000001490116;-1043018.881000000983477;0
1937;-743273.000000000000000;-1044318.000000000000000;0
4661;-742816.708000000566244;-1042503.918999999761581;0
4654;-742797.372999999672174;-1042533.888999998569489;0
2172;-742886.000000000000000;-1045182.000000000000000;0
3276;-743673.931000001728535;-1042836.190999999642372;0
7980;-741198.179999999701977;-1044410.339999999850988;0
1902;-743459.000000000000000;-1044269.000000000000000;0
4499;-742338.899999998509884;-1042707.250000000000000;0
4721;-742883.219999998807907;-1042605.010000001639128;0
3836;-743096.070000000298023;-1042561.879999998956919;0
4897;-742560.320000000298023;-1042829.359999999403954;0
5706;-743417.688999999314547;-1043638.852000001817942;0
1140;-741475.000000000000000;-1044461.000000000000000;0
262;-743408.000000000000000;-1043731.000000000000000;0
600;-741840.000000000000000;-1043212.000000000000000;0
6160;-742311.730999998748302;-1043061.116000000387430;0
6267;-742344.767999999225140;-1043019.272999998182058;0
505;-741917.000000000000000;-1043153.000000000000000;0
4756;-742712.579999998211861;-1042776.829999998211861;0
1112;-741189.050000000745058;-1044602.469999998807907;0
5757;-743420.747999999672174;-1043633.940999999642372;0
3964;-743352.359999999403954;-1043540.780000001192093;0
1817;-743058.000000000000000;-1044411.000000000000000;0
3842;-743141.300000000745058;-1042637.030000001192093;0
6013;-743372.780000001192093;-1043377.921999998390675;0
4523;-742703.960000000894070;-1042805.670000001788139;0
2582;-741030.372999999672174;-1044607.635000001639128;0
5221;-743263.820000000298023;-1043556.920000001788139;0
3433;-743896.050000000745058;-1042546.662000000476837;0
1445;-741553.000000000000000;-1044757.000000000000000;0
5680;-743402.000000000000000;-1043718.245000001043081;0
8072;-742148.059999998658895;-1045271.649999998509884;0
5697;-743416.916000001132488;-1043635.342000000178814;0
4710;-742796.730000000447035;-1042611.769999999552965;0
541;-742258.000000000000000;-1043678.000000000000000;0
7750;-742972.960000000894070;-1044053.329999998211861;0
1559;-741190.000000000000000;-1044242.000000000000000;0
4701;-742687.780000001192093;-1042761.660000000149012;0
5441;-743196.690000001341105;-1043289.765000000596046;0
613;-742089.000000000000000;-1043271.000000000000000;0
384;-742471.000000000000000;-1043766.000000000000000;0
1562;-743199.000000000000000;-1045122.000000000000000;0
7704;-742256.021000001579523;-1044313.592999998480082;0
539;-742127.000000000000000;-1043824.000000000000000;0
4649;-742732.228999998420477;-1042525.100000001490116;0
3285;-743661.519999999552965;-1042862.697000000625849;0
2253;-743250.000000000000000;-1045314.000000000000000;0
5215;-743342.890000000596046;-1043380.368000000715256;0
670;-742502.000000000000000;-1043239.000000000000000;0
6198;-742312.659000001847744;-1043056.964999999850988;0
3957;-743415.125000000000000;-1043567.214999999850988;0
757;-741673.000000000000000;-1042678.000000000000000;0
819;-741987.000000000000000;-1042599.000000000000000;0
2545;-741723.000000000000000;-1044265.000000000000000;0
4457;-741664.109999999403954;-1042615.550000000745058;0
5416;-742963.127999998629093;-1042713.598000001162291;0
513;-742083.000000000000000;-1043145.000000000000000;0
8045;-742173.070000000298023;-1044806.519999999552965;0
520;-742225.000000000000000;-1043127.000000000000000;0
4633;-742625.931000001728535;-1042639.918999999761581;0
1932;-743359.000000000000000;-1044408.000000000000000;0
7973;-741347.850000001490116;-1044381.850000001490116;0
537;-742099.000000000000000;-1043663.000000000000000;0
6854;-741522.427999999374151;-1045038.967999998480082;0
5651;-743429.440999999642372;-1043699.524999998509884;0
5666;-743418.543999999761581;-1043712.120000001043081;0
4830;-743043.449999999254942;-1042882.359999999403954;0
4503;-742402.579999998211861;-1042702.839999999850988;0
1811;-743175.000000000000000;-1044525.000000000000000;0
677;-742425.000000000000000;-1043200.000000000000000;0
94;-744054.000000000000000;-1042934.000000000000000;0
8258;-742053.760000001639128;-1042683.769999999552965;0
2094;-743203.000000000000000;-1044744.000000000000000;0
265;-743344.000000000000000;-1043735.000000000000000;0
5723;-743420.903000000864267;-1043631.703999999910593;0
705;-741929.000000000000000;-1042865.000000000000000;0
4616;-742545.416999999433756;-1042662.541999999433756;0
4772;-742879.881999999284744;-1042872.157000001519918;0
6157;-742314.026999998837709;-1043065.331000000238419;0
1015;-742126.000000000000000;-1044599.000000000000000;0
4460;-742216.600000001490116;-1042598.850000001490116;0
3094;-743906.500000000000000;-1042759.554999999701977;0
7345;-742613.339999999850988;-1045185.250000000000000;0
5026;-742631.168999999761581;-1042903.938999999314547;0
5370;-742580.300999999046326;-1042977.140999998897314;0
5418;-742434.890000000596046;-1042864.780000001192093;0
2355;-742465.000000000000000;-1045568.000000000000000;0
4107;-742652.458999998867512;-1043744.934000000357628;0
5653;-743429.589999999850988;-1043701.940999999642372;0
1683;-741134.429999999701977;-1044711.329999998211861;0
1699;-741435.000000000000000;-1044671.000000000000000;0
1046;-741838.000000000000000;-1044805.000000000000000;0
4177;-742387.940999999642372;-1044182.254999998956919;0
5640;-743428.425000000745058;-1043686.254000000655651;0
540;-742144.000000000000000;-1043804.000000000000000;0
5923;-742953.765000000596046;-1043015.067999999970198;0
81;-744074.000000000000000;-1043369.000000000000000;0
6284;-742309.677999999374151;-1043054.043999999761581;0
888;-741994.000000000000000;-1042797.000000000000000;0
5174;-743296.331000000238419;-1043439.800000000745058;0
5712;-743423.701000001281500;-1043638.675999999046326;0
921;-743338.000000000000000;-1043818.000000000000000;0
4515;-742607.100000001490116;-1042765.780000001192093;0
4718;-742933.730000000447035;-1042628.039999999105930;0
3154;-743984.818999998271465;-1042573.844999998807907;0
4759;-742842.945999998599291;-1042806.664000000804663;0
2292;-742819.000000000000000;-1045388.000000000000000;0
6692;-742222.114999998360872;-1044818.673000000417233;0
4748;-742895.730000000447035;-1042781.289999999105930;0
880;-741793.000000000000000;-1042834.000000000000000;0
6273;-742321.806000001728535;-1043017.085000000894070;0
6232;-742316.034000001847744;-1043057.000000000000000;0
3796;-743161.100000001490116;-1042834.149999998509884;0
7781;-743030.026999998837709;-1045857.486000001430511;0
738;-741818.000000000000000;-1043024.000000000000000;0
6846;-741505.875000000000000;-1044995.949000000953674;0
4927;-742447.969999998807907;-1042874.710000000894070;0
1091;-741531.480000000447035;-1044543.440000001341105;0
283;-743026.000000000000000;-1043788.000000000000000;0
3945;-743388.361000001430511;-1043434.486000001430511;0
2129;-743108.000000000000000;-1045142.000000000000000;0
6265;-742353.164999999105930;-1043020.054999999701977;0
1128;-741655.000000000000000;-1044448.000000000000000;0
3808;-742987.050000000745058;-1042925.350000001490116;0
7385;-743182.811000000685453;-1045457.984000001102686;0
394;-742405.000000000000000;-1043863.000000000000000;0
1424;-742134.000000000000000;-1044171.000000000000000;0
5999;-741991.910000000149012;-1043282.079999998211861;0
1363;-742095.000000000000000;-1044934.000000000000000;0
5657;-743429.199999999254942;-1043706.837999999523163;0
697;-742101.000000000000000;-1042908.000000000000000;0
1727;-741495.000000000000000;-1045103.000000000000000;0
8048;-742190.519999999552965;-1044865.730000000447035;0
4613;-742506.557000000029802;-1042597.938000001013279;0
1092;-741549.000000000000000;-1044556.000000000000000;0
6103;-742213.102000001817942;-1043103.528999999165535;0
249;-743433.000000000000000;-1043775.000000000000000;0
