OID_;X;Y;TEMPERATURE
3614;-744984.548999998718500;-1042283.640999998897314;0
3019;-744463.447999998927116;-1042784.646000001579523;0
3568;-744718.817999999970198;-1042588.614999998360872;0
3692;-744525.876499999314547;-1042540.534000001847744;0
3580;-744924.973999999463558;-1042593.699999999254942;0
2605;-745393.842999998480082;-1042860.796000000089407;0
5975;-745052.346999999135733;-1042674.673000000417233;0
118;-745135.000000000000000;-1042687.000000000000000;0
3542;-744575.274000000208616;-1042656.160000000149012;0
2696;-743477.489999998360872;-1042038.000000000000000;0
2520;-741847.000000000000000;-1045324.000000000000000;0
3066;-744075.627000000327826;-1042883.837000001221895;0
6;-743464.000000000000000;-1042594.000000000000000;0
3216;-743615.890999998897314;-1042451.129999998956919;0
2226;-743057.000000000000000;-1045470.000000000000000;0
3211;-743651.409000001847744;-1042483.458999998867512;0
7716;-743023.190999999642372;-1045843.241999998688698;0
6872;-741751.719999998807907;-1045296.679999999701977;0
7397;-743021.859999999403954;-1045682.989999998360872;0
7744;-742941.256999999284744;-1045533.171000000089407;0
2760;-743863.331000000238419;-1043483.304000001400709;0
2755;-744003.879000000655651;-1043471.734000001102686;0
1584;-742368.000000000000000;-1044717.000000000000000;0
2404;-742179.000000000000000;-1045467.000000000000000;0
3919;-743904.947000000625849;-1043493.929999999701977;0
3107;-743778.888000000268221;-1042682.131999999284744;0
2326;-742523.000000000000000;-1045498.000000000000000;0
2255;-743181.000000000000000;-1045372.000000000000000;0
2740;-744042.611999999731779;-1043335.940000001341105;0
2641;-743432.578999999910593;-1042583.418999999761581;0
3268;-743594.046999998390675;-1042721.412999998778105;0
5408;-743696.881000000983477;-1042878.024999998509884;0
6705;-742279.050999999046326;-1044655.923000000417233;0
7217;-742516.318999998271465;-1044582.890000000596046;0
1629;-742450.000000000000000;-1044518.000000000000000;0
1767;-741261.000000000000000;-1044168.000000000000000;0
1426;-742056.000000000000000;-1044228.000000000000000;0
1760;-741162.000000000000000;-1044101.000000000000000;0
2085;-742426.000000000000000;-1044797.000000000000000;0
2166;-743016.000000000000000;-1045179.000000000000000;0
3233;-744152.962999999523163;-1042686.791999999433756;0
7185;-742600.515000000596046;-1044717.333999998867512;0
7829;-743509.649999998509884;-1045166.399999998509884;0
1267;-742040.000000000000000;-1044999.000000000000000;0
6945;-742955.907000001519918;-1043932.182999998331070;0
6833;-741571.423000000417233;-1044909.473999999463558;0
7325;-743032.969999998807907;-1045186.298999998718500;0
5405;-744043.826000001281500;-1042674.686000000685453;0
1486;-741150.000000000000000;-1044219.000000000000000;0
1445;-741553.000000000000000;-1044757.000000000000000;0
7174;-742639.019999999552965;-1044564.949999999254942;0
598;-741853.000000000000000;-1043233.000000000000000;0
1332;-741793.000000000000000;-1044755.000000000000000;0
6712;-742273.328000001609325;-1044860.912000000476837;0
8046;-742169.109999999403954;-1044835.660000000149012;0
1524;-741710.000000000000000;-1043844.000000000000000;0
1727;-741495.000000000000000;-1045103.000000000000000;0
1723;-741611.000000000000000;-1045092.000000000000000;0
1699;-741435.000000000000000;-1044671.000000000000000;0
3289;-743584.761999998241663;-1042769.188000001013279;0
1053;-741768.000000000000000;-1045023.000000000000000;0
2017;-743247.000000000000000;-1044884.000000000000000;0
1411;-741639.480000000447035;-1044683.019999999552965;0
1773;-741281.000000000000000;-1043977.000000000000000;0
7183;-742606.379999998956919;-1044692.969999998807907;0
6828;-741465.309999998658895;-1044768.940000001341105;0
4068;-742917.125000000000000;-1043734.535000000149012;0
2409;-742363.000000000000000;-1045093.000000000000000;0
8285;-742232.780000001192093;-1042821.149999998509884;0
526;-742209.000000000000000;-1043849.000000000000000;0
1562;-743199.000000000000000;-1045122.000000000000000;0
7411;-743529.510000001639128;-1045393.140000000596046;0
727;-742001.000000000000000;-1042962.000000000000000;0
8054;-742230.239999998360872;-1044988.530000001192093;0
6719;-742371.686999998986721;-1044952.227000001817942;0
7020;-743104.175000000745058;-1044078.344999998807907;0
3413;-743776.791000001132488;-1043071.675000000745058;0
6728;-742547.451000001281500;-1044392.396000001579523;0
7212;-742559.410000000149012;-1045073.070000000298023;0
1602;-742507.000000000000000;-1044924.000000000000000;0
1291;-742205.000000000000000;-1044568.000000000000000;0
6835;-741618.964000001549721;-1044934.515000000596046;0
4018;-743153.285000000149012;-1043925.850000001490116;0
1971;-743385.000000000000000;-1044881.000000000000000;0
2079;-742688.000000000000000;-1044428.000000000000000;0
1355;-741899.000000000000000;-1044858.000000000000000;0
2061;-742681.000000000000000;-1044491.000000000000000;0
2151;-742827.000000000000000;-1045047.000000000000000;0
8244;-742617.899999998509884;-1045206.480000000447035;0
1674;-741099.000000000000000;-1044736.000000000000000;0
283;-743026.000000000000000;-1043788.000000000000000;0
1041;-741893.000000000000000;-1044653.000000000000000;0
6845;-741527.188000001013279;-1044989.557000000029802;0
7158;-742984.796999998390675;-1044545.407999999821186;0
8257;-742149.809999998658895;-1045048.399999998509884;0
1718;-741366.219999998807907;-1044870.989999998360872;0
1316;-741765.000000000000000;-1044903.000000000000000;0
1324;-741943.000000000000000;-1044994.000000000000000;0
7704;-742256.021000001579523;-1044313.592999998480082;0
4052;-743252.954999998211861;-1043843.585000000894070;0
5434;-744042.467999998480082;-1043135.986999999731779;0
1315;-741715.000000000000000;-1044867.000000000000000;0
385;-742436.000000000000000;-1043742.000000000000000;0
748;-741671.000000000000000;-1042971.000000000000000;0
4991;-742675.414999999105930;-1043031.236000001430511;0
7143;-742850.414999999105930;-1044473.449999999254942;0
345;-742559.000000000000000;-1043826.000000000000000;0
8079;-742021.839999999850988;-1045292.179999999701977;0
2070;-742993.000000000000000;-1044723.000000000000000;0
2097;-743143.000000000000000;-1044742.000000000000000;0
4156;-742513.734999999403954;-1043978.035000000149012;0
7249;-742789.010999999940395;-1044830.250000000000000;0
3988;-743309.704999998211861;-1044008.570000000298023;0
6415;-743180.657999999821186;-1043208.993999999016523;0
1092;-741549.000000000000000;-1044556.000000000000000;0
1250;-742103.000000000000000;-1044672.000000000000000;0
2417;-742421.000000000000000;-1045135.000000000000000;0
7263;-743009.559999998658895;-1044894.379999998956919;0
1303;-741865.000000000000000;-1044692.000000000000000;0
1704;-741289.000000000000000;-1044690.000000000000000;0
5309;-743033.405000001192093;-1043187.043999999761581;0
352;-742386.000000000000000;-1043914.000000000000000;0
383;-742450.000000000000000;-1043722.000000000000000;0
4238;-742440.263000000268221;-1043528.236000001430511;0
3096;-743906.309999998658895;-1042750.539999999105930;0
4794;-743065.828999999910593;-1042673.377000000327826;0
1811;-743175.000000000000000;-1044525.000000000000000;0
465;-741728.000000000000000;-1043309.000000000000000;0
7654;-742242.081000000238419;-1045273.263999998569489;0
6995;-743129.710000000894070;-1044496.579999998211861;0
984;-741917.000000000000000;-1044411.000000000000000;0
7000;-743096.190000001341105;-1044426.870000001043081;0
2893;-743977.276000000536442;-1043208.923999998718500;0
502;-741901.000000000000000;-1043169.000000000000000;0
7008;-742899.559999998658895;-1044224.074999999254942;0
1914;-743464.000000000000000;-1044458.000000000000000;0
1521;-741808.000000000000000;-1043917.000000000000000;0
1984;-743476.000000000000000;-1044743.000000000000000;0
2394;-742273.000000000000000;-1045360.000000000000000;0
4500;-742315.239999998360872;-1042719.460000000894070;0
2329;-742432.000000000000000;-1045508.000000000000000;0
1539;-741977.000000000000000;-1043997.000000000000000;0
335;-742635.000000000000000;-1043966.000000000000000;0
226;-742879.000000000000000;-1043516.000000000000000;0
1791;-742157.000000000000000;-1044163.000000000000000;0
4332;-742410.359000001102686;-1043282.916000001132488;0
4210;-742178.550000000745058;-1043586.035000000149012;0
2050;-743460.000000000000000;-1045072.000000000000000;0
4236;-742406.842999998480082;-1043504.015000000596046;0
4087;-742811.609999999403954;-1043604.190000001341105;0
1852;-742739.000000000000000;-1044210.000000000000000;0
7153;-742889.646999999880791;-1044547.438000001013279;0
2160;-742849.000000000000000;-1045147.000000000000000;0
2161;-742876.000000000000000;-1045153.000000000000000;0
4174;-742738.230000000447035;-1043763.155000001192093;0
4003;-743371.839999999850988;-1044053.258999999612570;0
7324;-742833.980000000447035;-1044949.109999999403954;0
307;-742781.000000000000000;-1044143.000000000000000;0
884;-741771.000000000000000;-1042776.000000000000000;0
2123;-743299.000000000000000;-1045010.000000000000000;0
844;-742138.000000000000000;-1042519.000000000000000;0
3822;-743065.039999999105930;-1042594.239999998360872;0
1843;-743041.600000001490116;-1044324.489999998360872;0
8073;-742120.640000000596046;-1045259.500000000000000;0
6448;-744017.179999999701977;-1043123.899999998509884;0
3847;-743122.146999999880791;-1042525.489999998360872;0
7515;-742273.021999999880791;-1044371.543999999761581;0
3848;-743094.383999999612570;-1042505.245000001043081;0
275;-743361.000000000000000;-1043904.000000000000000;0
6726;-742476.517999999225140;-1044410.600000001490116;0
5066;-742827.379000000655651;-1043252.267999999225140;0
7121;-743339.839999999850988;-1044620.059999998658895;0
5065;-742796.800999999046326;-1043254.010000001639128;0
512;-742063.000000000000000;-1043136.000000000000000;0
4504;-742387.329999998211861;-1042714.820000000298023;0
4927;-742447.969999998807907;-1042874.710000000894070;0
3782;-743285.429999999701977;-1042842.460000000894070;0
1981;-743406.000000000000000;-1044627.000000000000000;0
3163;-743993.758999999612570;-1042530.366000000387430;0
1954;-743372.000000000000000;-1044497.000000000000000;0
347;-742542.000000000000000;-1043795.000000000000000;0
7652;-742275.046999998390675;-1045497.052000001072884;0
574;-742068.000000000000000;-1043538.000000000000000;0
1015;-742126.000000000000000;-1044599.000000000000000;0
3365;-743840.598999999463558;-1043023.565000001341105;0
1287;-742217.000000000000000;-1044486.000000000000000;0
2378;-742372.000000000000000;-1045503.000000000000000;0
6008;-743902.607000000774860;-1042749.771000001579523;0
3353;-743954.399999998509884;-1043021.017999999225140;0
5220;-743247.339999999850988;-1043589.050000000745058;0
3303;-743810.967999998480082;-1042865.596000000834465;39
580;-742010.000000000000000;-1043443.000000000000000;0
734;-741935.000000000000000;-1043014.000000000000000;0
586;-741966.000000000000000;-1043374.000000000000000;0
4342;-742506.473000001162291;-1043301.100000001490116;0
563;-742155.000000000000000;-1043660.000000000000000;0
5792;-743363.984999999403954;-1043442.513999998569489;0
628;-742217.370000001043081;-1043308.559999998658895;0
6652;-741678.190000001341105;-1044132.780000001192093;0
208;-743146.000000000000000;-1043573.000000000000000;0
4328;-742347.322000000625849;-1043375.796999998390675;0
6311;-743930.489999998360872;-1042569.390000000596046;0
6487;-741745.798000000417233;-1044519.414999999105930;0
825;-742171.000000000000000;-1042598.000000000000000;0
699;-742067.000000000000000;-1042896.000000000000000;0
1514;-741882.000000000000000;-1044096.000000000000000;0
4858;-742955.339999999850988;-1042963.960000000894070;0
6675;-742272.140000000596046;-1044167.469999998807907;0
5250;-743328.995000001043081;-1043178.495000001043081;0
4823;-742936.660000000149012;-1042868.949999999254942;0
4138;-742883.587000001221895;-1043997.287999998778105;0
2323;-742622.000000000000000;-1045487.000000000000000;0
1932;-743359.000000000000000;-1044408.000000000000000;0
1004;-741898.000000000000000;-1044565.000000000000000;0
4055;-743119.070000000298023;-1043694.109999999403954;0
1189;-741786.000000000000000;-1044043.000000000000000;0
5302;-743090.423999998718500;-1043070.048999998718500;0
4973;-742480.098000001162291;-1043031.443999998271465;0
4826;-743043.850000001490116;-1042979.600000001490116;0
709;-741861.000000000000000;-1042862.000000000000000;0
1376;-742165.000000000000000;-1044873.000000000000000;0
6152;-742310.348999999463558;-1043060.046999998390675;0
2542;-741813.000000000000000;-1044224.000000000000000;0
518;-742194.000000000000000;-1043131.000000000000000;0
1034;-741964.000000000000000;-1044876.000000000000000;0
1945;-743270.000000000000000;-1044454.000000000000000;0
4786;-742953.361000001430511;-1042655.886999998241663;0
8018;-741974.039999999105930;-1044442.870000001043081;0
1455;-741517.000000000000000;-1044468.000000000000000;0
819;-741987.000000000000000;-1042599.000000000000000;0
1256;-742084.000000000000000;-1044787.000000000000000;0
1533;-741832.000000000000000;-1043879.000000000000000;0
4119;-742717.223999999463558;-1043999.837999999523163;0
2488;-742083.000000000000000;-1044303.000000000000000;0
4221;-742209.576000001281500;-1043499.238000001758337;0
5701;-743417.076999999582767;-1043630.140000000596046;0
1490;-741023.000000000000000;-1044335.000000000000000;0
7141;-742895.629999998956919;-1044470.910000000149012;0
4251;-742136.420000001788139;-1043379.969999998807907;0
8263;-742151.089999999850988;-1042702.239999998360872;0
1929;-743440.000000000000000;-1044410.000000000000000;0
1027;-741984.000000000000000;-1044660.000000000000000;0
5210;-743253.673999998718500;-1043370.440999999642372;0
5206;-743189.870999999344349;-1043360.936000000685453;0
7007;-742923.890000000596046;-1044218.879999998956919;0
1923;-743395.000000000000000;-1044274.000000000000000;0
6121;-742069.784000001847744;-1043299.828000001609325;0
3812;-743231.179999999701977;-1042815.199999999254942;0
738;-741818.000000000000000;-1043024.000000000000000;0
4978;-742491.822999998927116;-1043028.688000001013279;0
7963;-741608.199999999254942;-1044329.510000001639128;0
1042;-741883.000000000000000;-1044682.000000000000000;0
2211;-743248.000000000000000;-1045258.000000000000000;0
1542;-742043.000000000000000;-1044057.000000000000000;0
1478;-741443.000000000000000;-1044220.000000000000000;0
4081;-742828.035000000149012;-1043754.850000001490116;0
537;-742099.000000000000000;-1043663.000000000000000;0
2507;-742427.000000000000000;-1044437.000000000000000;0
7983;-741127.800000000745058;-1044416.199999999254942;0
882;-741825.000000000000000;-1042788.000000000000000;0
913;-741742.000000000000000;-1042579.000000000000000;0
5592;-743420.136999998241663;-1043679.831999998539686;0
679;-742404.000000000000000;-1043185.000000000000000;0
2222;-743058.000000000000000;-1045420.000000000000000;0
5228;-743334.289999999105930;-1043545.039999999105930;0
3962;-743407.190000001341105;-1043535.730000000447035;0
2249;-743211.000000000000000;-1045443.000000000000000;0
519;-742239.000000000000000;-1043113.000000000000000;0
3756;-743319.230000000447035;-1042949.019999999552965;0
3794;-743091.015000000596046;-1042800.471999999135733;0
5681;-743400.820000000298023;-1043718.682000000029802;0
5715;-743423.747000001370907;-1043633.157999999821186;0
6699;-742301.118999999016523;-1044484.282999999821186;0
1993;-743483.000000000000000;-1044984.000000000000000;0
6003;-742038.201000001281500;-1043299.010999999940395;0
3761;-743202.559999998658895;-1042981.710000000894070;0
1938;-743289.000000000000000;-1044306.000000000000000;0
6783;-741340.728000000119209;-1044457.412000000476837;0
1101;-741339.000000000000000;-1044568.000000000000000;0
4429;-742222.260000001639128;-1043102.250000000000000;0
109;-744134.000000000000000;-1042768.000000000000000;0
2537;-741975.000000000000000;-1044131.000000000000000;0
3787;-743130.989999998360872;-1042979.320000000298023;0
5144;-743052.642000000923872;-1043488.940000001341105;0
2483;-741266.219999998807907;-1044755.030000001192093;0
4040;-743224.710000000894070;-1043766.050000000745058;0
6277;-742304.633999999612570;-1043024.256000000983477;0
1840;-742984.379999998956919;-1044155.149999998509884;0
6209;-742319.320000000298023;-1043066.114999998360872;0
6952;-743044.730999998748302;-1044106.129999998956919;0
4896;-742589.649999998509884;-1042838.989999998360872;0
4699;-742676.469999998807907;-1042731.760000001639128;0
510;-742048.000000000000000;-1043150.000000000000000;0
274;-743359.000000000000000;-1043833.000000000000000;0
4341;-742488.855000000447035;-1043325.412999998778105;0
219;-742979.000000000000000;-1043549.000000000000000;0
6204;-742315.578999999910593;-1043060.826000001281500;0
3791;-743144.839999999850988;-1042881.120000001043081;0
1620;-742439.000000000000000;-1044323.000000000000000;0
2237;-743368.000000000000000;-1045238.000000000000000;0
4039;-743159.070000000298023;-1043772.795000001788139;0
4897;-742560.320000000298023;-1042829.359999999403954;0
3833;-743029.679999999701977;-1042612.300000000745058;0
4509;-742502.519999999552965;-1042732.079999998211861;0
5683;-743398.456000000238419;-1043719.557999998331070;0
6118;-743652.447000000625849;-1042857.607999999076128;0
4588;-742421.668999999761581;-1042556.124000001698732;0
178;-743389.000000000000000;-1043251.000000000000000;0
624;-742241.000000000000000;-1043343.000000000000000;0
6511;-741291.670000001788139;-1044319.690000001341105;0
4426;-742197.589999999850988;-1043031.679999999701977;0
4122;-742732.074999999254942;-1043923.995000001043081;0
2501;-742746.000000000000000;-1045430.000000000000000;0
4128;-742915.039999999105930;-1044041.920000001788139;0
5676;-743406.725999999791384;-1043716.493000000715256;0
8122;-742826.149999998509884;-1045713.260000001639128;0
6143;-742309.690999999642372;-1043060.385000001639128;0
6245;-742369.682000000029802;-1043057.377000000327826;0
6171;-742310.780999999493361;-1043057.971000000834465;0
6199;-742319.442000001668930;-1043067.822999998927116;0
4075;-742947.934999998658895;-1043903.649999998509884;0
6172;-742317.552999999374151;-1043068.875999998301268;0
3981;-743341.517000000923872;-1043837.353999998420477;0
6180;-742311.429000001400709;-1043057.635999999940395;0
4661;-742816.708000000566244;-1042503.918999999761581;0
5042;-742731.719000000506639;-1042890.517000000923872;0
4723;-742883.429999999701977;-1042644.829999998211861;0
4951;-742335.579999998211861;-1042934.429999999701977;0
1239;-742138.000000000000000;-1044401.000000000000000;0
6169;-742312.320000000298023;-1043060.791999999433756;0
3799;-743117.550000000745058;-1042868.160000000149012;0
1180;-741935.000000000000000;-1044283.000000000000000;33
6181;-742318.164999999105930;-1043068.541999999433756;0
5712;-743423.701000001281500;-1043638.675999999046326;0
4996;-742488.458999998867512;-1042974.723999999463558;0
4964;-742390.059999998658895;-1043044.839999999850988;0
2314;-742884.000000000000000;-1045456.000000000000000;0
2477;-741238.370000001043081;-1044535.289999999105930;0
1454;-741521.000000000000000;-1044499.000000000000000;0
3889;-742335.008999999612570;-1042489.949000000953674;0
4766;-742803.037999998778105;-1042842.532999999821186;0
1920;-743384.000000000000000;-1044363.000000000000000;0
4077;-742849.614999998360872;-1043858.745000001043081;0
1394;-741822.000000000000000;-1044310.000000000000000;0
4203;-742299.442000001668930;-1043608.692000001668930;0
6142;-742310.477000001817942;-1043061.813000001013279;0
4718;-742933.730000000447035;-1042628.039999999105930;0
4580;-742393.905000001192093;-1042551.807000000029802;0
4671;-742824.179999999701977;-1042687.210000000894070;0
4511;-742539.859999999403954;-1042744.070000000298023;0
3956;-743414.039999999105930;-1043561.081999998539686;0
7966;-741489.800000000745058;-1044356.219999998807907;0
4591;-742426.813000001013279;-1042640.035000000149012;0
6175;-742315.256999999284744;-1043064.660999998450279;0
6769;-741281.120000001043081;-1044417.780000001192093;0
6265;-742353.164999999105930;-1043020.054999999701977;0
4573;-742341.550000000745058;-1042629.699999999254942;0
6197;-742313.425000000745058;-1043058.370999999344349;0
6778;-741060.820000000298023;-1044484.339999999850988;0
6364;-742003.519999999552965;-1042660.690000001341105;0
4840;-742988.201999999582767;-1042740.603999998420477;0
1262;-742066.000000000000000;-1044917.000000000000000;0
3960;-743418.563000001013279;-1043583.526000000536442;0
4815;-742992.210000000894070;-1042788.359999999403954;0
1168;-741825.000000000000000;-1044403.000000000000000;0
1117;-741066.000000000000000;-1044603.000000000000000;0
6259;-742383.170000001788139;-1043030.809000000357628;0
4505;-742434.910000000149012;-1042706.170000001788139;0
4622;-742533.901000000536442;-1042569.660000000149012;0
6262;-742370.024999998509884;-1043021.666000001132488;0
6393;-742076.660000000149012;-1042499.879999998956919;0
6013;-743372.780000001192093;-1043377.921999998390675;0
4628;-742619.598000001162291;-1042609.989999998360872;0
1878;-743324.000000000000000;-1044249.000000000000000;0
7043;-743398.899999998509884;-1044106.629999998956919;0
1464;-741899.000000000000000;-1043994.000000000000000;0
4957;-742366.010000001639128;-1043006.059999998658895;0
5195;-743232.432999998331070;-1043297.890999998897314;0
5280;-743058.660000000149012;-1043362.201999999582767;0
6191;-742318.017000000923872;-1043066.800999999046326;0
458;-741726.000000000000000;-1043324.000000000000000;0
555;-742230.000000000000000;-1043726.000000000000000;0
317;-742464.000000000000000;-1044207.000000000000000;0
5689;-743415.442000001668930;-1043633.646000001579523;0
6676;-742250.239999998360872;-1044174.719999998807907;0
2035;-743435.000000000000000;-1044802.000000000000000;0
2504;-742757.000000000000000;-1045516.000000000000000;0
395;-742369.000000000000000;-1043840.000000000000000;0
6374;-741977.035000000149012;-1042674.153999999165535;0
1972;-743389.000000000000000;-1044907.000000000000000;0
5252;-743283.517000000923872;-1043176.197999998927116;0
912;-741690.000000000000000;-1042686.000000000000000;0
4428;-742206.750000000000000;-1043097.800000000745058;0
6162;-742310.199999999254942;-1043058.306000001728535;0
4629;-742630.986000001430511;-1042626.096000000834465;0
4763;-742847.094000000506639;-1042842.671000000089407;0
5777;-742926.357000000774860;-1043427.357999999076128;0
2557;-741318.000000000000000;-1044384.000000000000000;0
4961;-742309.460000000894070;-1043010.730000000447035;0
3360;-743950.688000001013279;-1042982.188000001013279;0
1470;-741728.000000000000000;-1044116.000000000000000;0
4936;-742454.684000000357628;-1042685.620999999344349;0
1228;-742220.539999999105930;-1044250.829999998211861;0
5738;-743410.412999998778105;-1043691.800000000745058;0
1137;-741538.000000000000000;-1044442.000000000000000;0
7169;-742693.079999998211861;-1044394.177999999374151;0
4679;-742774.199999999254942;-1042819.160000000149012;0
5155;-743140.712999999523163;-1043357.901999998837709;0
5197;-743222.513000000268221;-1043313.989999998360872;0
2440;-742596.000000000000000;-1044193.000000000000000;0
681;-742383.000000000000000;-1043170.000000000000000;0
1861;-743457.000000000000000;-1044175.000000000000000;0
6510;-741721.960000000894070;-1044461.815000001341105;0
5745;-743415.129000000655651;-1043695.054000001400709;0
6657;-741565.760000001639128;-1044156.980000000447035;0
5656;-743429.752999998629093;-1043705.570000000298023;0
5651;-743429.440999999642372;-1043699.524999998509884;0
6397;-742033.839999999850988;-1042501.859999999403954;0
4909;-742383.146000001579523;-1042799.159000001847744;0
4330;-742377.440999999642372;-1043332.162999998778105;0
6113;-742229.061000000685453;-1043368.359000001102686;0
2524;-742108.000000000000000;-1044191.000000000000000;0
1157;-741172.000000000000000;-1044489.000000000000000;0
2499;-741884.000000000000000;-1044011.000000000000000;0
5663;-743422.087999999523163;-1043710.807999998331070;0
2508;-742961.000000000000000;-1044050.000000000000000;0
4776;-742909.276000000536442;-1042820.587000001221895;0
4594;-742555.890999998897314;-1042650.090999998152256;0
4745;-742840.800000000745058;-1042742.120000001043081;0
1159;-741137.000000000000000;-1044493.000000000000000;0
6492;-742174.054000001400709;-1044455.534000001847744;0
6144;-742308.925000000745058;-1043059.002000000327826;0
756;-741681.000000000000000;-1042695.000000000000000;0
7033;-743303.864999998360872;-1044132.750000000000000;0
4472;-741816.140000000596046;-1042675.499000001698732;0
5293;-743043.969999998807907;-1043208.554000001400709;0
328;-742670.000000000000000;-1044072.000000000000000;0
4566;-742473.846000000834465;-1042545.780000001192093;0
1408;-741647.000000000000000;-1044201.000000000000000;0
1132;-741596.000000000000000;-1044446.000000000000000;0
5226;-743310.730000000447035;-1043553.269999999552965;0
4253;-742109.368000000715256;-1043416.399999998509884;0
4079;-742836.170000001788139;-1043800.960000000894070;0
5685;-743396.092999998480082;-1043720.434000000357628;0
7277;-742796.870000001043081;-1044653.429999999701977;0
2369;-742503.000000000000000;-1045427.000000000000000;0
5149;-743072.195999998599291;-1043377.370999999344349;0
7980;-741198.179999999701977;-1044410.339999999850988;0
8277;-742111.260000001639128;-1042746.399999998509884;0
6156;-742314.791999999433756;-1043066.736000001430511;0
6663;-741457.949999999254942;-1044194.329999998211861;0
833;-742050.000000000000000;-1042573.000000000000000;0
2052;-743403.000000000000000;-1045075.000000000000000;0
6140;-742311.999000001698732;-1043064.638999998569489;0
4047;-743210.230000000447035;-1043992.289999999105930;0
6300;-741836.949999999254942;-1042698.329999998211861;0
5700;-743416.574000000953674;-1043630.223999999463558;0
2331;-742895.000000000000000;-1045530.000000000000000;0
4708;-742755.420000001788139;-1042611.309999998658895;0
6361;-742016.024999998509884;-1042677.243999999016523;0
4959;-742331.289999999105930;-1043002.690000001341105;0
6198;-742312.659000001847744;-1043056.964999999850988;0
5502;-743427.894999999552965;-1043706.885000001639128;0
4674;-742806.475999999791384;-1042703.594999998807907;0
1491;-741057.000000000000000;-1044333.000000000000000;0
6195;-742314.956000000238419;-1043061.181000001728535;0
5082;-742925.114000000059605;-1043348.883999999612570;0
6241;-742365.649999998509884;-1043065.059999998658895;0
4161;-742506.254999998956919;-1044181.925000000745058;0
4574;-742339.980000000447035;-1042661.570000000298023;0
1421;-741587.000000000000000;-1044356.000000000000000;0
4635;-742575.561999998986721;-1042702.701000001281500;0
4953;-742431.500999998301268;-1043027.399999998509884;0
4115;-742757.210000000894070;-1044109.620000001043081;0
7290;-742819.100000001490116;-1044794.800000000745058;0
4770;-742872.535000000149012;-1042899.679000001400709;0
5415;-742954.934000000357628;-1042714.414000000804663;0
6151;-742311.114999998360872;-1043061.451000001281500;0
547;-742316.910000000149012;-1043790.309999998658895;0
5720;-743418.223000001162291;-1043629.960999999195337;0
5142;-743039.870000001043081;-1043473.929999999701977;0
1872;-743422.000000000000000;-1044246.000000000000000;0
248;-743439.000000000000000;-1043748.000000000000000;0
7508;-742947.440000001341105;-1045540.690000001341105;0
739;-741789.000000000000000;-1043028.000000000000000;0
4774;-742900.078999999910593;-1042854.859000001102686;0
4010;-743200.372999999672174;-1044041.177999999374151;0
530;-742139.000000000000000;-1043771.000000000000000;0
5709;-743420.221999999135733;-1043640.467999998480082;0
6508;-741728.552999999374151;-1044508.050999999046326;0
5138;-743030.936000000685453;-1043483.587999999523163;0
4326;-742319.855000000447035;-1043419.918999999761581;0
6177;-742313.717999998480082;-1043061.859999999403954;0
6174;-742316.021999999880791;-1043066.065000001341105;0
6185;-742315.103999998420477;-1043062.923000000417233;0
2344;-742691.000000000000000;-1045541.000000000000000;0
6129;-742312.925000000745058;-1043067.717000000178814;0
4623;-742533.778999999165535;-1042585.824000000953674;0
544;-742343.910000000149012;-1043796.500000000000000;0
4648;-742721.809999998658895;-1042535.192000001668930;0
