OID_;X;Y;TEMPERATURE
3612;-744996.545000001788139;-1042292.646000001579523;0
2758;-743919.949999999254942;-1043488.059999998658895;0
2641;-743432.578999999910593;-1042583.418999999761581;0
3211;-743651.409000001847744;-1042483.458999998867512;0
2809;-744090.649999998509884;-1043371.184000000357628;0
5787;-743470.390000000596046;-1042099.079999998211861;0
1584;-742368.000000000000000;-1044717.000000000000000;0
7409;-743521.629999998956919;-1045356.570000000298023;0
4237;-742425.385000001639128;-1043517.421000000089407;0
7514;-742304.866000000387430;-1044375.124000001698732;0
3268;-743594.046999998390675;-1042721.412999998778105;0
2097;-743143.000000000000000;-1044742.000000000000000;0
2233;-743461.000000000000000;-1045218.000000000000000;0
725;-741983.000000000000000;-1042939.000000000000000;0
7715;-743042.480000000447035;-1045860.798999998718500;0
7259;-742935.280000001192093;-1044869.829999998211861;0
2889;-744074.103999998420477;-1043194.559999998658895;0
7047;-743395.495000001043081;-1044210.765000000596046;0
4175;-742721.254999998956919;-1043775.890000000596046;0
7945;-742063.179999999701977;-1044077.379999998956919;0
3810;-743261.510000001639128;-1042802.960000000894070;145
736;-741880.000000000000000;-1043017.000000000000000;114
4119;-742717.223999999463558;-1043999.837999999523163;0
5326;-742969.850000001490116;-1043038.800000000745058;0
4653;-742788.747999999672174;-1042524.557000000029802;0
6814;-741118.537999998778105;-1044802.493000000715256;0
3128;-743948.160000000149012;-1042657.320000000298023;0
3291;-743588.212999999523163;-1042790.916999999433756;0
7147;-742827.925000000745058;-1044451.385000001639128;0
4088;-742812.114999998360872;-1043580.475000001490116;0
1790;-742152.000000000000000;-1044138.000000000000000;0
6448;-744017.179999999701977;-1043123.899999998509884;0
3066;-744075.627000000327826;-1042883.837000001221895;0
7022;-743155.660000000149012;-1044074.410000000149012;0
3371;-743840.392999999225140;-1043010.835000000894070;0
2154;-742805.000000000000000;-1045147.000000000000000;0
3233;-744152.962999999523163;-1042686.791999999433756;0
3020;-744427.359000001102686;-1042798.999000001698732;0
941;-742098.000000000000000;-1043132.000000000000000;0
6702;-742291.596999999135733;-1044564.116999998688698;0
2400;-742087.000000000000000;-1045374.000000000000000;0
509;-741991.000000000000000;-1043143.000000000000000;0
1533;-741832.000000000000000;-1043879.000000000000000;0
1629;-742450.000000000000000;-1044518.000000000000000;0
1768;-741265.000000000000000;-1044133.000000000000000;0
1725;-741536.000000000000000;-1045136.000000000000000;0
281;-743045.000000000000000;-1043848.000000000000000;205
467;-741757.000000000000000;-1043352.000000000000000;0
1865;-743458.000000000000000;-1044233.000000000000000;0
5292;-743055.866000000387430;-1043215.710999999195337;0
603;-741810.000000000000000;-1043205.000000000000000;0
4047;-743210.230000000447035;-1043992.289999999105930;0
7280;-742806.989999998360872;-1044667.600000001490116;0
6;-743464.000000000000000;-1042594.000000000000000;0
3163;-743993.758999999612570;-1042530.366000000387430;0
8266;-742220.320000000298023;-1042706.760000001639128;0
1941;-743267.000000000000000;-1044384.000000000000000;0
2329;-742432.000000000000000;-1045508.000000000000000;0
1496;-741253.000000000000000;-1044321.000000000000000;0
3825;-743056.390000000596046;-1042570.079999998211861;0
6708;-742268.296999998390675;-1044748.438000001013279;0
7015;-742554.570000000298023;-1044360.725000001490116;0
3216;-743615.890999998897314;-1042451.129999998956919;0
8261;-742108.039999999105930;-1042693.769999999552965;0
7807;-742647.802999999374151;-1044543.524000000208616;0
7214;-742470.679999999701977;-1044531.269999999552965;0
2562;-741090.000000000000000;-1044404.000000000000000;0
4154;-742544.524999998509884;-1044048.190000001341105;0
2498;-741906.000000000000000;-1044040.000000000000000;0
1942;-743283.000000000000000;-1044370.000000000000000;0
1906;-743459.000000000000000;-1044325.000000000000000;0
7925;-743541.780000001192093;-1044709.149999998509884;0
1248;-742109.000000000000000;-1044631.000000000000000;0
7036;-743316.204999998211861;-1044198.315000001341105;0
697;-742101.000000000000000;-1042908.000000000000000;0
1823;-742973.000000000000000;-1044174.000000000000000;0
1964;-743412.000000000000000;-1044708.000000000000000;0
1125;-741728.000000000000000;-1044435.000000000000000;0
1597;-742338.000000000000000;-1045064.000000000000000;0
2893;-743977.276000000536442;-1043208.923999998718500;0
2091;-742920.000000000000000;-1044593.000000000000000;0
4770;-742872.535000000149012;-1042899.679000001400709;0
1285;-742198.000000000000000;-1044467.000000000000000;0
884;-741771.000000000000000;-1042776.000000000000000;0
559;-742191.000000000000000;-1043693.000000000000000;0
6751;-742426.350000001490116;-1044371.070000000298023;0
5975;-745052.346999999135733;-1042674.673000000417233;0
1994;-743483.000000000000000;-1045010.000000000000000;0
1750;-742045.000000000000000;-1045215.000000000000000;0
4025;-743202.881000000983477;-1043852.008000001311302;0
1697;-741495.000000000000000;-1044664.000000000000000;0
2255;-743181.000000000000000;-1045372.000000000000000;0
2220;-743075.000000000000000;-1045396.000000000000000;0
584;-741980.000000000000000;-1043396.000000000000000;0
4625;-742594.258000001311302;-1042576.114000000059605;0
8285;-742232.780000001192093;-1042821.149999998509884;0
4063;-742855.079999998211861;-1043654.695000000298023;0
1931;-743388.000000000000000;-1044409.000000000000000;0
7689;-742554.140000000596046;-1045198.359999999403954;0
4253;-742109.368000000715256;-1043416.399999998509884;0
3535;-744653.131999999284744;-1042674.822000000625849;0
7138;-742917.554999999701977;-1044421.774999998509884;0
3656;-744550.905000001192093;-1042638.070000000298023;0
7000;-743096.190000001341105;-1044426.870000001043081;0
7233;-742606.750000000000000;-1044827.379999998956919;0
6432;-742029.997999999672174;-1043511.272999998182058;0
3990;-743339.489999998360872;-1043987.234999999403954;0
3807;-743008.690000001341105;-1042928.690000001341105;0
504;-741937.000000000000000;-1043164.000000000000000;0
6846;-741505.875000000000000;-1044995.949000000953674;0
995;-741906.000000000000000;-1044434.000000000000000;0
323;-742711.000000000000000;-1044140.000000000000000;0
6559;-741296.480000000447035;-1043984.920000001788139;0
7018;-742577.747000001370907;-1044239.712999999523163;0
7205;-742570.679999999701977;-1044988.579999998211861;0
8085;-741919.059999998658895;-1045407.820000000298023;0
430;-742185.000000000000000;-1043888.000000000000000;0
1929;-743440.000000000000000;-1044410.000000000000000;0
6995;-743129.710000000894070;-1044496.579999998211861;0
6826;-741405.300000000745058;-1044777.199999999254942;0
6121;-742069.784000001847744;-1043299.828000001609325;0
2060;-742659.000000000000000;-1044472.000000000000000;0
6686;-742381.967000000178814;-1044961.747000001370907;0
1216;-742093.000000000000000;-1044333.000000000000000;0
318;-742434.000000000000000;-1044213.000000000000000;0
5143;-743052.232000000774860;-1043454.120000001043081;0
7084;-743318.609999999403954;-1044521.789999999105930;0
1972;-743389.000000000000000;-1044907.000000000000000;0
1030;-741975.000000000000000;-1044753.000000000000000;0
345;-742559.000000000000000;-1043826.000000000000000;0
4076;-742855.589999999850988;-1043882.670000001788139;0
3701;-744582.008000001311302;-1042507.443999998271465;0
4922;-742443.129999998956919;-1042886.510000001639128;0
1410;-741643.039999999105930;-1044709.940000001341105;0
5302;-743090.423999998718500;-1043070.048999998718500;0
4503;-742402.579999998211861;-1042702.839999999850988;0
4427;-742190.519999999552965;-1043099.440000001341105;0
1350;-741814.000000000000000;-1044844.000000000000000;0
3158;-744000.453999999910593;-1042558.089000001549721;0
7285;-742806.960000000894070;-1044758.379999998956919;0
705;-741929.000000000000000;-1042865.000000000000000;0
1189;-741786.000000000000000;-1044043.000000000000000;0
5720;-743418.223000001162291;-1043629.960999999195337;0
4221;-742209.576000001281500;-1043499.238000001758337;0
1157;-741172.000000000000000;-1044489.000000000000000;0
1045;-741849.000000000000000;-1044775.000000000000000;0
4741;-742787.859999999403954;-1042715.800000000745058;0
6166;-742314.649999998509884;-1043065.006999999284744;0
394;-742405.000000000000000;-1043863.000000000000000;0
6500;-741697.967999998480082;-1044926.364999998360872;0
220;-742969.000000000000000;-1043530.000000000000000;0
2133;-743040.000000000000000;-1045127.000000000000000;0
908;-742211.000000000000000;-1042501.000000000000000;0
3889;-742335.008999999612570;-1042489.949000000953674;0
2379;-742291.000000000000000;-1045388.000000000000000;0
6202;-742317.124000001698732;-1043063.651999998837709;0
2035;-743435.000000000000000;-1044802.000000000000000;0
573;-742067.000000000000000;-1043561.000000000000000;0
1534;-741849.000000000000000;-1043893.000000000000000;0
1259;-742064.000000000000000;-1044854.000000000000000;0
1179;-741934.000000000000000;-1044251.000000000000000;0
4070;-742925.285000000149012;-1043783.565000001341105;0
4699;-742676.469999998807907;-1042731.760000001639128;0
3531;-744733.070999998599291;-1042679.260000001639128;0
7955;-741807.699999999254942;-1044246.519999999552965;0
1387;-742155.000000000000000;-1044999.000000000000000;0
6652;-741678.190000001341105;-1044132.780000001192093;0
1057;-741686.000000000000000;-1045058.000000000000000;0
590;-741935.000000000000000;-1043331.000000000000000;0
1244;-742127.000000000000000;-1044527.000000000000000;0
4873;-742775.690000001341105;-1042931.829999998211861;0
788;-741637.000000000000000;-1042607.000000000000000;0
2431;-742498.000000000000000;-1045094.000000000000000;0
3790;-743140.809999998658895;-1042908.210000000894070;0
4208;-742372.416999999433756;-1043503.423000000417233;0
6496;-742290.655999999493361;-1044438.502999998629093;0
2263;-742989.000000000000000;-1045714.000000000000000;0
555;-742230.000000000000000;-1043726.000000000000000;0
993;-741977.000000000000000;-1044436.000000000000000;0
1776;-741200.000000000000000;-1044007.000000000000000;0
3761;-743202.559999998658895;-1042981.710000000894070;0
5111;-742892.337999999523163;-1043424.370999999344349;0
3425;-743730.254000000655651;-1043071.712000001221895;0
1039;-741914.000000000000000;-1044595.000000000000000;0
1409;-741634.000000000000000;-1044170.000000000000000;0
381;-742465.000000000000000;-1043700.000000000000000;0
462;-741707.000000000000000;-1043294.000000000000000;0
1181;-741920.000000000000000;-1044230.000000000000000;0
4461;-742218.370000001043081;-1042583.800000000745058;0
4809;-743081.589999999850988;-1042799.800000000745058;0
7655;-742266.583000000566244;-1045284.133999999612570;0
1733;-741767.000000000000000;-1045399.000000000000000;0
918;-743437.000000000000000;-1043904.000000000000000;0
1326;-741927.000000000000000;-1044976.000000000000000;0
2017;-743247.000000000000000;-1044884.000000000000000;0
4602;-742441.269000001251698;-1042596.320000000298023;0
6820;-741224.105999998748302;-1044799.311999998986721;0
1250;-742103.000000000000000;-1044672.000000000000000;0
1451;-741522.000000000000000;-1044602.000000000000000;0
5738;-743410.412999998778105;-1043691.800000000745058;0
2502;-742750.000000000000000;-1045457.000000000000000;0
5502;-743427.894999999552965;-1043706.885000001639128;0
7088;-743335.559999998658895;-1044546.359999999403954;0
2314;-742884.000000000000000;-1045456.000000000000000;0
7652;-742275.046999998390675;-1045497.052000001072884;0
5582;-743410.127000000327826;-1043640.197999998927116;0
1359;-742000.000000000000000;-1044897.000000000000000;0
1444;-741559.000000000000000;-1044786.000000000000000;0
296;-742950.170000001788139;-1044097.429999999701977;0
2052;-743403.000000000000000;-1045075.000000000000000;0
1128;-741655.000000000000000;-1044448.000000000000000;0
387;-742421.000000000000000;-1043763.000000000000000;0
1618;-742405.000000000000000;-1044404.000000000000000;0
6266;-742349.021000001579523;-1043019.662999998778105;0
2373;-742469.000000000000000;-1045517.000000000000000;0
1732;-741840.000000000000000;-1045226.000000000000000;0
670;-742502.000000000000000;-1043239.000000000000000;0
4081;-742828.035000000149012;-1043754.850000001490116;0
7183;-742606.379999998956919;-1044692.969999998807907;0
5064;-742811.537999998778105;-1043238.886999998241663;0
4507;-742472.469999998807907;-1042720.199999999254942;0
4211;-742193.190000001341105;-1043565.660000000149012;0
4966;-742377.289999999105930;-1043071.030000001192093;0
6605;-741648.401999998837709;-1043884.642999999225140;0
707;-741897.000000000000000;-1042863.000000000000000;0
4241;-742225.929999999701977;-1043394.530000001192093;0
4963;-742396.510000001639128;-1043031.829999998211861;0
1468;-741778.000000000000000;-1044082.000000000000000;0
2244;-743264.000000000000000;-1045331.000000000000000;0
2536;-742003.000000000000000;-1044113.000000000000000;0
1324;-741943.000000000000000;-1044994.000000000000000;0
6357;-741947.870000001043081;-1042701.129999998956919;0
5245;-743368.859999999403954;-1043290.789999999105930;0
824;-742142.000000000000000;-1042596.000000000000000;0
5645;-743428.886999998241663;-1043692.285999998450279;0
6943;-742902.013999998569489;-1043932.647999998182058;0
3579;-744924.442999999970198;-1042569.135000001639128;0
1007;-741976.000000000000000;-1044586.000000000000000;0
6175;-742315.256999999284744;-1043064.660999998450279;0
2104;-743176.000000000000000;-1044964.000000000000000;0
6008;-743902.607000000774860;-1042749.771000001579523;0
210;-743112.000000000000000;-1043566.000000000000000;0
2269;-742933.000000000000000;-1045611.000000000000000;0
2020;-743260.000000000000000;-1044941.000000000000000;0
7008;-742899.559999998658895;-1044224.074999999254942;0
5306;-743103.326999999582767;-1043193.129000000655651;0
2318;-742763.000000000000000;-1045470.000000000000000;0
5961;-742431.225000001490116;-1044003.574999999254942;0
6770;-741306.423999998718500;-1044414.120999999344349;0
5415;-742954.934000000357628;-1042714.414000000804663;0
1488;-741088.000000000000000;-1044212.000000000000000;0
5214;-743307.671999998390675;-1043376.414000000804663;0
839;-742021.000000000000000;-1042510.000000000000000;0
4677;-742787.309999998658895;-1042797.899999998509884;0
3992;-743365.899999998509884;-1043881.385000001639128;0
2480;-741251.739999998360872;-1044639.480000000447035;0
542;-742367.629999998956919;-1043814.379999998956919;0
4767;-742786.899999998509884;-1042835.736000001430511;0
3302;-743795.043999999761581;-1042863.539000000804663;0
3849;-743061.690000001341105;-1042485.920000001788139;0
1843;-743041.600000001490116;-1044324.489999998360872;0
626;-742236.000000000000000;-1043317.000000000000000;0
3830;-743013.879999998956919;-1042612.359999999403954;0
5447;-743129.958999998867512;-1043365.166000001132488;0
3947;-743403.787999998778105;-1043488.118999999016523;0
2228;-743044.000000000000000;-1045502.000000000000000;0
5124;-742983.513000000268221;-1043417.271999999880791;0
746;-741714.000000000000000;-1043020.000000000000000;0
676;-742442.000000000000000;-1043196.000000000000000;0
3357;-743953.732000000774860;-1043042.298999998718500;0
4331;-742391.967999998480082;-1043310.539000000804663;0
5120;-742868.383999999612570;-1043343.986000001430511;0
618;-742203.000000000000000;-1043272.000000000000000;0
1347;-741791.000000000000000;-1044816.000000000000000;0
1223;-742190.000000000000000;-1044277.000000000000000;0
2493;-742011.000000000000000;-1044181.000000000000000;0
3758;-743284.129999998956919;-1042964.100000001490116;0
5172;-743274.383999999612570;-1043432.322999998927116;0
1085;-741634.000000000000000;-1044530.000000000000000;0
8054;-742230.239999998360872;-1044988.530000001192093;0
6835;-741618.964000001549721;-1044934.515000000596046;0
3141;-744035.420000001788139;-1042680.460000000894070;0
6159;-742312.495999999344349;-1043062.521000001579523;0
1477;-741482.750000000000000;-1044212.480000000447035;0
718;-741691.000000000000000;-1042844.000000000000000;0
4946;-742411.739000000059605;-1043002.199999999254942;0
6136;-742315.081999998539686;-1043070.210000000894070;0
8262;-742129.620000001043081;-1042698.079999998211861;0
5224;-743293.449999999254942;-1043542.160000000149012;0
4250;-742144.109999999403954;-1043367.519999999552965;0
6483;-741773.829999998211861;-1044640.969000000506639;0
5408;-743696.881000000983477;-1042878.024999998509884;0
4623;-742533.778999999165535;-1042585.824000000953674;0
2403;-742211.000000000000000;-1045436.000000000000000;0
5062;-742798.513999998569489;-1043227.370999999344349;0
5508;-743426.105999998748302;-1043645.960999999195337;0
8046;-742169.109999999403954;-1044835.660000000149012;0
3971;-743206.815000001341105;-1043721.065000001341105;0
4634;-742635.980000000447035;-1042656.144999999552965;0
6993;-743172.409000001847744;-1044501.339000001549721;0
3796;-743161.100000001490116;-1042834.149999998509884;0
2354;-742452.000000000000000;-1045584.000000000000000;0
7158;-742984.796999998390675;-1044545.407999999821186;0
6274;-742318.392999999225140;-1043016.747000001370907;0
7959;-741699.170000001788139;-1044292.620000001043081;0
4838;-742981.304999999701977;-1042697.471000000834465;0
5167;-743219.324999999254942;-1043405.249000001698732;0
5252;-743283.517000000923872;-1043176.197999998927116;0
6216;-742313.892000000923872;-1043056.272999998182058;0
2198;-743302.000000000000000;-1045194.000000000000000;0
7362;-743205.807000000029802;-1045156.089999999850988;0
322;-742701.000000000000000;-1044153.000000000000000;0
6439;-741765.070999998599291;-1042636.877999998629093;0
1291;-742205.000000000000000;-1044568.000000000000000;0
4989;-742648.756000000983477;-1043019.318999998271465;0
7223;-742409.149999998509884;-1044822.649999998509884;0
4205;-742325.267999999225140;-1043571.951000001281500;0
1458;-741506.000000000000000;-1044384.000000000000000;0
1708;-741170.820000000298023;-1044705.589999999850988;0
1261;-742057.000000000000000;-1044894.000000000000000;0
5240;-743364.164000000804663;-1043254.934000000357628;0
6692;-742222.114999998360872;-1044818.673000000417233;0
548;-742297.000000000000000;-1043762.000000000000000;0
1343;-741714.000000000000000;-1044765.000000000000000;0
6322;-745097.228000000119209;-1042674.039999999105930;0
3355;-743953.881000000983477;-1043031.379999998956919;0
4148;-742631.269999999552965;-1043885.870000001043081;0
7032;-743301.464999999850988;-1044106.190000001341105;0
701;-742023.000000000000000;-1042885.000000000000000;0
729;-741986.000000000000000;-1042998.000000000000000;0
5716;-743423.320999998599291;-1043631.197000000625849;0
2456;-741013.000000000000000;-1044501.000000000000000;0
308;-742754.000000000000000;-1044149.000000000000000;0
6113;-742229.061000000685453;-1043368.359000001102686;0
2322;-742651.000000000000000;-1045483.000000000000000;0
6177;-742313.717999998480082;-1043061.859999999403954;0
5194;-743205.761999998241663;-1043310.581999998539686;0
4980;-742521.857999999076128;-1043030.853000000119209;0
6001;-742006.079999998211861;-1043292.300000000745058;0
1965;-743413.000000000000000;-1044726.000000000000000;0
5210;-743253.673999998718500;-1043370.440999999642372;0
6663;-741457.949999999254942;-1044194.329999998211861;0
1097;-741414.000000000000000;-1044558.000000000000000;0
4890;-742605.287000000476837;-1042838.535000000149012;0
6205;-742314.800000000745058;-1043059.416999999433756;0
1751;-742046.000000000000000;-1045235.000000000000000;0
2055;-743425.000000000000000;-1045038.000000000000000;0
5697;-743416.916000001132488;-1043635.342000000178814;0
7970;-741444.739999998360872;-1044384.980000000447035;0
3844;-743184.170000001788139;-1042586.949999999254942;0
987;-741814.000000000000000;-1044493.000000000000000;0
1270;-742242.000000000000000;-1044491.000000000000000;0
1262;-742066.000000000000000;-1044917.000000000000000;0
5217;-743306.870999999344349;-1043323.228000000119209;0
1300;-741917.410000000149012;-1044719.769999999552965;0
4332;-742410.359000001102686;-1043282.916000001132488;0
3956;-743414.039999999105930;-1043561.081999998539686;0
4001;-743418.500000000000000;-1044051.739000000059605;0
634;-742117.000000000000000;-1043309.000000000000000;0
7828;-743537.940000001341105;-1045170.530000001192093;0
4204;-742312.750999998301268;-1043589.962999999523163;0
5163;-743163.861999999731779;-1043392.113000001758337;0
524;-742255.000000000000000;-1043913.000000000000000;0
3767;-743033.910000000149012;-1042982.390000000596046;0
2435;-742452.000000000000000;-1044222.000000000000000;0
6662;-741466.800000000745058;-1044192.359999999403954;0
1424;-742134.000000000000000;-1044171.000000000000000;0
5226;-743310.730000000447035;-1043553.269999999552965;0
7980;-741198.179999999701977;-1044410.339999999850988;0
4037;-743205.375000000000000;-1043771.175000000745058;0
3804;-743040.109999999403954;-1042895.410000000149012;0
4140;-742831.635999999940395;-1044004.828999999910593;0
6822;-741283.870000001043081;-1044793.059999998658895;0
285;-743021.000000000000000;-1043730.000000000000000;0
4984;-742580.537999998778105;-1043025.210999999195337;0
3871;-742356.649999998509884;-1042420.543999999761581;0
225;-742885.000000000000000;-1043535.000000000000000;0
544;-742343.910000000149012;-1043796.500000000000000;0
7659;-742336.048000000417233;-1045327.868000000715256;0
3312;-743789.184999998658895;-1042904.234000001102686;0
4818;-742949.140000000596046;-1042791.660000000149012;0
4673;-742811.420000001788139;-1042756.050000000745058;0
336;-742616.000000000000000;-1043959.000000000000000;0
5722;-743419.659000001847744;-1043631.798000000417233;0
5149;-743072.195999998599291;-1043377.370999999344349;0
8258;-742053.760000001639128;-1042683.769999999552965;0
7387;-743066.739999998360872;-1045487.570000000298023;0
5158;-743148.138999998569489;-1043320.254999998956919;0
4711;-742803.300000000745058;-1042601.140000000596046;0
8053;-742224.410000000149012;-1044970.879999998956919;0
3325;-743911.068999998271465;-1042947.052000001072884;0
5721;-743418.407999999821186;-1043631.800000000745058;0
1528;-741698.000000000000000;-1043770.000000000000000;0
168;-743427.000000000000000;-1043311.000000000000000;0
204;-743208.000000000000000;-1043588.000000000000000;0
2171;-742893.000000000000000;-1045151.000000000000000;0
2146;-742845.000000000000000;-1044968.000000000000000;0
4710;-742796.730000000447035;-1042611.769999999552965;0
2299;-742592.000000000000000;-1045409.000000000000000;0
1101;-741339.000000000000000;-1044568.000000000000000;0
4213;-742218.094999998807907;-1043529.954999998211861;0
5580;-743409.831000000238419;-1043636.449000000953674;0
4122;-742732.074999999254942;-1043923.995000001043081;0
3310;-743829.561999998986721;-1042854.063000001013279;0
3832;-743029.390000000596046;-1042595.910000000149012;0
1088;-741617.000000000000000;-1044547.000000000000000;0
2374;-742473.000000000000000;-1045546.000000000000000;0
5969;-742284.809999998658895;-1044169.578000001609325;0
2343;-742674.000000000000000;-1045557.000000000000000;0
4858;-742955.339999999850988;-1042963.960000000894070;0
3839;-743112.140000000596046;-1042558.280000001192093;0
1267;-742040.000000000000000;-1044999.000000000000000;0
6270;-742333.412999998778105;-1043018.204999998211861;0
4053;-743260.039999999105930;-1043823.480000000447035;0
6039;-742085.370000001043081;-1043669.620999999344349;0
5695;-743417.217999998480082;-1043638.749000001698732;0
4560;-742427.079999998211861;-1042500.829999998211861;0
6719;-742371.686999998986721;-1044952.227000001817942;0
1015;-742126.000000000000000;-1044599.000000000000000;0
6188;-742312.807999998331070;-1043058.706999998539686;0
5265;-743188.572999998927116;-1043226.513999998569489;0
4672;-742811.831999998539686;-1042675.907999999821186;0
6368;-741940.324999999254942;-1042660.324000000953674;0
7519;-742850.620000001043081;-1045673.670000001788139;0
1107;-741239.260000001639128;-1044580.940000001341105;0
6659;-741515.070000000298023;-1044171.070000000298023;0
4500;-742315.239999998360872;-1042719.460000000894070;0
4901;-742520.120000001043081;-1042823.960000000894070;0
2447;-742772.000000000000000;-1044159.000000000000000;0
5685;-743396.092999998480082;-1043720.434000000357628;0
5589;-743423.785999998450279;-1043679.548000000417233;0
6140;-742311.999000001698732;-1043064.638999998569489;0
7007;-742923.890000000596046;-1044218.879999998956919;0
1674;-741099.000000000000000;-1044736.000000000000000;0
8282;-742183.519999999552965;-1042790.890000000596046;0
6746;-742405.083999998867512;-1044259.199999999254942;0
4637;-742572.578000001609325;-1042742.510999999940395;0
848;-741973.000000000000000;-1042526.000000000000000;0
632;-742130.000000000000000;-1043287.000000000000000;0
4052;-743252.954999998211861;-1043843.585000000894070;0
1344;-741750.000000000000000;-1044808.000000000000000;0
6694;-742280.806000001728535;-1044814.875999998301268;0
4517;-742638.449999999254942;-1042779.280000001192093;0
7538;-742701.420000001788139;-1045364.109999999403954;0
6297;-742506.859999999403954;-1042634.250000000000000;0
7269;-743143.410000000149012;-1044948.879999998956919;0
4142;-742777.425000000745058;-1044013.440000001341105;0
4523;-742703.960000000894070;-1042805.670000001788139;0
837;-741990.000000000000000;-1042511.000000000000000;0
4900;-742508.089999999850988;-1042815.289999999105930;0
3944;-743390.002000000327826;-1043413.532999999821186;0
2546;-741750.000000000000000;-1044271.000000000000000;0
1677;-741109.160000000149012;-1044522.699999999254942;0
799;-741822.000000000000000;-1042573.000000000000000;0
7324;-742833.980000000447035;-1044949.109999999403954;0
695;-742207.000000000000000;-1043019.000000000000000;0
538;-742113.000000000000000;-1043652.000000000000000;0
2289;-742915.000000000000000;-1045426.000000000000000;0
4073;-742939.109999999403954;-1043858.504999998956919;0
5204;-743246.423999998718500;-1043308.298999998718500;0
6139;-742312.807000000029802;-1043066.006000000983477;0
2492;-742017.000000000000000;-1044210.000000000000000;0
4836;-742984.245999999344349;-1042653.127999998629093;0
519;-742239.000000000000000;-1043113.000000000000000;0
5701;-743417.076999999582767;-1043630.140000000596046;0
1096;-741474.000000000000000;-1044566.000000000000000;0
3601;-744894.190999999642372;-1042626.861999999731779;0
6186;-742314.337999999523163;-1043061.517000000923872;0
6143;-742309.690999999642372;-1043060.385000001639128;0
7698;-742389.168000001460314;-1044818.684000000357628;0
7515;-742273.021999999880791;-1044371.543999999761581;0
1182;-741915.000000000000000;-1044252.000000000000000;0
7973;-741347.850000001490116;-1044381.850000001490116;0
3847;-743122.146999999880791;-1042525.489999998360872;0
6172;-742317.552999999374151;-1043068.875999998301268;0
6230;-742317.590999998152256;-1043059.730999998748302;0
6114;-742234.250000000000000;-1043361.324999999254942;0
3957;-743415.125000000000000;-1043567.214999999850988;0
4325;-742270.679000001400709;-1043141.787999998778105;0
1508;-741705.000000000000000;-1044210.000000000000000;0
4589;-742408.243000000715256;-1042542.631999999284744;0
4944;-742430.605999998748302;-1043013.879000000655651;0
7344;-742653.460000000894070;-1045190.980000000447035;0
1442;-741753.000000000000000;-1044375.000000000000000;0
2225;-743041.000000000000000;-1045477.000000000000000;0
6249;-742373.554999999701977;-1043049.822000000625849;0
5177;-743336.440999999642372;-1043440.883999999612570;0
1137;-741538.000000000000000;-1044442.000000000000000;0
1416;-741628.000000000000000;-1044523.000000000000000;0
4646;-742694.853000000119209;-1042535.625999998301268;0
2167;-743021.000000000000000;-1045154.000000000000000;0
629;-742200.000000000000000;-1043289.000000000000000;0
1707;-741196.219999998807907;-1044702.390000000596046;0
4995;-742476.986000001430511;-1042961.239000000059605;0
4974;-742489.458999998867512;-1043047.024999998509884;0
4791;-743022.245000001043081;-1042633.714000001549721;0
4936;-742454.684000000357628;-1042685.620999999344349;0
588;-741950.000000000000000;-1043352.000000000000000;0
5112;-742942.920000001788139;-1043441.850000001490116;0
3850;-743037.969999998807907;-1042473.780000001192093;0
