OID_;X;Y;TEMPERATURE
3614;-744984.548999998718500;-1042283.640999998897314;0
3019;-744463.447999998927116;-1042784.646000001579523;0
3568;-744718.817999999970198;-1042588.614999998360872;0
3692;-744525.876499999314547;-1042540.534000001847744;0
3580;-744924.973999999463558;-1042593.699999999254942;0
2605;-745393.842999998480082;-1042860.796000000089407;0
5975;-745052.346999999135733;-1042674.673000000417233;0
118;-745135.000000000000000;-1042687.000000000000000;0
3542;-744575.274000000208616;-1042656.160000000149012;0
2696;-743477.489999998360872;-1042038.000000000000000;0
2520;-741847.000000000000000;-1045324.000000000000000;0
6872;-741751.719999998807907;-1045296.679999999701977;0
2760;-743863.331000000238419;-1043483.304000001400709;0
2755;-744003.879000000655651;-1043471.734000001102686;0
2404;-742179.000000000000000;-1045467.000000000000000;0
3919;-743904.947000000625849;-1043493.929999999701977;0
3107;-743778.888000000268221;-1042682.131999999284744;0
2740;-744042.611999999731779;-1043335.940000001341105;0
1486;-741150.000000000000000;-1044219.000000000000000;0
6828;-741465.309999998658895;-1044768.940000001341105;0
7411;-743529.510000001639128;-1045393.140000000596046;0
8079;-742021.839999999850988;-1045292.179999999701977;0
2070;-742993.000000000000000;-1044723.000000000000000;0
2097;-743143.000000000000000;-1044742.000000000000000;0
7263;-743009.559999998658895;-1044894.379999998956919;0
4238;-742440.263000000268221;-1043528.236000001430511;0
7654;-742242.081000000238419;-1045273.263999998569489;0
2394;-742273.000000000000000;-1045360.000000000000000;0
2160;-742849.000000000000000;-1045147.000000000000000;0
2161;-742876.000000000000000;-1045153.000000000000000;0
8073;-742120.640000000596046;-1045259.500000000000000;0
4075;-742947.934999998658895;-1043903.649999998509884;0
7947;-742030.969999998807907;-1044096.679999999701977;0
524;-742255.000000000000000;-1043913.000000000000000;0
1780;-741214.000000000000000;-1043934.000000000000000;0
738;-741818.000000000000000;-1043024.000000000000000;0
1983;-743474.000000000000000;-1044709.000000000000000;0
748;-741671.000000000000000;-1042971.000000000000000;0
110;-744127.000000000000000;-1042724.000000000000000;0
1764;-741163.000000000000000;-1044144.000000000000000;0
735;-741910.000000000000000;-1043014.000000000000000;0
514;-742119.000000000000000;-1043141.000000000000000;0
510;-742048.000000000000000;-1043150.000000000000000;0
2050;-743460.000000000000000;-1045072.000000000000000;0
2008;-743242.000000000000000;-1044759.000000000000000;0
6722;-742357.717000000178814;-1044705.708000000566244;0
1561;-743186.000000000000000;-1045098.000000000000000;0
1251;-742091.000000000000000;-1044690.000000000000000;0
7;-743479.000000000000000;-1042567.000000000000000;0
17;-743587.000000000000000;-1042394.000000000000000;0
5303;-743164.818999998271465;-1043211.078000001609325;0
1492;-741096.000000000000000;-1044331.000000000000000;0
4332;-742410.359000001102686;-1043282.916000001132488;0
3204;-743715.278999999165535;-1042506.118999999016523;0
6;-743464.000000000000000;-1042594.000000000000000;0
2133;-743040.000000000000000;-1045127.000000000000000;0
2151;-742827.000000000000000;-1045047.000000000000000;0
2166;-743016.000000000000000;-1045179.000000000000000;0
7324;-742833.980000000447035;-1044949.109999999403954;0
4162;-742497.193999998271465;-1044160.030000001192093;0
6746;-742405.083999998867512;-1044259.199999999254942;0
1515;-741913.000000000000000;-1044072.000000000000000;0
1371;-742089.000000000000000;-1044807.000000000000000;0
884;-741771.000000000000000;-1042776.000000000000000;0
1013;-742076.000000000000000;-1044595.000000000000000;0
2189;-743472.000000000000000;-1045183.000000000000000;0
727;-742001.000000000000000;-1042962.000000000000000;0
1091;-741531.480000000447035;-1044543.440000001341105;0
728;-741997.000000000000000;-1042918.000000000000000;0
696;-742077.000000000000000;-1042913.000000000000000;0
3326;-744036.002000000327826;-1042922.574999999254942;0
2226;-743057.000000000000000;-1045470.000000000000000;0
5062;-742798.513999998569489;-1043227.370999999344349;0
1970;-743380.000000000000000;-1044854.000000000000000;0
1987;-743480.000000000000000;-1044820.000000000000000;0
3387;-743960.368000000715256;-1043194.717000000178814;0
2256;-743156.000000000000000;-1045353.000000000000000;0
3233;-744152.962999999523163;-1042686.791999999433756;0
7776;-743089.784000001847744;-1045773.409000001847744;0
4232;-742315.057999998331070;-1043428.918999999761581;0
1915;-743468.000000000000000;-1044494.000000000000000;0
5119;-742850.592999998480082;-1043328.484999999403954;0
7520;-742808.589999999850988;-1045680.519999999552965;0
7087;-743339.940000001341105;-1044536.690000001341105;0
7350;-742556.390000000596046;-1045185.980000000447035;0
1945;-743270.000000000000000;-1044454.000000000000000;0
1058;-741667.000000000000000;-1045072.000000000000000;0
6791;-741047.329999998211861;-1044765.467999998480082;0
1875;-743367.000000000000000;-1044261.000000000000000;0
2262;-742999.000000000000000;-1045686.000000000000000;0
1926;-743301.000000000000000;-1044321.000000000000000;0
5292;-743055.866000000387430;-1043215.710999999195337;0
5272;-743000.013999998569489;-1043245.364000000059605;0
4070;-742925.285000000149012;-1043783.565000001341105;0
4342;-742506.473000001162291;-1043301.100000001490116;0
7651;-742295.381000000983477;-1045479.861999999731779;0
4212;-742205.245000001043081;-1043548.410000000149012;0
1238;-742150.000000000000000;-1044384.000000000000000;0
1243;-742122.000000000000000;-1044502.000000000000000;0
5223;-743283.699999999254942;-1043535.940000001341105;0
2491;-742059.000000000000000;-1044251.000000000000000;0
7217;-742516.318999998271465;-1044582.890000000596046;0
910;-742219.000000000000000;-1042529.000000000000000;0
1171;-741882.000000000000000;-1044375.000000000000000;0
6943;-742902.013999998569489;-1043932.647999998182058;0
6825;-741380.010000001639128;-1044780.089999999850988;0
281;-743045.000000000000000;-1043848.000000000000000;0
8018;-741974.039999999105930;-1044442.870000001043081;0
1138;-741500.000000000000000;-1044458.000000000000000;0
4236;-742406.842999998480082;-1043504.015000000596046;0
6095;-742082.920000001788139;-1043614.710000000894070;0
1865;-743458.000000000000000;-1044233.000000000000000;0
3781;-743273.059999998658895;-1042814.050000000745058;0
3752;-743213.949999999254942;-1042902.719999998807907;0
7218;-742534.100000001490116;-1044603.559999998658895;0
1656;-741395.000000000000000;-1044688.000000000000000;0
1922;-743390.000000000000000;-1044308.000000000000000;0
1920;-743384.000000000000000;-1044363.000000000000000;0
1905;-743446.000000000000000;-1044312.000000000000000;0
2513;-742574.000000000000000;-1044441.000000000000000;0
7044;-743400.635000001639128;-1044135.579999998211861;0
7104;-743423.739999998360872;-1044624.530000001192093;0
6313;-743936.949999999254942;-1042594.780000001192093;0
3155;-743969.353000000119209;-1042568.828000001609325;0
4026;-743178.984999999403954;-1043847.989999998360872;0
6821;-741256.649999998509884;-1044796.100000001490116;0
1101;-741339.000000000000000;-1044568.000000000000000;0
4023;-743246.635000001639128;-1043864.364999998360872;0
2300;-742561.000000000000000;-1045413.000000000000000;0
1449;-741533.000000000000000;-1044684.000000000000000;0
1693;-741613.000000000000000;-1044649.000000000000000;0
713;-741800.000000000000000;-1042859.000000000000000;0
3976;-743088.861000001430511;-1043707.728000000119209;0
881;-741806.000000000000000;-1042815.000000000000000;0
1611;-742400.000000000000000;-1044442.000000000000000;0
6700;-742298.611000001430511;-1044507.315999999642372;0
6703;-742288.903999999165535;-1044591.625999998301268;0
7010;-742857.964999999850988;-1044251.155000001192093;4
4058;-743138.765000000596046;-1043625.405000001192093;0
4057;-743132.184999998658895;-1043648.719999998807907;0
1310;-741623.000000000000000;-1044829.000000000000000;0
6718;-742339.493000000715256;-1044956.921999998390675;0
1692;-741125.000000000000000;-1044816.000000000000000;0
6662;-741466.800000000745058;-1044192.359999999403954;0
2016;-743230.000000000000000;-1044873.000000000000000;0
2575;-742484.000000000000000;-1045453.000000000000000;0
1387;-742155.000000000000000;-1044999.000000000000000;0
2375;-742438.000000000000000;-1045570.000000000000000;0
2309;-742322.000000000000000;-1045519.000000000000000;0
2329;-742432.000000000000000;-1045508.000000000000000;0
6842;-741574.894000001251698;-1044962.013999998569489;0
1590;-742377.000000000000000;-1044885.000000000000000;0
4064;-742879.655000001192093;-1043647.420000001788139;0
1993;-743483.000000000000000;-1044984.000000000000000;0
2041;-743531.000000000000000;-1044957.000000000000000;0
1269;-742246.000000000000000;-1044462.000000000000000;0
6573;-741294.089999999850988;-1044091.679999999701977;0
4036;-743246.920000001788139;-1043771.574999999254942;0
3766;-743053.532999999821186;-1042996.631000000983477;0
2017;-743247.000000000000000;-1044884.000000000000000;0
6726;-742476.517999999225140;-1044410.600000001490116;0
2028;-743371.000000000000000;-1045054.000000000000000;0
1604;-742552.000000000000000;-1044918.000000000000000;0
5241;-743365.063000001013279;-1043245.954999998211861;0
7152;-742867.331999998539686;-1044547.015999998897314;0
5258;-743356.739999998360872;-1043230.039999999105930;0
7156;-742944.515000000596046;-1044546.140000000596046;0
1553;-741350.000000000000000;-1044268.000000000000000;0
4252;-742124.022999998182058;-1043390.519000001251698;0
1126;-741684.000000000000000;-1044450.000000000000000;0
1459;-741491.000000000000000;-1044340.000000000000000;0
3995;-743393.225000001490116;-1043973.719999998807907;0
2247;-743199.000000000000000;-1045400.000000000000000;0
3287;-743711.173999998718500;-1042886.515999998897314;0
7141;-742895.629999998956919;-1044470.910000000149012;0
1518;-741994.000000000000000;-1044011.000000000000000;0
2286;-742894.000000000000000;-1045440.000000000000000;0
4990;-742657.837999999523163;-1043024.199999999254942;0
1619;-742426.000000000000000;-1044401.000000000000000;0
4062;-742830.460000000894070;-1043654.920000001788139;0
7017;-742571.059999998658895;-1044267.640000000596046;0
3413;-743776.791000001132488;-1043071.675000000745058;0
3747;-743250.879999998956919;-1042956.620000001043081;0
2238;-743372.000000000000000;-1045261.000000000000000;0
2232;-743488.000000000000000;-1045234.000000000000000;0
4794;-743065.828999999910593;-1042673.377000000327826;0
1849;-742732.000000000000000;-1044228.000000000000000;0
4079;-742836.170000001788139;-1043800.960000000894070;0
1061;-741586.000000000000000;-1045133.000000000000000;0
2891;-744029.914000000804663;-1043200.478000000119209;0
2888;-744082.749000001698732;-1043174.458999998867512;0
3266;-743585.618999999016523;-1042739.508999999612570;0
3289;-743584.761999998241663;-1042769.188000001013279;0
2213;-743188.000000000000000;-1045298.000000000000000;0
2241;-743319.000000000000000;-1045289.000000000000000;0
2526;-741087.000000000000000;-1044616.000000000000000;0
1435;-741903.000000000000000;-1044306.000000000000000;0
4198;-742192.445000000298023;-1043760.521000001579523;0
4505;-742434.910000000149012;-1042706.170000001788139;0
835;-741950.000000000000000;-1042513.000000000000000;0
7146;-742819.425000000745058;-1044426.225000001490116;0
2487;-742101.000000000000000;-1044308.000000000000000;0
4500;-742315.239999998360872;-1042719.460000000894070;0
7958;-741664.710000000894070;-1044289.879999998956919;0
1455;-741517.000000000000000;-1044468.000000000000000;0
1164;-741055.000000000000000;-1044515.000000000000000;0
5323;-743049.401000000536442;-1043038.131000000983477;0
1531;-741782.000000000000000;-1043838.000000000000000;0
1520;-741777.000000000000000;-1043939.000000000000000;0
4144;-742704.414999999105930;-1043822.484999999403954;0
560;-742181.000000000000000;-1043665.000000000000000;0
4981;-742536.340999998152256;-1043014.929999999701977;0
6854;-741522.427999999374151;-1045038.967999998480082;0
1839;-742994.469999998807907;-1044185.679999999701977;0
574;-742068.000000000000000;-1043538.000000000000000;0
3095;-743923.068999998271465;-1042787.789000000804663;0
3303;-743810.967999998480082;-1042865.596000000834465;0
4097;-742806.000000000000000;-1043874.793999999761581;0
3101;-743922.754999998956919;-1042745.195000000298023;0
4925;-742455.502000000327826;-1042923.307000000029802;0
3304;-743786.739000000059605;-1042873.728999998420477;0
334;-742631.000000000000000;-1043987.000000000000000;0
581;-741991.000000000000000;-1043457.000000000000000;0
5961;-742431.225000001490116;-1044003.574999999254942;0
408;-742317.000000000000000;-1044182.000000000000000;0
591;-741912.000000000000000;-1043346.000000000000000;0
1328;-742037.000000000000000;-1045043.000000000000000;0
7281;-742801.859999999403954;-1044705.300000000745058;0
346;-742540.000000000000000;-1043816.000000000000000;0
1261;-742057.000000000000000;-1044894.000000000000000;0
2321;-742679.000000000000000;-1045480.000000000000000;0
1008;-741962.000000000000000;-1044568.000000000000000;0
339;-742606.000000000000000;-1043916.000000000000000;0
1005;-741944.000000000000000;-1044583.000000000000000;0
4953;-742431.500999998301268;-1043027.399999998509884;0
826;-742191.000000000000000;-1042616.000000000000000;0
6391;-742109.269999999552965;-1042498.320000000298023;0
834;-742049.000000000000000;-1042541.000000000000000;0
7147;-742827.925000000745058;-1044451.385000001639128;0
1036;-741961.000000000000000;-1044922.000000000000000;0
401;-742324.000000000000000;-1043907.000000000000000;0
224;-742904.000000000000000;-1043522.000000000000000;0
6656;-741590.160000000149012;-1044150.480000000447035;0
2501;-742746.000000000000000;-1045430.000000000000000;0
8281;-742164.160000000149012;-1042778.140000000596046;0
8283;-742198.600000001490116;-1042801.980000000447035;0
2084;-742447.000000000000000;-1044797.000000000000000;0
3886;-742385.100000001490116;-1042445.500000000000000;0
1705;-741257.219999998807907;-1044695.690000001341105;0
2079;-742688.000000000000000;-1044428.000000000000000;0
5419;-742434.690000001341105;-1042846.280000001192093;0
555;-742230.000000000000000;-1043726.000000000000000;0
7175;-742651.780000001192093;-1044558.149999998509884;0
3943;-743413.429000001400709;-1043376.822000000625849;0
4878;-742876.434000000357628;-1042964.004000000655651;0
2082;-742569.000000000000000;-1044642.000000000000000;0
3769;-742978.969999998807907;-1042975.300000000745058;0
2320;-742707.000000000000000;-1045477.000000000000000;0
5020;-742572.699999999254942;-1042891.372999999672174;0
6509;-741724.809999998658895;-1044485.162000000476837;0
1824;-742963.809999998658895;-1044143.929999999701977;0
7190;-742577.989999998360872;-1044771.690000001341105;0
6705;-742279.050999999046326;-1044655.923000000417233;0
4455;-741714.589000001549721;-1042663.557000000029802;0
6604;-741636.960000000894070;-1043867.217999998480082;0
4033;-743319.719999998807907;-1043793.300000000745058;0
955;-742230.000000000000000;-1043005.000000000000000;0
6783;-741340.728000000119209;-1044457.412000000476837;0
3794;-743091.015000000596046;-1042800.471999999135733;0
4510;-742483.149999998509884;-1042738.460000000894070;0
1109;-741204.100000001490116;-1044585.460000000894070;0
6693;-742248.197000000625849;-1044816.127000000327826;0
5996;-742061.879000000655651;-1043284.276999998837709;0
6002;-742018.502000000327826;-1043294.918999999761581;0
6366;-741957.399999998509884;-1042652.609999999403954;0
1529;-741727.000000000000000;-1043794.000000000000000;0
4571;-742345.710000000894070;-1042568.989999998360872;0
303;-742895.000000000000000;-1044116.000000000000000;0
7233;-742606.750000000000000;-1044827.379999998956919;0
4559;-742400.530000001192093;-1042503.760000001639128;0
4229;-742146.929000001400709;-1043334.585000000894070;0
7031;-743301.824999999254942;-1044080.774999998509884;0
2334;-742872.000000000000000;-1045519.000000000000000;0
551;-742269.000000000000000;-1043755.000000000000000;0
392;-742418.000000000000000;-1043843.000000000000000;0
399;-742339.000000000000000;-1043884.000000000000000;0
6839;-741723.412000000476837;-1044988.993000000715256;0
3992;-743365.899999998509884;-1043881.385000001639128;0
3797;-743147.989999998360872;-1042854.129999998956919;0
6836;-741643.532000001519918;-1044947.486999999731779;0
1029;-741978.000000000000000;-1044721.000000000000000;0
381;-742465.000000000000000;-1043700.000000000000000;0
1300;-741917.410000000149012;-1044719.769999999552965;0
378;-742514.000000000000000;-1043703.000000000000000;0
1323;-741859.000000000000000;-1044941.000000000000000;0
793;-741697.000000000000000;-1042588.000000000000000;0
4481;-741766.089999999850988;-1042627.859999999403954;0
3837;-743093.699999999254942;-1042577.890000000596046;0
6982;-743055.109999999403954;-1044342.629999998956919;0
4875;-742814.660000000149012;-1042937.800000000745058;0
1307;-741803.000000000000000;-1044663.000000000000000;0
6711;-742266.486000001430511;-1044832.896000001579523;0
4105;-742678.771999999880791;-1043769.206000000238419;0
4640;-742588.572999998927116;-1042544.848999999463558;0
5113;-742946.795000001788139;-1043444.427999999374151;0
5229;-743327.379999998956919;-1043528.620000001043081;0
5779;-742907.197999998927116;-1043414.096999999135733;0
1790;-742152.000000000000000;-1044138.000000000000000;0
1819;-743034.000000000000000;-1044350.000000000000000;0
7318;-742578.910000000149012;-1045033.530000001192093;0
4821;-742966.550000000745058;-1042877.969999998807907;0
1346;-741769.000000000000000;-1044817.000000000000000;0
4818;-742949.140000000596046;-1042791.660000000149012;0
5461;-742442.704999998211861;-1043234.515000000596046;0
1350;-741814.000000000000000;-1044844.000000000000000;0
6134;-742309.011999998241663;-1043060.703000001609325;0
1304;-741810.000000000000000;-1044684.000000000000000;0
4587;-742482.011999998241663;-1042641.392999999225140;0
1384;-742180.000000000000000;-1044969.000000000000000;0
1595;-742313.000000000000000;-1045010.000000000000000;0
2270;-742954.000000000000000;-1045592.000000000000000;0
6789;-741187.510000001639128;-1044470.660000000149012;0
4498;-741866.120000001043081;-1042718.471000000834465;0
5697;-743416.916000001132488;-1043635.342000000178814;0
4666;-742808.710000000894070;-1042576.609999999403954;0
5146;-743064.554000001400709;-1043452.671999998390675;0
4142;-742777.425000000745058;-1044013.440000001341105;0
4680;-742759.370000001043081;-1042864.140000000596046;0
8273;-742057.820000000298023;-1042728.760000001639128;0
6159;-742312.495999999344349;-1043062.521000001579523;0
7032;-743301.464999999850988;-1044106.190000001341105;0
5176;-743321.252999998629093;-1043447.495000001043081;0
1189;-741786.000000000000000;-1044043.000000000000000;0
6175;-742315.256999999284744;-1043064.660999998450279;0
4735;-742686.059999998658895;-1042669.260000001639128;0
1351;-741850.000000000000000;-1044830.000000000000000;0
5642;-743428.609999999403954;-1043688.666999999433756;0
7959;-741699.170000001788139;-1044292.620000001043081;0
4788;-742970.409000001847744;-1042588.238000001758337;0
6230;-742317.590999998152256;-1043059.730999998748302;0
5643;-743428.701999999582767;-1043689.872999999672174;0
3348;-743960.361000001430511;-1043015.629999998956919;0
5667;-743417.361999999731779;-1043712.557000000029802;0
5042;-742731.719000000506639;-1042890.517000000923872;0
4203;-742299.442000001668930;-1043608.692000001668930;0
4427;-742190.519999999552965;-1043099.440000001341105;0
4963;-742396.510000001639128;-1043031.829999998211861;0
6143;-742309.690999999642372;-1043060.385000001639128;0
6229;-742318.326000001281500;-1043061.204999998211861;0
5451;-743276.109000001102686;-1043331.000999998301268;0
4520;-742651.079999998211861;-1042798.449999999254942;0
1597;-742338.000000000000000;-1045064.000000000000000;0
7348;-742537.370000001043081;-1045173.839999999850988;0
6180;-742311.429000001400709;-1043057.635999999940395;0
4781;-742926.519000001251698;-1042695.502999998629093;0
2523;-742181.000000000000000;-1044140.000000000000000;0
598;-741853.000000000000000;-1043233.000000000000000;0
7162;-743075.840999998152256;-1044541.596000000834465;0
623;-742254.000000000000000;-1043325.000000000000000;0
4792;-743051.280000001192093;-1042654.962999999523163;0
6206;-742314.043000001460314;-1043058.028999999165535;0
4007;-743275.230999998748302;-1044049.184999998658895;0
5636;-743427.432000000029802;-1043681.359999999403954;0
6172;-742317.552999999374151;-1043068.875999998301268;0
1223;-742190.000000000000000;-1044277.000000000000000;0
3958;-743416.328000001609325;-1043572.265999998897314;0
6165;-742315.407000001519918;-1043066.436000000685453;0
6996;-743116.699999999254942;-1044476.469999998807907;0
4837;-742979.105999998748302;-1042672.627999998629093;0
4594;-742555.890999998897314;-1042650.090999998152256;0
676;-742442.000000000000000;-1043196.000000000000000;0
502;-741901.000000000000000;-1043169.000000000000000;0
5167;-743219.324999999254942;-1043405.249000001698732;0
5640;-743428.425000000745058;-1043686.254000000655651;0
4117;-742733.614999998360872;-1044043.129999998956919;0
6225;-742314.519999999552965;-1043055.927000001072884;0
3839;-743112.140000000596046;-1042558.280000001192093;0
3944;-743390.002000000327826;-1043413.532999999821186;0
6228;-742319.103999998420477;-1043062.592000000178814;0
6140;-742311.999000001698732;-1043064.638999998569489;0
7289;-742812.159000001847744;-1044811.989999998360872;0
4890;-742605.287000000476837;-1042838.535000000149012;0
7024;-743182.745000001043081;-1044052.815000001341105;0
310;-742696.000000000000000;-1044162.000000000000000;0
3414;-743757.269999999552965;-1043051.379999998956919;0
4841;-742989.993999999016523;-1042765.850999999791384;0
216;-743023.000000000000000;-1043539.000000000000000;0
3368;-743901.462000001221895;-1043012.500999998301268;0
4743;-742812.449999999254942;-1042729.609999999403954;0
5023;-742588.899000000208616;-1042870.296999998390675;0
5656;-743429.752999998629093;-1043705.570000000298023;0
5595;-743416.488000001758337;-1043680.118999999016523;0
5581;-743409.978999998420477;-1043638.324000000953674;0
7020;-743104.175000000745058;-1044078.344999998807907;0
4658;-742804.655000001192093;-1042456.622000001370907;0
6164;-742316.155999999493361;-1043067.784000001847744;0
323;-742711.000000000000000;-1044140.000000000000000;0
985;-741823.000000000000000;-1044444.000000000000000;0
467;-741757.000000000000000;-1043352.000000000000000;0
7021;-743129.019999999552965;-1044076.230000000447035;0
4814;-743000.489999998360872;-1042803.920000001788139;0
3750;-743221.379999998956919;-1042925.429999999701977;0
7985;-741091.269999999552965;-1044419.039999999105930;0
6356;-741962.699999999254942;-1042712.320000000298023;0
6282;-742308.337999999523163;-1043045.984000001102686;0
1495;-741215.000000000000000;-1044324.000000000000000;0
5675;-743407.907999999821186;-1043716.054999999701977;0
5682;-743399.638000000268221;-1043719.120999999344349;0
1813;-743118.000000000000000;-1044528.000000000000000;0
629;-742200.000000000000000;-1043289.000000000000000;0
6192;-742317.252000000327826;-1043065.394999999552965;0
6148;-742313.410999998450279;-1043065.666999999433756;0
4691;-742693.760000001639128;-1042596.969999998807907;0
4148;-742631.269999999552965;-1043885.870000001043081;0
5657;-743429.199999999254942;-1043706.837999999523163;0
4776;-742909.276000000536442;-1042820.587000001221895;0
7516;-742248.390000000596046;-1044368.907999999821186;0
4800;-742990.043000001460314;-1042700.708000000566244;0
4139;-742859.625999998301268;-1044000.574999999254942;0
6188;-742312.807999998331070;-1043058.706999998539686;0
3324;-743935.892000000923872;-1042963.829999998211861;0
4961;-742309.460000000894070;-1043010.730000000447035;0
6130;-742312.136999998241663;-1043066.344000000506639;0
6167;-742313.859999999403954;-1043063.607000000774860;0
515;-742176.000000000000000;-1043121.000000000000000;0
628;-742217.370000001043081;-1043308.559999998658895;0
692;-742292.000000000000000;-1043084.000000000000000;0
1545;-742236.000000000000000;-1044234.000000000000000;0
1599;-742237.000000000000000;-1044977.000000000000000;0
5447;-743129.958999998867512;-1043365.166000001132488;0
5711;-743422.837999999523163;-1043640.131000000983477;0
457;-741732.000000000000000;-1043333.000000000000000;0
507;-741953.000000000000000;-1043148.000000000000000;0
2408;-742369.000000000000000;-1045125.000000000000000;0
799;-741822.000000000000000;-1042573.000000000000000;0
6147;-742314.177000001072884;-1043067.070999998599291;0
6126;-743428.385999999940395;-1043621.800000000745058;0
4751;-742791.629999998956919;-1042751.460000000894070;0
4753;-742764.600000001490116;-1042761.899999998509884;0
4473;-741822.449999999254942;-1042676.699000000953674;0
5691;-743415.714000001549721;-1043637.241000000387430;0
5196;-743199.263000000268221;-1043326.401000000536442;0
6156;-742314.791999999433756;-1043066.736000001430511;0
2545;-741723.000000000000000;-1044265.000000000000000;0
6153;-742309.583999998867512;-1043058.640999998897314;0
622;-742271.000000000000000;-1043302.000000000000000;0
6649;-741731.100000001490116;-1044094.850000001490116;0
7694;-742486.548999998718500;-1045129.752000000327826;0
498;-741801.000000000000000;-1043199.000000000000000;0
6152;-742310.348999999463558;-1043060.046999998390675;0
5515;-743426.960000000894070;-1043612.083999998867512;0
6208;-742320.098000001162291;-1043067.458999998867512;0
5663;-743422.087999999523163;-1043710.807999998331070;0
2284;-742901.000000000000000;-1045502.000000000000000;0
7246;-742736.730000000447035;-1044825.399999998509884;0
5699;-743416.657000001519918;-1043631.932999998331070;0
5718;-743420.888999998569489;-1043629.666999999433756;0
5594;-743417.704999998211861;-1043680.022999998182058;0
4674;-742806.475999999791384;-1042703.594999998807907;0
4723;-742883.429999999701977;-1042644.829999998211861;0
5730;-743418.855999998748302;-1043638.949000000953674;0
4521;-742681.440000001341105;-1042792.960000000894070;0
1555;-741196.000000000000000;-1044374.000000000000000;0
1550;-741356.000000000000000;-1044363.000000000000000;0
6611;-741711.614000000059605;-1043979.263999998569489;0
4763;-742847.094000000506639;-1042842.671000000089407;0
8260;-742091.730000000447035;-1042690.769999999552965;0
5662;-743423.271000001579523;-1043710.372000001370907;0
6233;-742319.057000000029802;-1043072.162999998778105;0
3789;-743137.469999998807907;-1042933.670000001788139;0
6216;-742313.892000000923872;-1043056.272999998182058;0
5734;-743412.366999998688698;-1043688.041999999433756;0
4944;-742430.605999998748302;-1043013.879000000655651;0
6132;-742310.590999998152256;-1043063.552999999374151;0
6250;-742374.638999998569489;-1043047.576999999582767;0
4650;-742749.989000000059605;-1042534.539999999105930;0
6242;-742366.677999999374151;-1043062.949000000953674;0
674;-742463.000000000000000;-1043211.000000000000000;0
1445;-741553.000000000000000;-1044757.000000000000000;0
4593;-742510.820000000298023;-1042652.203999999910593;0
1187;-741805.000000000000000;-1044071.000000000000000;0
1118;-741807.000000000000000;-1044459.000000000000000;0
1469;-741752.000000000000000;-1044100.000000000000000;0
4665;-742824.410000000149012;-1042592.260000001639128;0
462;-741707.000000000000000;-1043294.000000000000000;0
261;-743429.000000000000000;-1043723.000000000000000;0
6199;-742319.442000001668930;-1043067.822999998927116;0
6295;-742653.399999998509884;-1042696.070000000298023;0
4663;-742820.800000000745058;-1042560.039999999105930;0
4220;-742214.344999998807907;-1043580.359999999403954;0
5136;-742992.278000000864267;-1043472.440000001341105;0
7704;-742256.021000001579523;-1044313.592999998480082;0
3846;-743149.390000000596046;-1042549.600000001490116;0
5138;-743030.936000000685453;-1043483.587999999523163;0
6277;-742304.633999999612570;-1043024.256000000983477;0
4755;-742734.960000000894070;-1042778.019999999552965;0
1333;-741781.000000000000000;-1044777.000000000000000;0
308;-742754.000000000000000;-1044149.000000000000000;0
5668;-743416.179999999701977;-1043712.995000001043081;0
6272;-742325.379000000655651;-1043017.383000001311302;0
