OID_;X;Y;TEMPERATURE
3752;-743213.949999999254942;-1042902.719999998807907;0
3614;-744984.548999998718500;-1042283.640999998897314;0
7;-743479.000000000000000;-1042567.000000000000000;0
5790;-743521.019999999552965;-1042064.280000001192093;0
1486;-741150.000000000000000;-1044219.000000000000000;0
381;-742465.000000000000000;-1043700.000000000000000;0
3578;-744924.046000000089407;-1042547.359000001102686;0
4334;-742384.170000001788139;-1043468.820000000298023;0
3233;-744152.962999999523163;-1042686.791999999433756;0
1269;-742246.000000000000000;-1044462.000000000000000;0
7410;-743525.730000000447035;-1045377.420000001788139;0
6705;-742279.050999999046326;-1044655.923000000417233;0
2155;-742797.000000000000000;-1045124.000000000000000;0
8043;-742180.050000000745058;-1044750.160000000149012;0
3923;-743845.660000000149012;-1043512.260000001639128;0
3917;-743967.182999998331070;-1043516.284000001847744;0
4072;-742934.225000001490116;-1043833.899999998509884;0
3750;-743221.379999998956919;-1042925.429999999701977;0
2211;-743248.000000000000000;-1045258.000000000000000;0
2059;-742625.000000000000000;-1044459.000000000000000;0
2809;-744090.649999998509884;-1043371.184000000357628;0
2194;-743448.000000000000000;-1045193.000000000000000;0
6870;-741708.260000001639128;-1045321.590999998152256;0
3310;-743829.561999998986721;-1042854.063000001013279;0
7018;-742577.747000001370907;-1044239.712999999523163;0
5252;-743283.517000000923872;-1043176.197999998927116;0
1520;-741777.000000000000000;-1043939.000000000000000;0
7935;-743156.000000000000000;-1045071.149999998509884;0
2072;-743043.000000000000000;-1044743.000000000000000;0
2049;-743499.000000000000000;-1045071.000000000000000;0
6946;-742974.765000000596046;-1043929.388000000268221;0
2024;-743305.000000000000000;-1045000.000000000000000;0
7118;-743468.750000000000000;-1044677.690000001341105;0
1669;-741077.000000000000000;-1044092.000000000000000;0
1587;-742372.000000000000000;-1044806.000000000000000;0
2016;-743230.000000000000000;-1044873.000000000000000;0
2036;-743404.000000000000000;-1044803.000000000000000;0
8267;-742240.420000001788139;-1042709.160000000149012;0
1040;-741904.000000000000000;-1044623.000000000000000;0
6699;-742301.118999999016523;-1044484.282999999821186;0
7176;-742630.820000000298023;-1044585.809999998658895;0
201;-743229.000000000000000;-1043614.000000000000000;0
3018;-744443.368000000715256;-1042805.962000001221895;0
7003;-743074.140000000596046;-1044350.280000001192093;0
7147;-742827.925000000745058;-1044451.385000001639128;0
3065;-744092.028999999165535;-1042868.519000001251698;0
6647;-741767.690000001341105;-1044068.160000000149012;0
7284;-742811.789999999105930;-1044718.210000000894070;0
1628;-742449.000000000000000;-1044494.000000000000000;0
3033;-744483.675000000745058;-1042733.627000000327826;0
1879;-743302.000000000000000;-1044264.000000000000000;0
4222;-742187.096999999135733;-1043485.890000000596046;0
5324;-743025.329999998211861;-1043045.789999999105930;0
525;-742233.000000000000000;-1043884.000000000000000;0
4026;-743178.984999999403954;-1043847.989999998360872;0
1246;-742120.000000000000000;-1044570.000000000000000;0
2536;-742003.000000000000000;-1044113.000000000000000;0
4331;-742391.967999998480082;-1043310.539000000804663;0
7706;-742313.239999998360872;-1044319.611999999731779;96
5993;-743947.829999998211861;-1042646.350000001490116;0
1815;-743083.000000000000000;-1044478.000000000000000;0
1524;-741710.000000000000000;-1043844.000000000000000;0
1612;-742429.000000000000000;-1044425.000000000000000;0
345;-742559.000000000000000;-1043826.000000000000000;0
7216;-742500.129999998956919;-1044564.390000000596046;0
1622;-742495.000000000000000;-1044321.000000000000000;0
3153;-743993.857999999076128;-1042576.355000000447035;0
380;-742501.000000000000000;-1043722.000000000000000;0
4845;-742978.655999999493361;-1042776.048000000417233;0
1699;-741435.000000000000000;-1044671.000000000000000;0
4089;-742812.844999998807907;-1043560.114999998360872;0
6568;-741292.100000001490116;-1044161.670000001788139;0
7260;-742953.010000001639128;-1044873.530000001192093;0
2166;-743016.000000000000000;-1045179.000000000000000;0
5295;-743047.995000001043081;-1043185.530000001192093;0
8285;-742232.780000001192093;-1042821.149999998509884;0
23;-743544.000000000000000;-1042505.000000000000000;0
5204;-743246.423999998718500;-1043308.298999998718500;0
2265;-742972.000000000000000;-1045774.000000000000000;0
3784;-743187.730000000447035;-1042922.429999999701977;0
1422;-742199.000000000000000;-1044127.000000000000000;0
4175;-742721.254999998956919;-1043775.890000000596046;0
5069;-742829.063999999314547;-1043280.938000001013279;0
7153;-742889.646999999880791;-1044547.438000001013279;0
6532;-741593.359999999403954;-1044141.059999998658895;0
1723;-741611.000000000000000;-1045092.000000000000000;0
728;-741997.000000000000000;-1042918.000000000000000;0
6008;-743902.607000000774860;-1042749.771000001579523;0
2133;-743040.000000000000000;-1045127.000000000000000;0
2319;-742734.000000000000000;-1045474.000000000000000;0
1775;-741246.000000000000000;-1044012.000000000000000;0
1453;-741525.000000000000000;-1044529.000000000000000;0
4807;-743122.570000000298023;-1042767.850000001490116;0
8122;-742826.149999998509884;-1045713.260000001639128;0
3465;-745090.089999999850988;-1042676.664999999105930;0
7166;-742741.322000000625849;-1044519.208999998867512;0
2891;-744029.914000000804663;-1043200.478000000119209;0
7197;-742570.949000000953674;-1044895.548999998718500;0
3988;-743309.704999998211861;-1044008.570000000298023;0
398;-742372.000000000000000;-1043909.000000000000000;0
6704;-742282.179999999701977;-1044623.793999999761581;0
6650;-741714.296999998390675;-1044110.177000001072884;0
2308;-742345.000000000000000;-1045499.000000000000000;0
2240;-743343.000000000000000;-1045290.000000000000000;0
3848;-743094.383999999612570;-1042505.245000001043081;0
2498;-741906.000000000000000;-1044040.000000000000000;0
1852;-742739.000000000000000;-1044210.000000000000000;0
1989;-743481.000000000000000;-1044876.000000000000000;0
4070;-742925.285000000149012;-1043783.565000001341105;0
1222;-742157.000000000000000;-1044266.000000000000000;0
6092;-742001.309999998658895;-1043482.089999999850988;0
1223;-742190.000000000000000;-1044277.000000000000000;0
1095;-741452.000000000000000;-1044553.000000000000000;0
1055;-741747.000000000000000;-1045038.000000000000000;0
2085;-742426.000000000000000;-1044797.000000000000000;0
4931;-742449.300000000745058;-1042791.403000000864267;0
735;-741910.000000000000000;-1043014.000000000000000;0
6560;-741301.682000000029802;-1043959.640000000596046;0
2440;-742596.000000000000000;-1044193.000000000000000;0
3207;-743687.458999998867512;-1042502.859000001102686;0
1822;-742986.199999999254942;-1044211.969999998807907;0
2321;-742679.000000000000000;-1045480.000000000000000;0
7183;-742606.379999998956919;-1044692.969999998807907;0
1242;-742137.000000000000000;-1044481.000000000000000;0
1312;-741659.000000000000000;-1044848.000000000000000;0
210;-743112.000000000000000;-1043566.000000000000000;0
3342;-743922.624000001698732;-1043077.261999998241663;0
8075;-742072.149999998509884;-1045261.399999998509884;0
7661;-742294.495999999344349;-1045349.482000000774860;0
1013;-742076.000000000000000;-1044595.000000000000000;0
226;-742879.000000000000000;-1043516.000000000000000;0
3700;-744597.480999998748302;-1042518.239999998360872;0
2480;-741251.739999998360872;-1044639.480000000447035;0
2285;-742897.000000000000000;-1045467.000000000000000;0
6193;-742316.486000001430511;-1043063.991000000387430;0
3412;-743772.947000000625849;-1043053.557999998331070;0
4573;-742341.550000000745058;-1042629.699999999254942;0
6511;-741291.670000001788139;-1044319.690000001341105;0
6746;-742405.083999998867512;-1044259.199999999254942;0
6791;-741047.329999998211861;-1044765.467999998480082;0
389;-742408.000000000000000;-1043783.000000000000000;0
693;-742284.000000000000000;-1043062.000000000000000;0
3833;-743029.679999999701977;-1042612.300000000745058;0
5246;-743373.739999998360872;-1043268.899999998509884;0
840;-742067.000000000000000;-1042522.000000000000000;0
1732;-741840.000000000000000;-1045226.000000000000000;0
3108;-743768.699999999254942;-1042671.241999998688698;0
4203;-742299.442000001668930;-1043608.692000001668930;0
1707;-741196.219999998807907;-1044702.390000000596046;0
6269;-742337.300000000745058;-1043018.486000001430511;0
1330;-741817.000000000000000;-1044709.000000000000000;0
612;-742064.000000000000000;-1043270.000000000000000;0
4770;-742872.535000000149012;-1042899.679000001400709;0
5283;-743032.892000000923872;-1043284.399000000208616;0
1867;-743474.000000000000000;-1044257.000000000000000;0
5715;-743423.747000001370907;-1043633.157999999821186;0
6689;-742384.449999999254942;-1045033.609999999403954;0
5167;-743219.324999999254942;-1043405.249000001698732;0
2228;-743044.000000000000000;-1045502.000000000000000;0
2403;-742211.000000000000000;-1045436.000000000000000;0
3836;-743096.070000000298023;-1042561.879999998956919;0
7025;-743199.914999999105930;-1044070.515000000596046;26
6820;-741224.105999998748302;-1044799.311999998986721;0
1326;-741927.000000000000000;-1044976.000000000000000;0
4154;-742544.524999998509884;-1044048.190000001341105;0
5706;-743417.688999999314547;-1043638.852000001817942;0
3978;-743342.695000000298023;-1043756.835000000894070;0
7011;-742831.309999998658895;-1044257.245000001043081;0
1432;-741958.000000000000000;-1044285.000000000000000;0
5411;-742776.079999998211861;-1042905.300000000745058;0
7678;-742388.550999999046326;-1045109.184000000357628;0
3995;-743393.225000001490116;-1043973.719999998807907;0
4987;-742641.745000001043081;-1043011.309999998658895;0
1437;-741840.000000000000000;-1044336.000000000000000;0
2399;-742121.000000000000000;-1045372.000000000000000;0
1385;-742194.000000000000000;-1044974.000000000000000;0
1751;-742046.000000000000000;-1045235.000000000000000;0
545;-742337.000000000000000;-1043805.000000000000000;0
8018;-741974.039999999105930;-1044442.870000001043081;0
641;-742008.000000000000000;-1043304.000000000000000;0
6828;-741465.309999998658895;-1044768.940000001341105;0
4034;-743295.410000000149012;-1043786.070000000298023;0
502;-741901.000000000000000;-1043169.000000000000000;0
3965;-743388.850000001490116;-1043528.160000000149012;0
7963;-741608.199999999254942;-1044329.510000001639128;0
2256;-743156.000000000000000;-1045353.000000000000000;0
1093;-741494.000000000000000;-1044548.000000000000000;0
1116;-741125.980000000447035;-1044610.410000000149012;0
1008;-741962.000000000000000;-1044568.000000000000000;0
1426;-742056.000000000000000;-1044228.000000000000000;0
3801;-743091.350000001490116;-1042882.719999998807907;0
1556;-741195.000000000000000;-1044344.000000000000000;0
2217;-743112.000000000000000;-1045360.000000000000000;0
1215;-742091.000000000000000;-1044365.000000000000000;0
4784;-742945.712999999523163;-1042685.611999999731779;0
3348;-743960.361000001430511;-1043015.629999998956919;0
4198;-742192.445000000298023;-1043760.521000001579523;0
1046;-741838.000000000000000;-1044805.000000000000000;0
629;-742200.000000000000000;-1043289.000000000000000;0
4097;-742806.000000000000000;-1043874.793999999761581;0
2007;-743231.000000000000000;-1044741.000000000000000;0
6508;-741728.552999999374151;-1044508.050999999046326;0
7347;-742557.690000001341105;-1045177.440000001341105;0
575;-742053.000000000000000;-1043541.000000000000000;0
5064;-742811.537999998778105;-1043238.886999998241663;0
4745;-742840.800000000745058;-1042742.120000001043081;0
1518;-741994.000000000000000;-1044011.000000000000000;0
6221;-742317.633000001311302;-1043061.541000001132488;0
7032;-743301.464999999850988;-1044106.190000001341105;0
3537;-744632.945000000298023;-1042671.657000001519918;0
236;-743459.000000000000000;-1043775.000000000000000;0
6197;-742313.425000000745058;-1043058.370999999344349;0
888;-741994.000000000000000;-1042797.000000000000000;0
4610;-742548.888000000268221;-1042601.879000000655651;0
4650;-742749.989000000059605;-1042534.539999999105930;0
7160;-743028.010999999940395;-1044543.267999999225140;0
5306;-743103.326999999582767;-1043193.129000000655651;0
825;-742171.000000000000000;-1042598.000000000000000;0
6952;-743044.730999998748302;-1044106.129999998956919;0
3264;-743565.725000001490116;-1042729.024999998509884;0
4074;-742943.350000001490116;-1043880.304999999701977;0
4707;-742743.519999999552965;-1042600.359999999403954;0
4031;-743135.774000000208616;-1043769.622000001370907;0
7208;-742560.289999999105930;-1045023.789999999105930;0
1491;-741057.000000000000000;-1044333.000000000000000;0
4429;-742222.260000001639128;-1043102.250000000000000;0
875;-741783.000000000000000;-1042677.000000000000000;0
1449;-741533.000000000000000;-1044684.000000000000000;0
2257;-742956.000000000000000;-1045558.000000000000000;0
4678;-742775.910000000149012;-1042839.929999999701977;0
4131;-742844.625000000000000;-1044059.980000000447035;0
6105;-742213.883000001311302;-1043111.734000001102686;0
4238;-742440.263000000268221;-1043528.236000001430511;0
2052;-743403.000000000000000;-1045075.000000000000000;0
6217;-742320.725999999791384;-1043067.133999999612570;0
332;-742645.000000000000000;-1044014.000000000000000;0
3305;-743801.410000000149012;-1042874.962999999523163;0
1918;-743377.000000000000000;-1044428.000000000000000;0
1032;-741970.000000000000000;-1044813.000000000000000;0
1124;-741715.000000000000000;-1044452.000000000000000;0
6993;-743172.409000001847744;-1044501.339000001549721;0
785;-741702.000000000000000;-1042622.000000000000000;0
1943;-743264.000000000000000;-1044421.000000000000000;0
458;-741726.000000000000000;-1043324.000000000000000;0
5779;-742907.197999998927116;-1043414.096999999135733;0
4246;-742193.159000001847744;-1043412.537000000476837;0
6675;-742272.140000000596046;-1044167.469999998807907;0
7090;-743353.289999999105930;-1044571.760000001639128;0
205;-743173.000000000000000;-1043599.000000000000000;0
5144;-743052.642000000923872;-1043488.940000001341105;0
6696;-742332.717000000178814;-1044815.649999998509884;0
510;-742048.000000000000000;-1043150.000000000000000;373
516;-742160.000000000000000;-1043135.000000000000000;0
1031;-741973.000000000000000;-1044784.000000000000000;0
2297;-742650.000000000000000;-1045402.000000000000000;0
327;-742687.000000000000000;-1044082.000000000000000;0
5325;-742997.480000000447035;-1043042.289999999105930;0
876;-741953.000000000000000;-1042636.000000000000000;0
1395;-741799.000000000000000;-1044291.000000000000000;0
1926;-743301.000000000000000;-1044321.000000000000000;0
6003;-742038.201000001281500;-1043299.010999999940395;0
1890;-743522.000000000000000;-1044402.000000000000000;0
1164;-741055.000000000000000;-1044515.000000000000000;0
3804;-743040.109999999403954;-1042895.410000000149012;0
3868;-742432.381000000983477;-1042412.094000000506639;0
1591;-742378.000000000000000;-1044910.000000000000000;0
338;-742602.000000000000000;-1043933.000000000000000;0
4025;-743202.881000000983477;-1043852.008000001311302;0
5461;-742442.704999998211861;-1043234.515000000596046;0
2476;-741234.809999998658895;-1044506.690000001341105;0
3265;-743560.760000001639128;-1042741.429000001400709;0
883;-741802.000000000000000;-1042773.000000000000000;0
5418;-742434.890000000596046;-1042864.780000001192093;0
204;-743208.000000000000000;-1043588.000000000000000;0
4572;-742343.539999999105930;-1042598.289999999105930;0
6243;-742367.739999998360872;-1043061.098000001162291;0
4084;-742817.504999998956919;-1043681.475000001490116;0
678;-742421.000000000000000;-1043181.000000000000000;0
4740;-742757.410000000149012;-1042715.589999999850988;0
1501;-741475.000000000000000;-1044292.000000000000000;0
1140;-741475.000000000000000;-1044461.000000000000000;0
5705;-743417.603000000119209;-1043637.098000001162291;0
4743;-742812.449999999254942;-1042729.609999999403954;0
1419;-741603.000000000000000;-1044410.000000000000000;0
1572;-742265.000000000000000;-1044184.000000000000000;0
6857;-741503.982999999076128;-1044930.340999998152256;0
5724;-743422.230999998748302;-1043632.715999998152256;0
1960;-743386.000000000000000;-1044623.000000000000000;0
2307;-742371.000000000000000;-1045477.000000000000000;0
517;-742207.000000000000000;-1043117.000000000000000;0
4561;-742458.059999998658895;-1042497.190000001341105;0
6191;-742318.017000000923872;-1043066.800999999046326;0
1726;-741516.000000000000000;-1045120.000000000000000;0
722;-742139.000000000000000;-1043009.000000000000000;0
6658;-741538.879999998956919;-1044165.440000001341105;0
3286;-743679.592999998480082;-1042870.787000000476837;0
1442;-741753.000000000000000;-1044375.000000000000000;0
1194;-741721.000000000000000;-1043955.000000000000000;0
6751;-742426.350000001490116;-1044371.070000000298023;0
8271;-742030.649999998509884;-1042720.129999998956919;0
2565;-741043.000000000000000;-1044424.000000000000000;0
534;-742087.000000000000000;-1043699.000000000000000;130
3522;-744830.425000000745058;-1042686.690000001341105;0
6166;-742314.649999998509884;-1043065.006999999284744;0
5956;-742960.690999999642372;-1043513.846999999135733;0
2160;-742849.000000000000000;-1045147.000000000000000;0
4978;-742491.822999998927116;-1043028.688000001013279;0
2325;-742559.000000000000000;-1045494.000000000000000;0
4322;-742266.414000000804663;-1043213.907999999821186;0
4636;-742576.870999999344349;-1042687.116999998688698;0
3994;-743394.864000000059605;-1043949.813999999314547;0
984;-741917.000000000000000;-1044411.000000000000000;0
1307;-741803.000000000000000;-1044663.000000000000000;0
6355;-741920.949999999254942;-1042700.510000001639128;0
5371;-742052.149999998509884;-1043011.940000001341105;0
2275;-742845.000000000000000;-1045719.000000000000000;0
6769;-741281.120000001043081;-1044417.780000001192093;0
5108;-742876.219999998807907;-1043431.129999998956919;0
4819;-742941.910000000149012;-1042776.670000001788139;0
3396;-743905.006000000983477;-1043084.449999999254942;0
4955;-742383.649999998509884;-1043019.250000000000000;0
4057;-743132.184999998658895;-1043648.719999998807907;0
1871;-743440.000000000000000;-1044260.000000000000000;0
4425;-742208.820000000298023;-1043035.230000000447035;0
2557;-741318.000000000000000;-1044384.000000000000000;0
1860;-743472.000000000000000;-1044155.000000000000000;0
1599;-742237.000000000000000;-1044977.000000000000000;0
3322;-743927.326000001281500;-1042934.425999999046326;0
847;-742155.000000000000000;-1042504.000000000000000;0
696;-742077.000000000000000;-1042913.000000000000000;0
1932;-743359.000000000000000;-1044408.000000000000000;0
4892;-742663.079999998211861;-1042817.344999998807907;0
4896;-742589.649999998509884;-1042838.989999998360872;0
5187;-743086.927000001072884;-1043435.230999998748302;0
4257;-742056.467000000178814;-1043503.657999999821186;0
2309;-742322.000000000000000;-1045519.000000000000000;0
3946;-743397.693999998271465;-1043460.780999999493361;0
1374;-742155.000000000000000;-1044854.000000000000000;0
705;-741929.000000000000000;-1042865.000000000000000;0
7136;-742914.329999998211861;-1044374.469999998807907;0
1963;-743410.000000000000000;-1044689.000000000000000;0
4464;-742182.309999998658895;-1042571.379999998956919;0
8281;-742164.160000000149012;-1042778.140000000596046;0
4906;-742448.370000001043081;-1042815.789999999105930;0
1383;-742077.000000000000000;-1045046.000000000000000;0
7245;-742748.780000001192093;-1044837.699999999254942;0
6128;-742313.668999999761581;-1043069.186000000685453;0
5117;-742816.081999998539686;-1043298.302999999374151;0
5447;-743129.958999998867512;-1043365.166000001132488;0
744;-741666.000000000000000;-1042994.000000000000000;0
1797;-743098.000000000000000;-1044099.000000000000000;0
2889;-744074.103999998420477;-1043194.559999998658895;0
1546;-742219.000000000000000;-1044147.000000000000000;0
169;-743433.000000000000000;-1043334.000000000000000;0
8057;-742238.839999999850988;-1045047.489999998360872;0
6962;-743011.489999998360872;-1044196.070000000298023;0
6695;-742306.234000001102686;-1044816.138999998569489;0
1147;-741346.000000000000000;-1044466.000000000000000;0
2149;-742819.000000000000000;-1045024.000000000000000;0
5226;-743310.730000000447035;-1043553.269999999552965;0
4128;-742915.039999999105930;-1044041.920000001788139;0
4958;-742349.620000001043081;-1043004.539999999105930;0
7233;-742606.750000000000000;-1044827.379999998956919;0
6353;-741893.070000000298023;-1042697.059999998658895;0
3769;-742978.969999998807907;-1042975.300000000745058;0
570;-742098.000000000000000;-1043582.000000000000000;0
4067;-742913.594999998807907;-1043714.640000000596046;0
1482;-741289.000000000000000;-1044232.000000000000000;0
7656;-742290.328000001609325;-1045294.499000001698732;0
8069;-742226.440000001341105;-1045255.949999999254942;0
4168;-742423.695000000298023;-1043984.135000001639128;0
4514;-742555.050000000745058;-1042761.809999998658895;0
524;-742255.000000000000000;-1043913.000000000000000;0
6352;-741906.920000001788139;-1042710.609999999403954;0
5214;-743307.671999998390675;-1043376.414000000804663;0
600;-741840.000000000000000;-1043212.000000000000000;0
3534;-744667.721000000834465;-1042664.578000001609325;0
2328;-742459.000000000000000;-1045505.000000000000000;0
5577;-743409.385999999940395;-1043630.826999999582767;0
4829;-743051.579999998211861;-1042916.609999999403954;0
1367;-742137.000000000000000;-1044959.000000000000000;0
6607;-741674.456000000238419;-1043925.333999998867512;0
808;-741921.000000000000000;-1042542.000000000000000;0
2043;-743471.000000000000000;-1044959.000000000000000;0
4071;-742929.394999999552965;-1043807.585000000894070;0
4780;-742928.596000000834465;-1042747.480000000447035;0
7677;-742383.142000000923872;-1045124.221000000834465;0
6403;-741971.879999998956919;-1042504.289999999105930;0
5504;-743428.977000001817942;-1043686.274000000208616;0
7203;-742571.300000000745058;-1044963.219999998807907;0
3392;-743913.699999999254942;-1043165.480000000447035;0
464;-741713.000000000000000;-1043286.000000000000000;0
6174;-742316.021999999880791;-1043066.065000001341105;0
5;-743466.000000000000000;-1042616.000000000000000;0
1351;-741850.000000000000000;-1044830.000000000000000;0
5413;-742651.872000001370907;-1042662.627999998629093;0
827;-742218.000000000000000;-1042626.000000000000000;0
3794;-743091.015000000596046;-1042800.471999999135733;0
1827;-743033.000000000000000;-1044080.000000000000000;0
1327;-742001.000000000000000;-1045024.000000000000000;0
5923;-742953.765000000596046;-1043015.067999999970198;0
4736;-742701.269999999552965;-1042690.000000000000000;0
6252;-742378.052000001072884;-1043040.958000000566244;0
1369;-742029.000000000000000;-1044788.000000000000000;0
1695;-741550.000000000000000;-1044656.000000000000000;0
584;-741980.000000000000000;-1043396.000000000000000;0
2206;-743125.000000000000000;-1045327.000000000000000;0
7039;-743335.785000000149012;-1044169.030000001192093;0
6855;-741501.394999999552965;-1045027.784000001847744;0
648;-742246.000000000000000;-1043363.000000000000000;0
7154;-742908.467000000178814;-1044547.784000001847744;0
6189;-742312.041999999433756;-1043057.302000001072884;0
553;-742251.000000000000000;-1043741.000000000000000;0
8049;-742198.890000000596046;-1044891.600000001490116;0
7004;-743069.289999999105930;-1044326.469999998807907;0
5745;-743415.129000000655651;-1043695.054000001400709;0
2348;-742615.000000000000000;-1045550.000000000000000;0
328;-742670.000000000000000;-1044072.000000000000000;0
8053;-742224.410000000149012;-1044970.879999998956919;0
4518;-742623.960000000894070;-1042786.719999998807907;0
1344;-741750.000000000000000;-1044808.000000000000000;0
838;-742043.000000000000000;-1042524.000000000000000;0
7994;-741529.219999998807907;-1045148.010000001639128;0
5668;-743416.179999999701977;-1043712.995000001043081;0
3810;-743261.510000001639128;-1042802.960000000894070;0
5684;-743397.274000000208616;-1043719.995999999344349;0
4638;-742553.631999999284744;-1042542.028000000864267;0
4592;-742448.190999999642372;-1042642.517999999225140;0
1070;-741665.000000000000000;-1044736.000000000000000;0
1319;-741788.000000000000000;-1044905.000000000000000;0
753;-741692.000000000000000;-1042713.000000000000000;0
7148;-742828.445000000298023;-1044472.094999998807907;0
7985;-741091.269999999552965;-1044419.039999999105930;0
6834;-741594.763000000268221;-1044922.236000001430511;0
1038;-741956.000000000000000;-1044977.000000000000000;0
4980;-742521.857999999076128;-1043030.853000000119209;0
1323;-741859.000000000000000;-1044941.000000000000000;0
2346;-742654.000000000000000;-1045546.000000000000000;0
4235;-742390.041999999433756;-1043492.094999998807907;0
1382;-742096.000000000000000;-1045023.000000000000000;0
346;-742540.000000000000000;-1043816.000000000000000;0
5710;-743421.574999999254942;-1043640.598000001162291;0
1470;-741728.000000000000000;-1044116.000000000000000;0
5000;-742542.798000000417233;-1042978.486999999731779;0
6944;-742927.063000001013279;-1043928.673000000417233;0
1324;-741943.000000000000000;-1044994.000000000000000;0
5284;-743041.022999998182058;-1043277.397999998182058;0
4948;-742386.929999999701977;-1042992.239999998360872;0
4989;-742648.756000000983477;-1043019.318999998271465;0
6103;-742213.102000001817942;-1043103.528999999165535;0
4726;-742863.519999999552965;-1042684.000000000000000;0
4674;-742806.475999999791384;-1042703.594999998807907;0
6146;-742314.942000001668930;-1043068.475999999791384;0
691;-742293.000000000000000;-1043097.000000000000000;0
5694;-743417.339999999850988;-1043640.361000001430511;0
3885;-742418.339999999850988;-1042442.059999998658895;0
7042;-743396.980000000447035;-1044078.954999998211861;0
7258;-742917.370000001043081;-1044865.420000001788139;0
6213;-742316.227000001817942;-1043060.478999998420477;0
695;-742207.000000000000000;-1043019.000000000000000;0
6294;-742653.550000000745058;-1042686.140000000596046;0
4136;-742726.225000001490116;-1044089.829999998211861;0
4477;-741858.039999999105930;-1042692.129999998956919;0
4788;-742970.409000001847744;-1042588.238000001758337;0
4566;-742473.846000000834465;-1042545.780000001192093;0
4949;-742369.969999998807907;-1042973.199999999254942;0
3598;-744894.750000000000000;-1042560.583999998867512;0
520;-742225.000000000000000;-1043127.000000000000000;0
303;-742895.000000000000000;-1044116.000000000000000;0
6250;-742374.638999998569489;-1043047.576999999582767;0
5596;-743415.271999999880791;-1043680.212999999523163;0
3378;-743818.598999999463558;-1042922.491999998688698;0
4243;-742194.050000000745058;-1043431.899999998509884;0
1224;-742174.000000000000000;-1044253.000000000000000;0
7537;-742722.660000000149012;-1045361.410000000149012;0
1551;-741353.000000000000000;-1044326.000000000000000;0
3295;-743595.543000001460314;-1042827.322000000625849;0
8019;-741972.039999999105930;-1044557.089999999850988;0
5638;-743428.245000001043081;-1043683.840999998152256;0
1092;-741549.000000000000000;-1044556.000000000000000;0
4727;-742869.390000000596046;-1042700.829999998211861;0
585;-741960.000000000000000;-1043413.000000000000000;0
4953;-742431.500999998301268;-1043027.399999998509884;0
4739;-742751.690000001341105;-1042699.230000000447035;0
4735;-742686.059999998658895;-1042669.260000001639128;0
7660;-742321.396999999880791;-1045335.578999999910593;0
4890;-742605.287000000476837;-1042838.535000000149012;0
1555;-741196.000000000000000;-1044374.000000000000000;0
4944;-742430.605999998748302;-1043013.879000000655651;0
6276;-742310.815999999642372;-1043016.000999998301268;0
2468;-742947.000000000000000;-1045187.000000000000000;0
702;-741961.000000000000000;-1042885.000000000000000;0
2134;-743028.000000000000000;-1045111.000000000000000;0
6185;-742315.103999998420477;-1043062.923000000417233;0
6230;-742317.590999998152256;-1043059.730999998748302;0
711;-741828.000000000000000;-1042860.000000000000000;0
3980;-743339.260000001639128;-1043798.940000001341105;0
5168;-743228.796000000089407;-1043420.092000000178814;0
5166;-743202.493000000715256;-1043412.614999998360872;0
731;-741925.000000000000000;-1042997.000000000000000;0
