OID_;X;Y;TEMPERATURE
7077;-743564.359000001102686;-1045385.210000000894070;0
5995;-744441.440999999642372;-1042779.568999998271465;0
3679;-744571.809999998658895;-1042497.875999998301268;0
3527;-744805.695999998599291;-1042671.809000000357628;0
3538;-744616.304000001400709;-1042656.734000001102686;0
3537;-744632.945000000298023;-1042671.657000001519918;0
3585;-744920.065000001341105;-1042522.129999998956919;0
3460;-744993.289000000804663;-1042693.587000001221895;0
3466;-745113.802000001072884;-1042675.725000001490116;0
3612;-744996.545000001788139;-1042292.646000001579523;0
2889;-744074.103999998420477;-1043194.559999998658895;0
2264;-742977.000000000000000;-1045745.000000000000000;0
2209;-743309.000000000000000;-1045217.000000000000000;0
2248;-743201.000000000000000;-1045423.000000000000000;0
4088;-742812.114999998360872;-1043580.475000001490116;0
7798;-743468.929999999701977;-1045091.809999998658895;0
7147;-742827.925000000745058;-1044451.385000001639128;0
2467;-743434.000000000000000;-1044742.000000000000000;0
6822;-741283.870000001043081;-1044793.059999998658895;0
2222;-743058.000000000000000;-1045420.000000000000000;0
94;-744054.000000000000000;-1042934.000000000000000;0
4069;-742920.684999998658895;-1043755.420000001788139;0
745;-741649.000000000000000;-1042968.000000000000000;0
4236;-742406.842999998480082;-1043504.015000000596046;0
3796;-743161.100000001490116;-1042834.149999998509884;0
5;-743466.000000000000000;-1042616.000000000000000;0
2498;-741906.000000000000000;-1044040.000000000000000;0
3847;-743122.146999999880791;-1042525.489999998360872;0
2346;-742654.000000000000000;-1045546.000000000000000;0
398;-742372.000000000000000;-1043909.000000000000000;0
2147;-742828.000000000000000;-1044984.000000000000000;0
7801;-742459.168999999761581;-1044490.660000000149012;0
4770;-742872.535000000149012;-1042899.679000001400709;0
333;-742651.000000000000000;-1043996.000000000000000;0
2276;-742865.000000000000000;-1045649.000000000000000;0
4078;-742842.960000000894070;-1043832.824999999254942;0
2758;-743919.949999999254942;-1043488.059999998658895;0
1382;-742096.000000000000000;-1045023.000000000000000;0
2354;-742452.000000000000000;-1045584.000000000000000;0
1920;-743384.000000000000000;-1044363.000000000000000;0
4063;-742855.079999998211861;-1043654.695000000298023;0
7259;-742935.280000001192093;-1044869.829999998211861;0
1878;-743324.000000000000000;-1044249.000000000000000;0
1822;-742986.199999999254942;-1044211.969999998807907;0
2103;-743182.000000000000000;-1044931.000000000000000;0
6943;-742902.013999998569489;-1043932.647999998182058;0
526;-742209.000000000000000;-1043849.000000000000000;83
87;-743857.000000000000000;-1043557.000000000000000;0
845;-742126.000000000000000;-1042505.000000000000000;0
4582;-742390.164999999105930;-1042606.546000000089407;0
2894;-743960.129000000655651;-1043216.409000001847744;0
513;-742083.000000000000000;-1043145.000000000000000;0
4055;-743119.070000000298023;-1043694.109999999403954;0
307;-742781.000000000000000;-1044143.000000000000000;0
4214;-742229.274999998509884;-1043511.745000001043081;0
1960;-743386.000000000000000;-1044623.000000000000000;0
2696;-743477.489999998360872;-1042038.000000000000000;0
5791;-743256.583000000566244;-1043571.184000000357628;0
4144;-742704.414999999105930;-1043822.484999999403954;0
3214;-743628.813000001013279;-1042457.677000001072884;0
3750;-743221.379999998956919;-1042925.429999999701977;0
6015;-742854.607999999076128;-1043226.870999999344349;0
6312;-743933.359999999403954;-1042580.719999998807907;0
1586;-742372.000000000000000;-1044785.000000000000000;0
2361;-742323.000000000000000;-1045576.000000000000000;0
1620;-742439.000000000000000;-1044323.000000000000000;0
4459;-742274.829999998211861;-1042644.269999999552965;0
110;-744127.000000000000000;-1042724.000000000000000;3
2387;-742118.000000000000000;-1045443.000000000000000;0
2210;-743280.000000000000000;-1045237.000000000000000;0
1257;-742070.000000000000000;-1044815.000000000000000;0
6952;-743044.730999998748302;-1044106.129999998956919;0
466;-741743.000000000000000;-1043331.000000000000000;0
2189;-743472.000000000000000;-1045183.000000000000000;0
4333;-742428.420000001788139;-1043255.609999999403954;0
2334;-742872.000000000000000;-1045519.000000000000000;0
1229;-742244.000000000000000;-1044253.000000000000000;0
3355;-743953.881000000983477;-1043031.379999998956919;0
1945;-743270.000000000000000;-1044454.000000000000000;0
1027;-741984.000000000000000;-1044660.000000000000000;0
3090;-743913.418999999761581;-1042804.416999999433756;0
2458;-741019.000000000000000;-1044567.000000000000000;0
1523;-741679.000000000000000;-1043865.000000000000000;0
6651;-741697.910000000149012;-1044123.329999998211861;0
608;-741955.000000000000000;-1043274.000000000000000;0
6946;-742974.765000000596046;-1043929.388000000268221;0
6843;-741569.070000000298023;-1044975.261999998241663;0
1559;-741190.000000000000000;-1044242.000000000000000;0
5325;-742997.480000000447035;-1043042.289999999105930;0
4035;-743274.690000001341105;-1043779.739999998360872;0
2301;-742533.000000000000000;-1045416.000000000000000;0
7183;-742606.379999998956919;-1044692.969999998807907;0
5139;-743032.489999998360872;-1043533.679999999701977;0
1049;-741795.000000000000000;-1044923.000000000000000;0
9;-743512.000000000000000;-1042512.000000000000000;133
2440;-742596.000000000000000;-1044193.000000000000000;0
347;-742542.000000000000000;-1043795.000000000000000;0
1695;-741550.000000000000000;-1044656.000000000000000;0
1059;-741637.000000000000000;-1045095.000000000000000;0
6875;-741808.350000001490116;-1045257.269999999552965;0
1034;-741964.000000000000000;-1044876.000000000000000;0
1727;-741495.000000000000000;-1045103.000000000000000;0
4660;-742801.596999999135733;-1042487.965999998152256;0
2535;-742042.000000000000000;-1044071.000000000000000;0
3313;-743774.447000000625849;-1042903.081999998539686;0
982;-741992.000000000000000;-1044416.000000000000000;0
1513;-741852.000000000000000;-1044118.000000000000000;0
2160;-742849.000000000000000;-1045147.000000000000000;0
7201;-742571.190000001341105;-1044939.320000000298023;0
7165;-742711.789999999105930;-1044504.984999999403954;0
1270;-742242.000000000000000;-1044491.000000000000000;0
8080;-741989.600000001490116;-1045310.420000001788139;0
696;-742077.000000000000000;-1042913.000000000000000;0
3994;-743394.864000000059605;-1043949.813999999314547;0
6805;-741109.710000000894070;-1044689.170000001788139;0
7015;-742554.570000000298023;-1044360.725000001490116;0
2516;-742500.000000000000000;-1044414.000000000000000;0
6492;-742174.054000001400709;-1044455.534000001847744;0
4180;-742368.370000001043081;-1044115.471999999135733;0
1249;-742097.000000000000000;-1044649.000000000000000;0
2574;-742481.000000000000000;-1045423.000000000000000;0
1458;-741506.000000000000000;-1044384.000000000000000;0
8283;-742198.600000001490116;-1042801.980000000447035;0
4826;-743043.850000001490116;-1042979.600000001490116;0
3412;-743772.947000000625849;-1043053.557999998331070;0
1473;-741642.000000000000000;-1044158.000000000000000;0
1454;-741521.000000000000000;-1044499.000000000000000;0
547;-742316.910000000149012;-1043790.309999998658895;0
2487;-742101.000000000000000;-1044308.000000000000000;0
6116;-742963.905999999493361;-1042886.313000001013279;0
2230;-742996.000000000000000;-1045551.000000000000000;0
6202;-742317.124000001698732;-1043063.651999998837709;0
6977;-743098.949999999254942;-1044459.879999998956919;0
7649;-742319.399999998509884;-1045429.557000000029802;0
6686;-742381.967000000178814;-1044961.747000001370907;0
796;-741771.000000000000000;-1042592.000000000000000;0
624;-742241.000000000000000;-1043343.000000000000000;0
2008;-743242.000000000000000;-1044759.000000000000000;0
4305;-742520.295000001788139;-1043993.065000001341105;0
1532;-741805.000000000000000;-1043858.000000000000000;0
8068;-742254.309999998658895;-1045265.969999998807907;0
1322;-741906.000000000000000;-1044975.000000000000000;0
3785;-743172.449999999254942;-1042923.850000001490116;0
1099;-741376.000000000000000;-1044563.000000000000000;0
4606;-742512.769000001251698;-1042608.333000000566244;0
1395;-741799.000000000000000;-1044291.000000000000000;0
1546;-742219.000000000000000;-1044147.000000000000000;0
6721;-742321.052999999374151;-1044705.548000000417233;0
6826;-741405.300000000745058;-1044777.199999999254942;0
5778;-742917.131000000983477;-1043419.723000001162291;0
1535;-741873.000000000000000;-1043913.000000000000000;0
1432;-741958.000000000000000;-1044285.000000000000000;0
4021;-743293.295000001788139;-1043876.995000001043081;0
6127;-742314.456000000238419;-1043070.548999998718500;0
3820;-743111.699999999254942;-1042659.320000000298023;0
7142;-742872.445000000298023;-1044472.239999998360872;0
1702;-741348.000000000000000;-1044682.000000000000000;0
709;-741861.000000000000000;-1042862.000000000000000;0
2133;-743040.000000000000000;-1045127.000000000000000;0
1477;-741482.750000000000000;-1044212.480000000447035;0
1237;-742144.000000000000000;-1044365.000000000000000;0
2093;-742915.000000000000000;-1044642.000000000000000;0
995;-741906.000000000000000;-1044434.000000000000000;0
5214;-743307.671999998390675;-1043376.414000000804663;0
6092;-742001.309999998658895;-1043482.089999999850988;0
3111;-743727.034000001847744;-1042625.182999998331070;0
7516;-742248.390000000596046;-1044368.907999999821186;0
6170;-742311.548000000417233;-1043059.381000000983477;0
3810;-743261.510000001639128;-1042802.960000000894070;145
3269;-743600.679000001400709;-1042731.660000000149012;0
7979;-741161.500000000000000;-1044398.210000000894070;0
4902;-742480.460000000894070;-1042802.989999998360872;0
2503;-742753.000000000000000;-1045484.000000000000000;0
1268;-742046.000000000000000;-1045021.000000000000000;0
4538;-742291.464000001549721;-1042734.344000000506639;0
4922;-742443.129999998956919;-1042886.510000001639128;0
7031;-743301.824999999254942;-1044080.774999998509884;0
502;-741901.000000000000000;-1043169.000000000000000;0
1086;-741659.000000000000000;-1044542.000000000000000;0
1020;-742293.000000000000000;-1044615.000000000000000;0
7362;-743205.807000000029802;-1045156.089999999850988;0
1892;-743525.000000000000000;-1044425.000000000000000;0
4903;-742493.579999998211861;-1042816.620000001043081;0
1425;-742080.000000000000000;-1044210.000000000000000;0
1012;-742060.000000000000000;-1044582.000000000000000;0
6246;-742370.552999999374151;-1043055.625999998301268;0
7282;-742809.410000000149012;-1044693.629999998956919;0
6606;-741654.631999999284744;-1043906.848000001162291;0
7218;-742534.100000001490116;-1044603.559999998658895;0
1939;-743269.000000000000000;-1044355.000000000000000;0
4895;-742596.936999998986721;-1042829.168000001460314;0
4141;-742804.644999999552965;-1044008.964999999850988;0
4892;-742663.079999998211861;-1042817.344999998807907;0
6978;-743090.239999998360872;-1044436.379999998956919;0
5250;-743328.995000001043081;-1043178.495000001043081;0
4560;-742427.079999998211861;-1042500.829999998211861;0
1424;-742134.000000000000000;-1044171.000000000000000;0
4777;-742910.034000001847744;-1042759.350999999791384;0
1953;-743344.000000000000000;-1044500.000000000000000;0
7740;-742301.949999999254942;-1045061.239000000059605;0
7008;-742899.559999998658895;-1044224.074999999254942;0
1552;-741351.000000000000000;-1044295.000000000000000;0
510;-742048.000000000000000;-1043150.000000000000000;0
3950;-743426.829999998211861;-1043556.070000000298023;0
4508;-742449.140000000596046;-1042725.980000000447035;0
5303;-743164.818999998271465;-1043211.078000001609325;0
8049;-742198.890000000596046;-1044891.600000001490116;0
1973;-743394.000000000000000;-1044931.000000000000000;0
7950;-741950.460000000894070;-1044150.710000000894070;0
2446;-742750.000000000000000;-1044164.000000000000000;0
4630;-742646.271999999880791;-1042652.089999999850988;0
6366;-741957.399999998509884;-1042652.609999999403954;0
885;-741739.000000000000000;-1042777.000000000000000;0
4966;-742377.289999999105930;-1043071.030000001192093;0
1289;-742211.000000000000000;-1044521.000000000000000;0
926;-741894.000000000000000;-1042999.000000000000000;0
4532;-742760.140000000596046;-1042899.600000001490116;0
6493;-742196.574000000953674;-1044452.076999999582767;0
672;-742484.000000000000000;-1043226.000000000000000;0
1043;-741872.000000000000000;-1044711.000000000000000;0
381;-742465.000000000000000;-1043700.000000000000000;0
6167;-742313.859999999403954;-1043063.607000000774860;0
2478;-741241.859999999403954;-1044562.089999999850988;0
2141;-742897.000000000000000;-1045094.000000000000000;0
1182;-741915.000000000000000;-1044252.000000000000000;0
4817;-742967.460000000894070;-1042782.559999998658895;0
670;-742502.000000000000000;-1043239.000000000000000;0
4781;-742926.519000001251698;-1042695.502999998629093;0
5718;-743420.888999998569489;-1043629.666999999433756;0
352;-742386.000000000000000;-1043914.000000000000000;0
8265;-742197.820000000298023;-1042704.260000001639128;0
7200;-742561.710999999195337;-1044911.469999998807907;0
4210;-742178.550000000745058;-1043586.035000000149012;0
4072;-742934.225000001490116;-1043833.899999998509884;0
6140;-742311.999000001698732;-1043064.638999998569489;0
5409;-743745.201000001281500;-1042902.750000000000000;0
725;-741983.000000000000000;-1042939.000000000000000;0
6039;-742085.370000001043081;-1043669.620999999344349;0
892;-742946.000000000000000;-1042607.000000000000000;0
7694;-742486.548999998718500;-1045129.752000000327826;0
2502;-742750.000000000000000;-1045457.000000000000000;0
4173;-742756.320000000298023;-1043749.629999998956919;0
4310;-742031.800000000745058;-1043475.199999999254942;0
1674;-741099.000000000000000;-1044736.000000000000000;0
90;-744040.000000000000000;-1043095.000000000000000;0
6197;-742313.425000000745058;-1043058.370999999344349;0
3276;-743673.931000001728535;-1042836.190999999642372;0
378;-742514.000000000000000;-1043703.000000000000000;0
6510;-741721.960000000894070;-1044461.815000001341105;0
4676;-742792.579999998211861;-1042771.519999999552965;0
5293;-743043.969999998807907;-1043208.554000001400709;0
7047;-743395.495000001043081;-1044210.765000000596046;0
1380;-742156.000000000000000;-1044947.000000000000000;0
6195;-742314.956000000238419;-1043061.181000001728535;0
220;-742969.000000000000000;-1043530.000000000000000;0
4156;-742513.734999999403954;-1043978.035000000149012;0
2451;-742884.000000000000000;-1044134.000000000000000;0
4849;-742966.960000000894070;-1042893.583999998867512;0
601;-741823.000000000000000;-1043224.000000000000000;0
4223;-742161.556000001728535;-1043473.138999998569489;0
7024;-743182.745000001043081;-1044052.815000001341105;0
694;-742280.000000000000000;-1043043.000000000000000;0
3323;-743934.361999999731779;-1042945.002999998629093;0
4975;-742477.829999998211861;-1043016.923000000417233;0
4705;-742714.100000001490116;-1042599.829999998211861;0
7960;-741633.300000000745058;-1044301.980000000447035;0
7986;-741040.829999998211861;-1044408.250000000000000;0
6260;-742377.692999999970198;-1043022.434000000357628;0
759;-741659.000000000000000;-1042650.000000000000000;0
4804;-743020.045000001788139;-1042704.315999999642372;0
4956;-742383.579999998211861;-1043007.739999998360872;0
4669;-742823.199999999254942;-1042658.309999998658895;0
6132;-742310.590999998152256;-1043063.552999999374151;0
7044;-743400.635000001639128;-1044135.579999998211861;0
1005;-741944.000000000000000;-1044583.000000000000000;0
5966;-742483.469999998807907;-1043066.721999999135733;0
4952;-742318.899999998509884;-1042915.589999999850988;0
338;-742602.000000000000000;-1043933.000000000000000;0
6000;-741980.750000000000000;-1043285.629999998956919;0
2740;-744042.611999999731779;-1043335.940000001341105;0
4030;-743133.280000001192093;-1043791.552000001072884;0
4031;-743135.774000000208616;-1043769.622000001370907;0
632;-742130.000000000000000;-1043287.000000000000000;0
7745;-742933.037000000476837;-1045523.714999999850988;0
808;-741921.000000000000000;-1042542.000000000000000;0
4425;-742208.820000000298023;-1043035.230000000447035;0
1169;-741813.000000000000000;-1044376.000000000000000;0
8073;-742120.640000000596046;-1045259.500000000000000;0
1449;-741533.000000000000000;-1044684.000000000000000;0
2080;-742685.000000000000000;-1044460.000000000000000;0
1372;-742118.000000000000000;-1044815.000000000000000;0
557;-742213.000000000000000;-1043713.000000000000000;0
5309;-743033.405000001192093;-1043187.043999999761581;0
7043;-743398.899999998509884;-1044106.629999998956919;0
7190;-742577.989999998360872;-1044771.690000001341105;0
2435;-742452.000000000000000;-1044222.000000000000000;0
1041;-741893.000000000000000;-1044653.000000000000000;0
1160;-741114.859999999403954;-1044508.120000001043081;0
2150;-742812.000000000000000;-1045054.000000000000000;0
248;-743439.000000000000000;-1043748.000000000000000;0
4948;-742386.929999999701977;-1042992.239999998360872;0
33;-743464.000000000000000;-1042652.000000000000000;0
6501;-741689.493000000715256;-1044942.905000001192093;0
874;-741755.000000000000000;-1042675.000000000000000;0
4696;-742682.817000001668930;-1042658.543999999761581;0
908;-742211.000000000000000;-1042501.000000000000000;0
1648;-741373.000000000000000;-1044431.000000000000000;0
5955;-742960.732999999076128;-1043520.888999998569489;0
2158;-742781.000000000000000;-1045197.000000000000000;0
6302;-741814.370000001043081;-1042743.910000000149012;0
6171;-742310.780999999493361;-1043057.971000000834465;0
8273;-742057.820000000298023;-1042728.760000001639128;0
6696;-742332.717000000178814;-1044815.649999998509884;0
7252;-742775.109999999403954;-1044855.940000001341105;0
6976;-743107.829999998211861;-1044483.399999998509884;0
6511;-741291.670000001788139;-1044319.690000001341105;0
7288;-742817.019999999552965;-1044773.399999998509884;0
4328;-742347.322000000625849;-1043375.796999998390675;0
1780;-741214.000000000000000;-1043934.000000000000000;0
5001;-742560.092999998480082;-1042966.206999998539686;0
846;-742175.000000000000000;-1042517.000000000000000;0
191;-743424.000000000000000;-1043599.000000000000000;0
5015;-742575.741000000387430;-1043008.607999999076128;0
6282;-742308.337999999523163;-1043045.984000001102686;0
4824;-742918.673000000417233;-1042871.875000000000000;0
4107;-742652.458999998867512;-1043744.934000000357628;0
4998;-742514.109000001102686;-1042978.602000001817942;0
5128;-743040.467000000178814;-1043389.765999998897314;0
393;-742384.000000000000000;-1043819.000000000000000;0
7004;-743069.289999999105930;-1044326.469999998807907;0
6485;-741795.653999999165535;-1044513.458000000566244;0
6244;-742368.587000001221895;-1043059.245999999344349;0
4167;-742438.315000001341105;-1044021.960000000894070;0
4953;-742431.500999998301268;-1043027.399999998509884;0
817;-741937.000000000000000;-1042586.000000000000000;0
1308;-741589.000000000000000;-1044811.000000000000000;0
2152;-742814.000000000000000;-1045106.000000000000000;0
2431;-742498.000000000000000;-1045094.000000000000000;0
4899;-742534.420000001788139;-1042820.899999998509884;0
6308;-741823.129999998956919;-1042770.370000001043081;0
4169;-742414.420000001788139;-1043962.329999998211861;0
5243;-743357.622000001370907;-1043407.258999999612570;0
4924;-742427.890999998897314;-1042890.581000000238419;0
2526;-741087.000000000000000;-1044616.000000000000000;0
5226;-743310.730000000447035;-1043553.269999999552965;0
1993;-743483.000000000000000;-1044984.000000000000000;0
1343;-741714.000000000000000;-1044765.000000000000000;0
5447;-743129.958999998867512;-1043365.166000001132488;0
1342;-741721.000000000000000;-1044783.000000000000000;0
3846;-743149.390000000596046;-1042549.600000001490116;0
5048;-742867.500000000000000;-1043381.899999998509884;0
1764;-741163.000000000000000;-1044144.000000000000000;0
386;-742457.000000000000000;-1043786.000000000000000;0
206;-743179.000000000000000;-1043581.000000000000000;0
5087;-742847.622999999672174;-1043250.081000000238419;0
2108;-743147.000000000000000;-1045086.000000000000000;0
4555;-742337.140000000596046;-1042512.379999998956919;0
1459;-741491.000000000000000;-1044340.000000000000000;0
6374;-741977.035000000149012;-1042674.153999999165535;0
6573;-741294.089999999850988;-1044091.679999999701977;0
1151;-741279.000000000000000;-1044475.000000000000000;0
5156;-743160.188999999314547;-1043355.291999999433756;0
4841;-742989.993999999016523;-1042765.850999999791384;0
5510;-743424.346000000834465;-1043626.458999998867512;0
7962;-741640.190000001341105;-1044316.800000000745058;0
3094;-743906.500000000000000;-1042759.554999999701977;0
4424;-742225.300000000745058;-1043033.250000000000000;0
6144;-742308.925000000745058;-1043059.002000000327826;0
881;-741806.000000000000000;-1042815.000000000000000;0
1336;-741737.000000000000000;-1044860.000000000000000;0
7021;-743129.019999999552965;-1044076.230000000447035;0
1617;-742384.000000000000000;-1044407.000000000000000;0
4134;-742772.309999998658895;-1044078.870000001043081;0
555;-742230.000000000000000;-1043726.000000000000000;0
1966;-743413.000000000000000;-1044746.000000000000000;0
7048;-743392.429999999701977;-1044236.170000001788139;0
2376;-742411.000000000000000;-1045554.000000000000000;0
698;-742041.000000000000000;-1042903.000000000000000;0
843;-742085.000000000000000;-1042507.000000000000000;0
2142;-742883.000000000000000;-1045078.000000000000000;0
6844;-741545.278999999165535;-1044985.256999999284744;0
5316;-743075.980000000447035;-1043041.059999998658895;0
4336;-742416.888999998569489;-1043431.418000001460314;0
4813;-743013.550000000745058;-1042793.390000000596046;0
5069;-742829.063999999314547;-1043280.938000001013279;0
5164;-743173.335000000894070;-1043404.677000001072884;0
4609;-742557.414000000804663;-1042621.583999998867512;0
1860;-743472.000000000000000;-1044155.000000000000000;0
7647;-742319.918000001460314;-1045405.197999998927116;0
4018;-743153.285000000149012;-1043925.850000001490116;0
4964;-742390.059999998658895;-1043044.839999999850988;0
3998;-743432.704999998211861;-1043914.274999998509884;0
5727;-743422.451999999582767;-1043637.473000001162291;0
1138;-741500.000000000000000;-1044458.000000000000000;0
1357;-741935.000000000000000;-1044871.000000000000000;0
873;-741728.000000000000000;-1042672.000000000000000;0
346;-742540.000000000000000;-1043816.000000000000000;0
4638;-742553.631999999284744;-1042542.028000000864267;0
4025;-743202.881000000983477;-1043852.008000001311302;0
6149;-742312.646000001579523;-1043064.261999998241663;0
5252;-743283.517000000923872;-1043176.197999998927116;0
6759;-741016.559999998658895;-1044436.829999998211861;0
6242;-742366.677999999374151;-1043062.949000000953674;0
4798;-743028.991999998688698;-1042693.375000000000000;0
4747;-742866.289999999105930;-1042753.390000000596046;0
614;-742111.000000000000000;-1043271.000000000000000;0
7980;-741198.179999999701977;-1044410.339999999850988;0
740;-741759.000000000000000;-1043031.000000000000000;0
820;-742019.000000000000000;-1042600.000000000000000;0
5258;-743356.739999998360872;-1043230.039999999105930;0
6352;-741906.920000001788139;-1042710.609999999403954;0
4190;-742301.250000000000000;-1044166.100000001490116;0
4428;-742206.750000000000000;-1043097.800000000745058;0
509;-741991.000000000000000;-1043143.000000000000000;0
4656;-742827.763000000268221;-1042494.379999998956919;0
397;-742355.000000000000000;-1043861.000000000000000;0
2308;-742345.000000000000000;-1045499.000000000000000;0
5968;-742288.989000000059605;-1044168.456999998539686;0
2805;-743893.609999999403954;-1043543.980000000447035;0
5637;-743428.151000000536442;-1043682.633999999612570;0
1346;-741769.000000000000000;-1044817.000000000000000;0
277;-743398.000000000000000;-1043928.000000000000000;0
2392;-742057.000000000000000;-1045310.000000000000000;0
2072;-743043.000000000000000;-1044743.000000000000000;0
4898;-742571.280000001192093;-1042840.859999999403954;0
630;-742179.000000000000000;-1043289.000000000000000;0
2457;-741016.000000000000000;-1044542.000000000000000;0
1140;-741475.000000000000000;-1044461.000000000000000;0
4566;-742473.846000000834465;-1042545.780000001192093;0
276;-743382.000000000000000;-1043905.000000000000000;0
1769;-741260.000000000000000;-1044112.000000000000000;0
3980;-743339.260000001639128;-1043798.940000001341105;0
6183;-742316.633999999612570;-1043065.732000000774860;0
4320;-742264.149000000208616;-1043259.541999999433756;0
4507;-742472.469999998807907;-1042720.199999999254942;0
1985;-743478.000000000000000;-1044769.000000000000000;0
3201;-743741.188999999314547;-1042531.719000000506639;0
512;-742063.000000000000000;-1043136.000000000000000;0
4740;-742757.410000000149012;-1042715.589999999850988;0
7202;-742561.410000000149012;-1044949.640000000596046;0
249;-743433.000000000000000;-1043775.000000000000000;0
170;-743440.000000000000000;-1043364.000000000000000;0
5169;-743240.785000000149012;-1043411.081999998539686;0
4925;-742455.502000000327826;-1042923.307000000029802;0
4659;-742803.311000000685453;-1042470.754999998956919;0
6173;-742316.787000000476837;-1043067.471000000834465;0
1757;-742189.000000000000000;-1045219.000000000000000;0
274;-743359.000000000000000;-1043833.000000000000000;0
7250;-742792.079999998211861;-1044844.600000001490116;0
5042;-742731.719000000506639;-1042890.517000000923872;0
5221;-743263.820000000298023;-1043556.920000001788139;0
1323;-741859.000000000000000;-1044941.000000000000000;0
5186;-743270.949999999254942;-1043526.039999999105930;0
5000;-742542.798000000417233;-1042978.486999999731779;0
518;-742194.000000000000000;-1043131.000000000000000;0
4955;-742383.649999998509884;-1043019.250000000000000;0
6136;-742315.081999998539686;-1043070.210000000894070;0
4718;-742933.730000000447035;-1042628.039999999105930;0
1223;-742190.000000000000000;-1044277.000000000000000;0
1499;-741413.000000000000000;-1044304.000000000000000;0
6363;-742027.344999998807907;-1042665.324000000953674;0
6716;-742256.467000000178814;-1044966.368000000715256;0
1368;-741998.000000000000000;-1044779.000000000000000;0
5509;-743425.144999999552965;-1043637.853000000119209;0
1965;-743413.000000000000000;-1044726.000000000000000;0
2558;-741286.000000000000000;-1044387.000000000000000;0
1614;-742388.000000000000000;-1044432.000000000000000;0
7299;-743117.530000001192093;-1045145.859999999403954;0
1986;-743480.000000000000000;-1044794.000000000000000;0
2218;-743091.000000000000000;-1045372.000000000000000;0
4920;-742444.449999999254942;-1042928.980000000447035;0
1590;-742377.000000000000000;-1044885.000000000000000;0
2131;-743073.000000000000000;-1045134.000000000000000;0
5234;-743348.486000001430511;-1043412.741999998688698;0
5792;-743363.984999999403954;-1043442.513999998569489;0
6258;-742382.381999999284744;-1043032.370999999344349;0
1906;-743459.000000000000000;-1044325.000000000000000;0
6184;-742315.868999999016523;-1043064.326999999582767;0
6687;-742383.274000000208616;-1044983.381999999284744;0
1718;-741366.219999998807907;-1044870.989999998360872;0
5207;-743208.434999998658895;-1043365.236999999731779;0
6224;-742315.320000000298023;-1043057.335000000894070;0
7219;-742443.460000000894070;-1044813.000000000000000;0
1141;-741454.000000000000000;-1044453.000000000000000;0
4999;-742534.149999998509884;-1042966.892999999225140;0
1824;-742963.809999998658895;-1044143.929999999701977;0
1452;-741519.000000000000000;-1044574.000000000000000;0
4957;-742366.010000001639128;-1043006.059999998658895;0
4537;-742303.159000001847744;-1042752.293000001460314;0
7943;-742063.449999999254942;-1044055.260000001639128;0
626;-742236.000000000000000;-1043317.000000000000000;0
5941;-742044.835000000894070;-1043561.903999999165535;0
4814;-743000.489999998360872;-1042803.920000001788139;0
692;-742292.000000000000000;-1043084.000000000000000;0
6189;-742312.041999999433756;-1043057.302000001072884;0
1683;-741134.429999999701977;-1044711.329999998211861;0
6997;-743109.160000000149012;-1044453.600000001490116;0
2892;-744005.317000001668930;-1043204.537000000476837;0
7030;-743291.859999999403954;-1044128.440000001341105;0
7034;-743299.725999999791384;-1044153.140000000596046;0
