OID_;X;Y;TEMPERATURE
3614;-744984.548999998718500;-1042283.640999998897314;0
3019;-744463.447999998927116;-1042784.646000001579523;0
3568;-744718.817999999970198;-1042588.614999998360872;0
3692;-744525.876499999314547;-1042540.534000001847744;0
3580;-744924.973999999463558;-1042593.699999999254942;0
2605;-745393.842999998480082;-1042860.796000000089407;0
5975;-745052.346999999135733;-1042674.673000000417233;0
118;-745135.000000000000000;-1042687.000000000000000;0
3542;-744575.274000000208616;-1042656.160000000149012;0
2696;-743477.489999998360872;-1042038.000000000000000;0
2520;-741847.000000000000000;-1045324.000000000000000;0
6872;-741751.719999998807907;-1045296.679999999701977;0
2760;-743863.331000000238419;-1043483.304000001400709;0
2755;-744003.879000000655651;-1043471.734000001102686;0
2404;-742179.000000000000000;-1045467.000000000000000;0
3919;-743904.947000000625849;-1043493.929999999701977;0
3107;-743778.888000000268221;-1042682.131999999284744;0
2740;-744042.611999999731779;-1043335.940000001341105;0
6705;-742279.050999999046326;-1044655.923000000417233;0
6833;-741571.423000000417233;-1044909.473999999463558;0
1486;-741150.000000000000000;-1044219.000000000000000;0
1445;-741553.000000000000000;-1044757.000000000000000;0
1727;-741495.000000000000000;-1045103.000000000000000;0
1411;-741639.480000000447035;-1044683.019999999552965;0
6828;-741465.309999998658895;-1044768.940000001341105;0
7411;-743529.510000001639128;-1045393.140000000596046;0
2079;-742688.000000000000000;-1044428.000000000000000;0
385;-742436.000000000000000;-1043742.000000000000000;0
8079;-742021.839999999850988;-1045292.179999999701977;0
2070;-742993.000000000000000;-1044723.000000000000000;0
2097;-743143.000000000000000;-1044742.000000000000000;0
4156;-742513.734999999403954;-1043978.035000000149012;0
7263;-743009.559999998658895;-1044894.379999998956919;0
383;-742450.000000000000000;-1043722.000000000000000;0
4238;-742440.263000000268221;-1043528.236000001430511;0
7654;-742242.081000000238419;-1045273.263999998569489;0
7008;-742899.559999998658895;-1044224.074999999254942;0
2394;-742273.000000000000000;-1045360.000000000000000;0
2329;-742432.000000000000000;-1045508.000000000000000;0
2160;-742849.000000000000000;-1045147.000000000000000;0
2161;-742876.000000000000000;-1045153.000000000000000;0
8073;-742120.640000000596046;-1045259.500000000000000;0
7141;-742895.629999998956919;-1044470.910000000149012;0
4075;-742947.934999998658895;-1043903.649999998509884;0
7243;-742724.339999999850988;-1044835.870000001043081;0
7947;-742030.969999998807907;-1044096.679999999701977;0
524;-742255.000000000000000;-1043913.000000000000000;96
2326;-742523.000000000000000;-1045498.000000000000000;0
1780;-741214.000000000000000;-1043934.000000000000000;0
738;-741818.000000000000000;-1043024.000000000000000;0
1983;-743474.000000000000000;-1044709.000000000000000;0
1519;-741754.000000000000000;-1043956.000000000000000;0
748;-741671.000000000000000;-1042971.000000000000000;0
110;-744127.000000000000000;-1042724.000000000000000;0
7721;-742941.157000001519918;-1044215.368000000715256;0
7022;-743155.660000000149012;-1044074.410000000149012;0
1764;-741163.000000000000000;-1044144.000000000000000;0
7015;-742554.570000000298023;-1044360.725000001490116;0
735;-741910.000000000000000;-1043014.000000000000000;0
1287;-742217.000000000000000;-1044486.000000000000000;0
6339;-742245.460000000894070;-1042835.780000001192093;0
3310;-743829.561999998986721;-1042854.063000001013279;0
4046;-743205.699999999254942;-1044009.719999998807907;0
514;-742119.000000000000000;-1043141.000000000000000;0
510;-742048.000000000000000;-1043150.000000000000000;0
343;-742575.000000000000000;-1043857.000000000000000;0
847;-742155.000000000000000;-1042504.000000000000000;0
2050;-743460.000000000000000;-1045072.000000000000000;0
2008;-743242.000000000000000;-1044759.000000000000000;0
2018;-743244.000000000000000;-1044909.000000000000000;0
4170;-742407.245000001043081;-1043945.519999999552965;0
394;-742405.000000000000000;-1043863.000000000000000;0
6722;-742357.717000000178814;-1044705.708000000566244;0
2020;-743260.000000000000000;-1044941.000000000000000;0
1561;-743186.000000000000000;-1045098.000000000000000;0
547;-742316.910000000149012;-1043790.309999998658895;0
1251;-742091.000000000000000;-1044690.000000000000000;0
7;-743479.000000000000000;-1042567.000000000000000;0
17;-743587.000000000000000;-1042394.000000000000000;0
1855;-742642.000000000000000;-1044286.000000000000000;0
5303;-743164.818999998271465;-1043211.078000001609325;0
1492;-741096.000000000000000;-1044331.000000000000000;0
4332;-742410.359000001102686;-1043282.916000001132488;0
4124;-742751.265000000596046;-1043878.414999999105930;0
3204;-743715.278999999165535;-1042506.118999999016523;0
6;-743464.000000000000000;-1042594.000000000000000;0
1769;-741260.000000000000000;-1044112.000000000000000;0
2133;-743040.000000000000000;-1045127.000000000000000;0
2151;-742827.000000000000000;-1045047.000000000000000;0
2166;-743016.000000000000000;-1045179.000000000000000;0
7324;-742833.980000000447035;-1044949.109999999403954;0
224;-742904.000000000000000;-1043522.000000000000000;0
4162;-742497.193999998271465;-1044160.030000001192093;0
6746;-742405.083999998867512;-1044259.199999999254942;0
1766;-741257.000000000000000;-1044204.000000000000000;0
1515;-741913.000000000000000;-1044072.000000000000000;0
2447;-742772.000000000000000;-1044159.000000000000000;0
1718;-741366.219999998807907;-1044870.989999998360872;0
1701;-741378.000000000000000;-1044678.000000000000000;0
6700;-742298.611000001430511;-1044507.315999999642372;0
1371;-742089.000000000000000;-1044807.000000000000000;0
7031;-743301.824999999254942;-1044080.774999998509884;0
2235;-743401.000000000000000;-1045221.000000000000000;0
884;-741771.000000000000000;-1042776.000000000000000;0
1013;-742076.000000000000000;-1044595.000000000000000;0
2189;-743472.000000000000000;-1045183.000000000000000;0
4150;-742581.789999999105930;-1044138.429999999701977;0
727;-742001.000000000000000;-1042962.000000000000000;0
1091;-741531.480000000447035;-1044543.440000001341105;0
308;-742754.000000000000000;-1044149.000000000000000;0
6311;-743930.489999998360872;-1042569.390000000596046;0
728;-741997.000000000000000;-1042918.000000000000000;0
3154;-743984.818999998271465;-1042573.844999998807907;0
1982;-743408.000000000000000;-1044646.000000000000000;0
1518;-741994.000000000000000;-1044011.000000000000000;0
3101;-743922.754999998956919;-1042745.195000000298023;0
3264;-743565.725000001490116;-1042729.024999998509884;0
696;-742077.000000000000000;-1042913.000000000000000;0
2212;-743217.000000000000000;-1045279.000000000000000;0
3326;-744036.002000000327826;-1042922.574999999254942;0
2226;-743057.000000000000000;-1045470.000000000000000;0
301;-742613.000000000000000;-1043903.000000000000000;0
4119;-742717.223999999463558;-1043999.837999999523163;0
504;-741937.000000000000000;-1043164.000000000000000;0
6982;-743055.109999999403954;-1044342.629999998956919;0
2043;-743471.000000000000000;-1044959.000000000000000;0
1996;-743484.000000000000000;-1045063.000000000000000;0
7048;-743392.429999999701977;-1044236.170000001788139;0
1695;-741550.000000000000000;-1044656.000000000000000;0
1920;-743384.000000000000000;-1044363.000000000000000;0
3752;-743213.949999999254942;-1042902.719999998807907;0
7212;-742559.410000000149012;-1045073.070000000298023;0
5062;-742798.513999998569489;-1043227.370999999344349;0
2209;-743309.000000000000000;-1045217.000000000000000;0
1991;-743482.000000000000000;-1044929.000000000000000;0
1388;-742152.000000000000000;-1045026.000000000000000;0
1970;-743380.000000000000000;-1044854.000000000000000;0
1381;-742115.000000000000000;-1044999.000000000000000;0
1987;-743480.000000000000000;-1044820.000000000000000;0
3387;-743960.368000000715256;-1043194.717000000178814;0
2255;-743181.000000000000000;-1045372.000000000000000;0
5322;-743060.379999998956919;-1043029.589999999850988;0
7515;-742273.021999999880791;-1044371.543999999761581;0
1652;-741379.000000000000000;-1044550.000000000000000;0
6714;-742287.171000000089407;-1044923.995999999344349;0
2256;-743156.000000000000000;-1045353.000000000000000;0
3233;-744152.962999999523163;-1042686.791999999433756;0
6695;-742306.234000001102686;-1044816.138999998569489;0
4506;-742419.730000000447035;-1042717.019999999552965;0
7776;-743089.784000001847744;-1045773.409000001847744;0
1373;-742143.000000000000000;-1044822.000000000000000;0
6952;-743044.730999998748302;-1044106.129999998956919;0
4184;-742311.379999998956919;-1044164.660000000149012;0
7279;-742799.399999998509884;-1044679.829999998211861;0
2289;-742915.000000000000000;-1045426.000000000000000;0
7957;-741692.839999999850988;-1044277.559999998658895;0
6610;-741694.364999998360872;-1043961.170000001788139;0
1523;-741679.000000000000000;-1043865.000000000000000;0
4232;-742315.057999998331070;-1043428.918999999761581;0
1531;-741782.000000000000000;-1043838.000000000000000;0
4208;-742372.416999999433756;-1043503.423000000417233;0
6686;-742381.967000000178814;-1044961.747000001370907;0
1915;-743468.000000000000000;-1044494.000000000000000;0
1839;-742994.469999998807907;-1044185.679999999701977;0
1603;-742525.000000000000000;-1044922.000000000000000;0
1029;-741978.000000000000000;-1044721.000000000000000;0
2451;-742884.000000000000000;-1044134.000000000000000;0
5240;-743364.164000000804663;-1043254.934000000357628;0
5119;-742850.592999998480082;-1043328.484999999403954;0
4426;-742197.589999999850988;-1043031.679999999701977;0
8150;-743304.219999998807907;-1043217.539999999105930;0
1324;-741943.000000000000000;-1044994.000000000000000;0
2516;-742500.000000000000000;-1044414.000000000000000;0
1931;-743388.000000000000000;-1044409.000000000000000;0
6696;-742332.717000000178814;-1044815.649999998509884;0
1545;-742236.000000000000000;-1044234.000000000000000;0
5434;-744042.467999998480082;-1043135.986999999731779;0
7520;-742808.589999999850988;-1045680.519999999552965;0
1913;-743453.000000000000000;-1044482.000000000000000;0
5135;-742979.611000001430511;-1043468.912999998778105;0
1039;-741914.000000000000000;-1044595.000000000000000;0
7087;-743339.940000001341105;-1044536.690000001341105;0
7350;-742556.390000000596046;-1045185.980000000447035;0
7215;-742484.320000000298023;-1044546.620000001043081;0
757;-741673.000000000000000;-1042678.000000000000000;0
4935;-742447.241999998688698;-1042699.399000000208616;0
2082;-742569.000000000000000;-1044642.000000000000000;0
2417;-742421.000000000000000;-1045135.000000000000000;0
5111;-742892.337999999523163;-1043424.370999999344349;0
8060;-742295.719999998807907;-1045082.859999999403954;0
6473;-741931.359999999403954;-1044555.109999999403954;0
1596;-742323.000000000000000;-1045037.000000000000000;0
1945;-743270.000000000000000;-1044454.000000000000000;0
5142;-743039.870000001043081;-1043473.929999999701977;0
6682;-742329.804000001400709;-1044319.611999999731779;0
1058;-741667.000000000000000;-1045072.000000000000000;0
6791;-741047.329999998211861;-1044765.467999998480082;0
2479;-741247.800000000745058;-1044609.379999998956919;0
571;-742082.000000000000000;-1043581.000000000000000;0
1794;-742151.000000000000000;-1044190.000000000000000;0
5208;-743237.954999998211861;-1043368.065999999642372;0
4827;-743046.359999999403954;-1042958.140000000596046;0
8274;-742065.089999999850988;-1042742.109999999403954;0
5206;-743189.870999999344349;-1043360.936000000685453;0
3846;-743149.390000000596046;-1042549.600000001490116;0
1170;-741893.000000000000000;-1044403.000000000000000;0
1875;-743367.000000000000000;-1044261.000000000000000;0
3839;-743112.140000000596046;-1042558.280000001192093;0
2262;-742999.000000000000000;-1045686.000000000000000;0
4632;-742615.638999998569489;-1042624.039999999105930;0
2887;-744098.480000000447035;-1043192.508000001311302;0
5923;-742953.765000000596046;-1043015.067999999970198;0
531;-742157.000000000000000;-1043778.000000000000000;0
1436;-741869.000000000000000;-1044323.000000000000000;0
2258;-742974.000000000000000;-1045574.000000000000000;0
786;-741706.000000000000000;-1042606.000000000000000;0
4874;-742795.429999999701977;-1042925.910000000149012;0
532;-742114.000000000000000;-1043737.000000000000000;0
1926;-743301.000000000000000;-1044321.000000000000000;0
1333;-741781.000000000000000;-1044777.000000000000000;0
5292;-743055.866000000387430;-1043215.710999999195337;0
819;-741987.000000000000000;-1042599.000000000000000;0
6976;-743107.829999998211861;-1044483.399999998509884;0
330;-742659.000000000000000;-1044043.000000000000000;0
7188;-742583.839999999850988;-1044742.870000001043081;0
599;-741837.000000000000000;-1043243.000000000000000;0
5272;-743000.013999998569489;-1043245.364000000059605;0
841;-742056.000000000000000;-1042508.000000000000000;0
7000;-743096.190000001341105;-1044426.870000001043081;0
3373;-743814.043000001460314;-1043018.168000001460314;0
6488;-741718.210000000894070;-1044532.489999998360872;0
4142;-742777.425000000745058;-1044013.440000001341105;0
8273;-742057.820000000298023;-1042728.760000001639128;0
5412;-742582.037000000476837;-1042571.986000001430511;0
5035;-742658.587999999523163;-1043006.899000000208616;0
6820;-741224.105999998748302;-1044799.311999998986721;0
6975;-743116.140000000596046;-1044506.469999998807907;0
1319;-741788.000000000000000;-1044905.000000000000000;0
6501;-741689.493000000715256;-1044942.905000001192093;0
2484;-741269.109999999403954;-1044779.070000000298023;0
6811;-741110.469999998807907;-1044663.493000000715256;0
4825;-742908.839999999850988;-1042860.670000001788139;0
5283;-743032.892000000923872;-1043284.399000000208616;0
3338;-743968.458999998867512;-1043042.706999998539686;0
4210;-742178.550000000745058;-1043586.035000000149012;0
1264;-742059.000000000000000;-1044942.000000000000000;0
877;-741951.000000000000000;-1042610.000000000000000;0
3350;-743955.140999998897314;-1043006.692000001668930;0
4767;-742786.899999998509884;-1042835.736000001430511;0
1423;-742167.000000000000000;-1044150.000000000000000;0
1131;-741643.000000000000000;-1044433.000000000000000;0
515;-742176.000000000000000;-1043121.000000000000000;0
2344;-742691.000000000000000;-1045541.000000000000000;0
4708;-742755.420000001788139;-1042611.309999998658895;0
1865;-743458.000000000000000;-1044233.000000000000000;0
2299;-742592.000000000000000;-1045409.000000000000000;0
6004;-742061.723000001162291;-1043300.859999999403954;0
639;-741958.000000000000000;-1043294.000000000000000;0
6273;-742321.806000001728535;-1043017.085000000894070;0
4796;-743054.247999999672174;-1042682.918000001460314;0
3314;-743758.675999999046326;-1042905.688999999314547;0
7042;-743396.980000000447035;-1044078.954999998211861;0
4026;-743178.984999999403954;-1043847.989999998360872;0
4055;-743119.070000000298023;-1043694.109999999403954;0
8283;-742198.600000001490116;-1042801.980000000447035;0
682;-742380.000000000000000;-1043151.000000000000000;0
5702;-743417.206000000238419;-1043631.844999998807907;0
4070;-742925.285000000149012;-1043783.565000001341105;0
636;-742160.000000000000000;-1043325.000000000000000;0
280;-743053.000000000000000;-1043875.000000000000000;0
622;-742271.000000000000000;-1043302.000000000000000;0
1352;-741840.000000000000000;-1044854.000000000000000;0
2488;-742083.000000000000000;-1044303.000000000000000;0
1586;-742372.000000000000000;-1044785.000000000000000;0
4067;-742913.594999998807907;-1043714.640000000596046;0
554;-742238.000000000000000;-1043717.000000000000000;0
496;-741768.000000000000000;-1043197.000000000000000;0
2500;-742743.000000000000000;-1045401.000000000000000;0
4342;-742506.473000001162291;-1043301.100000001490116;0
4702;-742669.300000000745058;-1042747.399999998509884;0
6450;-743166.964999999850988;-1043776.383999999612570;0
4130;-742868.460000000894070;-1044055.510000001639128;0
4581;-742391.460000000894070;-1042586.396999999880791;0
5420;-742442.920000001788139;-1042740.519999999552965;0
4562;-742471.000000000000000;-1042510.920000001788139;0
5113;-742946.795000001788139;-1043444.427999999374151;0
1043;-741872.000000000000000;-1044711.000000000000000;0
3426;-743729.493999999016523;-1043061.420000001788139;0
4894;-742610.888999998569489;-1042819.686999998986721;0
4088;-742812.114999998360872;-1043580.475000001490116;0
4574;-742339.980000000447035;-1042661.570000000298023;0
2558;-741286.000000000000000;-1044387.000000000000000;0
6277;-742304.633999999612570;-1043024.256000000983477;0
1610;-742374.000000000000000;-1044447.000000000000000;0
6352;-741906.920000001788139;-1042710.609999999403954;0
6943;-742902.013999998569489;-1043932.647999998182058;0
993;-741977.000000000000000;-1044436.000000000000000;0
6248;-742372.506000000983477;-1043051.769999999552965;0
4844;-742977.256000000983477;-1042754.953000001609325;0
4202;-742285.475999999791384;-1043627.734999999403954;0
3888;-742331.469999998807907;-1042455.429999999701977;0
7651;-742295.381000000983477;-1045479.861999999731779;0
674;-742463.000000000000000;-1043211.000000000000000;0
4023;-743246.635000001639128;-1043864.364999998360872;0
4212;-742205.245000001043081;-1043548.410000000149012;0
5723;-743420.903000000864267;-1043631.703999999910593;0
1238;-742150.000000000000000;-1044384.000000000000000;0
3793;-743101.820000000298023;-1042826.379999998956919;0
6458;-743360.644999999552965;-1043919.311999998986721;0
3798;-743131.500000000000000;-1042848.730000000447035;0
4171;-742796.910000000149012;-1043722.629999998956919;0
7966;-741489.800000000745058;-1044356.219999998807907;0
4105;-742678.771999999880791;-1043769.206000000238419;0
3986;-743313.355000000447035;-1043956.986999999731779;0
7148;-742828.445000000298023;-1044472.094999998807907;0
1164;-741055.000000000000000;-1044515.000000000000000;0
1243;-742122.000000000000000;-1044502.000000000000000;0
1473;-741642.000000000000000;-1044158.000000000000000;0
1607;-742414.000000000000000;-1044379.000000000000000;0
7139;-742919.179999999701977;-1044444.434999998658895;0
578;-742023.000000000000000;-1043464.000000000000000;0
1478;-741443.000000000000000;-1044220.000000000000000;0
1433;-741895.000000000000000;-1044328.000000000000000;0
1190;-741821.000000000000000;-1044110.000000000000000;0
5994;-743358.609999999403954;-1043460.469999998807907;0
5693;-743415.905000001192093;-1043640.377000000327826;0
4798;-743028.991999998688698;-1042693.375000000000000;0
3287;-743711.173999998718500;-1042886.515999998897314;0
6202;-742317.124000001698732;-1043063.651999998837709;0
5023;-742588.899000000208616;-1042870.296999998390675;0
3981;-743341.517000000923872;-1043837.353999998420477;0
6111;-742241.054000001400709;-1043365.475999999791384;0
1439;-741772.000000000000000;-1044379.000000000000000;0
582;-741994.000000000000000;-1043417.000000000000000;0
4476;-741849.620000001043081;-1042690.190000001341105;0
5223;-743283.699999999254942;-1043535.940000001341105;0
5514;-743426.903000000864267;-1043609.252999998629093;0
5736;-743414.859999999403954;-1043691.462999999523163;0
6193;-742316.486000001430511;-1043063.991000000387430;0
6216;-742313.892000000923872;-1043056.272999998182058;0
3750;-743221.379999998956919;-1042925.429999999701977;0
4324;-742269.346000000834465;-1043165.410999998450279;0
943;-742292.000000000000000;-1043017.000000000000000;0
6253;-742378.725000001490116;-1043039.690000001341105;0
1550;-741356.000000000000000;-1044363.000000000000000;0
2357;-742388.000000000000000;-1045577.000000000000000;0
6191;-742318.017000000923872;-1043066.800999999046326;0
5664;-743420.907000001519918;-1043711.245999999344349;0
2559;-741323.000000000000000;-1044399.000000000000000;0
5513;-743426.734999999403954;-1043606.184000000357628;0
5696;-743417.096000000834465;-1043637.135999999940395;0
4931;-742449.300000000745058;-1042791.403000000864267;0
1477;-741482.750000000000000;-1044212.480000000447035;0
2088;-742428.000000000000000;-1044838.000000000000000;0
7154;-742908.467000000178814;-1044547.784000001847744;0
4743;-742812.449999999254942;-1042729.609999999403954;0
5941;-742044.835000000894070;-1043561.903999999165535;0
465;-741728.000000000000000;-1043309.000000000000000;0
5744;-743412.905999999493361;-1043695.221000000834465;0
4663;-742820.800000000745058;-1042560.039999999105930;0
206;-743179.000000000000000;-1043581.000000000000000;0
1406;-741663.000000000000000;-1044277.000000000000000;0
2355;-742465.000000000000000;-1045568.000000000000000;0
1457;-741510.000000000000000;-1044411.000000000000000;0
3950;-743426.829999998211861;-1043556.070000000298023;0
6136;-742315.081999998539686;-1043070.210000000894070;0
826;-742191.000000000000000;-1042616.000000000000000;0
4252;-742124.022999998182058;-1043390.519000001251698;0
2336;-742837.000000000000000;-1045523.000000000000000;0
3811;-743244.620000001043081;-1042809.420000001788139;0
7276;-742801.670000001788139;-1044613.309999998658895;0
4174;-742738.230000000447035;-1043763.155000001192093;0
1358;-741950.000000000000000;-1044887.000000000000000;0
6151;-742311.114999998360872;-1043061.451000001281500;0
6128;-742313.668999999761581;-1043069.186000000685453;0
631;-742153.000000000000000;-1043288.000000000000000;0
6169;-742312.320000000298023;-1043060.791999999433756;0
6278;-742305.421999998390675;-1043028.918000001460314;0
5727;-743422.451999999582767;-1043637.473000001162291;0
7175;-742651.780000001192093;-1044558.149999998509884;0
4675;-742805.809999998658895;-1042785.070000000298023;0
1306;-741783.000000000000000;-1044653.000000000000000;0
690;-742306.000000000000000;-1043081.000000000000000;0
4491;-741872.890000000596046;-1042643.989999998360872;0
5687;-743415.142000000923872;-1043630.285999998450279;0
4849;-742966.960000000894070;-1042893.583999998867512;0
3792;-743110.019999999552965;-1042846.530000001192093;0
1426;-742056.000000000000000;-1044228.000000000000000;0
4074;-742943.350000001490116;-1043880.304999999701977;0
1729;-741449.000000000000000;-1045068.000000000000000;0
4059;-743142.649999998509884;-1043612.730000000447035;0
4322;-742266.414000000804663;-1043213.907999999821186;0
4781;-742926.519000001251698;-1042695.502999998629093;0
6247;-742371.447000000625849;-1043053.739000000059605;0
6699;-742301.118999999016523;-1044484.282999999821186;0
4962;-742387.429999999701977;-1043028.129999998956919;0
3291;-743588.212999999523163;-1042790.916999999433756;0
797;-741796.000000000000000;-1042574.000000000000000;0
6211;-742317.785000000149012;-1043063.318999998271465;0
5515;-743426.960000000894070;-1043612.083999998867512;0
4999;-742534.149999998509884;-1042966.892999999225140;0
4892;-742663.079999998211861;-1042817.344999998807907;0
3955;-743412.653000000864267;-1043555.727000001817942;0
6145;-742315.708000000566244;-1043069.881999999284744;0
4803;-743043.410999998450279;-1042699.506000000983477;0
6272;-742325.379000000655651;-1043017.383000001311302;0
1111;-741167.030000001192093;-1044590.170000001788139;0
2092;-742917.000000000000000;-1044617.000000000000000;0
688;-742284.000000000000000;-1043125.000000000000000;0
6187;-742313.572999998927116;-1043060.111999999731779;0
952;-742274.000000000000000;-1043018.000000000000000;0
4649;-742732.228999998420477;-1042525.100000001490116;0
3832;-743029.390000000596046;-1042595.910000000149012;0
6153;-742309.583999998867512;-1043058.640999998897314;0
5729;-743420.103000000119209;-1043638.901000000536442;0
4779;-742917.822999998927116;-1042727.385000001639128;0
1122;-741749.000000000000000;-1044455.000000000000000;0
6180;-742311.429000001400709;-1043057.635999999940395;0
4957;-742366.010000001639128;-1043006.059999998658895;0
3829;-742992.250000000000000;-1042635.140000000596046;0
3789;-743137.469999998807907;-1042933.670000001788139;0
2562;-741090.000000000000000;-1044404.000000000000000;0
6167;-742313.859999999403954;-1043063.607000000774860;0
4034;-743295.410000000149012;-1043786.070000000298023;0
2083;-742588.000000000000000;-1044663.000000000000000;0
2491;-742059.000000000000000;-1044251.000000000000000;0
1036;-741961.000000000000000;-1044922.000000000000000;0
4955;-742383.649999998509884;-1043019.250000000000000;0
3980;-743339.260000001639128;-1043798.940000001341105;0
4978;-742491.822999998927116;-1043028.688000001013279;0
265;-743344.000000000000000;-1043735.000000000000000;0
5746;-743415.399000000208616;-1043698.644000001251698;0
7508;-742947.440000001341105;-1045540.690000001341105;0
5583;-743410.274999998509884;-1043642.072000000625849;0
5716;-743423.320999998599291;-1043631.197000000625849;0
4666;-742808.710000000894070;-1042576.609999999403954;0
6134;-742309.011999998241663;-1043060.703000001609325;0
5508;-743426.105999998748302;-1043645.960999999195337;0
5580;-743409.831000000238419;-1043636.449000000953674;0
7157;-742964.840999998152256;-1044545.681000001728535;0
709;-741861.000000000000000;-1042862.000000000000000;0
4040;-743224.710000000894070;-1043766.050000000745058;0
4724;-742870.089999999850988;-1042658.210000000894070;0
5694;-743417.339999999850988;-1043640.361000001430511;0
6229;-742318.326000001281500;-1043061.204999998211861;0
6514;-741730.449999999254942;-1044087.109999999403954;0
264;-743367.000000000000000;-1043732.000000000000000;0
4921;-742444.739999998360872;-1042908.420000001788139;0
4063;-742855.079999998211861;-1043654.695000000298023;0
6013;-743372.780000001192093;-1043377.921999998390675;0
6127;-742314.456000000238419;-1043070.548999998718500;0
1400;-741719.000000000000000;-1044132.000000000000000;0
6787;-741242.429999999701977;-1044471.370000001043081;0
3424;-743725.243000000715256;-1043089.951999999582767;0
3843;-743139.170000001788139;-1042650.050000000745058;0
5737;-743412.636999998241663;-1043691.631000000983477;0
4946;-742411.739000000059605;-1043002.199999999254942;0
6267;-742344.767999999225140;-1043019.272999998182058;0
5593;-743418.921000000089407;-1043679.927999999374151;0
6137;-742314.326999999582767;-1043068.837000001221895;0
5680;-743402.000000000000000;-1043718.245000001043081;0
6765;-741163.449999999254942;-1044427.199999999254942;0
4229;-742146.929000001400709;-1043334.585000000894070;0
1589;-742376.000000000000000;-1044861.000000000000000;0
587;-741944.000000000000000;-1043391.000000000000000;0
883;-741802.000000000000000;-1042773.000000000000000;0
5665;-743419.725000001490116;-1043711.682000000029802;0
170;-743440.000000000000000;-1043364.000000000000000;0
4753;-742764.600000001490116;-1042761.899999998509884;0
6201;-742317.888999998569489;-1043065.035000000149012;0
6784;-741318.109999999403954;-1044460.920000001788139;0
5735;-743414.589999999850988;-1043687.874000001698732;0
4668;-742810.210000000894070;-1042618.969999998807907;0
3801;-743091.350000001490116;-1042882.719999998807907;0
3289;-743584.761999998241663;-1042769.188000001013279;0
6172;-742317.552999999374151;-1043068.875999998301268;0
6171;-742310.780999999493361;-1043057.971000000834465;0
4805;-743001.147999998182058;-1042707.644999999552965;0
4464;-742182.309999998658895;-1042571.379999998956919;0
4953;-742431.500999998301268;-1043027.399999998509884;0
6186;-742314.337999999523163;-1043061.517000000923872;0
842;-742101.000000000000000;-1042521.000000000000000;0
464;-741713.000000000000000;-1043286.000000000000000;0
4807;-743122.570000000298023;-1042767.850000001490116;0
6255;-742379.991999998688698;-1043037.068999998271465;0
6857;-741503.982999999076128;-1044930.340999998152256;0
4900;-742508.089999999850988;-1042815.289999999105930;0
3784;-743187.730000000447035;-1042922.429999999701977;0
6504;-741755.193999998271465;-1044619.083000000566244;0
4947;-742399.918000001460314;-1042993.458000000566244;0
1418;-741620.000000000000000;-1044458.000000000000000;0
4906;-742448.370000001043081;-1042815.789999999105930;0
7217;-742516.318999998271465;-1044582.890000000596046;0
7542;-742623.890000000596046;-1045372.899999998509884;0
7179;-742625.429000001400709;-1044622.710000000894070;0
1140;-741475.000000000000000;-1044461.000000000000000;0
6178;-742312.960000000894070;-1043060.445999998599291;0
4570;-742347.760000001639128;-1042540.809999998658895;0
7992;-741480.739999998360872;-1045117.620000001043081;0
4949;-742369.969999998807907;-1042973.199999999254942;0
