OID_;X;Y;TEMPERATURE
3614;-744984.548999998718500;-1042283.640999998897314;0
110;-744127.000000000000000;-1042724.000000000000000;0
3019;-744463.447999998927116;-1042784.646000001579523;0
3568;-744718.817999999970198;-1042588.614999998360872;0
3692;-744525.876499999314547;-1042540.534000001847744;0
3580;-744924.973999999463558;-1042593.699999999254942;0
2605;-745393.842999998480082;-1042860.796000000089407;0
5975;-745052.346999999135733;-1042674.673000000417233;0
884;-741771.000000000000000;-1042776.000000000000000;0
8;-743496.000000000000000;-1042539.000000000000000;0
118;-745135.000000000000000;-1042687.000000000000000;0
6870;-741708.260000001639128;-1045321.590999998152256;0
510;-742048.000000000000000;-1043150.000000000000000;0
2888;-744082.749000001698732;-1043174.458999998867512;22
4334;-742384.170000001788139;-1043468.820000000298023;0
6876;-741825.559999998658895;-1045240.469999998807907;0
6828;-741465.309999998658895;-1044768.940000001341105;0
7911;-743564.839999999850988;-1045408.649999998509884;0
3976;-743088.861000001430511;-1043707.728000000119209;0
3210;-743664.019000001251698;-1042478.668999999761581;0
4086;-742813.079999998211861;-1043631.730000000447035;0
2641;-743432.578999999910593;-1042583.418999999761581;0
4082;-742825.565000001341105;-1043737.364999998360872;0
3542;-744575.274000000208616;-1042656.160000000149012;0
5251;-743317.296000000089407;-1043180.037999998778105;0
7151;-742842.649000000208616;-1044545.307000000029802;0
3752;-743213.949999999254942;-1042902.719999998807907;0
467;-741757.000000000000000;-1043352.000000000000000;0
5961;-742431.225000001490116;-1044003.574999999254942;0
1196;-741677.000000000000000;-1043894.000000000000000;0
1561;-743186.000000000000000;-1045098.000000000000000;0
728;-741997.000000000000000;-1042918.000000000000000;0
1903;-743445.000000000000000;-1044281.000000000000000;0
2073;-743069.000000000000000;-1044754.000000000000000;0
7746;-742234.789999999105930;-1045549.890000000596046;0
7279;-742799.399999998509884;-1044679.829999998211861;0
7146;-742819.425000000745058;-1044426.225000001490116;0
2056;-743436.000000000000000;-1045065.000000000000000;0
502;-741901.000000000000000;-1043169.000000000000000;0
4002;-743397.818999998271465;-1044054.317999999970198;0
6823;-741313.910000000149012;-1044788.510000001639128;0
1141;-741454.000000000000000;-1044453.000000000000000;0
4333;-742428.420000001788139;-1043255.609999999403954;0
2080;-742685.000000000000000;-1044460.000000000000000;0
1486;-741150.000000000000000;-1044219.000000000000000;0
1475;-741565.000000000000000;-1044185.000000000000000;0
399;-742339.000000000000000;-1043884.000000000000000;0
2741;-744016.675000000745058;-1043336.642999999225140;0
1060;-741610.000000000000000;-1045115.000000000000000;0
4080;-742832.480000000447035;-1043782.030000001192093;0
4330;-742377.440999999642372;-1043332.162999998778105;0
7040;-743356.140000000596046;-1044164.359999999403954;0
3922;-743844.574999999254942;-1043491.188999999314547;0
277;-743398.000000000000000;-1043928.000000000000000;0
5265;-743188.572999998927116;-1043226.513999998569489;0
1693;-741613.000000000000000;-1044649.000000000000000;0
7216;-742500.129999998956919;-1044564.390000000596046;0
6728;-742547.451000001281500;-1044392.396000001579523;0
7261;-742970.839999999850988;-1044878.739999998360872;0
1655;-741391.000000000000000;-1044651.000000000000000;0
1705;-741257.219999998807907;-1044695.690000001341105;0
4162;-742497.193999998271465;-1044160.030000001192093;0
3110;-743743.295000001788139;-1042640.627000000327826;0
1319;-741788.000000000000000;-1044905.000000000000000;0
1501;-741475.000000000000000;-1044292.000000000000000;0
1250;-742103.000000000000000;-1044672.000000000000000;0
2755;-744003.879000000655651;-1043471.734000001102686;0
7027;-743237.269999999552965;-1044095.524999998509884;0
640;-741983.000000000000000;-1043299.000000000000000;0
1452;-741519.000000000000000;-1044574.000000000000000;0
7048;-743392.429999999701977;-1044236.170000001788139;0
397;-742355.000000000000000;-1043861.000000000000000;0
272;-743396.000000000000000;-1043809.000000000000000;0
2007;-743231.000000000000000;-1044741.000000000000000;0
3843;-743139.170000001788139;-1042650.050000000745058;0
2512;-743070.000000000000000;-1044052.000000000000000;0
1419;-741603.000000000000000;-1044410.000000000000000;0
164;-743392.000000000000000;-1043230.000000000000000;0
552;-742259.000000000000000;-1043732.000000000000000;0
3065;-744092.028999999165535;-1042868.519000001251698;0
1020;-742293.000000000000000;-1044615.000000000000000;0
2135;-743006.000000000000000;-1045119.000000000000000;0
2246;-743218.000000000000000;-1045379.000000000000000;0
6854;-741522.427999999374151;-1045038.967999998480082;0
1791;-742157.000000000000000;-1044163.000000000000000;0
5109;-742850.925999999046326;-1043483.024999998509884;0
2159;-742822.000000000000000;-1045141.000000000000000;0
1610;-742374.000000000000000;-1044447.000000000000000;0
5968;-742288.989000000059605;-1044168.456999998539686;0
2147;-742828.000000000000000;-1044984.000000000000000;0
785;-741702.000000000000000;-1042622.000000000000000;0
2024;-743305.000000000000000;-1045000.000000000000000;0
2217;-743112.000000000000000;-1045360.000000000000000;0
732;-741860.000000000000000;-1043003.000000000000000;0
1607;-742414.000000000000000;-1044379.000000000000000;0
3408;-743789.511999998241663;-1043022.425000000745058;0
1310;-741623.000000000000000;-1044829.000000000000000;0
3095;-743923.068999998271465;-1042787.789000000804663;87
2343;-742674.000000000000000;-1045557.000000000000000;0
6723;-742592.894999999552965;-1044408.905000001192093;0
3809;-742980.300000000745058;-1042944.469999998807907;0
5959;-742962.548999998718500;-1043523.155000001192093;0
1137;-741538.000000000000000;-1044442.000000000000000;0
2084;-742447.000000000000000;-1044797.000000000000000;0
4222;-742187.096999999135733;-1043485.890000000596046;0
6809;-741079.942999999970198;-1044626.942000001668930;0
7706;-742313.239999998360872;-1044319.611999999731779;0
2082;-742569.000000000000000;-1044642.000000000000000;0
3756;-743319.230000000447035;-1042949.019999999552965;0
1584;-742368.000000000000000;-1044717.000000000000000;0
2298;-742621.000000000000000;-1045406.000000000000000;0
6961;-743023.579999998211861;-1044221.129999998956919;0
4051;-743236.329999998211861;-1043889.710000000894070;0
513;-742083.000000000000000;-1043145.000000000000000;0
4009;-743231.157999999821186;-1044047.155000001192093;0
7190;-742577.989999998360872;-1044771.690000001341105;0
3989;-743307.815000001341105;-1044034.914999999105930;0
4428;-742206.750000000000000;-1043097.800000000745058;0
5408;-743696.881000000983477;-1042878.024999998509884;0
7019;-742585.024999998509884;-1044210.725000001490116;0
6121;-742069.784000001847744;-1043299.828000001609325;0
4025;-743202.881000000983477;-1043852.008000001311302;0
7979;-741161.500000000000000;-1044398.210000000894070;0
905;-742312.000000000000000;-1042489.000000000000000;0
7011;-742831.309999998658895;-1044257.245000001043081;0
1781;-741247.000000000000000;-1043923.000000000000000;0
4638;-742553.631999999284744;-1042542.028000000864267;0
1545;-742236.000000000000000;-1044234.000000000000000;0
3790;-743140.809999998658895;-1042908.210000000894070;0
633;-742100.000000000000000;-1043296.000000000000000;0
7750;-742972.960000000894070;-1044053.329999998211861;0
794;-741746.000000000000000;-1042595.000000000000000;0
4651;-742756.375000000000000;-1042524.938000001013279;0
1618;-742405.000000000000000;-1044404.000000000000000;0
5292;-743055.866000000387430;-1043215.710999999195337;0
5316;-743075.980000000447035;-1043041.059999998658895;0
408;-742317.000000000000000;-1044182.000000000000000;0
1430;-741993.000000000000000;-1044260.000000000000000;0
6092;-742001.309999998658895;-1043482.089999999850988;0
2473;-743469.000000000000000;-1044899.000000000000000;0
4924;-742427.890999998897314;-1042890.581000000238419;0
430;-742185.000000000000000;-1043888.000000000000000;0
1441;-741744.000000000000000;-1044392.000000000000000;0
5225;-743277.453999999910593;-1043558.087999999523163;0
3266;-743585.618999999016523;-1042739.508999999612570;0
1327;-742001.000000000000000;-1045024.000000000000000;0
1344;-741750.000000000000000;-1044808.000000000000000;0
1481;-741335.000000000000000;-1044231.000000000000000;0
7207;-742570.620000001043081;-1045016.149999998509884;0
1995;-743484.000000000000000;-1045036.000000000000000;0
1414;-741627.000000000000000;-1044593.000000000000000;0
306;-742809.000000000000000;-1044137.000000000000000;0
4040;-743224.710000000894070;-1043766.050000000745058;0
2293;-742786.000000000000000;-1045387.000000000000000;0
6857;-741503.982999999076128;-1044930.340999998152256;0
6688;-742383.146999999880791;-1045009.361000001430511;0
1530;-741753.000000000000000;-1043814.000000000000000;0
1394;-741822.000000000000000;-1044310.000000000000000;0
1542;-742043.000000000000000;-1044057.000000000000000;0
4502;-742349.309999998658895;-1042718.199999999254942;0
4858;-742955.339999999850988;-1042963.960000000894070;0
5270;-742989.153999999165535;-1043210.684999998658895;0
7200;-742561.710999999195337;-1044911.469999998807907;0
6836;-741643.532000001519918;-1044947.486999999731779;0
6160;-742311.730999998748302;-1043061.116000000387430;0
4809;-743081.589999999850988;-1042799.800000000745058;0
6186;-742314.337999999523163;-1043061.517000000923872;0
4321;-742265.214999999850988;-1043235.418999999761581;0
1094;-741513.000000000000000;-1044561.000000000000000;0
4613;-742506.557000000029802;-1042597.938000001013279;0
6015;-742854.607999999076128;-1043226.870999999344349;0
6700;-742298.611000001430511;-1044507.315999999642372;0
5461;-742442.704999998211861;-1043234.515000000596046;0
1144;-741402.000000000000000;-1044470.000000000000000;0
4877;-742845.760000001639128;-1042956.589999999850988;0
6492;-742174.054000001400709;-1044455.534000001847744;0
618;-742203.000000000000000;-1043272.000000000000000;0
1810;-743136.000000000000000;-1044544.000000000000000;0
5198;-743259.600999999791384;-1043302.061000000685453;0
7647;-742319.918000001460314;-1045405.197999998927116;0
1162;-741087.000000000000000;-1044511.000000000000000;0
1770;-741270.000000000000000;-1044086.000000000000000;0
7248;-742757.960000000894070;-1044826.929999999701977;0
3314;-743758.675999999046326;-1042905.688999999314547;0
4752;-742774.460000000894070;-1042743.280000001192093;0
2478;-741241.859999999403954;-1044562.089999999850988;0
2556;-741376.000000000000000;-1044379.000000000000000;0
5067;-742813.465999998152256;-1043267.335999999195337;0
5125;-742992.826000001281500;-1043402.497999999672174;0
4073;-742939.109999999403954;-1043858.504999998956919;0
6493;-742196.574000000953674;-1044452.076999999582767;0
7004;-743069.289999999105930;-1044326.469999998807907;0
4464;-742182.309999998658895;-1042571.379999998956919;0
1041;-741893.000000000000000;-1044653.000000000000000;0
2576;-742487.000000000000000;-1045483.000000000000000;0
7295;-743165.010000001639128;-1044947.170000001788139;0
7137;-742916.074999999254942;-1044400.230000000447035;0
4531;-742746.070000000298023;-1042885.980000000447035;0
4783;-742933.866999998688698;-1042668.403000000864267;0
6368;-741940.324999999254942;-1042660.324000000953674;0
7387;-743066.739999998360872;-1045487.570000000298023;0
8079;-742021.839999999850988;-1045292.179999999701977;0
1303;-741865.000000000000000;-1044692.000000000000000;0
3354;-743954.250999998301268;-1043026.024999998509884;0
3964;-743352.359999999403954;-1043540.780000001192093;0
711;-741828.000000000000000;-1042860.000000000000000;0
2189;-743472.000000000000000;-1045183.000000000000000;0
2696;-743477.489999998360872;-1042038.000000000000000;0
2038;-743342.000000000000000;-1044806.000000000000000;0
4232;-742315.057999998331070;-1043428.918999999761581;0
1983;-743474.000000000000000;-1044709.000000000000000;0
4525;-742716.719999998807907;-1042823.219999998807907;0
1817;-743058.000000000000000;-1044411.000000000000000;0
6280;-742306.918999999761581;-1043038.083000000566244;0
4071;-742929.394999999552965;-1043807.585000000894070;0
5144;-743052.642000000923872;-1043488.940000001341105;0
6199;-742319.442000001668930;-1043067.822999998927116;0
6099;-741947.280000001192093;-1043424.289999999105930;0
347;-742542.000000000000000;-1043795.000000000000000;0
280;-743053.000000000000000;-1043875.000000000000000;0
4208;-742372.416999999433756;-1043503.423000000417233;0
1982;-743408.000000000000000;-1044646.000000000000000;0
202;-743240.000000000000000;-1043597.000000000000000;0
182;-743429.000000000000000;-1043385.000000000000000;0
4751;-742791.629999998956919;-1042751.460000000894070;0
6268;-742340.850000001490116;-1043018.881000000983477;0
6040;-742075.469999998807907;-1043676.809999998658895;0
6509;-741724.809999998658895;-1044485.162000000476837;0
8055;-742223.859999999403954;-1045007.899999998509884;0
6124;-743427.861999999731779;-1043609.043000001460314;0
6105;-742213.883000001311302;-1043111.734000001102686;0
1216;-742093.000000000000000;-1044333.000000000000000;0
3950;-743426.829999998211861;-1043556.070000000298023;0
1675;-741059.000000000000000;-1044754.000000000000000;0
6187;-742313.572999998927116;-1043060.111999999731779;0
1057;-741686.000000000000000;-1045058.000000000000000;0
1007;-741976.000000000000000;-1044586.000000000000000;0
4426;-742197.589999999850988;-1043031.679999999701977;0
3834;-743079.190000001341105;-1042579.899999998509884;0
4030;-743133.280000001192093;-1043791.552000001072884;0
799;-741822.000000000000000;-1042573.000000000000000;0
4771;-742890.828000001609325;-1042889.975000001490116;0
7781;-743030.026999998837709;-1045857.486000001430511;0
3264;-743565.725000001490116;-1042729.024999998509884;0
7518;-742829.780000001192093;-1045693.210000000894070;0
1692;-741125.000000000000000;-1044816.000000000000000;0
6931;-742050.949999999254942;-1045191.190000001341105;0
6232;-742316.034000001847744;-1043057.000000000000000;0
4517;-742638.449999999254942;-1042779.280000001192093;0
4730;-742831.050000000745058;-1042696.600000001490116;0
1966;-743413.000000000000000;-1044746.000000000000000;0
1519;-741754.000000000000000;-1043956.000000000000000;0
2081;-742551.000000000000000;-1044621.000000000000000;0
1927;-743501.000000000000000;-1044407.000000000000000;0
4592;-742448.190999999642372;-1042642.517999999225140;0
4824;-742918.673000000417233;-1042871.875000000000000;0
2285;-742897.000000000000000;-1045467.000000000000000;0
7654;-742242.081000000238419;-1045273.263999998569489;0
527;-742186.000000000000000;-1043818.000000000000000;0
4859;-742966.710000000894070;-1042996.302999999374151;0
7962;-741640.190000001341105;-1044316.800000000745058;0
7090;-743353.289999999105930;-1044571.760000001639128;0
1116;-741125.980000000447035;-1044610.410000000149012;0
7156;-742944.515000000596046;-1044546.140000000596046;0
1359;-742000.000000000000000;-1044897.000000000000000;0
7351;-742529.339999999850988;-1045181.269999999552965;0
1247;-742104.000000000000000;-1044609.000000000000000;0
6651;-741697.910000000149012;-1044123.329999998211861;0
5207;-743208.434999998658895;-1043365.236999999731779;0
2377;-742390.000000000000000;-1045527.000000000000000;0
6373;-741992.809999998658895;-1042677.000000000000000;0
210;-743112.000000000000000;-1043566.000000000000000;0
5158;-743148.138999998569489;-1043320.254999998956919;0
2131;-743073.000000000000000;-1045134.000000000000000;0
7723;-741757.929000001400709;-1044043.175000000745058;0
4899;-742534.420000001788139;-1042820.899999998509884;0
2053;-743404.000000000000000;-1044986.000000000000000;0
2263;-742989.000000000000000;-1045714.000000000000000;0
4512;-742515.339999999850988;-1042750.230000000447035;0
4127;-742837.324999999254942;-1044032.670000001788139;0
1391;-742117.000000000000000;-1045084.000000000000000;0
4074;-742943.350000001490116;-1043880.304999999701977;0
4816;-742976.510000001639128;-1042798.309999998658895;0
5657;-743429.199999999254942;-1043706.837999999523163;0
1824;-742963.809999998658895;-1044143.929999999701977;0
1510;-741764.000000000000000;-1044180.000000000000000;0
835;-741950.000000000000000;-1042513.000000000000000;0
1971;-743385.000000000000000;-1044881.000000000000000;0
4854;-742971.159000001847744;-1042912.429000001400709;0
5169;-743240.785000000149012;-1043411.081999998539686;0
4673;-742811.420000001788139;-1042756.050000000745058;0
328;-742670.000000000000000;-1044072.000000000000000;0
7700;-742371.105999998748302;-1044818.445000000298023;0
4221;-742209.576000001281500;-1043499.238000001758337;0
3183;-743909.289999999105930;-1042546.210000000894070;0
87;-743857.000000000000000;-1043557.000000000000000;0
6694;-742280.806000001728535;-1044814.875999998301268;0
1300;-741917.410000000149012;-1044719.769999999552965;0
3365;-743840.598999999463558;-1043023.565000001341105;0
5014;-742563.771999999880791;-1042993.241999998688698;0
342;-742573.000000000000000;-1043878.000000000000000;0
7677;-742383.142000000923872;-1045124.221000000834465;0
7083;-743309.980000000447035;-1044509.500000000000000;0
1385;-742194.000000000000000;-1044974.000000000000000;0
532;-742114.000000000000000;-1043737.000000000000000;0
7015;-742554.570000000298023;-1044360.725000001490116;0
323;-742711.000000000000000;-1044140.000000000000000;0
5036;-742666.855999998748302;-1042990.710000000894070;0
2338;-742797.000000000000000;-1045528.000000000000000;0
6339;-742245.460000000894070;-1042835.780000001192093;0
2366;-742513.000000000000000;-1045512.000000000000000;0
1030;-741975.000000000000000;-1044753.000000000000000;0
2499;-741884.000000000000000;-1044011.000000000000000;0
4979;-742507.703000001609325;-1043016.118000000715256;0
5676;-743406.725999999791384;-1043716.493000000715256;0
2230;-742996.000000000000000;-1045551.000000000000000;0
679;-742404.000000000000000;-1043185.000000000000000;0
8049;-742198.890000000596046;-1044891.600000001490116;0
1515;-741913.000000000000000;-1044072.000000000000000;0
1254;-742090.000000000000000;-1044750.000000000000000;0
4671;-742824.179999999701977;-1042687.210000000894070;0
4773;-742888.429000001400709;-1042839.530000001192093;0
2397;-742181.000000000000000;-1045368.000000000000000;0
6264;-742357.280000001192093;-1043020.445999998599291;0
6242;-742366.677999999374151;-1043062.949000000953674;0
5664;-743420.907000001519918;-1043711.245999999344349;0
4601;-742631.969999998807907;-1042675.629999998956919;0
5641;-743428.517000000923872;-1043687.460000000894070;0
4519;-742665.160000000149012;-1042790.820000000298023;0
2289;-742915.000000000000000;-1045426.000000000000000;0
3825;-743056.390000000596046;-1042570.079999998211861;0
982;-741992.000000000000000;-1044416.000000000000000;0
4145;-742687.109999999403954;-1043837.125000000000000;0
4891;-742595.048999998718500;-1042857.274999998509884;0
3887;-742347.760000001639128;-1042449.881000000983477;0
1170;-741893.000000000000000;-1044403.000000000000000;0
4690;-742679.162999998778105;-1042583.138999998569489;0
4722;-742878.030000001192093;-1042626.550000000745058;0
3392;-743913.699999999254942;-1043165.480000000447035;0
954;-742231.000000000000000;-1043024.000000000000000;0
6175;-742315.256999999284744;-1043064.660999998450279;0
823;-742110.000000000000000;-1042596.000000000000000;0
3238;-744159.147999998182058;-1042638.964000001549721;0
4920;-742444.449999999254942;-1042928.980000000447035;0
4839;-742984.162000000476837;-1042715.425000000745058;0
5161;-743160.846999999135733;-1043333.914999999105930;0
376;-742530.000000000000000;-1043680.000000000000000;0
1178;-741952.000000000000000;-1044311.000000000000000;0
6500;-741697.967999998480082;-1044926.364999998360872;0
541;-742258.000000000000000;-1043678.000000000000000;0
4630;-742646.271999999880791;-1042652.089999999850988;0
4888;-742649.925999999046326;-1042830.767000000923872;0
5685;-743396.092999998480082;-1043720.434000000357628;0
888;-741994.000000000000000;-1042797.000000000000000;0
1307;-741803.000000000000000;-1044663.000000000000000;0
2489;-742079.000000000000000;-1044278.000000000000000;0
2321;-742679.000000000000000;-1045480.000000000000000;0
6415;-743180.657999999821186;-1043208.993999999016523;0
387;-742421.000000000000000;-1043763.000000000000000;0
4427;-742190.519999999552965;-1043099.440000001341105;0
7661;-742294.495999999344349;-1045349.482000000774860;0
7089;-743344.149999998509884;-1044558.530000001192093;0
4830;-743043.449999999254942;-1042882.359999999403954;0
745;-741649.000000000000000;-1042968.000000000000000;0
5226;-743310.730000000447035;-1043553.269999999552965;0
4120;-742715.179999999701977;-1043974.089999999850988;0
377;-742494.000000000000000;-1043658.000000000000000;0
4147;-742649.245000001043081;-1043870.320000000298023;0
389;-742408.000000000000000;-1043783.000000000000000;0
2396;-742212.000000000000000;-1045365.000000000000000;0
2542;-741813.000000000000000;-1044224.000000000000000;0
3810;-743261.510000001639128;-1042802.960000000894070;0
3176;-743891.085999999195337;-1042631.991999998688698;0
6387;-742159.980000000447035;-1042496.210000000894070;0
729;-741986.000000000000000;-1042998.000000000000000;0
4634;-742635.980000000447035;-1042656.144999999552965;0
2748;-743933.984000001102686;-1043445.734000001102686;0
6183;-742316.633999999612570;-1043065.732000000774860;0
5591;-743421.353999998420477;-1043679.738000001758337;0
1354;-741877.000000000000000;-1044859.000000000000000;0
1222;-742157.000000000000000;-1044266.000000000000000;0
4792;-743051.280000001192093;-1042654.962999999523163;0
574;-742068.000000000000000;-1043538.000000000000000;0
5016;-742572.212000001221895;-1042955.526999998837709;0
4585;-742437.502000000327826;-1042630.243999999016523;0
581;-741991.000000000000000;-1043457.000000000000000;0
4709;-742775.800000000745058;-1042600.690000001341105;0
4524;-742683.789999999105930;-1042823.579999998211861;0
3358;-743952.916999999433756;-1043047.306000001728535;0
700;-742008.000000000000000;-1042895.000000000000000;0
838;-742043.000000000000000;-1042524.000000000000000;0
7285;-742806.960000000894070;-1044758.379999998956919;0
8044;-742176.640000000596046;-1044778.420000001788139;0
2145;-742825.000000000000000;-1045079.000000000000000;0
528;-742187.000000000000000;-1043838.000000000000000;0
1812;-743149.000000000000000;-1044528.000000000000000;0
5462;-742498.728999998420477;-1042986.947000000625849;0
6103;-742213.102000001817942;-1043103.528999999165535;0
1761;-741194.000000000000000;-1044104.000000000000000;0
1495;-741215.000000000000000;-1044324.000000000000000;0
6370;-741968.780000001192093;-1042685.250000000000000;0
6212;-742317.006000000983477;-1043061.888000000268221;0
8259;-742072.089999999850988;-1042687.219999998807907;0
1497;-741332.000000000000000;-1044317.000000000000000;0
2320;-742707.000000000000000;-1045477.000000000000000;0
3380;-743794.508000001311302;-1042935.758999999612570;0
7645;-742305.313000001013279;-1045383.625000000000000;0
1490;-741023.000000000000000;-1044335.000000000000000;0
5020;-742572.699999999254942;-1042891.372999999672174;0
602;-741828.000000000000000;-1043190.000000000000000;0
1926;-743301.000000000000000;-1044321.000000000000000;0
4257;-742056.467000000178814;-1043503.657999999821186;0
5108;-742876.219999998807907;-1043431.129999998956919;0
1902;-743459.000000000000000;-1044269.000000000000000;0
1012;-742060.000000000000000;-1044582.000000000000000;0
917;-742121.000000000000000;-1043008.000000000000000;0
4242;-742214.469999998807907;-1043415.800000000745058;0
5756;-743426.113000001758337;-1043680.102000001817942;0
5722;-743419.659000001847744;-1043631.798000000417233;0
3949;-743420.780000001192093;-1043527.820000000298023;0
5595;-743416.488000001758337;-1043680.118999999016523;0
6282;-742308.337999999523163;-1043045.984000001102686;0
6768;-741255.769999999552965;-1044419.920000001788139;0
6182;-742317.399000000208616;-1043067.136999998241663;0
3800;-743098.550000000745058;-1042863.019999999552965;0
6284;-742309.677999999374151;-1043054.043999999761581;0
6719;-742371.686999998986721;-1044952.227000001817942;0
1916;-743371.000000000000000;-1044484.000000000000000;0
8273;-742057.820000000298023;-1042728.760000001639128;0
995;-741906.000000000000000;-1044434.000000000000000;0
4796;-743054.247999999672174;-1042682.918000001460314;0
5236;-743352.302000001072884;-1043362.752000000327826;0
302;-742925.000000000000000;-1044109.000000000000000;0
1559;-741190.000000000000000;-1044242.000000000000000;0
6210;-742318.541000001132488;-1043064.662999998778105;0
1944;-743280.000000000000000;-1044400.000000000000000;0
4689;-742688.114999998360872;-1042568.859999999403954;0
1373;-742143.000000000000000;-1044822.000000000000000;0
6979;-743081.460000000894070;-1044413.079999998211861;0
629;-742200.000000000000000;-1043289.000000000000000;0
4459;-742274.829999998211861;-1042644.269999999552965;0
1499;-741413.000000000000000;-1044304.000000000000000;0
4787;-742962.412000000476837;-1042621.662000000476837;0
5138;-743030.936000000685453;-1043483.587999999523163;0
263;-743389.000000000000000;-1043725.000000000000000;0
380;-742501.000000000000000;-1043722.000000000000000;0
7515;-742273.021999999880791;-1044371.543999999761581;0
6173;-742316.787000000476837;-1043067.471000000834465;0
4874;-742795.429999999701977;-1042925.910000000149012;0
6696;-742332.717000000178814;-1044815.649999998509884;0
8244;-742617.899999998509884;-1045206.480000000447035;0
1296;-742100.000000000000000;-1044473.000000000000000;0
2240;-743343.000000000000000;-1045290.000000000000000;0
4322;-742266.414000000804663;-1043213.907999999821186;0
3409;-743790.434999998658895;-1043040.907999999821186;0
3157;-743935.576000001281500;-1042567.035000000149012;0
2243;-743292.000000000000000;-1045310.000000000000000;0
4606;-742512.769000001251698;-1042608.333000000566244;0
4860;-742964.800999999046326;-1043016.107999999076128;0
6297;-742506.859999999403954;-1042634.250000000000000;0
7703;-742462.714000001549721;-1044818.045000001788139;0
5446;-743190.850000001490116;-1043337.008999999612570;0
4819;-742941.910000000149012;-1042776.670000001788139;0
8060;-742295.719999998807907;-1045082.859999999403954;0
6174;-742316.021999999880791;-1043066.065000001341105;0
6202;-742317.124000001698732;-1043063.651999998837709;0
6259;-742383.170000001788139;-1043030.809000000357628;0
8046;-742169.109999999403954;-1044835.660000000149012;0
3846;-743149.390000000596046;-1042549.600000001490116;0
4945;-742422.162999998778105;-1043009.861000001430511;0
7139;-742919.179999999701977;-1044444.434999998658895;0
6208;-742320.098000001162291;-1043067.458999998867512;0
4122;-742732.074999999254942;-1043923.995000001043081;0
5444;-743183.024000000208616;-1043210.600000001490116;0
338;-742602.000000000000000;-1043933.000000000000000;0
5680;-743402.000000000000000;-1043718.245000001043081;0
497;-741780.000000000000000;-1043214.000000000000000;0
8262;-742129.620000001043081;-1042698.079999998211861;0
1125;-741728.000000000000000;-1044435.000000000000000;0
6245;-742369.682000000029802;-1043057.377000000327826;0
610;-742011.000000000000000;-1043270.000000000000000;0
7945;-742063.179999999701977;-1044077.379999998956919;0
4969;-742465.059999998658895;-1043095.034000001847744;0
1291;-742205.000000000000000;-1044568.000000000000000;0
1406;-741663.000000000000000;-1044277.000000000000000;0
2206;-743125.000000000000000;-1045327.000000000000000;0
4622;-742533.901000000536442;-1042569.660000000149012;0
1052;-741761.000000000000000;-1045002.000000000000000;0
172;-743456.000000000000000;-1043433.000000000000000;0
7973;-741347.850000001490116;-1044381.850000001490116;0
4977;-742489.451000001281500;-1042992.394000001251698;0
1532;-741805.000000000000000;-1043858.000000000000000;0
183;-743438.000000000000000;-1043422.000000000000000;0
1150;-741290.000000000000000;-1044485.000000000000000;0
8261;-742108.039999999105930;-1042693.769999999552965;0
601;-741823.000000000000000;-1043224.000000000000000;0
2346;-742654.000000000000000;-1045546.000000000000000;0
5993;-743947.829999998211861;-1042646.350000001490116;0
6508;-741728.552999999374151;-1044508.050999999046326;0
7644;-742295.089000001549721;-1045373.164999999105930;0
