OID_;X;Y;TEMPERATURE
3614;-744984.548999998718500;-1042283.640999998897314;0
3019;-744463.447999998927116;-1042784.646000001579523;0
3568;-744718.817999999970198;-1042588.614999998360872;0
3692;-744525.876499999314547;-1042540.534000001847744;0
3580;-744924.973999999463558;-1042593.699999999254942;0
2605;-745393.842999998480082;-1042860.796000000089407;0
5975;-745052.346999999135733;-1042674.673000000417233;0
118;-745135.000000000000000;-1042687.000000000000000;0
3542;-744575.274000000208616;-1042656.160000000149012;0
2696;-743477.489999998360872;-1042038.000000000000000;0
2520;-741847.000000000000000;-1045324.000000000000000;0
696;-742077.000000000000000;-1042913.000000000000000;0
7259;-742935.280000001192093;-1044869.829999998211861;0
3066;-744075.627000000327826;-1042883.837000001221895;0
725;-741983.000000000000000;-1042939.000000000000000;0
6;-743464.000000000000000;-1042594.000000000000000;0
3216;-743615.890999998897314;-1042451.129999998956919;0
7410;-743525.730000000447035;-1045377.420000001788139;0
651;-742490.000000000000000;-1043564.000000000000000;0
6946;-742974.765000000596046;-1043929.388000000268221;0
2226;-743057.000000000000000;-1045470.000000000000000;0
3211;-743651.409000001847744;-1042483.458999998867512;0
7716;-743023.190999999642372;-1045843.241999998688698;0
6872;-741751.719999998807907;-1045296.679999999701977;0
7397;-743021.859999999403954;-1045682.989999998360872;0
1756;-742165.000000000000000;-1045209.000000000000000;0
2275;-742845.000000000000000;-1045719.000000000000000;0
7744;-742941.256999999284744;-1045533.171000000089407;0
2760;-743863.331000000238419;-1043483.304000001400709;0
7347;-742557.690000001341105;-1045177.440000001341105;0
2755;-744003.879000000655651;-1043471.734000001102686;0
2316;-742823.000000000000000;-1045463.000000000000000;0
2334;-742872.000000000000000;-1045519.000000000000000;0
1584;-742368.000000000000000;-1044717.000000000000000;0
2404;-742179.000000000000000;-1045467.000000000000000;0
350;-742505.000000000000000;-1043757.000000000000000;0
2274;-742870.000000000000000;-1045732.000000000000000;0
4025;-743202.881000000983477;-1043852.008000001311302;0
3919;-743904.947000000625849;-1043493.929999999701977;0
1382;-742096.000000000000000;-1045023.000000000000000;0
6746;-742405.083999998867512;-1044259.199999999254942;0
2060;-742659.000000000000000;-1044472.000000000000000;0
6823;-741313.910000000149012;-1044788.510000001639128;0
3107;-743778.888000000268221;-1042682.131999999284744;0
2322;-742651.000000000000000;-1045483.000000000000000;0
1824;-742963.809999998658895;-1044143.929999999701977;0
2487;-742101.000000000000000;-1044308.000000000000000;0
7024;-743182.745000001043081;-1044052.815000001341105;0
4332;-742410.359000001102686;-1043282.916000001132488;0
7516;-742248.390000000596046;-1044368.907999999821186;0
2326;-742523.000000000000000;-1045498.000000000000000;0
2255;-743181.000000000000000;-1045372.000000000000000;0
7538;-742701.420000001788139;-1045364.109999999403954;0
1655;-741391.000000000000000;-1044651.000000000000000;0
2740;-744042.611999999731779;-1043335.940000001341105;0
2641;-743432.578999999910593;-1042583.418999999761581;0
1243;-742122.000000000000000;-1044502.000000000000000;0
3268;-743594.046999998390675;-1042721.412999998778105;0
7140;-742921.300000000745058;-1044469.335000000894070;0
5408;-743696.881000000983477;-1042878.024999998509884;0
1042;-741883.000000000000000;-1044682.000000000000000;0
1291;-742205.000000000000000;-1044568.000000000000000;0
5434;-744042.467999998480082;-1043135.986999999731779;0
6705;-742279.050999999046326;-1044655.923000000417233;0
7016;-742557.515000000596046;-1044334.074999999254942;0
1250;-742103.000000000000000;-1044672.000000000000000;0
3269;-743600.679000001400709;-1042731.660000000149012;0
1171;-741882.000000000000000;-1044375.000000000000000;0
1050;-741785.000000000000000;-1044952.000000000000000;0
2337;-742783.000000000000000;-1045544.000000000000000;0
1720;-741436.000000000000000;-1044862.000000000000000;0
513;-742083.000000000000000;-1043145.000000000000000;0
6726;-742476.517999999225140;-1044410.600000001490116;0
7043;-743398.899999998509884;-1044106.629999998956919;0
7217;-742516.318999998271465;-1044582.890000000596046;0
7995;-741545.920000001788139;-1045160.100000001490116;0
2309;-742322.000000000000000;-1045519.000000000000000;0
7721;-742941.157000001519918;-1044215.368000000715256;0
7147;-742827.925000000745058;-1044451.385000001639128;0
1615;-742367.000000000000000;-1044434.000000000000000;0
1629;-742450.000000000000000;-1044518.000000000000000;0
2304;-742442.000000000000000;-1045429.000000000000000;0
6699;-742301.118999999016523;-1044484.282999999821186;0
2375;-742438.000000000000000;-1045570.000000000000000;0
4087;-742811.609999999403954;-1043604.190000001341105;0
7704;-742256.021000001579523;-1044313.592999998480082;0
1607;-742414.000000000000000;-1044379.000000000000000;0
1101;-741339.000000000000000;-1044568.000000000000000;0
6715;-742291.912999998778105;-1044948.105999998748302;0
884;-741771.000000000000000;-1042776.000000000000000;0
2511;-743050.000000000000000;-1044050.000000000000000;0
7658;-742333.647999998182058;-1045313.331999998539686;0
1596;-742323.000000000000000;-1045037.000000000000000;0
1330;-741817.000000000000000;-1044709.000000000000000;0
408;-742317.000000000000000;-1044182.000000000000000;0
1423;-742167.000000000000000;-1044150.000000000000000;0
1792;-742165.000000000000000;-1044209.000000000000000;0
2891;-744029.914000000804663;-1043200.478000000119209;0
1598;-742351.000000000000000;-1045090.000000000000000;0
6975;-743116.140000000596046;-1044506.469999998807907;0
1239;-742138.000000000000000;-1044401.000000000000000;0
3100;-743941.234000001102686;-1042742.857999999076128;0
1767;-741261.000000000000000;-1044168.000000000000000;0
3392;-743913.699999999254942;-1043165.480000000447035;0
2447;-742772.000000000000000;-1044159.000000000000000;0
7946;-742007.769999999552965;-1044091.789999999105930;0
3368;-743901.462000001221895;-1043012.500999998301268;0
285;-743021.000000000000000;-1043730.000000000000000;0
7175;-742651.780000001192093;-1044558.149999998509884;0
1695;-741550.000000000000000;-1044656.000000000000000;0
1447;-741541.000000000000000;-1044744.000000000000000;0
710;-741829.000000000000000;-1042878.000000000000000;0
737;-741849.000000000000000;-1043021.000000000000000;0
1426;-742056.000000000000000;-1044228.000000000000000;0
1986;-743480.000000000000000;-1044794.000000000000000;0
3411;-743769.885999999940395;-1043038.517000000923872;0
7151;-742842.649000000208616;-1044545.307000000029802;0
3321;-743903.500999998301268;-1042936.324999999254942;0
4208;-742372.416999999433756;-1043503.423000000417233;0
677;-742425.000000000000000;-1043200.000000000000000;0
5294;-743056.328999999910593;-1043196.096999999135733;0
314;-742585.000000000000000;-1044184.000000000000000;0
4031;-743135.774000000208616;-1043769.622000001370907;0
1317;-741748.000000000000000;-1044884.000000000000000;0
3091;-743924.489000000059605;-1042816.170000001788139;0
744;-741666.000000000000000;-1042994.000000000000000;0
2236;-743391.000000000000000;-1045242.000000000000000;0
1253;-742084.000000000000000;-1044730.000000000000000;0
1600;-742418.000000000000000;-1044944.000000000000000;0
4327;-742333.449000000953674;-1043399.671000000089407;0
1121;-741765.000000000000000;-1044444.000000000000000;0
6096;-742098.760000001639128;-1043615.589999999850988;0
2395;-742244.000000000000000;-1045363.000000000000000;0
2098;-743134.000000000000000;-1044763.000000000000000;0
8284;-742219.410000000149012;-1042809.500000000000000;0
6849;-741635.855999998748302;-1045019.947999998927116;0
4537;-742303.159000001847744;-1042752.293000001460314;0
4339;-742459.269000001251698;-1043367.923000000417233;0
1731;-741456.000000000000000;-1045017.000000000000000;0
2256;-743156.000000000000000;-1045353.000000000000000;0
1533;-741832.000000000000000;-1043879.000000000000000;0
2544;-741753.000000000000000;-1044252.000000000000000;0
635;-742143.000000000000000;-1043317.000000000000000;0
4063;-742855.079999998211861;-1043654.695000000298023;0
1090;-741581.000000000000000;-1044552.000000000000000;0
7247;-742774.480000000447035;-1044839.850000001490116;0
4147;-742649.245000001043081;-1043870.320000000298023;0
3836;-743096.070000000298023;-1042561.879999998956919;0
5295;-743047.995000001043081;-1043185.530000001192093;0
1197;-741657.000000000000000;-1043865.000000000000000;0
276;-743382.000000000000000;-1043905.000000000000000;0
6485;-741795.653999999165535;-1044513.458000000566244;0
6832;-741552.254000000655651;-1044899.227000001817942;0
1495;-741215.000000000000000;-1044324.000000000000000;0
6693;-742248.197000000625849;-1044816.127000000327826;0
2146;-742845.000000000000000;-1044968.000000000000000;0
730;-741948.000000000000000;-1042998.000000000000000;0
514;-742119.000000000000000;-1043141.000000000000000;0
8277;-742111.260000001639128;-1042746.399999998509884;0
2043;-743471.000000000000000;-1044959.000000000000000;0
4164;-742476.478000000119209;-1044110.528000000864267;0
2467;-743434.000000000000000;-1044742.000000000000000;0
3989;-743307.815000001341105;-1044034.914999999105930;0
1340;-741695.000000000000000;-1044759.000000000000000;0
1932;-743359.000000000000000;-1044408.000000000000000;0
2108;-743147.000000000000000;-1045086.000000000000000;0
4079;-742836.170000001788139;-1043800.960000000894070;0
7202;-742561.410000000149012;-1044949.640000000596046;0
1760;-741162.000000000000000;-1044101.000000000000000;0
5230;-743335.399999998509884;-1043517.670000001788139;0
1195;-741696.000000000000000;-1043920.000000000000000;0
4046;-743205.699999999254942;-1044009.719999998807907;0
212;-743080.000000000000000;-1043557.000000000000000;0
3308;-743813.059999998658895;-1042830.515000000596046;0
7680;-742500.160000000149012;-1045137.399999998509884;0
3767;-743033.910000000149012;-1042982.390000000596046;0
2245;-743239.000000000000000;-1045356.000000000000000;0
586;-741966.000000000000000;-1043374.000000000000000;0
6122;-742071.870000001043081;-1043283.660000000149012;0
1142;-741437.000000000000000;-1044466.000000000000000;0
2085;-742426.000000000000000;-1044797.000000000000000;0
385;-742436.000000000000000;-1043742.000000000000000;0
7360;-743228.008000001311302;-1045144.625999998301268;0
403;-742307.000000000000000;-1043931.000000000000000;0
6712;-742273.328000001609325;-1044860.912000000476837;0
8267;-742240.420000001788139;-1042709.160000000149012;0
1772;-741277.000000000000000;-1044012.000000000000000;0
2212;-743217.000000000000000;-1045279.000000000000000;0
3768;-743006.370000001043081;-1042978.829999998211861;0
7939;-741306.171999998390675;-1043955.960000000894070;0
1435;-741903.000000000000000;-1044306.000000000000000;0
535;-742111.000000000000000;-1043714.000000000000000;0
1488;-741088.000000000000000;-1044212.000000000000000;0
4107;-742652.458999998867512;-1043744.934000000357628;0
6113;-742229.061000000685453;-1043368.359000001102686;0
2166;-743016.000000000000000;-1045179.000000000000000;0
3766;-743053.532999999821186;-1042996.631000000983477;0
1674;-741099.000000000000000;-1044736.000000000000000;0
5370;-742580.300999999046326;-1042977.140999998897314;0
8152;-743293.600000001490116;-1043190.510000001639128;0
1360;-741983.000000000000000;-1044900.000000000000000;0
7005;-742998.190000001341105;-1043944.824999999254942;0
2141;-742897.000000000000000;-1045094.000000000000000;0
3233;-744152.962999999523163;-1042686.791999999433756;0
2016;-743230.000000000000000;-1044873.000000000000000;0
4321;-742265.214999999850988;-1043235.418999999761581;0
1908;-743459.000000000000000;-1044358.000000000000000;0
7041;-743381.004999998956919;-1044158.699999999254942;0
3409;-743790.434999998658895;-1043040.907999999821186;0
1665;-741012.000000000000000;-1044351.000000000000000;0
1874;-743379.000000000000000;-1044247.000000000000000;0
4143;-742750.925000000745058;-1044017.960000000894070;0
3845;-743172.920000001788139;-1042573.210000000894070;0
1542;-742043.000000000000000;-1044057.000000000000000;0
5637;-743428.151000000536442;-1043682.633999999612570;0
1357;-741935.000000000000000;-1044871.000000000000000;0
1937;-743273.000000000000000;-1044318.000000000000000;0
1418;-741620.000000000000000;-1044458.000000000000000;0
1706;-741225.800000000745058;-1044698.800000000745058;0
6014;-742844.000000000000000;-1043239.482999999076128;0
6002;-742018.502000000327826;-1043294.918999999761581;0
7038;-743316.394999999552965;-1044240.155000001192093;0
7967;-741508.109999999403954;-1044369.239999998360872;0
1478;-741443.000000000000000;-1044220.000000000000000;0
2030;-743400.000000000000000;-1045091.000000000000000;0
1332;-741793.000000000000000;-1044755.000000000000000;0
7157;-742964.840999998152256;-1044545.681000001728535;0
5243;-743357.622000001370907;-1043407.258999999612570;0
4596;-742597.181000001728535;-1042670.653000000864267;0
684;-742358.000000000000000;-1043136.000000000000000;0
335;-742635.000000000000000;-1043966.000000000000000;0
1909;-743446.000000000000000;-1044375.000000000000000;0
3145;-744025.730000000447035;-1042639.432999998331070;0
7047;-743395.495000001043081;-1044210.765000000596046;0
1323;-741859.000000000000000;-1044941.000000000000000;0
4582;-742390.164999999105930;-1042606.546000000089407;0
1590;-742377.000000000000000;-1044885.000000000000000;0
4498;-741866.120000001043081;-1042718.471000000834465;0
6829;-741498.170000001788139;-1044764.809999998658895;0
5149;-743072.195999998599291;-1043377.370999999344349;0
4058;-743138.765000000596046;-1043625.405000001192093;0
5118;-742835.168000001460314;-1043315.074000000953674;0
524;-742255.000000000000000;-1043913.000000000000000;0
3785;-743172.449999999254942;-1042923.850000001490116;0
4120;-742715.179999999701977;-1043974.089999999850988;0
4069;-742920.684999998658895;-1043755.420000001788139;0
343;-742575.000000000000000;-1043857.000000000000000;0
5941;-742044.835000000894070;-1043561.903999999165535;0
2123;-743299.000000000000000;-1045010.000000000000000;0
3966;-743363.859999999403954;-1043530.829999998211861;0
391;-742395.000000000000000;-1043802.000000000000000;0
4035;-743274.690000001341105;-1043779.739999998360872;0
4464;-742182.309999998658895;-1042571.379999998956919;0
3761;-743202.559999998658895;-1042981.710000000894070;0
3746;-743261.420000001788139;-1042982.839999999850988;0
5686;-743394.912000000476837;-1043720.872000001370907;0
3781;-743273.059999998658895;-1042814.050000000745058;0
4072;-742934.225000001490116;-1043833.899999998509884;0
5303;-743164.818999998271465;-1043211.078000001609325;0
4170;-742407.245000001043081;-1043945.519999999552965;0
4735;-742686.059999998658895;-1042669.260000001639128;0
2478;-741241.859999999403954;-1044562.089999999850988;0
824;-742142.000000000000000;-1042596.000000000000000;0
3834;-743079.190000001341105;-1042579.899999998509884;0
4257;-742056.467000000178814;-1043503.657999999821186;0
1381;-742115.000000000000000;-1044999.000000000000000;0
507;-741953.000000000000000;-1043148.000000000000000;200
3871;-742356.649999998509884;-1042420.543999999761581;0
4766;-742803.037999998778105;-1042842.532999999821186;0
7004;-743069.289999999105930;-1044326.469999998807907;0
2397;-742181.000000000000000;-1045368.000000000000000;0
588;-741950.000000000000000;-1043352.000000000000000;0
2075;-743114.000000000000000;-1044772.000000000000000;0
1960;-743386.000000000000000;-1044623.000000000000000;0
4723;-742883.429999999701977;-1042644.829999998211861;0
4896;-742589.649999998509884;-1042838.989999998360872;0
4572;-742343.539999999105930;-1042598.289999999105930;0
6197;-742313.425000000745058;-1043058.370999999344349;0
4248;-742157.039999999105930;-1043376.699999999254942;0
6104;-742208.646999999880791;-1043103.999000001698732;0
4501;-742368.980000000447035;-1042705.100000001490116;0
6391;-742109.269999999552965;-1042498.320000000298023;0
4668;-742810.210000000894070;-1042618.969999998807907;0
6149;-742312.646000001579523;-1043064.261999998241663;0
4427;-742190.519999999552965;-1043099.440000001341105;0
756;-741681.000000000000000;-1042695.000000000000000;0
795;-741770.000000000000000;-1042577.000000000000000;0
3812;-743231.179999999701977;-1042815.199999999254942;0
2556;-741376.000000000000000;-1044379.000000000000000;0
2163;-742944.000000000000000;-1045168.000000000000000;0
810;-741934.000000000000000;-1042519.000000000000000;0
5645;-743428.886999998241663;-1043692.285999998450279;0
4323;-742267.879999998956919;-1043190.035000000149012;0
833;-742050.000000000000000;-1042573.000000000000000;0
6183;-742316.633999999612570;-1043065.732000000774860;0
5022;-742578.440000001341105;-1042849.350000001490116;0
8259;-742072.089999999850988;-1042687.219999998807907;0
1815;-743083.000000000000000;-1044478.000000000000000;0
4213;-742218.094999998807907;-1043529.954999998211861;0
5667;-743417.361999999731779;-1043712.557000000029802;0
4204;-742312.750999998301268;-1043589.962999999523163;0
1260;-742070.000000000000000;-1044876.000000000000000;0
6256;-742380.723000001162291;-1043035.640000000596046;0
1185;-741822.000000000000000;-1044095.000000000000000;0
1808;-743187.000000000000000;-1044539.000000000000000;0
5600;-743410.407000001519918;-1043680.594000000506639;0
4520;-742651.079999998211861;-1042798.449999999254942;0
501;-741836.000000000000000;-1043163.000000000000000;0
7277;-742796.870000001043081;-1044653.429999999701977;0
3177;-743877.122000001370907;-1042630.761999998241663;0
1028;-741981.000000000000000;-1044692.000000000000000;0
4033;-743319.719999998807907;-1043793.300000000745058;0
1436;-741869.000000000000000;-1044323.000000000000000;0
7010;-742857.964999999850988;-1044251.155000001192093;0
8151;-743319.030000001192093;-1043194.940000001341105;0
4611;-742532.804999999701977;-1042593.420000001788139;0
6982;-743055.109999999403954;-1044342.629999998956919;0
4783;-742933.866999998688698;-1042668.403000000864267;0
1955;-743374.000000000000000;-1044515.000000000000000;0
170;-743440.000000000000000;-1043364.000000000000000;0
7211;-742570.070000000298023;-1045065.679999999701977;0
7197;-742570.949000000953674;-1044895.548999998718500;0
5755;-743415.670000001788139;-1043702.254000000655651;0
5170;-743246.743000000715256;-1043425.304000001400709;0
1026;-741986.000000000000000;-1044631.000000000000000;0
7809;-741981.809999998658895;-1044560.280000001192093;0
6140;-742311.999000001698732;-1043064.638999998569489;0
597;-741855.000000000000000;-1043268.000000000000000;0
2233;-743461.000000000000000;-1045218.000000000000000;0
4689;-742688.114999998360872;-1042568.859999999403954;0
8078;-742024.710000000894070;-1045262.460000000894070;0
4130;-742868.460000000894070;-1044055.510000001639128;0
5369;-742583.364999998360872;-1042976.820999998599291;0
527;-742186.000000000000000;-1043818.000000000000000;0
5674;-743409.089999999850988;-1043715.618000000715256;0
7185;-742600.515000000596046;-1044717.333999998867512;0
4948;-742386.929999999701977;-1042992.239999998360872;0
6195;-742314.956000000238419;-1043061.181000001728535;0
5360;-742453.188999999314547;-1042938.521999999880791;0
2049;-743499.000000000000000;-1045071.000000000000000;0
6270;-742333.412999998778105;-1043018.204999998211861;0
3807;-743008.690000001341105;-1042928.690000001341105;0
6179;-742312.195000000298023;-1043059.041000001132488;0
985;-741823.000000000000000;-1044444.000000000000000;0
6247;-742371.447000000625849;-1043053.739000000059605;0
4811;-743040.379999998956919;-1042799.609999999403954;0
465;-741728.000000000000000;-1043309.000000000000000;0
1151;-741279.000000000000000;-1044475.000000000000000;0
3802;-743068.190000001341105;-1042879.710000000894070;0
6192;-742317.252000000327826;-1043065.394999999552965;0
4772;-742879.881999999284744;-1042872.157000001519918;0
7732;-742611.719000000506639;-1044632.203999999910593;0
6297;-742506.859999999403954;-1042634.250000000000000;0
4957;-742366.010000001639128;-1043006.059999998658895;0
556;-742222.000000000000000;-1043702.000000000000000;0
6159;-742312.495999999344349;-1043062.521000001579523;0
6365;-741979.230000000447035;-1042656.230000000447035;0
5138;-743030.936000000685453;-1043483.587999999523163;0
4841;-742989.993999999016523;-1042765.850999999791384;0
4565;-742462.576999999582767;-1042533.901999998837709;0
4814;-743000.489999998360872;-1042803.920000001788139;0
324;-742694.000000000000000;-1044132.000000000000000;0
6907;-741728.850000001490116;-1045105.190000001341105;0
4206;-742342.340999998152256;-1043547.063000001013279;0
2391;-742060.000000000000000;-1045336.000000000000000;0
6266;-742349.021000001579523;-1043019.662999998778105;0
1508;-741705.000000000000000;-1044210.000000000000000;0
6139;-742312.807000000029802;-1043066.006000000983477;0
6194;-742315.721000000834465;-1043062.585999999195337;0
393;-742384.000000000000000;-1043819.000000000000000;0
3372;-743823.475000001490116;-1043010.432999998331070;0
6358;-741993.554999999701977;-1042717.964000001549721;0
4837;-742979.105999998748302;-1042672.627999998629093;0
4899;-742534.420000001788139;-1042820.899999998509884;0
599;-741837.000000000000000;-1043243.000000000000000;0
1405;-741681.000000000000000;-1044325.000000000000000;0
1933;-743329.000000000000000;-1044407.000000000000000;0
538;-742113.000000000000000;-1043652.000000000000000;0
5966;-742483.469999998807907;-1043066.721999999135733;0
1466;-741838.000000000000000;-1044041.000000000000000;0
6782;-741303.329999998211861;-1044447.660000000149012;0
6313;-743936.949999999254942;-1042594.780000001192093;0
226;-742879.000000000000000;-1043516.000000000000000;0
1409;-741634.000000000000000;-1044170.000000000000000;0
2082;-742569.000000000000000;-1044642.000000000000000;0
5122;-742902.166999999433756;-1043373.543999999761581;0
3160;-743959.590999998152256;-1042557.386999998241663;0
4760;-742826.947000000625849;-1042799.914000000804663;0
6145;-742315.708000000566244;-1043069.881999999284744;0
274;-743359.000000000000000;-1043833.000000000000000;0
4649;-742732.228999998420477;-1042525.100000001490116;0
5107;-742857.611999999731779;-1043458.278000000864267;0
1989;-743481.000000000000000;-1044876.000000000000000;0
6103;-742213.102000001817942;-1043103.528999999165535;0
5598;-743412.839999999850988;-1043680.403000000864267;0
216;-743023.000000000000000;-1043539.000000000000000;0
2154;-742805.000000000000000;-1045147.000000000000000;0
4984;-742580.537999998778105;-1043025.210999999195337;0
4023;-743246.635000001639128;-1043864.364999998360872;0
1854;-742675.000000000000000;-1044271.000000000000000;0
5113;-742946.795000001788139;-1043444.427999999374151;0
724;-741987.000000000000000;-1042981.000000000000000;0
6974;-743127.620000001043081;-1044518.800000000745058;0
7829;-743509.649999998509884;-1045166.399999998509884;0
4935;-742447.241999998688698;-1042699.399000000208616;0
5512;-743426.556000001728535;-1043602.920000001788139;0
1970;-743380.000000000000000;-1044854.000000000000000;0
3959;-743417.421999998390675;-1043577.730000000447035;0
6150;-742311.879999998956919;-1043062.857000000774860;0
7146;-742819.425000000745058;-1044426.225000001490116;0
993;-741977.000000000000000;-1044436.000000000000000;0
6180;-742311.429000001400709;-1043057.635999999940395;0
6763;-741117.219999998807907;-1044428.989999998360872;0
4874;-742795.429999999701977;-1042925.910000000149012;0
4962;-742387.429999999701977;-1043028.129999998956919;0
1218;-742120.000000000000000;-1044309.000000000000000;0
1987;-743480.000000000000000;-1044820.000000000000000;0
4846;-742981.635999999940395;-1042805.254000000655651;0
4672;-742811.831999998539686;-1042675.907999999821186;0
7155;-742920.776999998837709;-1044546.934000000357628;0
4794;-743065.828999999910593;-1042673.377000000327826;0
1162;-741087.000000000000000;-1044511.000000000000000;0
601;-741823.000000000000000;-1043224.000000000000000;0
2526;-741087.000000000000000;-1044616.000000000000000;0
6241;-742365.649999998509884;-1043065.059999998658895;0
6133;-742309.820000000298023;-1043062.171999998390675;0
5222;-743271.000000000000000;-1043543.149999998509884;0
4926;-742452.660000000149012;-1042896.190000001341105;0
4767;-742786.899999998509884;-1042835.736000001430511;0
792;-741718.000000000000000;-1042599.000000000000000;0
1367;-742137.000000000000000;-1044959.000000000000000;0
893;-742956.000000000000000;-1042572.000000000000000;0
6283;-742308.969000000506639;-1043049.539999999105930;0
4514;-742555.050000000745058;-1042761.809999998658895;0
6783;-741340.728000000119209;-1044457.412000000476837;0
6186;-742314.337999999523163;-1043061.517000000923872;0
266;-743321.000000000000000;-1043735.000000000000000;0
7130;-743306.429999999701977;-1044539.519999999552965;0
6189;-742312.041999999433756;-1043057.302000001072884;0
248;-743439.000000000000000;-1043748.000000000000000;0
3945;-743388.361000001430511;-1043434.486000001430511;0
5678;-743404.363000001758337;-1043717.368999999016523;0
1421;-741587.000000000000000;-1044356.000000000000000;0
4592;-742448.190999999642372;-1042642.517999999225140;0
1117;-741066.000000000000000;-1044603.000000000000000;0
5580;-743409.831000000238419;-1043636.449000000953674;0
5157;-743178.671999998390675;-1043354.681000001728535;0
5244;-743361.021000001579523;-1043374.999000001698732;0
8053;-742224.410000000149012;-1044970.879999998956919;0
529;-742162.000000000000000;-1043803.000000000000000;0
4955;-742383.649999998509884;-1043019.250000000000000;0
5590;-743422.570000000298023;-1043679.642000000923872;0
5503;-743427.870000001043081;-1043698.647999998182058;0
4799;-743008.011999998241663;-1042697.245999999344349;0
4472;-741816.140000000596046;-1042675.499000001698732;0
262;-743408.000000000000000;-1043731.000000000000000;0
4703;-742697.859000001102686;-1042783.011999998241663;0
876;-741953.000000000000000;-1042636.000000000000000;0
6272;-742325.379000000655651;-1043017.383000001311302;0
1464;-741899.000000000000000;-1043994.000000000000000;0
5156;-743160.188999999314547;-1043355.291999999433756;0
5636;-743427.432000000029802;-1043681.359999999403954;0
5518;-743427.500999998301268;-1043621.975000001490116;0
5111;-742892.337999999523163;-1043424.370999999344349;0
5582;-743410.127000000327826;-1043640.197999998927116;0
4801;-742998.943999998271465;-1042721.118000000715256;0
4424;-742225.300000000745058;-1043033.250000000000000;0
842;-742101.000000000000000;-1042521.000000000000000;0
2566;-741010.000000000000000;-1044427.000000000000000;0
3832;-743029.390000000596046;-1042595.910000000149012;0
6778;-741060.820000000298023;-1044484.339999999850988;0
4975;-742477.829999998211861;-1043016.923000000417233;0
5162;-743180.460999999195337;-1043323.660000000149012;0
4958;-742349.620000001043081;-1043004.539999999105930;0
6248;-742372.506000000983477;-1043051.769999999552965;0
4699;-742676.469999998807907;-1042731.760000001639128;0
2152;-742814.000000000000000;-1045106.000000000000000;0
3787;-743130.989999998360872;-1042979.320000000298023;0
4978;-742491.822999998927116;-1043028.688000001013279;0
4765;-742822.897999998182058;-1042850.499000001698732;0
6226;-742320.660999998450279;-1043065.366999998688698;0
4702;-742669.300000000745058;-1042747.399999998509884;0
4747;-742866.289999999105930;-1042753.390000000596046;0
1957;-743402.000000000000000;-1044519.000000000000000;0
1501;-741475.000000000000000;-1044292.000000000000000;0
4652;-742775.500000000000000;-1042533.997999999672174;0
5746;-743415.399000000208616;-1043698.644000001251698;0
1519;-741754.000000000000000;-1043956.000000000000000;0
1452;-741519.000000000000000;-1044574.000000000000000;0
5655;-743429.699000000953674;-1043704.359999999403954;0
4705;-742714.100000001490116;-1042599.829999998211861;0
4947;-742399.918000001460314;-1042993.458000000566244;0
533;-742137.000000000000000;-1043750.000000000000000;0
3747;-743250.879999998956919;-1042956.620000001043081;0
1149;-741311.000000000000000;-1044471.000000000000000;0
4670;-742810.120000001043081;-1042644.289999999105930;0
1400;-741719.000000000000000;-1044132.000000000000000;0
4651;-742756.375000000000000;-1042524.938000001013279;0
6660;-741490.809999998658895;-1044176.750000000000000;0
261;-743429.000000000000000;-1043723.000000000000000;0
