OID_;X;Y;TEMPERATURE
7;-743479.000000000000000;-1042567.000000000000000;0
3063;-744133.098999999463558;-1042851.478999998420477;0
5788;-743488.300000000745058;-1042088.320000000298023;0
2255;-743181.000000000000000;-1045372.000000000000000;0
2760;-743863.331000000238419;-1043483.304000001400709;0
2891;-744029.914000000804663;-1043200.478000000119209;0
2324;-742589.000000000000000;-1045490.000000000000000;0
1608;-742391.000000000000000;-1044383.000000000000000;0
1766;-741257.000000000000000;-1044204.000000000000000;0
2466;-743460.000000000000000;-1044740.000000000000000;0
7132;-743262.120000001043081;-1044825.699999999254942;0
2168;-743025.000000000000000;-1045134.000000000000000;0
3916;-743964.037999998778105;-1043492.932999998331070;0
745;-741649.000000000000000;-1042968.000000000000000;0
1561;-743186.000000000000000;-1045098.000000000000000;0
2262;-742999.000000000000000;-1045686.000000000000000;0
7260;-742953.010000001639128;-1044873.530000001192093;0
2189;-743472.000000000000000;-1045183.000000000000000;0
4071;-742929.394999999552965;-1043807.585000000894070;0
2641;-743432.578999999910593;-1042583.418999999761581;0
2211;-743248.000000000000000;-1045258.000000000000000;0
6873;-741769.339999999850988;-1045285.489999998360872;0
537;-742099.000000000000000;-1043663.000000000000000;0
709;-741861.000000000000000;-1042862.000000000000000;0
7704;-742256.021000001579523;-1044313.592999998480082;0
3422;-743740.361000001430511;-1043095.657999999821186;0
2501;-742746.000000000000000;-1045430.000000000000000;0
5995;-744441.440999999642372;-1042779.568999998271465;0
7409;-743521.629999998956919;-1045356.570000000298023;0
7979;-741161.500000000000000;-1044398.210000000894070;0
110;-744127.000000000000000;-1042724.000000000000000;3
7746;-742234.789999999105930;-1045549.890000000596046;0
5308;-743062.039999999105930;-1043186.831999998539686;0
6722;-742357.717000000178814;-1044705.708000000566244;0
80;-744067.000000000000000;-1043330.000000000000000;0
2330;-742403.000000000000000;-1045511.000000000000000;0
1059;-741637.000000000000000;-1045095.000000000000000;0
651;-742490.000000000000000;-1043564.000000000000000;0
3768;-743006.370000001043081;-1042978.829999998211861;0
3542;-744575.274000000208616;-1042656.160000000149012;0
461;-741713.000000000000000;-1043304.000000000000000;0
2081;-742551.000000000000000;-1044621.000000000000000;0
6448;-744017.179999999701977;-1043123.899999998509884;0
3470;-745024.565000001341105;-1042295.905000001192093;0
3845;-743172.920000001788139;-1042573.210000000894070;0
7721;-742941.157000001519918;-1044215.368000000715256;0
3578;-744924.046000000089407;-1042547.359000001102686;0
7015;-742554.570000000298023;-1044360.725000001490116;0
1411;-741639.480000000447035;-1044683.019999999552965;0
1521;-741808.000000000000000;-1043917.000000000000000;3
1873;-743410.000000000000000;-1044260.000000000000000;0
1791;-742157.000000000000000;-1044163.000000000000000;0
738;-741818.000000000000000;-1043024.000000000000000;0
1659;-741420.000000000000000;-1044790.000000000000000;0
671;-742489.000000000000000;-1043245.000000000000000;0
1674;-741099.000000000000000;-1044736.000000000000000;0
7147;-742827.925000000745058;-1044451.385000001639128;0
296;-742950.170000001788139;-1044097.429999999701977;0
5068;-742837.162999998778105;-1043263.965999998152256;0
280;-743053.000000000000000;-1043875.000000000000000;0
1865;-743458.000000000000000;-1044233.000000000000000;0
2091;-742920.000000000000000;-1044593.000000000000000;0
2485;-741285.420000001788139;-1044820.140000000596046;0
6858;-741492.363000001758337;-1044950.462999999523163;0
1942;-743283.000000000000000;-1044370.000000000000000;0
7995;-741545.920000001788139;-1045160.100000001490116;0
2222;-743058.000000000000000;-1045420.000000000000000;0
7276;-742801.670000001788139;-1044613.309999998658895;0
2399;-742121.000000000000000;-1045372.000000000000000;0
514;-742119.000000000000000;-1043141.000000000000000;0
826;-742191.000000000000000;-1042616.000000000000000;0
4692;-742681.477000001817942;-1042600.622000001370907;0
602;-741828.000000000000000;-1043190.000000000000000;0
2020;-743260.000000000000000;-1044941.000000000000000;0
4020;-743160.616000000387430;-1043872.782999999821186;0
3747;-743250.879999998956919;-1042956.620000001043081;0
1371;-742089.000000000000000;-1044807.000000000000000;0
3314;-743758.675999999046326;-1042905.688999999314547;0
3802;-743068.190000001341105;-1042879.710000000894070;0
2489;-742079.000000000000000;-1044278.000000000000000;0
4178;-742382.640000000596046;-1044160.138000000268221;0
6145;-742315.708000000566244;-1043069.881999999284744;0
1015;-742126.000000000000000;-1044599.000000000000000;0
735;-741910.000000000000000;-1043014.000000000000000;0
528;-742187.000000000000000;-1043838.000000000000000;0
622;-742271.000000000000000;-1043302.000000000000000;0
1724;-741478.000000000000000;-1045023.000000000000000;0
2276;-742865.000000000000000;-1045649.000000000000000;0
3531;-744733.070999998599291;-1042679.260000001639128;0
3871;-742356.649999998509884;-1042420.543999999761581;0
1461;-741473.000000000000000;-1044266.000000000000000;0
2339;-742747.000000000000000;-1045548.000000000000000;0
3752;-743213.949999999254942;-1042902.719999998807907;0
1489;-741055.000000000000000;-1044209.000000000000000;0
1140;-741475.000000000000000;-1044461.000000000000000;0
3701;-744582.008000001311302;-1042507.443999998271465;0
1430;-741993.000000000000000;-1044260.000000000000000;0
1545;-742236.000000000000000;-1044234.000000000000000;0
7146;-742819.425000000745058;-1044426.225000001490116;0
2315;-742854.000000000000000;-1045460.000000000000000;0
1367;-742137.000000000000000;-1044959.000000000000000;0
4004;-743345.877000000327826;-1044053.135999999940395;0
283;-743026.000000000000000;-1043788.000000000000000;0
909;-742183.000000000000000;-1042503.000000000000000;0
1006;-741930.000000000000000;-1044565.000000000000000;0
403;-742307.000000000000000;-1043931.000000000000000;0
1523;-741679.000000000000000;-1043865.000000000000000;0
1215;-742091.000000000000000;-1044365.000000000000000;0
2149;-742819.000000000000000;-1045024.000000000000000;0
4082;-742825.565000001341105;-1043737.364999998360872;0
1051;-741775.000000000000000;-1044980.000000000000000;0
338;-742602.000000000000000;-1043933.000000000000000;0
4150;-742581.789999999105930;-1044138.429999999701977;0
3273;-743642.442999999970198;-1042796.677999999374151;0
697;-742101.000000000000000;-1042908.000000000000000;0
7778;-743070.728000000119209;-1045812.342000000178814;0
4248;-742157.039999999105930;-1043376.699999999254942;0
1450;-741527.000000000000000;-1044632.000000000000000;0
5116;-742947.859000001102686;-1043386.767000000923872;0
594;-741896.000000000000000;-1043296.000000000000000;0
2235;-743401.000000000000000;-1045221.000000000000000;0
1332;-741793.000000000000000;-1044755.000000000000000;0
4987;-742641.745000001043081;-1043011.309999998658895;0
4770;-742872.535000000149012;-1042899.679000001400709;0
984;-741917.000000000000000;-1044411.000000000000000;26
3971;-743206.815000001341105;-1043721.065000001341105;0
4603;-742442.480000000447035;-1042617.250000000000000;0
6099;-741947.280000001192093;-1043424.289999999105930;0
6712;-742273.328000001609325;-1044860.912000000476837;0
5316;-743075.980000000447035;-1043041.059999998658895;0
4538;-742291.464000001549721;-1042734.344000000506639;0
4577;-742376.686000000685453;-1042590.309999998658895;0
839;-742021.000000000000000;-1042510.000000000000000;0
1404;-741692.000000000000000;-1044355.000000000000000;0
1929;-743440.000000000000000;-1044410.000000000000000;0
5456;-742761.041000001132488;-1043254.350999999791384;0
7316;-742603.460000000894070;-1045033.969999998807907;0
7120;-743351.160000000149012;-1044618.460000000894070;0
3812;-743231.179999999701977;-1042815.199999999254942;0
8069;-742226.440000001341105;-1045255.949999999254942;0
516;-742160.000000000000000;-1043135.000000000000000;0
3367;-743914.585000000894070;-1043020.743999999016523;0
2477;-741238.370000001043081;-1044535.289999999105930;0
6125;-743428.124000001698732;-1043615.223999999463558;0
8076;-742050.429999999701977;-1045256.199999999254942;0
1310;-741623.000000000000000;-1044829.000000000000000;0
681;-742383.000000000000000;-1043170.000000000000000;0
8260;-742091.730000000447035;-1042690.769999999552965;0
7814;-741769.006999999284744;-1044058.535999998450279;0
1272;-742237.000000000000000;-1044545.000000000000000;0
3838;-743113.550000000745058;-1042543.399999998509884;0
2557;-741318.000000000000000;-1044384.000000000000000;0
693;-742284.000000000000000;-1043062.000000000000000;0
505;-741917.000000000000000;-1043153.000000000000000;0
2409;-742363.000000000000000;-1045093.000000000000000;0
3809;-742980.300000000745058;-1042944.469999998807907;0
1091;-741531.480000000447035;-1044543.440000001341105;0
6207;-742313.287000000476837;-1043056.642000000923872;0
1546;-742219.000000000000000;-1044147.000000000000000;0
7038;-743316.394999999552965;-1044240.155000001192093;0
7220;-742418.820000000298023;-1044813.199999999254942;0
1780;-741214.000000000000000;-1043934.000000000000000;0
3806;-743010.089999999850988;-1042912.410000000149012;0
1586;-742372.000000000000000;-1044785.000000000000000;0
4951;-742335.579999998211861;-1042934.429999999701977;0
4721;-742883.219999998807907;-1042605.010000001639128;0
1539;-741977.000000000000000;-1043997.000000000000000;0
6234;-742324.105000000447035;-1043076.613000001758337;0
7022;-743155.660000000149012;-1044074.410000000149012;0
3092;-743909.377999998629093;-1042780.322999998927116;0
1121;-741765.000000000000000;-1044444.000000000000000;0
6240;-742364.495999999344349;-1043067.289999999105930;0
6324;-745068.543000001460314;-1042720.445999998599291;0
1030;-741975.000000000000000;-1044753.000000000000000;0
4428;-742206.750000000000000;-1043097.800000000745058;0
4795;-743049.835000000894070;-1042669.013000000268221;0
6997;-743109.160000000149012;-1044453.600000001490116;0
8285;-742232.780000001192093;-1042821.149999998509884;0
5196;-743199.263000000268221;-1043326.401000000536442;0
7248;-742757.960000000894070;-1044826.929999999701977;0
3148;-744008.699000000953674;-1042624.668999999761581;0
1930;-743415.000000000000000;-1044409.000000000000000;0
1286;-742221.460000000894070;-1044465.969999998807907;0
5258;-743356.739999998360872;-1043230.039999999105930;0
1592;-742378.000000000000000;-1044936.000000000000000;0
5129;-743046.677000001072884;-1043376.409000001847744;0
632;-742130.000000000000000;-1043287.000000000000000;0
1305;-741826.000000000000000;-1044678.000000000000000;0
6279;-742306.210000000894070;-1043033.421999998390675;0
3211;-743651.409000001847744;-1042483.458999998867512;0
2169;-742902.000000000000000;-1045108.000000000000000;0
4455;-741714.589000001549721;-1042663.557000000029802;0
1370;-742061.000000000000000;-1044797.000000000000000;0
1473;-741642.000000000000000;-1044158.000000000000000;0
7165;-742711.789999999105930;-1044504.984999999403954;0
2158;-742781.000000000000000;-1045197.000000000000000;0
6312;-743933.359999999403954;-1042580.719999998807907;0
6258;-742382.381999999284744;-1043032.370999999344349;0
1749;-742065.000000000000000;-1045064.000000000000000;0
4205;-742325.267999999225140;-1043571.951000001281500;0
4610;-742548.888000000268221;-1042601.879000000655651;0
227;-742846.000000000000000;-1043520.000000000000000;0
6673;-742244.289999999105930;-1044153.350000001490116;0
4463;-742198.989999998360872;-1042569.030000001192093;0
4898;-742571.280000001192093;-1042840.859999999403954;0
7004;-743069.289999999105930;-1044326.469999998807907;0
4730;-742831.050000000745058;-1042696.600000001490116;0
4522;-742668.079999998211861;-1042813.780000001192093;0
3981;-743341.517000000923872;-1043837.353999998420477;0
2478;-741241.859999999403954;-1044562.089999999850988;0
1083;-741667.000000000000000;-1044526.000000000000000;0
4478;-741867.359999999403954;-1042693.289999999105930;0
3833;-743029.679999999701977;-1042612.300000000745058;0
1265;-742047.000000000000000;-1044960.000000000000000;0
4244;-742179.410000000149012;-1043422.000000000000000;0
5647;-743429.070999998599291;-1043694.699000000953674;0
4047;-743210.230000000447035;-1043992.289999999105930;0
2050;-743460.000000000000000;-1045072.000000000000000;0
7086;-743333.149999998509884;-1044527.250000000000000;0
5688;-743415.267000000923872;-1043631.945000000298023;0
4074;-742943.350000001490116;-1043880.304999999701977;0
609;-741984.000000000000000;-1043272.000000000000000;0
1105;-741274.000000000000000;-1044576.000000000000000;0
4623;-742533.778999999165535;-1042585.824000000953674;0
4144;-742704.414999999105930;-1043822.484999999403954;0
4926;-742452.660000000149012;-1042896.190000001341105;0
3268;-743594.046999998390675;-1042721.412999998778105;0
2546;-741750.000000000000000;-1044271.000000000000000;0
7262;-742990.940000001341105;-1044886.989999998360872;0
1669;-741077.000000000000000;-1044092.000000000000000;0
5239;-743361.096000000834465;-1043279.333999998867512;0
6189;-742312.041999999433756;-1043057.302000001072884;0
2381;-742313.000000000000000;-1045438.000000000000000;0
1971;-743385.000000000000000;-1044881.000000000000000;0
1166;-741020.000000000000000;-1044520.000000000000000;0
3433;-743896.050000000745058;-1042546.662000000476837;0
5419;-742434.690000001341105;-1042846.280000001192093;0
1111;-741167.030000001192093;-1044590.170000001788139;0
7222;-742428.280000001192093;-1044822.489999998360872;0
2042;-743505.000000000000000;-1044958.000000000000000;0
5714;-743423.756000000983477;-1043635.103999998420477;0
4755;-742734.960000000894070;-1042778.019999999552965;0
7739;-742301.399000000208616;-1045040.431000001728535;0
1179;-741934.000000000000000;-1044251.000000000000000;0
4625;-742594.258000001311302;-1042576.114000000059605;0
1446;-741545.000000000000000;-1044774.000000000000000;0
988;-741820.000000000000000;-1044516.000000000000000;0
2075;-743114.000000000000000;-1044772.000000000000000;0
7040;-743356.140000000596046;-1044164.359999999403954;0
5241;-743365.063000001013279;-1043245.954999998211861;0
6249;-742373.554999999701977;-1043049.822000000625849;0
6221;-742317.633000001311302;-1043061.541000001132488;0
7185;-742600.515000000596046;-1044717.333999998867512;0
173;-743463.000000000000000;-1043463.000000000000000;0
2226;-743057.000000000000000;-1045470.000000000000000;0
6501;-741689.493000000715256;-1044942.905000001192093;0
6975;-743116.140000000596046;-1044506.469999998807907;0
4974;-742489.458999998867512;-1043047.024999998509884;0
5177;-743336.440999999642372;-1043440.883999999612570;0
1458;-741506.000000000000000;-1044384.000000000000000;0
4233;-742334.782000001519918;-1043445.793000001460314;0
4605;-742489.238000001758337;-1042616.754999998956919;0
5204;-743246.423999998718500;-1043308.298999998718500;0
5936;-743333.519000001251698;-1043956.541999999433756;0
4593;-742510.820000000298023;-1042652.203999999910593;0
5230;-743335.399999998509884;-1043517.670000001788139;0
3951;-743433.379999998956919;-1043586.600000001490116;0
4774;-742900.078999999910593;-1042854.859000001102686;0
7037;-743316.085000000894070;-1044222.170000001788139;0
7283;-742804.480000000447035;-1044732.769999999552965;0
519;-742239.000000000000000;-1043113.000000000000000;0
209;-743108.000000000000000;-1043583.000000000000000;0
5579;-743409.682999998331070;-1043634.574999999254942;0
4203;-742299.442000001668930;-1043608.692000001668930;0
6255;-742379.991999998688698;-1043037.068999998271465;0
2105;-743158.000000000000000;-1044971.000000000000000;0
4140;-742831.635999999940395;-1044004.828999999910593;0
2576;-742487.000000000000000;-1045483.000000000000000;0
5517;-743427.287000000476837;-1043618.956999998539686;0
2520;-741847.000000000000000;-1045324.000000000000000;0
4085;-742812.431000001728535;-1043657.114000000059605;0
397;-742355.000000000000000;-1043861.000000000000000;0
1298;-741964.000000000000000;-1044736.000000000000000;0
4737;-742718.399999998509884;-1042684.079999998211861;0
1325;-741894.000000000000000;-1044959.000000000000000;0
4080;-742832.480000000447035;-1043782.030000001192093;0
387;-742421.000000000000000;-1043763.000000000000000;0
6251;-742377.396999999880791;-1043042.284000001847744;0
1705;-741257.219999998807907;-1044695.690000001341105;0
4009;-743231.157999999821186;-1044047.155000001192093;0
728;-741997.000000000000000;-1042918.000000000000000;0
6310;-744674.719999998807907;-1042585.710000000894070;0
3945;-743388.361000001430511;-1043434.486000001430511;0
1776;-741200.000000000000000;-1044007.000000000000000;0
6224;-742315.320000000298023;-1043057.335000000894070;0
1517;-741964.000000000000000;-1044034.000000000000000;0
1115;-741105.000000000000000;-1044598.000000000000000;0
4811;-743040.379999998956919;-1042799.609999999403954;0
4680;-742759.370000001043081;-1042864.140000000596046;0
4661;-742816.708000000566244;-1042503.918999999761581;0
1514;-741882.000000000000000;-1044096.000000000000000;0
1703;-741320.000000000000000;-1044686.000000000000000;0
4116;-742740.429999999701977;-1044064.789999999105930;0
533;-742137.000000000000000;-1043750.000000000000000;0
3762;-743173.489999998360872;-1042984.559999998658895;0
5756;-743426.113000001758337;-1043680.102000001817942;0
1291;-742205.000000000000000;-1044568.000000000000000;0
1584;-742368.000000000000000;-1044717.000000000000000;0
6659;-741515.070000000298023;-1044171.070000000298023;0
4820;-742927.769999999552965;-1042786.710000000894070;0
6366;-741957.399999998509884;-1042652.609999999403954;0
7173;-742660.850000001490116;-1044535.730000000447035;0
1823;-742973.000000000000000;-1044174.000000000000000;0
6691;-742386.879000000655651;-1045082.589000001549721;0
4939;-742448.866999998688698;-1043072.822999998927116;0
874;-741755.000000000000000;-1042675.000000000000000;0
1365;-742125.050000000745058;-1044945.710000000894070;0
1573;-742358.000000000000000;-1044452.000000000000000;0
5685;-743396.092999998480082;-1043720.434000000357628;0
335;-742635.000000000000000;-1043966.000000000000000;0
4499;-742338.899999998509884;-1042707.250000000000000;0
1242;-742137.000000000000000;-1044481.000000000000000;0
1214;-742064.000000000000000;-1044358.000000000000000;0
1043;-741872.000000000000000;-1044711.000000000000000;0
4227;-742108.530000001192093;-1043326.289999999105930;0
5225;-743277.453999999910593;-1043558.087999999523163;0
820;-742019.000000000000000;-1042600.000000000000000;0
3351;-743954.622000001370907;-1043011.489999998360872;0
2420;-742431.000000000000000;-1045120.000000000000000;0
6170;-742311.548000000417233;-1043059.381000000983477;0
884;-741771.000000000000000;-1042776.000000000000000;0
1855;-742642.000000000000000;-1044286.000000000000000;0
7983;-741127.800000000745058;-1044416.199999999254942;0
6374;-741977.035000000149012;-1042674.153999999165535;0
3107;-743778.888000000268221;-1042682.131999999284744;0
323;-742711.000000000000000;-1044140.000000000000000;0
5213;-743326.385999999940395;-1043368.675999999046326;0
5026;-742631.168999999761581;-1042903.938999999314547;0
4332;-742410.359000001102686;-1043282.916000001132488;0
3569;-744704.920000001788139;-1042585.679999999701977;0
1628;-742449.000000000000000;-1044494.000000000000000;0
1328;-742037.000000000000000;-1045043.000000000000000;0
6166;-742314.649999998509884;-1043065.006999999284744;0
1117;-741066.000000000000000;-1044603.000000000000000;0
5578;-743409.534000001847744;-1043632.701000001281500;0
395;-742369.000000000000000;-1043840.000000000000000;0
4236;-742406.842999998480082;-1043504.015000000596046;0
347;-742542.000000000000000;-1043795.000000000000000;0
7955;-741807.699999999254942;-1044246.519999999552965;0
4664;-742806.739999998360872;-1042547.980000000447035;0
17;-743587.000000000000000;-1042394.000000000000000;0
6726;-742476.517999999225140;-1044410.600000001490116;0
1620;-742439.000000000000000;-1044323.000000000000000;0
2085;-742426.000000000000000;-1044797.000000000000000;0
4954;-742405.539999999105930;-1043024.640000000596046;0
6179;-742312.195000000298023;-1043059.041000001132488;0
2008;-743242.000000000000000;-1044759.000000000000000;0
955;-742230.000000000000000;-1043005.000000000000000;0
225;-742885.000000000000000;-1043535.000000000000000;0
1159;-741137.000000000000000;-1044493.000000000000000;0
4744;-742848.129999998956919;-1042759.629999998956919;0
5675;-743407.907999999821186;-1043716.054999999701977;0
1849;-742732.000000000000000;-1044228.000000000000000;0
5678;-743404.363000001758337;-1043717.368999999016523;0
3017;-744468.008999999612570;-1042806.090999998152256;0
5961;-742431.225000001490116;-1044003.574999999254942;0
4159;-742455.734999999403954;-1043898.035000000149012;0
7694;-742486.548999998718500;-1045129.752000000327826;0
4125;-742857.695000000298023;-1044110.460000000894070;0
3943;-743413.429000001400709;-1043376.822000000625849;0
4220;-742214.344999998807907;-1043580.359999999403954;0
674;-742463.000000000000000;-1043211.000000000000000;0
1106;-741293.000000000000000;-1044589.000000000000000;0
1932;-743359.000000000000000;-1044408.000000000000000;0
5757;-743420.747999999672174;-1043633.940999999642372;0
4831;-743041.170000001788139;-1042862.530000001192093;0
4900;-742508.089999999850988;-1042815.289999999105930;0
623;-742254.000000000000000;-1043325.000000000000000;0
272;-743396.000000000000000;-1043809.000000000000000;0
6009;-743896.859000001102686;-1042750.497000001370907;0
6783;-741340.728000000119209;-1044457.412000000476837;0
4676;-742792.579999998211861;-1042771.519999999552965;0
4253;-742109.368000000715256;-1043416.399999998509884;0
5303;-743164.818999998271465;-1043211.078000001609325;0
1947;-743286.000000000000000;-1044465.000000000000000;0
3340;-743960.212999999523163;-1043080.166999999433756;0
2257;-742956.000000000000000;-1045558.000000000000000;0
6696;-742332.717000000178814;-1044815.649999998509884;0
5167;-743219.324999999254942;-1043405.249000001698732;0
7200;-742561.710999999195337;-1044911.469999998807907;0
1212;-742038.000000000000000;-1044383.000000000000000;0
7660;-742321.396999999880791;-1045335.578999999910593;0
1122;-741749.000000000000000;-1044455.000000000000000;0
4161;-742506.254999998956919;-1044181.925000000745058;0
7032;-743301.464999999850988;-1044106.190000001341105;0
5727;-743422.451999999582767;-1043637.473000001162291;0
2562;-741090.000000000000000;-1044404.000000000000000;0
4616;-742545.416999999433756;-1042662.541999999433756;0
6373;-741992.809999998658895;-1042677.000000000000000;0
570;-742098.000000000000000;-1043582.000000000000000;0
4320;-742264.149000000208616;-1043259.541999999433756;0
553;-742251.000000000000000;-1043741.000000000000000;0
2481;-741255.609999999403954;-1044671.179999999701977;0
382;-742481.000000000000000;-1043751.000000000000000;0
5270;-742989.153999999165535;-1043210.684999998658895;0
578;-742023.000000000000000;-1043464.000000000000000;0
3410;-743766.532000001519918;-1043023.280999999493361;0
5758;-743420.897999998182058;-1043635.921999998390675;0
785;-741702.000000000000000;-1042622.000000000000000;0
2018;-743244.000000000000000;-1044909.000000000000000;0
6709;-742264.587999999523163;-1044776.254999998956919;0
8055;-742223.859999999403954;-1045007.899999998509884;0
7025;-743199.914999999105930;-1044070.515000000596046;0
5447;-743129.958999998867512;-1043365.166000001132488;0
1808;-743187.000000000000000;-1044539.000000000000000;0
3952;-743407.521999999880791;-1043538.500999998301268;0
5194;-743205.761999998241663;-1043310.581999998539686;0
4120;-742715.179999999701977;-1043974.089999999850988;0
1388;-742152.000000000000000;-1045026.000000000000000;0
212;-743080.000000000000000;-1043557.000000000000000;0
5128;-743040.467000000178814;-1043389.765999998897314;0
759;-741659.000000000000000;-1042650.000000000000000;0
91;-744044.000000000000000;-1043053.000000000000000;0
2162;-742917.000000000000000;-1045162.000000000000000;0
3378;-743818.598999999463558;-1042922.491999998688698;0
1318;-741838.000000000000000;-1044940.000000000000000;0
6766;-741193.449999999254942;-1044424.320000000298023;0
7144;-742803.668999999761581;-1044378.798999998718500;0
1039;-741914.000000000000000;-1044595.000000000000000;0
3949;-743420.780000001192093;-1043527.820000000298023;0
4668;-742810.210000000894070;-1042618.969999998807907;0
6981;-743063.800000000745058;-1044366.239999998360872;0
1128;-741655.000000000000000;-1044448.000000000000000;0
4324;-742269.346000000834465;-1043165.410999998450279;0
1321;-741825.000000000000000;-1044923.000000000000000;0
8066;-742286.199999999254942;-1045237.250000000000000;0
4729;-742855.690000001341105;-1042695.640000000596046;0
4039;-743159.070000000298023;-1043772.795000001788139;0
3962;-743407.190000001341105;-1043535.730000000447035;0
3127;-743955.348000001162291;-1042668.469000000506639;0
4627;-742601.138999998569489;-1042606.791000001132488;0
6103;-742213.102000001817942;-1043103.528999999165535;0
734;-741935.000000000000000;-1043014.000000000000000;0
4832;-743039.079999998211861;-1042840.850000001490116;0
1543;-742235.000000000000000;-1044164.000000000000000;0
2143;-742859.000000000000000;-1045086.000000000000000;0
4854;-742971.159000001847744;-1042912.429000001400709;0
5003;-742589.811999998986721;-1042974.888999998569489;0
6113;-742229.061000000685453;-1043368.359000001102686;0
5444;-743183.024000000208616;-1043210.600000001490116;0
1110;-741220.730000000447035;-1044598.480000000447035;0
5955;-742960.732999999076128;-1043520.888999998569489;0
6165;-742315.407000001519918;-1043066.436000000685453;0
2578;-742494.000000000000000;-1045542.000000000000000;0
7986;-741040.829999998211861;-1044408.250000000000000;0
7190;-742577.989999998360872;-1044771.690000001341105;0
3801;-743091.350000001490116;-1042882.719999998807907;0
7956;-741777.379999998956919;-1044260.170000001788139;0
226;-742879.000000000000000;-1043516.000000000000000;0
5198;-743259.600999999791384;-1043302.061000000685453;0
1407;-741650.000000000000000;-1044242.000000000000000;0
1098;-741435.000000000000000;-1044571.000000000000000;0
5234;-743348.486000001430511;-1043412.741999998688698;0
6001;-742006.079999998211861;-1043292.300000000745058;0
6849;-741635.855999998748302;-1045019.947999998927116;0
7654;-742242.081000000238419;-1045273.263999998569489;0
4105;-742678.771999999880791;-1043769.206000000238419;0
4461;-742218.370000001043081;-1042583.800000000745058;0
1422;-742199.000000000000000;-1044127.000000000000000;0
6096;-742098.760000001639128;-1043615.589999999850988;0
4024;-743223.734999999403954;-1043859.954999998211861;0
1131;-741643.000000000000000;-1044433.000000000000000;0
6945;-742955.907000001519918;-1043932.182999998331070;0
1243;-742122.000000000000000;-1044502.000000000000000;0
5124;-742983.513000000268221;-1043417.271999999880791;0
4674;-742806.475999999791384;-1042703.594999998807907;0
1434;-741931.000000000000000;-1044293.000000000000000;0
4688;-742676.179000001400709;-1042555.322999998927116;0
6676;-742250.239999998360872;-1044174.719999998807907;0
4482;-741768.079999998211861;-1042606.449999999254942;0
4876;-742826.449999999254942;-1042944.910000000149012;0
4510;-742483.149999998509884;-1042738.460000000894070;0
7957;-741692.839999999850988;-1044277.559999998658895;0
2282;-742923.000000000000000;-1045519.000000000000000;0
6293;-742666.339999999850988;-1042695.188999999314547;0
4805;-743001.147999998182058;-1042707.644999999552965;0
6178;-742312.960000000894070;-1043060.445999998599291;0
3323;-743934.361999999731779;-1042945.002999998629093;0
7928;-743542.539999999105930;-1044784.769999999552965;0
7645;-742305.313000001013279;-1045383.625000000000000;0
4328;-742347.322000000625849;-1043375.796999998390675;0
3978;-743342.695000000298023;-1043756.835000000894070;0
4937;-742461.982000000774860;-1042671.942000001668930;0
6174;-742316.021999999880791;-1043066.065000001341105;0
4896;-742589.649999998509884;-1042838.989999998360872;0
720;-741671.000000000000000;-1042815.000000000000000;0
5512;-743426.556000001728535;-1043602.920000001788139;0
5209;-743271.947999998927116;-1043361.392000000923872;0
1505;-741606.000000000000000;-1044248.000000000000000;0
2225;-743041.000000000000000;-1045477.000000000000000;0
