OID_;X;Y;TEMPERATURE
7077;-743564.359000001102686;-1045385.210000000894070;0
5995;-744441.440999999642372;-1042779.568999998271465;0
3527;-744805.695999998599291;-1042671.809000000357628;0
3538;-744616.304000001400709;-1042656.734000001102686;0
3585;-744920.065000001341105;-1042522.129999998956919;0
3460;-744993.289000000804663;-1042693.587000001221895;0
3466;-745113.802000001072884;-1042675.725000001490116;0
3612;-744996.545000001788139;-1042292.646000001579523;0
2696;-743477.489999998360872;-1042038.000000000000000;0
1586;-742372.000000000000000;-1044785.000000000000000;0
466;-741743.000000000000000;-1043331.000000000000000;0
9;-743512.000000000000000;-1042512.000000000000000;0
1532;-741805.000000000000000;-1043858.000000000000000;0
926;-741894.000000000000000;-1042999.000000000000000;0
1674;-741099.000000000000000;-1044736.000000000000000;0
7514;-742304.866000000387430;-1044375.124000001698732;0
4146;-742666.940000001341105;-1043854.829999998211861;0
4078;-742842.960000000894070;-1043832.824999999254942;0
2214;-743162.000000000000000;-1045316.000000000000000;0
2506;-741267.000000000000000;-1044015.000000000000000;0
734;-741935.000000000000000;-1043014.000000000000000;0
747;-741690.000000000000000;-1043000.000000000000000;0
4238;-742440.263000000268221;-1043528.236000001430511;0
5306;-743103.326999999582767;-1043193.129000000655651;0
110;-744127.000000000000000;-1042724.000000000000000;3
2192;-743499.000000000000000;-1045199.000000000000000;0
1291;-742205.000000000000000;-1044568.000000000000000;0
3919;-743904.947000000625849;-1043493.929999999701977;0
6993;-743172.409000001847744;-1044501.339000001549721;0
7369;-743236.822000000625849;-1045458.699000000953674;0
7778;-743070.728000000119209;-1045812.342000000178814;0
2892;-744005.317000001668930;-1043204.537000000476837;0
3108;-743768.699999999254942;-1042671.241999998688698;0
7146;-742819.425000000745058;-1044426.225000001490116;0
1516;-741928.000000000000000;-1044062.000000000000000;0
1921;-743387.000000000000000;-1044335.000000000000000;0
502;-741901.000000000000000;-1043169.000000000000000;0
5113;-742946.795000001788139;-1043444.427999999374151;0
2259;-743001.000000000000000;-1045599.000000000000000;0
5437;-744084.208999998867512;-1043295.061999998986721;0
317;-742464.000000000000000;-1044207.000000000000000;0
2752;-743983.471000000834465;-1043454.780000001192093;0
3752;-743213.949999999254942;-1042902.719999998807907;0
2220;-743075.000000000000000;-1045396.000000000000000;0
7944;-742086.969999998807907;-1044063.079999998211861;0
2891;-744029.914000000804663;-1043200.478000000119209;0
2512;-743070.000000000000000;-1044052.000000000000000;0
1492;-741096.000000000000000;-1044331.000000000000000;0
527;-742186.000000000000000;-1043818.000000000000000;0
7928;-743542.539999999105930;-1044784.769999999552965;0
4071;-742929.394999999552965;-1043807.585000000894070;0
2146;-742845.000000000000000;-1044968.000000000000000;0
2386;-742139.000000000000000;-1045460.000000000000000;0
1933;-743329.000000000000000;-1044407.000000000000000;0
8069;-742226.440000001341105;-1045255.949999999254942;0
1722;-741672.000000000000000;-1045029.000000000000000;0
7091;-743361.839999999850988;-1044584.039999999105930;0
3845;-743172.920000001788139;-1042573.210000000894070;0
1610;-742374.000000000000000;-1044447.000000000000000;0
1013;-742076.000000000000000;-1044595.000000000000000;0
5459;-742368.519000001251698;-1043474.221999999135733;0
1843;-743041.600000001490116;-1044324.489999998360872;0
2073;-743069.000000000000000;-1044754.000000000000000;0
5064;-742811.537999998778105;-1043238.886999998241663;0
2291;-742850.000000000000000;-1045401.000000000000000;0
4309;-742042.329999998211861;-1043492.329999998211861;0
2029;-743393.000000000000000;-1045068.000000000000000;0
2257;-742956.000000000000000;-1045558.000000000000000;0
2096;-743154.000000000000000;-1044724.000000000000000;0
4175;-742721.254999998956919;-1043775.890000000596046;0
725;-741983.000000000000000;-1042939.000000000000000;0
1726;-741516.000000000000000;-1045120.000000000000000;0
2323;-742622.000000000000000;-1045487.000000000000000;0
3310;-743829.561999998986721;-1042854.063000001013279;0
7017;-742571.059999998658895;-1044267.640000000596046;0
6841;-741583.443999998271465;-1044946.208000000566244;0
7680;-742500.160000000149012;-1045137.399999998509884;0
3339;-743968.859000001102686;-1043058.642000000923872;0
696;-742077.000000000000000;-1042913.000000000000000;0
4224;-742139.756000000983477;-1043462.488000001758337;0
5241;-743365.063000001013279;-1043245.954999998211861;0
5413;-742651.872000001370907;-1042662.627999998629093;0
6726;-742476.517999999225140;-1044410.600000001490116;0
1445;-741553.000000000000000;-1044757.000000000000000;0
7279;-742799.399999998509884;-1044679.829999998211861;0
5322;-743060.379999998956919;-1043029.589999999850988;0
344;-742557.000000000000000;-1043847.000000000000000;0
2447;-742772.000000000000000;-1044159.000000000000000;0
2018;-743244.000000000000000;-1044909.000000000000000;0
512;-742063.000000000000000;-1043136.000000000000000;0
6872;-741751.719999998807907;-1045296.679999999701977;0
3371;-743840.392999999225140;-1043010.835000000894070;0
3945;-743388.361000001430511;-1043434.486000001430511;0
6114;-742234.250000000000000;-1043361.324999999254942;0
7218;-742534.100000001490116;-1044603.559999998658895;0
1658;-741404.000000000000000;-1044751.000000000000000;0
1694;-741582.000000000000000;-1044653.000000000000000;42
4529;-742762.920000001788139;-1042885.809999998658895;0
2273;-742895.000000000000000;-1045745.000000000000000;0
2561;-741214.000000000000000;-1044393.000000000000000;0
1089;-741567.949999999254942;-1044538.820000000298023;0
3973;-743161.204999998211861;-1043723.574999999254942;0
1458;-741506.000000000000000;-1044384.000000000000000;0
818;-741961.000000000000000;-1042598.000000000000000;0
787;-741714.000000000000000;-1042620.000000000000000;0
1592;-742378.000000000000000;-1044936.000000000000000;0
710;-741829.000000000000000;-1042878.000000000000000;0
6749;-742418.210999999195337;-1044329.190999999642372;0
164;-743392.000000000000000;-1043230.000000000000000;0
3094;-743906.500000000000000;-1042759.554999999701977;0
1653;-741384.000000000000000;-1044592.000000000000000;0
1027;-741984.000000000000000;-1044660.000000000000000;0
2393;-742054.000000000000000;-1045282.000000000000000;0
995;-741906.000000000000000;-1044434.000000000000000;0
547;-742316.910000000149012;-1043790.309999998658895;0
1506;-741642.000000000000000;-1044236.000000000000000;0
847;-742155.000000000000000;-1042504.000000000000000;0
4789;-742979.506000000983477;-1042555.324999999254942;0
1124;-741715.000000000000000;-1044452.000000000000000;0
2374;-742473.000000000000000;-1045546.000000000000000;0
7739;-742301.399000000208616;-1045040.431000001728535;0
5187;-743086.927000001072884;-1043435.230999998748302;0
4153;-742555.934999998658895;-1044073.285000000149012;0
7260;-742953.010000001639128;-1044873.530000001192093;0
7147;-742827.925000000745058;-1044451.385000001639128;0
6724;-742590.385000001639128;-1044428.910000000149012;0
6176;-742314.491000000387430;-1043063.256000000983477;0
5961;-742431.225000001490116;-1044003.574999999254942;0
397;-742355.000000000000000;-1043861.000000000000000;0
4460;-742216.600000001490116;-1042598.850000001490116;0
2300;-742561.000000000000000;-1045413.000000000000000;0
4609;-742557.414000000804663;-1042621.583999998867512;0
1471;-741711.000000000000000;-1044132.000000000000000;0
7046;-743398.329999998211861;-1044186.289999999105930;0
1478;-741443.000000000000000;-1044220.000000000000000;0
380;-742501.000000000000000;-1043722.000000000000000;0
3706;-744567.589999999850988;-1042534.585000000894070;0
2082;-742569.000000000000000;-1044642.000000000000000;0
1875;-743367.000000000000000;-1044261.000000000000000;0
1523;-741679.000000000000000;-1043865.000000000000000;0
533;-742137.000000000000000;-1043750.000000000000000;0
4813;-743013.550000000745058;-1042793.390000000596046;0
3537;-744632.945000000298023;-1042671.657000001519918;0
633;-742100.000000000000000;-1043296.000000000000000;0
2239;-743345.000000000000000;-1045263.000000000000000;0
7031;-743301.824999999254942;-1044080.774999998509884;0
6753;-742485.511999998241663;-1044950.206999998539686;0
4664;-742806.739999998360872;-1042547.980000000447035;0
2154;-742805.000000000000000;-1045147.000000000000000;0
5224;-743293.449999999254942;-1043542.160000000149012;0
4063;-742855.079999998211861;-1043654.695000000298023;0
519;-742239.000000000000000;-1043113.000000000000000;0
3424;-743725.243000000715256;-1043089.951999999582767;0
1352;-741840.000000000000000;-1044854.000000000000000;0
5461;-742442.704999998211861;-1043234.515000000596046;0
5195;-743232.432999998331070;-1043297.890999998897314;0
1928;-743474.000000000000000;-1044409.000000000000000;0
3746;-743261.420000001788139;-1042982.839999999850988;0
7008;-742899.559999998658895;-1044224.074999999254942;28
1215;-742091.000000000000000;-1044365.000000000000000;0
4595;-742574.953000001609325;-1042659.344000000506639;0
5778;-742917.131000000983477;-1043419.723000001162291;0
2494;-741985.000000000000000;-1044165.000000000000000;0
6997;-743109.160000000149012;-1044453.600000001490116;0
3290;-743573.385000001639128;-1042757.348999999463558;0
7187;-742595.019999999552965;-1044739.962000001221895;0
6159;-742312.495999999344349;-1043062.521000001579523;0
352;-742386.000000000000000;-1043914.000000000000000;0
4583;-742401.482999999076128;-1042625.886999998241663;0
2500;-742743.000000000000000;-1045401.000000000000000;0
3278;-743698.693999998271465;-1042862.070999998599291;0
875;-741783.000000000000000;-1042677.000000000000000;0
1369;-742029.000000000000000;-1044788.000000000000000;0
3333;-743967.447999998927116;-1042967.616000000387430;0
6155;-742315.557999998331070;-1043068.140999998897314;0
2170;-742897.000000000000000;-1045133.000000000000000;0
629;-742200.000000000000000;-1043289.000000000000000;0
588;-741950.000000000000000;-1043352.000000000000000;135
600;-741840.000000000000000;-1043212.000000000000000;0
1320;-741870.000000000000000;-1044957.000000000000000;0
6707;-742271.293999999761581;-1044721.274999998509884;0
5163;-743163.861999999731779;-1043392.113000001758337;0
1434;-741931.000000000000000;-1044293.000000000000000;0
987;-741814.000000000000000;-1044493.000000000000000;0
7174;-742639.019999999552965;-1044564.949999999254942;0
1263;-742048.000000000000000;-1044929.000000000000000;0
332;-742645.000000000000000;-1044014.000000000000000;0
5454;-742806.100999999791384;-1043305.197999998927116;0
1983;-743474.000000000000000;-1044709.000000000000000;0
3982;-743325.135000001639128;-1043857.684999998658895;0
4074;-742943.350000001490116;-1043880.304999999701977;0
5294;-743056.328999999910593;-1043196.096999999135733;0
218;-743006.000000000000000;-1043537.000000000000000;0
1838;-743004.480000000447035;-1044216.030000001192093;0
6277;-742304.633999999612570;-1043024.256000000983477;0
1755;-742144.000000000000000;-1045199.000000000000000;0
4083;-742820.771999999880791;-1043708.657000001519918;0
2243;-743292.000000000000000;-1045310.000000000000000;0
2090;-742923.000000000000000;-1044566.000000000000000;0
1269;-742246.000000000000000;-1044462.000000000000000;0
7;-743479.000000000000000;-1042567.000000000000000;0
4966;-742377.289999999105930;-1043071.030000001192093;0
1547;-742220.000000000000000;-1044181.000000000000000;0
1683;-741134.429999999701977;-1044711.329999998211861;0
5023;-742588.899000000208616;-1042870.296999998390675;0
4072;-742934.225000001490116;-1043833.899999998509884;0
4219;-742243.045000001788139;-1043600.660000000149012;0
680;-742402.109999999403954;-1043166.679999999701977;0
6172;-742317.552999999374151;-1043068.875999998301268;0
5733;-743410.142999999225140;-1043688.210999999195337;0
5174;-743296.331000000238419;-1043439.800000000745058;0
6853;-741548.899000000208616;-1045052.295000001788139;0
227;-742846.000000000000000;-1043520.000000000000000;0
2167;-743021.000000000000000;-1045154.000000000000000;0
6822;-741283.870000001043081;-1044793.059999998658895;0
5325;-742997.480000000447035;-1043042.289999999105930;0
4004;-743345.877000000327826;-1044053.135999999940395;0
5239;-743361.096000000834465;-1043279.333999998867512;0
2339;-742747.000000000000000;-1045548.000000000000000;0
4603;-742442.480000000447035;-1042617.250000000000000;0
324;-742694.000000000000000;-1044132.000000000000000;0
4783;-742933.866999998688698;-1042668.403000000864267;0
7518;-742829.780000001192093;-1045693.210000000894070;0
3212;-743646.699000000953674;-1042469.458999998867512;0
5714;-743423.756000000983477;-1043635.103999998420477;0
5725;-743422.388000000268221;-1043634.186999998986721;0
3870;-742381.989999998360872;-1042417.679999999701977;0
203;-743204.000000000000000;-1043607.000000000000000;0
273;-743381.000000000000000;-1043820.000000000000000;0
1285;-742198.000000000000000;-1044467.000000000000000;0
1463;-741933.000000000000000;-1043968.000000000000000;0
1832;-743024.000000000000000;-1044100.000000000000000;0
1395;-741799.000000000000000;-1044291.000000000000000;0
2309;-742322.000000000000000;-1045519.000000000000000;0
848;-741973.000000000000000;-1042526.000000000000000;0
1760;-741162.000000000000000;-1044101.000000000000000;0
1108;-741261.000000000000000;-1044593.000000000000000;0
2316;-742823.000000000000000;-1045463.000000000000000;0
561;-742172.000000000000000;-1043675.000000000000000;0
6104;-742208.646999999880791;-1043103.999000001698732;0
1456;-741513.000000000000000;-1044437.000000000000000;0
8282;-742183.519999999552965;-1042790.890000000596046;0
5678;-743404.363000001758337;-1043717.368999999016523;0
2469;-742941.000000000000000;-1045215.000000000000000;0
2542;-741813.000000000000000;-1044224.000000000000000;0
2487;-742101.000000000000000;-1044308.000000000000000;0
7723;-741757.929000001400709;-1044043.175000000745058;0
5941;-742044.835000000894070;-1043561.903999999165535;0
6134;-742309.011999998241663;-1043060.703000001609325;0
1479;-741407.000000000000000;-1044225.000000000000000;0
219;-742979.000000000000000;-1043549.000000000000000;0
5129;-743046.677000001072884;-1043376.409000001847744;0
6228;-742319.103999998420477;-1043062.592000000178814;0
1994;-743483.000000000000000;-1045010.000000000000000;0
1337;-741723.000000000000000;-1044886.000000000000000;0
7647;-742319.918000001460314;-1045405.197999998927116;0
4585;-742437.502000000327826;-1042630.243999999016523;0
6256;-742380.723000001162291;-1043035.640000000596046;0
4326;-742319.855000000447035;-1043419.918999999761581;0
4987;-742641.745000001043081;-1043011.309999998658895;0
2044;-743445.000000000000000;-1044960.000000000000000;0
3868;-742432.381000000983477;-1042412.094000000506639;0
4140;-742831.635999999940395;-1044004.828999999910593;0
3843;-743139.170000001788139;-1042650.050000000745058;0
4924;-742427.890999998897314;-1042890.581000000238419;0
1508;-741705.000000000000000;-1044210.000000000000000;0
3797;-743147.989999998360872;-1042854.129999998956919;0
826;-742191.000000000000000;-1042616.000000000000000;0
1791;-742157.000000000000000;-1044163.000000000000000;0
2037;-743373.000000000000000;-1044805.000000000000000;0
8049;-742198.890000000596046;-1044891.600000001490116;0
1518;-741994.000000000000000;-1044011.000000000000000;0
6946;-742974.765000000596046;-1043929.388000000268221;0
8084;-741928.710000000894070;-1045393.339999999850988;0
7021;-743129.019999999552965;-1044076.230000000447035;0
6273;-742321.806000001728535;-1043017.085000000894070;0
5654;-743429.644000001251698;-1043703.151000000536442;0
4505;-742434.910000000149012;-1042706.170000001788139;0
4475;-741839.219000000506639;-1042687.409000001847744;0
1793;-742166.000000000000000;-1044246.000000000000000;0
4048;-743218.050000000745058;-1043961.320000000298023;0
1599;-742237.000000000000000;-1044977.000000000000000;0
7350;-742556.390000000596046;-1045185.980000000447035;0
6353;-741893.070000000298023;-1042697.059999998658895;0
1293;-742037.000000000000000;-1044462.000000000000000;0
7362;-743205.807000000029802;-1045156.089999999850988;0
1499;-741413.000000000000000;-1044304.000000000000000;0
514;-742119.000000000000000;-1043141.000000000000000;0
4098;-742789.157000001519918;-1043861.918999999761581;0
1936;-743293.000000000000000;-1044272.000000000000000;0
7925;-743541.780000001192093;-1044709.149999998509884;0
7177;-742643.059999998658895;-1044579.679999999701977;0
2021;-743281.000000000000000;-1044948.000000000000000;0
6782;-741303.329999998211861;-1044447.660000000149012;0
4859;-742966.710000000894070;-1042996.302999999374151;0
1301;-741896.000000000000000;-1044703.000000000000000;0
4676;-742792.579999998211861;-1042771.519999999552965;0
3824;-743038.059999998658895;-1042573.800000000745058;0
1572;-742265.000000000000000;-1044184.000000000000000;0
4762;-742854.192000001668930;-1042825.931000001728535;0
4340;-742473.662000000476837;-1043349.048999998718500;0
4508;-742449.140000000596046;-1042725.980000000447035;0
1040;-741904.000000000000000;-1044623.000000000000000;0
5996;-742061.879000000655651;-1043284.276999998837709;0
4704;-742680.000000000000000;-1042776.750000000000000;0
6505;-741746.570000000298023;-1044600.429999999701977;0
1489;-741055.000000000000000;-1044209.000000000000000;0
5700;-743416.574000000953674;-1043630.223999999463558;0
206;-743179.000000000000000;-1043581.000000000000000;0
8078;-742024.710000000894070;-1045262.460000000894070;0
4710;-742796.730000000447035;-1042611.769999999552965;0
4576;-742354.388000000268221;-1042588.285999998450279;0
5025;-742609.543000001460314;-1042894.629000000655651;0
4800;-742990.043000001460314;-1042700.708000000566244;0
6368;-741940.324999999254942;-1042660.324000000953674;0
5707;-743417.815000001341105;-1043640.510999999940395;0
301;-742613.000000000000000;-1043903.000000000000000;0
383;-742450.000000000000000;-1043722.000000000000000;128
1766;-741257.000000000000000;-1044204.000000000000000;0
836;-742006.000000000000000;-1042525.000000000000000;0
6657;-741565.760000001639128;-1044156.980000000447035;0
6704;-742282.179999999701977;-1044623.793999999761581;0
3795;-743173.190000001341105;-1042842.170000001788139;0
1303;-741865.000000000000000;-1044692.000000000000000;0
5679;-743403.182000000029802;-1043717.807000000029802;0
1525;-741738.000000000000000;-1043823.000000000000000;0
3963;-743372.780000001192093;-1043538.789999999105930;0
3787;-743130.989999998360872;-1042979.320000000298023;0
6282;-742308.337999999523163;-1043045.984000001102686;0
1012;-742060.000000000000000;-1044582.000000000000000;0
4680;-742759.370000001043081;-1042864.140000000596046;0
6261;-742373.956999998539686;-1043022.041999999433756;0
2574;-742481.000000000000000;-1045423.000000000000000;0
4126;-742851.335000000894070;-1044085.449999999254942;0
3979;-743340.934999998658895;-1043779.414999999105930;0
1947;-743286.000000000000000;-1044465.000000000000000;0
7515;-742273.021999999880791;-1044371.543999999761581;0
4991;-742675.414999999105930;-1043031.236000001430511;0
6241;-742365.649999998509884;-1043065.059999998658895;0
2507;-742427.000000000000000;-1044437.000000000000000;0
4978;-742491.822999998927116;-1043028.688000001013279;0
5701;-743417.076999999582767;-1043630.140000000596046;0
2039;-743308.000000000000000;-1044808.000000000000000;0
3161;-743971.061000000685453;-1042551.515999998897314;0
1382;-742096.000000000000000;-1045023.000000000000000;0
7087;-743339.940000001341105;-1044536.690000001341105;0
5696;-743417.096000000834465;-1043637.135999999940395;0
6722;-742357.717000000178814;-1044705.708000000566244;0
4031;-743135.774000000208616;-1043769.622000001370907;0
3994;-743394.864000000059605;-1043949.813999999314547;0
8284;-742219.410000000149012;-1042809.500000000000000;0
4945;-742422.162999998778105;-1043009.861000001430511;0
785;-741702.000000000000000;-1042622.000000000000000;0
4705;-742714.100000001490116;-1042599.829999998211861;0
4130;-742868.460000000894070;-1044055.510000001639128;0
6239;-742363.504999998956919;-1043069.298000000417233;0
4925;-742455.502000000327826;-1042923.307000000029802;0
2563;-741065.000000000000000;-1044421.000000000000000;0
3261;-743581.445999998599291;-1042690.379999998956919;0
4036;-743246.920000001788139;-1043771.574999999254942;0
4874;-742795.429999999701977;-1042925.910000000149012;0
6856;-741514.510999999940395;-1044912.175999999046326;0
1956;-743397.000000000000000;-1044501.000000000000000;0
4716;-742893.160000000149012;-1042622.780000001192093;0
5164;-743173.335000000894070;-1043404.677000001072884;0
2238;-743372.000000000000000;-1045261.000000000000000;0
184;-743445.000000000000000;-1043450.000000000000000;0
4584;-742417.721999999135733;-1042627.620999999344349;0
7186;-742587.609999999403954;-1044726.000000000000000;0
4878;-742876.434000000357628;-1042964.004000000655651;0
3064;-744117.098999999463558;-1042868.348999999463558;0
1427;-742017.000000000000000;-1044256.000000000000000;0
4833;-743036.859999999403954;-1042820.050000000745058;0
6232;-742316.034000001847744;-1043057.000000000000000;0
6305;-741836.559999998658895;-1042745.190000001341105;0
4946;-742411.739000000059605;-1043002.199999999254942;0
501;-741836.000000000000000;-1043163.000000000000000;0
1115;-741105.000000000000000;-1044598.000000000000000;0
2433;-742514.000000000000000;-1045081.000000000000000;0
1098;-741435.000000000000000;-1044571.000000000000000;0
6268;-742340.850000001490116;-1043018.881000000983477;0
6262;-742370.024999998509884;-1043021.666000001132488;0
4758;-742854.840999998152256;-1042811.914000000804663;0
4756;-742712.579999998211861;-1042776.829999998211861;0
275;-743361.000000000000000;-1043904.000000000000000;0
2135;-743006.000000000000000;-1045119.000000000000000;0
3306;-743787.127999998629093;-1042847.872999999672174;0
7961;-741602.260000001639128;-1044314.350000001490116;0
5582;-743410.127000000327826;-1043640.197999998927116;0
2464;-743519.000000000000000;-1044697.000000000000000;0
4681;-742756.870000001043081;-1042844.710000000894070;0
1150;-741290.000000000000000;-1044485.000000000000000;0
1662;-741451.000000000000000;-1044403.000000000000000;0
4679;-742774.199999999254942;-1042819.160000000149012;0
7149;-742823.379000000655651;-1044496.758000001311302;0
4085;-742812.431000001728535;-1043657.114000000059605;0
6314;-743939.670000001788139;-1042606.239999998360872;0
3806;-743010.089999999850988;-1042912.410000000149012;0
4951;-742335.579999998211861;-1042934.429999999701977;0
3045;-744358.401999998837709;-1042788.074999999254942;0
5677;-743405.545000001788139;-1043716.931000001728535;0
6265;-742353.164999999105930;-1043020.054999999701977;0
4637;-742572.578000001609325;-1042742.510999999940395;0
5231;-743342.107000000774860;-1043497.627000000327826;0
4793;-743035.089999999850988;-1042650.028000000864267;0
4893;-742637.320000000298023;-1042818.600999999791384;0
4131;-742844.625000000000000;-1044059.980000000447035;0
7247;-742774.480000000447035;-1044839.850000001490116;0
1345;-741741.000000000000000;-1044789.000000000000000;0
3833;-743029.679999999701977;-1042612.300000000745058;0
3978;-743342.695000000298023;-1043756.835000000894070;0
7175;-742651.780000001192093;-1044558.149999998509884;0
1187;-741805.000000000000000;-1044071.000000000000000;0
1498;-741382.000000000000000;-1044310.000000000000000;0
4973;-742480.098000001162291;-1043031.443999998271465;0
4528;-742714.350000001490116;-1042840.010000001639128;0
4761;-742810.285000000149012;-1042793.122000001370907;0
6223;-742316.076000001281500;-1043058.679000001400709;0
282;-743034.000000000000000;-1043819.000000000000000;0
1929;-743440.000000000000000;-1044410.000000000000000;0
6279;-742306.210000000894070;-1043033.421999998390675;0
7732;-742611.719000000506639;-1044632.203999999910593;0
4984;-742580.537999998778105;-1043025.210999999195337;0
8048;-742190.519999999552965;-1044865.730000000447035;0
7188;-742583.839999999850988;-1044742.870000001043081;0
3144;-744012.590999998152256;-1042662.508000001311302;0
4615;-742527.811000000685453;-1042658.600999999791384;0
6233;-742319.057000000029802;-1043072.162999998778105;0
1982;-743408.000000000000000;-1044646.000000000000000;0
4513;-742579.030000001192093;-1042753.609999999403954;0
8274;-742065.089999999850988;-1042742.109999999403954;102
2403;-742211.000000000000000;-1045436.000000000000000;0
6188;-742312.807999998331070;-1043058.706999998539686;0
4765;-742822.897999998182058;-1042850.499000001698732;0
4212;-742205.245000001043081;-1043548.410000000149012;0
5169;-743240.785000000149012;-1043411.081999998539686;0
1314;-741695.000000000000000;-1044866.000000000000000;0
2104;-743176.000000000000000;-1044964.000000000000000;0
844;-742138.000000000000000;-1042519.000000000000000;0
6132;-742310.590999998152256;-1043063.552999999374151;0
7277;-742796.870000001043081;-1044653.429999999701977;0
4039;-743159.070000000298023;-1043772.795000001788139;0
5960;-743141.460999999195337;-1043339.964999999850988;0
1299;-741943.000000000000000;-1044719.000000000000000;0
5747;-743413.175999999046326;-1043698.811000000685453;0
7212;-742559.410000000149012;-1045073.070000000298023;0
3946;-743397.693999998271465;-1043460.780999999493361;0
5637;-743428.151000000536442;-1043682.633999999612570;0
4519;-742665.160000000149012;-1042790.820000000298023;0
1140;-741475.000000000000000;-1044461.000000000000000;0
525;-742233.000000000000000;-1043884.000000000000000;0
3747;-743250.879999998956919;-1042956.620000001043081;0
3794;-743091.015000000596046;-1042800.471999999135733;0
4956;-742383.579999998211861;-1043007.739999998360872;0
6258;-742382.381999999284744;-1043032.370999999344349;0
2389;-742076.000000000000000;-1045396.000000000000000;0
6303;-741823.820000000298023;-1042750.410000000149012;0
1057;-741686.000000000000000;-1045058.000000000000000;0
3850;-743037.969999998807907;-1042473.780000001192093;0
7223;-742409.149999998509884;-1044822.649999998509884;0
4760;-742826.947000000625849;-1042799.914000000804663;0
6403;-741971.879999998956919;-1042504.289999999105930;0
7968;-741473.980000000447035;-1044379.839999999850988;0
7349;-742516.719999998807907;-1045170.359999999403954;0
335;-742635.000000000000000;-1043966.000000000000000;0
3209;-743668.293999999761581;-1042492.478999998420477;0
8080;-741989.600000001490116;-1045310.420000001788139;0
6449;-743140.379999998956919;-1043395.559999998658895;0
4509;-742502.519999999552965;-1042732.079999998211861;0
693;-742284.000000000000000;-1043062.000000000000000;0
4329;-742363.315000001341105;-1043352.173999998718500;0
4726;-742863.519999999552965;-1042684.000000000000000;0
954;-742231.000000000000000;-1043024.000000000000000;0
7973;-741347.850000001490116;-1044381.850000001490116;0
1591;-742378.000000000000000;-1044910.000000000000000;0
6154;-742316.324000000953674;-1043069.546000000089407;0
2359;-742348.000000000000000;-1045581.000000000000000;0
4998;-742514.109000001102686;-1042978.602000001817942;0
8066;-742286.199999999254942;-1045237.250000000000000;0
2504;-742757.000000000000000;-1045516.000000000000000;0
6252;-742378.052000001072884;-1043040.958000000566244;0
1253;-742084.000000000000000;-1044730.000000000000000;0
6825;-741380.010000001639128;-1044780.089999999850988;0
1732;-741840.000000000000000;-1045226.000000000000000;0
7979;-741161.500000000000000;-1044398.210000000894070;0
1663;-741455.000000000000000;-1044433.000000000000000;0
1377;-742146.969999998807907;-1044922.489999998360872;0
1166;-741020.000000000000000;-1044520.000000000000000;0
1095;-741452.000000000000000;-1044553.000000000000000;0
630;-742179.000000000000000;-1043289.000000000000000;0
2083;-742588.000000000000000;-1044663.000000000000000;0
3277;-743688.120999999344349;-1042851.743000000715256;0
2060;-742659.000000000000000;-1044472.000000000000000;0
6191;-742318.017000000923872;-1043066.800999999046326;0
1730;-741428.000000000000000;-1045052.000000000000000;0
6216;-742313.892000000923872;-1043056.272999998182058;0
7015;-742554.570000000298023;-1044360.725000001490116;0
1611;-742400.000000000000000;-1044442.000000000000000;0
204;-743208.000000000000000;-1043588.000000000000000;0
6144;-742308.925000000745058;-1043059.002000000327826;0
