OID_;X;Y;TEMPERATURE
2758;-743919.949999999254942;-1043488.059999998658895;0
7409;-743521.629999998956919;-1045356.570000000298023;0
7147;-742827.925000000745058;-1044451.385000001639128;0
3233;-744152.962999999523163;-1042686.791999999433756;0
467;-741757.000000000000000;-1043352.000000000000000;0
6;-743464.000000000000000;-1042594.000000000000000;0
3656;-744550.905000001192093;-1042638.070000000298023;0
1929;-743440.000000000000000;-1044410.000000000000000;0
3701;-744582.008000001311302;-1042507.443999998271465;0
4070;-742925.285000000149012;-1043783.565000001341105;18
746;-741714.000000000000000;-1043020.000000000000000;0
513;-742083.000000000000000;-1043145.000000000000000;0
4075;-742947.934999998658895;-1043903.649999998509884;0
2237;-743368.000000000000000;-1045238.000000000000000;0
2805;-743893.609999999403954;-1043543.980000000447035;0
3811;-743244.620000001043081;-1042809.420000001788139;0
1487;-741117.000000000000000;-1044216.000000000000000;0
3216;-743615.890999998897314;-1042451.129999998956919;0
2886;-744104.953999999910593;-1043172.171999998390675;0
7008;-742899.559999998658895;-1044224.074999999254942;0
1810;-743136.000000000000000;-1044544.000000000000000;0
3456;-745096.247000001370907;-1042705.502999998629093;0
2151;-742827.000000000000000;-1045047.000000000000000;0
2016;-743230.000000000000000;-1044873.000000000000000;0
4083;-742820.771999999880791;-1043708.657000001519918;0
7022;-743155.660000000149012;-1044074.410000000149012;0
281;-743045.000000000000000;-1043848.000000000000000;0
3261;-743581.445999998599291;-1042690.379999998956919;0
7171;-742671.969999998807907;-1044508.219999998807907;0
378;-742514.000000000000000;-1043703.000000000000000;0
1196;-741677.000000000000000;-1043894.000000000000000;0
3760;-743233.829999998211861;-1042978.739999998360872;0
7159;-743013.767000000923872;-1044544.160999998450279;0
1229;-742244.000000000000000;-1044253.000000000000000;0
929;-744056.000000000000000;-1043306.000000000000000;0
224;-742904.000000000000000;-1043522.000000000000000;0
1781;-741247.000000000000000;-1043923.000000000000000;0
335;-742635.000000000000000;-1043966.000000000000000;0
1992;-743482.000000000000000;-1044954.000000000000000;0
1849;-742732.000000000000000;-1044228.000000000000000;0
696;-742077.000000000000000;-1042913.000000000000000;0
5993;-743947.829999998211861;-1042646.350000001490116;0
4339;-742459.269000001251698;-1043367.923000000417233;0
8073;-742120.640000000596046;-1045259.500000000000000;0
4499;-742338.899999998509884;-1042707.250000000000000;0
737;-741849.000000000000000;-1043021.000000000000000;0
3309;-743830.328000001609325;-1042834.535000000149012;0
2435;-742452.000000000000000;-1044222.000000000000000;0
7262;-742990.940000001341105;-1044886.989999998360872;0
8122;-742826.149999998509884;-1045713.260000001639128;0
8080;-741989.600000001490116;-1045310.420000001788139;0
8281;-742164.160000000149012;-1042778.140000000596046;0
7118;-743468.750000000000000;-1044677.690000001341105;0
1295;-742082.000000000000000;-1044456.000000000000000;0
4464;-742182.309999998658895;-1042571.379999998956919;0
7164;-742596.114999998360872;-1044447.173000000417233;0
1702;-741348.000000000000000;-1044682.000000000000000;0
1618;-742405.000000000000000;-1044404.000000000000000;0
2244;-743264.000000000000000;-1045331.000000000000000;0
1271;-742240.000000000000000;-1044521.000000000000000;0
3109;-743754.403999999165535;-1042652.872000001370907;0
4078;-742842.960000000894070;-1043832.824999999254942;0
5316;-743075.980000000447035;-1043041.059999998658895;0
7234;-742594.870000001043081;-1044815.140000000596046;0
3990;-743339.489999998360872;-1043987.234999999403954;0
5251;-743317.296000000089407;-1043180.037999998778105;69
3017;-744468.008999999612570;-1042806.090999998152256;0
3065;-744092.028999999165535;-1042868.519000001251698;0
560;-742181.000000000000000;-1043665.000000000000000;0
7947;-742030.969999998807907;-1044096.679999999701977;0
6771;-741345.015999998897314;-1044413.647999998182058;0
1837;-743015.000000000000000;-1044249.000000000000000;0
3752;-743213.949999999254942;-1042902.719999998807907;0
1324;-741943.000000000000000;-1044994.000000000000000;0
3297;-743706.958999998867512;-1042868.114999998360872;0
1265;-742047.000000000000000;-1044960.000000000000000;0
509;-741991.000000000000000;-1043143.000000000000000;0
8274;-742065.089999999850988;-1042742.109999999403954;0
4334;-742384.170000001788139;-1043468.820000000298023;0
1597;-742338.000000000000000;-1045064.000000000000000;0
542;-742367.629999998956919;-1043814.379999998956919;0
598;-741853.000000000000000;-1043233.000000000000000;0
6792;-741101.151999998837709;-1044754.271000001579523;0
5167;-743219.324999999254942;-1043405.249000001698732;0
674;-742463.000000000000000;-1043211.000000000000000;0
4257;-742056.467000000178814;-1043503.657999999821186;0
1369;-742029.000000000000000;-1044788.000000000000000;0
6874;-741789.789999999105930;-1045272.100000001490116;0
6125;-743428.124000001698732;-1043615.223999999463558;0
4764;-742839.835999999195337;-1042859.412999998778105;0
4331;-742391.967999998480082;-1043310.539000000804663;0
7216;-742500.129999998956919;-1044564.390000000596046;0
983;-741953.000000000000000;-1044414.000000000000000;0
4498;-741866.120000001043081;-1042718.471000000834465;0
3809;-742980.300000000745058;-1042944.469999998807907;0
5086;-742856.307999998331070;-1043239.488000001758337;0
7017;-742571.059999998658895;-1044267.640000000596046;0
7280;-742806.989999998360872;-1044667.600000001490116;0
1379;-742135.000000000000000;-1044975.000000000000000;0
7091;-743361.839999999850988;-1044584.039999999105930;0
5128;-743040.467000000178814;-1043389.765999998897314;0
588;-741950.000000000000000;-1043352.000000000000000;0
4148;-742631.269999999552965;-1043885.870000001043081;0
2508;-742961.000000000000000;-1044050.000000000000000;0
3717;-744716.670000001788139;-1042410.361999999731779;0
5294;-743056.328999999910593;-1043196.096999999135733;0
5589;-743423.785999998450279;-1043679.548000000417233;0
1875;-743367.000000000000000;-1044261.000000000000000;0
5996;-742061.879000000655651;-1043284.276999998837709;0
1376;-742165.000000000000000;-1044873.000000000000000;0
2336;-742837.000000000000000;-1045523.000000000000000;0
1414;-741627.000000000000000;-1044593.000000000000000;0
2155;-742797.000000000000000;-1045124.000000000000000;0
4056;-743125.315000001341105;-1043671.969999998807907;0
5244;-743361.021000001579523;-1043374.999000001698732;0
217;-742998.000000000000000;-1043554.000000000000000;0
591;-741912.000000000000000;-1043346.000000000000000;0
1123;-741734.000000000000000;-1044442.000000000000000;0
261;-743429.000000000000000;-1043723.000000000000000;0
3889;-742335.008999999612570;-1042489.949000000953674;0
709;-741861.000000000000000;-1042862.000000000000000;0
2092;-742917.000000000000000;-1044617.000000000000000;0
2128;-743170.000000000000000;-1045080.000000000000000;0
2369;-742503.000000000000000;-1045427.000000000000000;0
3818;-743130.217999998480082;-1042703.293000001460314;0
577;-742038.000000000000000;-1043521.000000000000000;0
7139;-742919.179999999701977;-1044444.434999998658895;0
6979;-743081.460000000894070;-1044413.079999998211861;0
4026;-743178.984999999403954;-1043847.989999998360872;0
1020;-742293.000000000000000;-1044615.000000000000000;0
526;-742209.000000000000000;-1043849.000000000000000;0
4458;-742245.679999999701977;-1042633.960000000894070;0
1307;-741803.000000000000000;-1044663.000000000000000;0
5161;-743160.846999999135733;-1043333.914999999105930;0
7217;-742516.318999998271465;-1044582.890000000596046;0
4670;-742810.120000001043081;-1042644.289999999105930;0
1492;-741096.000000000000000;-1044331.000000000000000;0
725;-741983.000000000000000;-1042939.000000000000000;0
3835;-743050.579999998211861;-1042590.109999999403954;0
2051;-743434.000000000000000;-1045074.000000000000000;0
1337;-741723.000000000000000;-1044886.000000000000000;0
1026;-741986.000000000000000;-1044631.000000000000000;0
4235;-742390.041999999433756;-1043492.094999998807907;0
3568;-744718.817999999970198;-1042588.614999998360872;0
5223;-743283.699999999254942;-1043535.940000001341105;0
1098;-741435.000000000000000;-1044571.000000000000000;0
3584;-744914.094999998807907;-1042552.403999999165535;0
1659;-741420.000000000000000;-1044790.000000000000000;0
326;-742682.000000000000000;-1044102.000000000000000;0
2282;-742923.000000000000000;-1045519.000000000000000;0
1336;-741737.000000000000000;-1044860.000000000000000;0
1513;-741852.000000000000000;-1044118.000000000000000;0
1289;-742211.000000000000000;-1044521.000000000000000;0
4475;-741839.219000000506639;-1042687.409000001847744;0
693;-742284.000000000000000;-1043062.000000000000000;0
1677;-741109.160000000149012;-1044522.699999999254942;0
1829;-742968.539999999105930;-1044100.210000000894070;0
2516;-742500.000000000000000;-1044414.000000000000000;0
2386;-742139.000000000000000;-1045460.000000000000000;0
6707;-742271.293999999761581;-1044721.274999998509884;0
2034;-743468.000000000000000;-1044800.000000000000000;0
7959;-741699.170000001788139;-1044292.620000001043081;0
2491;-742059.000000000000000;-1044251.000000000000000;0
4427;-742190.519999999552965;-1043099.440000001341105;0
783;-741695.000000000000000;-1042663.000000000000000;0
4892;-742663.079999998211861;-1042817.344999998807907;0
5779;-742907.197999998927116;-1043414.096999999135733;0
7250;-742792.079999998211861;-1044844.600000001490116;0
3100;-743941.234000001102686;-1042742.857999999076128;0
3155;-743969.353000000119209;-1042568.828000001609325;0
627;-742223.000000000000000;-1043335.000000000000000;0
1410;-741643.039999999105930;-1044709.940000001341105;0
4903;-742493.579999998211861;-1042816.620000001043081;0
2265;-742972.000000000000000;-1045774.000000000000000;0
4680;-742759.370000001043081;-1042864.140000000596046;0
2226;-743057.000000000000000;-1045470.000000000000000;0
4142;-742777.425000000745058;-1044013.440000001341105;0
7025;-743199.914999999105930;-1044070.515000000596046;0
1617;-742384.000000000000000;-1044407.000000000000000;0
7828;-743537.940000001341105;-1045170.530000001192093;0
4952;-742318.899999998509884;-1042915.589999999850988;0
5274;-743012.366000000387430;-1043280.149000000208616;0
5701;-743417.076999999582767;-1043630.140000000596046;0
2582;-741030.372999999672174;-1044607.635000001639128;0
1760;-741162.000000000000000;-1044101.000000000000000;0
6842;-741574.894000001251698;-1044962.013999998569489;0
4635;-742575.561999998986721;-1042702.701000001281500;0
1395;-741799.000000000000000;-1044291.000000000000000;0
1028;-741981.000000000000000;-1044692.000000000000000;0
3801;-743091.350000001490116;-1042882.719999998807907;0
1446;-741545.000000000000000;-1044774.000000000000000;0
4178;-742382.640000000596046;-1044160.138000000268221;0
5648;-743429.164000000804663;-1043695.905999999493361;0
7808;-741986.629999998956919;-1044440.109999999403954;0
4596;-742597.181000001728535;-1042670.653000000864267;0
1555;-741196.000000000000000;-1044374.000000000000000;0
4664;-742806.739999998360872;-1042547.980000000447035;0
7205;-742570.679999999701977;-1044988.579999998211861;0
6860;-741482.129999998956919;-1044991.089999999850988;0
7316;-742603.460000000894070;-1045033.969999998807907;0
1431;-741926.000000000000000;-1044313.000000000000000;0
2560;-741251.000000000000000;-1044390.000000000000000;0
4206;-742342.340999998152256;-1043547.063000001013279;0
885;-741739.000000000000000;-1042777.000000000000000;0
7939;-741306.171999998390675;-1043955.960000000894070;0
7966;-741489.800000000745058;-1044356.219999998807907;0
4972;-742479.962999999523163;-1043052.368999999016523;0
5371;-742052.149999998509884;-1043011.940000001341105;0
2487;-742101.000000000000000;-1044308.000000000000000;0
4983;-742587.776000000536442;-1043013.068999998271465;0
3416;-743754.546000000089407;-1043086.953000001609325;0
1543;-742235.000000000000000;-1044164.000000000000000;0
269;-743248.000000000000000;-1043725.000000000000000;0
1648;-741373.000000000000000;-1044431.000000000000000;0
1061;-741586.000000000000000;-1045133.000000000000000;0
1767;-741261.000000000000000;-1044168.000000000000000;0
6130;-742312.136999998241663;-1043066.344000000506639;0
3847;-743122.146999999880791;-1042525.489999998360872;0
2440;-742596.000000000000000;-1044193.000000000000000;0
7120;-743351.160000000149012;-1044618.460000000894070;0
5507;-743426.703000001609325;-1043656.230999998748302;0
2384;-742191.000000000000000;-1045494.000000000000000;0
1860;-743472.000000000000000;-1044155.000000000000000;0
2378;-742372.000000000000000;-1045503.000000000000000;0
6506;-741743.019999999552965;-1044571.050000000745058;0
4649;-742732.228999998420477;-1042525.100000001490116;0
6200;-742318.653999999165535;-1043066.462000001221895;0
2256;-743156.000000000000000;-1045353.000000000000000;0
2306;-742392.000000000000000;-1045461.000000000000000;0
1212;-742038.000000000000000;-1044383.000000000000000;0
1944;-743280.000000000000000;-1044400.000000000000000;0
1416;-741628.000000000000000;-1044523.000000000000000;0
846;-742175.000000000000000;-1042517.000000000000000;0
4577;-742376.686000000685453;-1042590.309999998658895;0
5641;-743428.517000000923872;-1043687.460000000894070;0
2087;-742450.000000000000000;-1044838.000000000000000;0
4953;-742431.500999998301268;-1043027.399999998509884;0
6496;-742290.655999999493361;-1044438.502999998629093;0
4734;-742762.920000001788139;-1042698.820000000298023;0
1054;-741734.000000000000000;-1045021.000000000000000;0
6204;-742315.578999999910593;-1043060.826000001281500;0
1170;-741893.000000000000000;-1044403.000000000000000;0
3986;-743313.355000000447035;-1043956.986999999731779;0
5267;-743190.021999999880791;-1043149.807000000029802;0
8054;-742230.239999998360872;-1044988.530000001192093;0
4736;-742701.269999999552965;-1042690.000000000000000;0
4822;-742945.579999998211861;-1042879.910000000149012;0
6821;-741256.649999998509884;-1044796.100000001490116;0
6118;-743652.447000000625849;-1042857.607999999076128;0
2544;-741753.000000000000000;-1044252.000000000000000;0
4849;-742966.960000000894070;-1042893.583999998867512;0
2135;-743006.000000000000000;-1045119.000000000000000;0
1792;-742165.000000000000000;-1044209.000000000000000;0
2085;-742426.000000000000000;-1044797.000000000000000;0
6715;-742291.912999998778105;-1044948.105999998748302;0
1462;-741464.000000000000000;-1044225.000000000000000;0
6719;-742371.686999998986721;-1044952.227000001817942;0
2343;-742674.000000000000000;-1045557.000000000000000;0
2458;-741019.000000000000000;-1044567.000000000000000;0
533;-742137.000000000000000;-1043750.000000000000000;0
1296;-742100.000000000000000;-1044473.000000000000000;0
6135;-742308.289000000804663;-1043059.340999998152256;0
191;-743424.000000000000000;-1043599.000000000000000;0
2164;-742966.000000000000000;-1045172.000000000000000;0
5455;-742823.936000000685453;-1043283.644999999552965;0
7679;-742498.250000000000000;-1045115.879999998956919;0
2007;-743231.000000000000000;-1044741.000000000000000;0
4641;-742591.151999998837709;-1042559.721000000834465;0
2477;-741238.370000001043081;-1044535.289999999105930;0
272;-743396.000000000000000;-1043809.000000000000000;0
4169;-742414.420000001788139;-1043962.329999998211861;0
6770;-741306.423999998718500;-1044414.120999999344349;0
1353;-741862.000000000000000;-1044843.000000000000000;0
1694;-741582.000000000000000;-1044653.000000000000000;0
2296;-742678.000000000000000;-1045399.000000000000000;0
5415;-742954.934000000357628;-1042714.414000000804663;0
1122;-741749.000000000000000;-1044455.000000000000000;0
4037;-743205.375000000000000;-1043771.175000000745058;0
7047;-743395.495000001043081;-1044210.765000000596046;0
1003;-741913.000000000000000;-1044580.000000000000000;0
4523;-742703.960000000894070;-1042805.670000001788139;0
1420;-741596.000000000000000;-1044382.000000000000000;0
4617;-742561.250999998301268;-1042668.140000000596046;0
2354;-742452.000000000000000;-1045584.000000000000000;0
382;-742481.000000000000000;-1043751.000000000000000;0
1550;-741356.000000000000000;-1044363.000000000000000;0
306;-742809.000000000000000;-1044137.000000000000000;0
1533;-741832.000000000000000;-1043879.000000000000000;0
3361;-743933.616000000387430;-1042980.793000001460314;0
6141;-742311.243999999016523;-1043063.195999998599291;0
1267;-742040.000000000000000;-1044999.000000000000000;0
5994;-743358.609999999403954;-1043460.469999998807907;0
2396;-742212.000000000000000;-1045365.000000000000000;0
695;-742207.000000000000000;-1043019.000000000000000;0
954;-742231.000000000000000;-1043024.000000000000000;0
8056;-742242.379999998956919;-1045023.460000000894070;0
6716;-742256.467000000178814;-1044966.368000000715256;0
2579;-742497.000000000000000;-1045572.000000000000000;0
5016;-742572.212000001221895;-1042955.526999998837709;0
1816;-743070.000000000000000;-1044444.000000000000000;0
6226;-742320.660999998450279;-1043065.366999998688698;0
4064;-742879.655000001192093;-1043647.420000001788139;0
3614;-744984.548999998718500;-1042283.640999998897314;0
545;-742337.000000000000000;-1043805.000000000000000;0
4506;-742419.730000000447035;-1042717.019999999552965;0
5646;-743428.978999998420477;-1043693.493000000715256;0
5023;-742588.899000000208616;-1042870.296999998390675;0
1936;-743293.000000000000000;-1044272.000000000000000;0
1955;-743374.000000000000000;-1044515.000000000000000;0
4897;-742560.320000000298023;-1042829.359999999403954;0
3848;-743094.383999999612570;-1042505.245000001043081;0
3370;-743858.489999998360872;-1043011.370999999344349;0
2073;-743069.000000000000000;-1044754.000000000000000;0
722;-742139.000000000000000;-1043009.000000000000000;0
5502;-743427.894999999552965;-1043706.885000001639128;0
7180;-742618.809000000357628;-1044646.109000001102686;0
5785;-743436.010000001639128;-1042105.550000000745058;0
6305;-741836.559999998658895;-1042745.190000001341105;0
4482;-741768.079999998211861;-1042606.449999999254942;0
4247;-742154.829999998211861;-1043394.660000000149012;0
1016;-742147.000000000000000;-1044590.000000000000000;0
6695;-742306.234000001102686;-1044816.138999998569489;0
7;-743479.000000000000000;-1042567.000000000000000;0
1144;-741402.000000000000000;-1044470.000000000000000;0
6268;-742340.850000001490116;-1043018.881000000983477;0
1663;-741455.000000000000000;-1044433.000000000000000;0
1372;-742118.000000000000000;-1044815.000000000000000;0
4613;-742506.557000000029802;-1042597.938000001013279;0
4565;-742462.576999999582767;-1042533.901999998837709;0
6306;-741842.129999998956919;-1042752.739999998360872;0
993;-741977.000000000000000;-1044436.000000000000000;0
1935;-743276.000000000000000;-1044289.000000000000000;0
2083;-742588.000000000000000;-1044663.000000000000000;0
6253;-742378.725000001490116;-1043039.690000001341105;0
4824;-742918.673000000417233;-1042871.875000000000000;0
1404;-741692.000000000000000;-1044355.000000000000000;0
5372;-742084.010000001639128;-1043008.550000000745058;0
7967;-741508.109999999403954;-1044369.239999998360872;0
527;-742186.000000000000000;-1043818.000000000000000;0
6853;-741548.899000000208616;-1045052.295000001788139;0
4780;-742928.596000000834465;-1042747.480000000447035;0
5238;-743360.410000000149012;-1043296.723999999463558;0
3816;-743149.379999998956919;-1042748.489999998360872;0
1971;-743385.000000000000000;-1044881.000000000000000;0
1589;-742376.000000000000000;-1044861.000000000000000;0
818;-741961.000000000000000;-1042598.000000000000000;0
235;-743467.000000000000000;-1043745.000000000000000;0
2295;-742707.000000000000000;-1045396.000000000000000;0
201;-743229.000000000000000;-1043614.000000000000000;0
6158;-742313.261999998241663;-1043063.925999999046326;0
4214;-742229.274999998509884;-1043511.745000001043081;0
684;-742358.000000000000000;-1043136.000000000000000;0
4144;-742704.414999999105930;-1043822.484999999403954;0
7798;-743468.929999999701977;-1045091.809999998658895;0
2498;-741906.000000000000000;-1044040.000000000000000;0
500;-741861.000000000000000;-1043174.000000000000000;0
617;-742179.000000000000000;-1043272.000000000000000;0
1586;-742372.000000000000000;-1044785.000000000000000;0
4591;-742426.813000001013279;-1042640.035000000149012;0
5706;-743417.688999999314547;-1043638.852000001817942;0
4211;-742193.190000001341105;-1043565.660000000149012;0
6170;-742311.548000000417233;-1043059.381000000983477;0
7515;-742273.021999999880791;-1044371.543999999761581;0
3831;-743005.140000000596046;-1042638.440000001341105;0
1865;-743458.000000000000000;-1044233.000000000000000;0
5716;-743423.320999998599291;-1043631.197000000625849;0
5714;-743423.756000000983477;-1043635.103999998420477;0
926;-741894.000000000000000;-1042999.000000000000000;0
7151;-742842.649000000208616;-1044545.307000000029802;0
1338;-741629.000000000000000;-1045045.000000000000000;0
5725;-743422.388000000268221;-1043634.186999998986721;0
7617;-742345.934000000357628;-1045300.958999998867512;0
6296;-742543.019999999552965;-1042643.350000001490116;0
4909;-742383.146000001579523;-1042799.159000001847744;0
5145;-743058.063000001013279;-1043471.706999998539686;0
1917;-743374.000000000000000;-1044458.000000000000000;0
1441;-741744.000000000000000;-1044392.000000000000000;0
2257;-742956.000000000000000;-1045558.000000000000000;0
7735;-742196.594999998807907;-1045243.149999998509884;0
6255;-742379.991999998688698;-1043037.068999998271465;0
4426;-742197.589999999850988;-1043031.679999999701977;0
1400;-741719.000000000000000;-1044132.000000000000000;0
3274;-743652.714999999850988;-1042812.727000001817942;0
2432;-742549.000000000000000;-1045078.000000000000000;0
4608;-742555.160999998450279;-1042637.633999999612570;0
5956;-742960.690999999642372;-1043513.846999999135733;0
7397;-743021.859999999403954;-1045682.989999998360872;0
7011;-742831.309999998658895;-1044257.245000001043081;0
5684;-743397.274000000208616;-1043719.995999999344349;0
625;-742247.000000000000000;-1043299.000000000000000;0
2104;-743176.000000000000000;-1044964.000000000000000;0
6103;-742213.102000001817942;-1043103.528999999165535;0
3718;-744739.026999998837709;-1042368.383000001311302;0
3769;-742978.969999998807907;-1042975.300000000745058;0
4928;-742444.890000000596046;-1042854.899999998509884;0
4783;-742933.866999998688698;-1042668.403000000864267;0
4200;-742219.350000001490116;-1043727.980999998748302;0
6656;-741590.160000000149012;-1044150.480000000447035;0
6391;-742109.269999999552965;-1042498.320000000298023;0
1687;-741142.120000001043081;-1044817.019999999552965;0
4927;-742447.969999998807907;-1042874.710000000894070;0
877;-741951.000000000000000;-1042610.000000000000000;0
6363;-742027.344999998807907;-1042665.324000000953674;0
1933;-743329.000000000000000;-1044407.000000000000000;0
4989;-742648.756000000983477;-1043019.318999998271465;0
6975;-743116.140000000596046;-1044506.469999998807907;0
4429;-742222.260000001639128;-1043102.250000000000000;0
3832;-743029.390000000596046;-1042595.910000000149012;0
3392;-743913.699999999254942;-1043165.480000000447035;0
6302;-741814.370000001043081;-1042743.910000000149012;0
1258;-742076.000000000000000;-1044837.000000000000000;0
7034;-743299.725999999791384;-1044153.140000000596046;0
5790;-743521.019999999552965;-1042064.280000001192093;0
6207;-742313.287000000476837;-1043056.642000000923872;0
1467;-741808.000000000000000;-1044064.000000000000000;0
4790;-743036.497999999672174;-1042635.973999999463558;0
1540;-742005.000000000000000;-1044009.000000000000000;0
3982;-743325.135000001639128;-1043857.684999998658895;0
1925;-743331.000000000000000;-1044321.000000000000000;0
5175;-743313.734999999403954;-1043433.749000001698732;0
1440;-741782.000000000000000;-1044362.000000000000000;0
4525;-742716.719999998807907;-1042823.219999998807907;0
171;-743448.000000000000000;-1043399.000000000000000;0
6155;-742315.557999998331070;-1043068.140999998897314;0
1723;-741611.000000000000000;-1045092.000000000000000;0
2222;-743058.000000000000000;-1045420.000000000000000;0
6282;-742308.337999999523163;-1043045.984000001102686;0
3338;-743968.458999998867512;-1043042.706999998539686;0
4167;-742438.315000001341105;-1044021.960000000894070;0
1972;-743389.000000000000000;-1044907.000000000000000;0
6962;-743011.489999998360872;-1044196.070000000298023;0
1299;-741943.000000000000000;-1044719.000000000000000;0
4770;-742872.535000000149012;-1042899.679000001400709;0
6354;-741928.410000000149012;-1042711.350000001490116;0
250;-743428.000000000000000;-1043794.000000000000000;0
6265;-742353.164999999105930;-1043020.054999999701977;0
2044;-743445.000000000000000;-1044960.000000000000000;0
3964;-743352.359999999403954;-1043540.780000001192093;0
4502;-742349.309999998658895;-1042718.199999999254942;0
463;-741703.000000000000000;-1043287.000000000000000;0
1133;-741604.000000000000000;-1044433.000000000000000;0
1158;-741152.320000000298023;-1044503.030000001192093;0
3790;-743140.809999998658895;-1042908.210000000894070;0
3756;-743319.230000000447035;-1042949.019999999552965;0
7779;-743059.598999999463558;-1045828.806000001728535;0
4582;-742390.164999999105930;-1042606.546000000089407;0
3396;-743905.006000000983477;-1043084.449999999254942;0
4924;-742427.890999998897314;-1042890.581000000238419;0
1047;-741816.000000000000000;-1044867.000000000000000;0
3581;-744918.206999998539686;-1042631.410000000149012;0
4758;-742854.840999998152256;-1042811.914000000804663;0
1701;-741378.000000000000000;-1044678.000000000000000;0
1551;-741353.000000000000000;-1044326.000000000000000;0
4252;-742124.022999998182058;-1043390.519000001251698;0
4052;-743252.954999998211861;-1043843.585000000894070;0
6300;-741836.949999999254942;-1042698.329999998211861;0
2124;-743275.000000000000000;-1045023.000000000000000;0
341;-742592.000000000000000;-1043889.000000000000000;0
3321;-743903.500999998301268;-1042936.324999999254942;0
5598;-743412.839999999850988;-1043680.403000000864267;0
2039;-743308.000000000000000;-1044808.000000000000000;0
1112;-741189.050000000745058;-1044602.469999998807907;0
1546;-742219.000000000000000;-1044147.000000000000000;0
3148;-744008.699000000953674;-1042624.668999999761581;0
1097;-741414.000000000000000;-1044558.000000000000000;0
1496;-741253.000000000000000;-1044321.000000000000000;0
4430;-742235.070000000298023;-1043092.839999999850988;0
6369;-741962.675000000745058;-1042665.013999998569489;0
6788;-741212.809999998658895;-1044473.129999998956919;0
4164;-742476.478000000119209;-1044110.528000000864267;0
6272;-742325.379000000655651;-1043017.383000001311302;0
669;-742510.000000000000000;-1043260.000000000000000;0
8066;-742286.199999999254942;-1045237.250000000000000;0
266;-743321.000000000000000;-1043735.000000000000000;0
5960;-743141.460999999195337;-1043339.964999999850988;0
1293;-742037.000000000000000;-1044462.000000000000000;0
6789;-741187.510000001639128;-1044470.660000000149012;0
3413;-743776.791000001132488;-1043071.675000000745058;0
1857;-742574.000000000000000;-1044318.000000000000000;0
3833;-743029.679999999701977;-1042612.300000000745058;0
1070;-741665.000000000000000;-1044736.000000000000000;0
2885;-744122.791999999433756;-1043190.208000000566244;0
5720;-743418.223000001162291;-1043629.960999999195337;0
7177;-742643.059999998658895;-1044579.679999999701977;0
4877;-742845.760000001639128;-1042956.589999999850988;0
1386;-742158.000000000000000;-1044976.000000000000000;0
4137;-742705.739999998360872;-1044094.100000001490116;0
5596;-743415.271999999880791;-1043680.212999999523163;0
1110;-741220.730000000447035;-1044598.480000000447035;0
4801;-742998.943999998271465;-1042721.118000000715256;0
6303;-741823.820000000298023;-1042750.410000000149012;0
1044;-741861.000000000000000;-1044743.000000000000000;0
430;-742185.000000000000000;-1043888.000000000000000;0
4731;-742802.002999998629093;-1042654.546000000089407;0
4955;-742383.649999998509884;-1043019.250000000000000;0
7049;-743420.177000001072884;-1044168.629999998956919;0
5704;-743417.484999999403954;-1043635.530999999493361;0
5213;-743326.385999999940395;-1043368.675999999046326;0
6111;-742241.054000001400709;-1043365.475999999791384;0
1476;-741531.000000000000000;-1044196.000000000000000;0
