OID_;X;Y;TEMPERATURE
8;-743496.000000000000000;-1042539.000000000000000;178
502;-741901.000000000000000;-1043169.000000000000000;0
3289;-743584.761999998241663;-1042769.188000001013279;0
283;-743026.000000000000000;-1043788.000000000000000;0
1531;-741782.000000000000000;-1043838.000000000000000;0
80;-744067.000000000000000;-1043330.000000000000000;0
531;-742157.000000000000000;-1043778.000000000000000;0
6946;-742974.765000000596046;-1043929.388000000268221;0
2516;-742500.000000000000000;-1044414.000000000000000;0
6722;-742357.717000000178814;-1044705.708000000566244;0
1587;-742372.000000000000000;-1044806.000000000000000;0
87;-743857.000000000000000;-1043557.000000000000000;0
2286;-742894.000000000000000;-1045440.000000000000000;0
1248;-742109.000000000000000;-1044631.000000000000000;170
6872;-741751.719999998807907;-1045296.679999999701977;0
1629;-742450.000000000000000;-1044518.000000000000000;169
2749;-743924.129999998956919;-1043464.359999999403954;0
6448;-744017.179999999701977;-1043123.899999998509884;0
4093;-742889.967999998480082;-1043954.530000001192093;0
466;-741743.000000000000000;-1043331.000000000000000;0
1498;-741382.000000000000000;-1044310.000000000000000;0
1666;-741017.000000000000000;-1044315.000000000000000;0
3068;-744158.921000000089407;-1042812.230999998748302;0
7015;-742554.570000000298023;-1044360.725000001490116;0
2270;-742954.000000000000000;-1045592.000000000000000;0
2050;-743460.000000000000000;-1045072.000000000000000;0
884;-741771.000000000000000;-1042776.000000000000000;0
4224;-742139.756000000983477;-1043462.488000001758337;0
1164;-741055.000000000000000;-1044515.000000000000000;0
1928;-743474.000000000000000;-1044409.000000000000000;0
2222;-743058.000000000000000;-1045420.000000000000000;0
7775;-743098.660999998450279;-1045755.228999998420477;0
31;-743485.000000000000000;-1042645.000000000000000;0
7050;-743438.070999998599291;-1044185.932000000029802;0
2692;-743430.750000000000000;-1042085.649999998509884;0
596;-741867.000000000000000;-1043259.000000000000000;0
2095;-743178.000000000000000;-1044734.000000000000000;0
3677;-744603.943999998271465;-1042491.761999998241663;0
1905;-743446.000000000000000;-1044312.000000000000000;0
7182;-742597.789999999105930;-1044678.260000001639128;0
1517;-741964.000000000000000;-1044034.000000000000000;0
7077;-743564.359000001102686;-1045385.210000000894070;0
1020;-742293.000000000000000;-1044615.000000000000000;0
4164;-742476.478000000119209;-1044110.528000000864267;0
1607;-742414.000000000000000;-1044379.000000000000000;0
1414;-741627.000000000000000;-1044593.000000000000000;0
1325;-741894.000000000000000;-1044959.000000000000000;0
2535;-742042.000000000000000;-1044071.000000000000000;0
6977;-743098.949999999254942;-1044459.879999998956919;0
1544;-742236.000000000000000;-1044198.000000000000000;0
3389;-743919.920000001788139;-1043153.510000001639128;0
3580;-744924.973999999463558;-1042593.699999999254942;0
6861;-741491.429999999701977;-1045010.300000000745058;0
2756;-743984.276999998837709;-1043475.763000000268221;0
1272;-742237.000000000000000;-1044545.000000000000000;0
1268;-742046.000000000000000;-1045021.000000000000000;0
1942;-743283.000000000000000;-1044370.000000000000000;0
551;-742269.000000000000000;-1043755.000000000000000;0
4213;-742218.094999998807907;-1043529.954999998211861;0
1502;-741506.000000000000000;-1044283.000000000000000;0
575;-742053.000000000000000;-1043541.000000000000000;0
7706;-742313.239999998360872;-1044319.611999999731779;0
4063;-742855.079999998211861;-1043654.695000000298023;0
1519;-741754.000000000000000;-1043956.000000000000000;0
3242;-744191.513000000268221;-1042647.011999998241663;0
2273;-742895.000000000000000;-1045745.000000000000000;0
3839;-743112.140000000596046;-1042558.280000001192093;0
7809;-741981.809999998658895;-1044560.280000001192093;0
1932;-743359.000000000000000;-1044408.000000000000000;0
7211;-742570.070000000298023;-1045065.679999999701977;0
8275;-742087.910000000149012;-1042738.609999999403954;0
4024;-743223.734999999403954;-1043859.954999998211861;0
2577;-742491.000000000000000;-1045513.000000000000000;0
1839;-742994.469999998807907;-1044185.679999999701977;0
4238;-742440.263000000268221;-1043528.236000001430511;0
3889;-742335.008999999612570;-1042489.949000000953674;0
2150;-742812.000000000000000;-1045054.000000000000000;0
7037;-743316.085000000894070;-1044222.170000001788139;0
381;-742465.000000000000000;-1043700.000000000000000;0
745;-741649.000000000000000;-1042968.000000000000000;0
7739;-742301.399000000208616;-1045040.431000001728535;0
1287;-742217.000000000000000;-1044486.000000000000000;0
7538;-742701.420000001788139;-1045364.109999999403954;0
3528;-744791.905999999493361;-1042674.936000000685453;0
2232;-743488.000000000000000;-1045234.000000000000000;0
1125;-741728.000000000000000;-1044435.000000000000000;0
1034;-741964.000000000000000;-1044876.000000000000000;0
4662;-742819.471000000834465;-1042530.037000000476837;0
4177;-742387.940999999642372;-1044182.254999998956919;0
586;-741966.000000000000000;-1043374.000000000000000;0
1986;-743480.000000000000000;-1044794.000000000000000;0
4465;-742180.250000000000000;-1042584.370000001043081;0
793;-741697.000000000000000;-1042588.000000000000000;0
6837;-741677.875999998301268;-1044964.791999999433756;0
3183;-743909.289999999105930;-1042546.210000000894070;0
1949;-743248.000000000000000;-1044491.000000000000000;0
4858;-742955.339999999850988;-1042963.960000000894070;0
7157;-742964.840999998152256;-1044545.681000001728535;0
6857;-741503.982999999076128;-1044930.340999998152256;0
7024;-743182.745000001043081;-1044052.815000001341105;0
2492;-742017.000000000000000;-1044210.000000000000000;0
3314;-743758.675999999046326;-1042905.688999999314547;0
6824;-741347.350000001490116;-1044784.280000001192093;0
728;-741997.000000000000000;-1042918.000000000000000;0
5306;-743103.326999999582767;-1043193.129000000655651;0
736;-741880.000000000000000;-1043017.000000000000000;0
3750;-743221.379999998956919;-1042925.429999999701977;0
4257;-742056.467000000178814;-1043503.657999999821186;0
390;-742429.000000000000000;-1043827.000000000000000;0
3110;-743743.295000001788139;-1042640.627000000327826;0
1029;-741978.000000000000000;-1044721.000000000000000;0
1816;-743070.000000000000000;-1044444.000000000000000;0
79;-744062.000000000000000;-1043257.000000000000000;0
4117;-742733.614999998360872;-1044043.129999998956919;0
3369;-743878.633000001311302;-1043011.739000000059605;0
3992;-743365.899999998509884;-1043881.385000001639128;0
4146;-742666.940000001341105;-1043854.829999998211861;0
6303;-741823.820000000298023;-1042750.410000000149012;0
5063;-742783.370000001043081;-1043241.048999998718500;0
4005;-743325.977000001817942;-1044053.392999999225140;0
1170;-741893.000000000000000;-1044403.000000000000000;0
4781;-742926.519000001251698;-1042695.502999998629093;0
516;-742160.000000000000000;-1043135.000000000000000;0
7132;-743262.120000001043081;-1044825.699999999254942;0
6493;-742196.574000000953674;-1044452.076999999582767;0
5508;-743426.105999998748302;-1043645.960999999195337;0
2081;-742551.000000000000000;-1044621.000000000000000;0
6565;-741325.239999998360872;-1044209.190000001341105;0
2308;-742345.000000000000000;-1045499.000000000000000;0
524;-742255.000000000000000;-1043913.000000000000000;0
6710;-742260.203000001609325;-1044803.609999999403954;0
2036;-743404.000000000000000;-1044803.000000000000000;0
3795;-743173.190000001341105;-1042842.170000001788139;0
1765;-741159.000000000000000;-1044178.000000000000000;0
4931;-742449.300000000745058;-1042791.403000000864267;0
2020;-743260.000000000000000;-1044941.000000000000000;0
1776;-741200.000000000000000;-1044007.000000000000000;0
1397;-741771.000000000000000;-1044236.000000000000000;0
7655;-742266.583000000566244;-1045284.133999999612570;0
4236;-742406.842999998480082;-1043504.015000000596046;0
1773;-741281.000000000000000;-1043977.000000000000000;0
6715;-742291.912999998778105;-1044948.105999998748302;0
5116;-742947.859000001102686;-1043386.767000000923872;0
7019;-742585.024999998509884;-1044210.725000001490116;0
2403;-742211.000000000000000;-1045436.000000000000000;0
7262;-742990.940000001341105;-1044886.989999998360872;0
1216;-742093.000000000000000;-1044333.000000000000000;0
3570;-744649.160000000149012;-1042588.129999998956919;0
4220;-742214.344999998807907;-1043580.359999999403954;0
5240;-743364.164000000804663;-1043254.934000000357628;0
2526;-741087.000000000000000;-1044616.000000000000000;0
8079;-742021.839999999850988;-1045292.179999999701977;0
1446;-741545.000000000000000;-1044774.000000000000000;0
1346;-741769.000000000000000;-1044817.000000000000000;0
4169;-742414.420000001788139;-1043962.329999998211861;0
1400;-741719.000000000000000;-1044132.000000000000000;0
4125;-742857.695000000298023;-1044110.460000000894070;0
220;-742969.000000000000000;-1043530.000000000000000;0
6853;-741548.899000000208616;-1045052.295000001788139;0
3811;-743244.620000001043081;-1042809.420000001788139;0
4835;-742967.660000000149012;-1042677.690000001341105;0
4996;-742488.458999998867512;-1042974.723999999463558;0
1440;-741782.000000000000000;-1044362.000000000000000;0
4078;-742842.960000000894070;-1043832.824999999254942;0
4983;-742587.776000000536442;-1043013.068999998271465;0
2256;-743156.000000000000000;-1045353.000000000000000;0
2419;-742418.000000000000000;-1045101.000000000000000;0
3263;-743570.528999999165535;-1042712.653999999165535;0
708;-741854.000000000000000;-1042881.000000000000000;0
1192;-741801.000000000000000;-1044083.000000000000000;0
692;-742292.000000000000000;-1043084.000000000000000;0
1070;-741665.000000000000000;-1044736.000000000000000;0
4105;-742678.771999999880791;-1043769.206000000238419;0
3143;-744031.217999998480082;-1042659.508999999612570;0
190;-743443.000000000000000;-1043597.000000000000000;0
3414;-743757.269999999552965;-1043051.379999998956919;0
2261;-743009.000000000000000;-1045657.000000000000000;0
3769;-742978.969999998807907;-1042975.300000000745058;0
1456;-741513.000000000000000;-1044437.000000000000000;0
7008;-742899.559999998658895;-1044224.074999999254942;0
2044;-743445.000000000000000;-1044960.000000000000000;0
514;-742119.000000000000000;-1043141.000000000000000;0
5371;-742052.149999998509884;-1043011.940000001341105;0
1124;-741715.000000000000000;-1044452.000000000000000;0
6354;-741928.410000000149012;-1042711.350000001490116;0
1112;-741189.050000000745058;-1044602.469999998807907;0
6095;-742082.920000001788139;-1043614.710000000894070;0
8075;-742072.149999998509884;-1045261.399999998509884;0
3537;-744632.945000000298023;-1042671.657000001519918;0
4331;-742391.967999998480082;-1043310.539000000804663;0
2157;-742789.000000000000000;-1045161.000000000000000;0
8149;-743305.579999998211861;-1043204.070000000298023;0
1962;-743406.000000000000000;-1044664.000000000000000;0
1504;-741577.000000000000000;-1044258.000000000000000;0
6982;-743055.109999999403954;-1044342.629999998956919;0
6603;-741616.600000001490116;-1043854.019999999552965;0
2253;-743250.000000000000000;-1045314.000000000000000;0
3297;-743706.958999998867512;-1042868.114999998360872;0
1089;-741567.949999999254942;-1044538.820000000298023;0
4249;-742151.910000000149012;-1043354.719999998807907;0
1494;-741173.000000000000000;-1044326.000000000000000;0
5745;-743415.129000000655651;-1043695.054000001400709;0
7048;-743392.429999999701977;-1044236.170000001788139;0
4068;-742917.125000000000000;-1043734.535000000149012;0
1674;-741099.000000000000000;-1044736.000000000000000;0
3806;-743010.089999999850988;-1042912.410000000149012;0
4742;-742822.300000000745058;-1042747.920000001788139;0
2235;-743401.000000000000000;-1045221.000000000000000;0
7138;-742917.554999999701977;-1044421.774999998509884;0
733;-741963.000000000000000;-1043018.000000000000000;0
3965;-743388.850000001490116;-1043528.160000000149012;0
6103;-742213.102000001817942;-1043103.528999999165535;0
6250;-742374.638999998569489;-1043047.576999999582767;0
7537;-742722.660000000149012;-1045361.410000000149012;0
7026;-743217.644999999552965;-1044082.329999998211861;0
7514;-742304.866000000387430;-1044375.124000001698732;0
4754;-742745.359999999403954;-1042759.160000000149012;0
3763;-743140.420000001788139;-1042987.649999998509884;0
755;-741668.000000000000000;-1042700.000000000000000;0
4714;-742856.359999999403954;-1042618.210000000894070;0
2135;-743006.000000000000000;-1045119.000000000000000;0
5069;-742829.063999999314547;-1043280.938000001013279;0
4873;-742775.690000001341105;-1042931.829999998211861;0
4809;-743081.589999999850988;-1042799.800000000745058;0
1099;-741376.000000000000000;-1044563.000000000000000;0
2495;-741982.000000000000000;-1044140.000000000000000;0
7154;-742908.467000000178814;-1044547.784000001847744;0
3090;-743913.418999999761581;-1042804.416999999433756;0
618;-742203.000000000000000;-1043272.000000000000000;0
4088;-742812.114999998360872;-1043580.475000001490116;0
1213;-742068.000000000000000;-1044387.000000000000000;0
1045;-741849.000000000000000;-1044775.000000000000000;0
397;-742355.000000000000000;-1043861.000000000000000;0
5412;-742582.037000000476837;-1042571.986000001430511;0
7011;-742831.309999998658895;-1044257.245000001043081;0
5124;-742983.513000000268221;-1043417.271999999880791;0
6473;-741931.359999999403954;-1044555.109999999403954;0
839;-742021.000000000000000;-1042510.000000000000000;0
4515;-742607.100000001490116;-1042765.780000001192093;0
206;-743179.000000000000000;-1043581.000000000000000;0
5209;-743271.947999998927116;-1043361.392000000923872;0
1769;-741260.000000000000000;-1044112.000000000000000;0
5995;-744441.440999999642372;-1042779.568999998271465;0
676;-742442.000000000000000;-1043196.000000000000000;0
4739;-742751.690000001341105;-1042699.230000000447035;0
335;-742635.000000000000000;-1043966.000000000000000;0
2108;-743147.000000000000000;-1045086.000000000000000;0
1381;-742115.000000000000000;-1044999.000000000000000;0
4925;-742455.502000000327826;-1042923.307000000029802;0
7136;-742914.329999998211861;-1044374.469999998807907;0
672;-742484.000000000000000;-1043226.000000000000000;0
3144;-744012.590999998152256;-1042662.508000001311302;0
5998;-742019.482000000774860;-1043283.164000000804663;0
4597;-742620.600000001490116;-1042680.690000001341105;0
222;-742939.000000000000000;-1043526.000000000000000;0
5708;-743418.927999999374151;-1043640.519000001251698;0
5747;-743413.175999999046326;-1043698.811000000685453;0
1370;-742061.000000000000000;-1044797.000000000000000;0
2395;-742244.000000000000000;-1045363.000000000000000;0
3064;-744117.098999999463558;-1042868.348999999463558;0
6200;-742318.653999999165535;-1043066.462000001221895;0
5685;-743396.092999998480082;-1043720.434000000357628;0
4602;-742441.269000001251698;-1042596.320000000298023;0
885;-741739.000000000000000;-1042777.000000000000000;0
4615;-742527.811000000685453;-1042658.600999999791384;0
4674;-742806.475999999791384;-1042703.594999998807907;0
7086;-743333.149999998509884;-1044527.250000000000000;0
5243;-743357.622000001370907;-1043407.258999999612570;0
7170;-742667.579999998211861;-1044492.469999998807907;0
1553;-741350.000000000000000;-1044268.000000000000000;0
4748;-742895.730000000447035;-1042781.289999999105930;0
4509;-742502.519999999552965;-1042732.079999998211861;0
4531;-742746.070000000298023;-1042885.980000000447035;0
4859;-742966.710000000894070;-1042996.302999999374151;0
6209;-742319.320000000298023;-1043066.114999998360872;0
5272;-743000.013999998569489;-1043245.364000000059605;0
5698;-743416.785999998450279;-1043633.638000000268221;0
4741;-742787.859999999403954;-1042715.800000000745058;0
6193;-742316.486000001430511;-1043063.991000000387430;0
3760;-743233.829999998211861;-1042978.739999998360872;0
4130;-742868.460000000894070;-1044055.510000001639128;0
509;-741991.000000000000000;-1043143.000000000000000;0
207;-743142.000000000000000;-1043590.000000000000000;0
4891;-742595.048999998718500;-1042857.274999998509884;0
4927;-742447.969999998807907;-1042874.710000000894070;0
609;-741984.000000000000000;-1043272.000000000000000;0
6337;-742257.140000000596046;-1042864.820000000298023;0
2163;-742944.000000000000000;-1045168.000000000000000;0
1269;-742246.000000000000000;-1044462.000000000000000;0
6458;-743360.644999999552965;-1043919.311999998986721;0
2079;-742688.000000000000000;-1044428.000000000000000;0
1591;-742378.000000000000000;-1044910.000000000000000;0
5174;-743296.331000000238419;-1043439.800000000745058;0
6201;-742317.888999998569489;-1043065.035000000149012;0
202;-743240.000000000000000;-1043597.000000000000000;0
322;-742701.000000000000000;-1044153.000000000000000;0
7201;-742571.190000001341105;-1044939.320000000298023;0
8276;-742095.079999998211861;-1042752.519999999552965;0
6227;-742319.839999999850988;-1043063.936000000685453;0
910;-742219.000000000000000;-1042529.000000000000000;0
6369;-741962.675000000745058;-1042665.013999998569489;0
6111;-742241.054000001400709;-1043365.475999999791384;0
1991;-743482.000000000000000;-1044929.000000000000000;0
2511;-743050.000000000000000;-1044050.000000000000000;0
4511;-742539.859999999403954;-1042744.070000000298023;0
5026;-742631.168999999761581;-1042903.938999999314547;0
5595;-743416.488000001758337;-1043680.118999999016523;0
4727;-742869.390000000596046;-1042700.829999998211861;0
1954;-743372.000000000000000;-1044497.000000000000000;0
346;-742540.000000000000000;-1043816.000000000000000;0
7245;-742748.780000001192093;-1044837.699999999254942;0
1791;-742157.000000000000000;-1044163.000000000000000;0
5727;-743422.451999999582767;-1043637.473000001162291;0
4001;-743418.500000000000000;-1044051.739000000059605;0
5198;-743259.600999999791384;-1043302.061000000685453;0
6225;-742314.519999999552965;-1043055.927000001072884;0
3945;-743388.361000001430511;-1043434.486000001430511;0
620;-742253.000000000000000;-1043281.000000000000000;0
3351;-743954.622000001370907;-1043011.489999998360872;0
4824;-742918.673000000417233;-1042871.875000000000000;0
4778;-742918.024999998509884;-1042786.565000001341105;0
6241;-742365.649999998509884;-1043065.059999998658895;0
2346;-742654.000000000000000;-1045546.000000000000000;0
1134;-741558.000000000000000;-1044450.000000000000000;0
4538;-742291.464000001549721;-1042734.344000000506639;0
7141;-742895.629999998956919;-1044470.910000000149012;0
5687;-743415.142000000923872;-1043630.285999998450279;0
4580;-742393.905000001192093;-1042551.807000000029802;0
6176;-742314.491000000387430;-1043063.256000000983477;0
2362;-742301.000000000000000;-1045580.000000000000000;0
679;-742404.000000000000000;-1043185.000000000000000;0
8281;-742164.160000000149012;-1042778.140000000596046;0
1700;-741406.000000000000000;-1044677.000000000000000;0
7198;-742561.769999999552965;-1044881.949999999254942;0
4705;-742714.100000001490116;-1042599.829999998211861;0
4025;-743202.881000000983477;-1043852.008000001311302;0
7281;-742801.859999999403954;-1044705.300000000745058;0
3204;-743715.278999999165535;-1042506.118999999016523;0
2505;-742762.000000000000000;-1045562.000000000000000;0
2304;-742442.000000000000000;-1045429.000000000000000;0
4516;-742588.570000000298023;-1042771.460000000894070;0
6829;-741498.170000001788139;-1044764.809999998658895;0
5652;-743429.532999999821186;-1043700.732000000774860;0
3944;-743390.002000000327826;-1043413.532999999821186;0
3527;-744805.695999998599291;-1042671.809000000357628;0
1555;-741196.000000000000000;-1044374.000000000000000;0
5960;-743141.460999999195337;-1043339.964999999850988;0
6785;-741294.269999999552965;-1044465.800000000745058;0
1697;-741495.000000000000000;-1044664.000000000000000;0
1716;-741294.859999999403954;-1044879.870000001043081;0
5736;-743414.859999999403954;-1043691.462999999523163;0
6487;-741745.798000000417233;-1044519.414999999105930;0
4030;-743133.280000001192093;-1043791.552000001072884;0
4906;-742448.370000001043081;-1042815.789999999105930;0
4667;-742823.039999999105930;-1042631.620000001043081;0
6279;-742306.210000000894070;-1043033.421999998390675;0
6159;-742312.495999999344349;-1043062.521000001579523;0
723;-741990.000000000000000;-1043024.000000000000000;0
1374;-742155.000000000000000;-1044854.000000000000000;0
1303;-741865.000000000000000;-1044692.000000000000000;0
1447;-741541.000000000000000;-1044744.000000000000000;0
272;-743396.000000000000000;-1043809.000000000000000;0
3791;-743144.839999999850988;-1042881.120000001043081;0
3421;-743743.348000001162291;-1043104.984999999403954;0
6499;-741707.811000000685453;-1044907.068999998271465;0
5213;-743326.385999999940395;-1043368.675999999046326;0
699;-742067.000000000000000;-1042896.000000000000000;0
5653;-743429.589999999850988;-1043701.940999999642372;0
5163;-743163.861999999731779;-1043392.113000001758337;0
4463;-742198.989999998360872;-1042569.030000001192093;0
734;-741935.000000000000000;-1043014.000000000000000;0
4982;-742559.320999998599291;-1043012.914000000804663;0
4964;-742390.059999998658895;-1043044.839999999850988;0
5168;-743228.796000000089407;-1043420.092000000178814;0
339;-742606.000000000000000;-1043916.000000000000000;0
4688;-742676.179000001400709;-1042555.322999998927116;0
6208;-742320.098000001162291;-1043067.458999998867512;0
7541;-742644.280000001192093;-1045370.789999999105930;0
1143;-741415.000000000000000;-1044457.000000000000000;0
2211;-743248.000000000000000;-1045258.000000000000000;0
6123;-743427.453000001609325;-1043603.083000000566244;0
4957;-742366.010000001639128;-1043006.059999998658895;0
4810;-743058.420000001788139;-1042810.050000000745058;0
7743;-741707.912999998778105;-1045072.826999999582767;0
316;-742490.000000000000000;-1044202.000000000000000;0
6179;-742312.195000000298023;-1043059.041000001132488;0
5596;-743415.271999999880791;-1043680.212999999523163;0
1818;-743046.000000000000000;-1044380.000000000000000;0
7176;-742630.820000000298023;-1044585.809999998658895;0
810;-741934.000000000000000;-1042519.000000000000000;0
4772;-742879.881999999284744;-1042872.157000001519918;0
7168;-742792.969999998807907;-1044547.879999998956919;0
7369;-743236.822000000625849;-1045458.699000000953674;0
6706;-742275.234999999403954;-1044689.607999999076128;0
568;-742116.000000000000000;-1043604.000000000000000;0
6359;-742018.440000001341105;-1042712.449999999254942;0
4500;-742315.239999998360872;-1042719.460000000894070;0
1318;-741838.000000000000000;-1044940.000000000000000;0
3801;-743091.350000001490116;-1042882.719999998807907;0
2341;-742711.000000000000000;-1045552.000000000000000;0
4079;-742836.170000001788139;-1043800.960000000894070;0
1172;-741869.000000000000000;-1044348.000000000000000;0
522;-742261.000000000000000;-1043122.000000000000000;0
4252;-742124.022999998182058;-1043390.519000001251698;0
6217;-742320.725999999791384;-1043067.133999999612570;0
6224;-742315.320000000298023;-1043057.335000000894070;0
711;-741828.000000000000000;-1042860.000000000000000;0
8283;-742198.600000001490116;-1042801.980000000447035;0
1235;-742150.000000000000000;-1044330.000000000000000;0
5689;-743415.442000001668930;-1043633.646000001579523;0
6842;-741574.894000001251698;-1044962.013999998569489;0
1657;-741399.000000000000000;-1044717.000000000000000;0
1538;-741948.000000000000000;-1043973.000000000000000;0
1699;-741435.000000000000000;-1044671.000000000000000;0
1384;-742180.000000000000000;-1044969.000000000000000;0
1407;-741650.000000000000000;-1044242.000000000000000;0
1473;-741642.000000000000000;-1044158.000000000000000;0
2339;-742747.000000000000000;-1045548.000000000000000;0
7243;-742724.339999999850988;-1044835.870000001043081;0
1365;-742125.050000000745058;-1044945.710000000894070;0
7292;-742821.410000000149012;-1044818.760000001639128;0
6269;-742337.300000000745058;-1043018.486000001430511;0
269;-743248.000000000000000;-1043725.000000000000000;0
695;-742207.000000000000000;-1043019.000000000000000;0
7814;-741769.006999999284744;-1044058.535999998450279;0
1156;-741191.980000000447035;-1044497.850000001490116;0
649;-742233.000000000000000;-1043382.000000000000000;0
171;-743448.000000000000000;-1043399.000000000000000;0
4762;-742854.192000001668930;-1042825.931000001728535;0
5583;-743410.274999998509884;-1043642.072000000625849;0
4693;-742691.399999998509884;-1042612.399999998509884;0
6261;-742373.956999998539686;-1043022.041999999433756;0
4586;-742464.175000000745058;-1042636.333999998867512;0
7967;-741508.109999999403954;-1044369.239999998360872;0
4920;-742444.449999999254942;-1042928.980000000447035;0
4698;-742673.530000001192093;-1042715.780000001192093;0
4638;-742553.631999999284744;-1042542.028000000864267;0
4566;-742473.846000000834465;-1042545.780000001192093;0
5579;-743409.682999998331070;-1043634.574999999254942;0
5733;-743410.142999999225140;-1043688.210999999195337;0
2072;-743043.000000000000000;-1044743.000000000000000;0
1823;-742973.000000000000000;-1044174.000000000000000;0
4723;-742883.429999999701977;-1042644.829999998211861;0
377;-742494.000000000000000;-1043658.000000000000000;0
6221;-742317.633000001311302;-1043061.541000001132488;0
1410;-741643.039999999105930;-1044709.940000001341105;0
7699;-742381.114000000059605;-1044818.644000001251698;0
1658;-741404.000000000000000;-1044751.000000000000000;0
3820;-743111.699999999254942;-1042659.320000000298023;0
7155;-742920.776999998837709;-1044546.934000000357628;0
1552;-741351.000000000000000;-1044295.000000000000000;0
1960;-743386.000000000000000;-1044623.000000000000000;0
2483;-741266.219999998807907;-1044755.030000001192093;0
6746;-742405.083999998867512;-1044259.199999999254942;0
5234;-743348.486000001430511;-1043412.741999998688698;0
3466;-745113.802000001072884;-1042675.725000001490116;0
8242;-742568.629999998956919;-1045197.829999998211861;0
4528;-742714.350000001490116;-1042840.010000001639128;0
6218;-742319.947000000625849;-1043065.767999999225140;0
3841;-743159.929999999701977;-1042641.120000001043081;0
2104;-743176.000000000000000;-1044964.000000000000000;0
6691;-742386.879000000655651;-1045082.589000001549721;0
4830;-743043.449999999254942;-1042882.359999999403954;0
2278;-742791.000000000000000;-1045657.000000000000000;0
3797;-743147.989999998360872;-1042854.129999998956919;0
208;-743146.000000000000000;-1043573.000000000000000;0
3433;-743896.050000000745058;-1042546.662000000476837;0
4572;-742343.539999999105930;-1042598.289999999105930;0
8062;-742311.170000001788139;-1045127.960000000894070;0
1332;-741793.000000000000000;-1044755.000000000000000;0
1312;-741659.000000000000000;-1044848.000000000000000;0
4852;-742992.449999999254942;-1042849.890000000596046;0
545;-742337.000000000000000;-1043805.000000000000000;0
6187;-742313.572999998927116;-1043060.111999999731779;0
3809;-742980.300000000745058;-1042944.469999998807907;0
4630;-742646.271999999880791;-1042652.089999999850988;0
4556;-742354.629999998956919;-1042526.789999999105930;0
5715;-743423.747000001370907;-1043633.157999999821186;0
5146;-743064.554000001400709;-1043452.671999998390675;0
3483;-745211.359999999403954;-1042783.331000000238419;0
4228;-742132.969999998807907;-1043331.449999999254942;0
4987;-742641.745000001043081;-1043011.309999998658895;0
5171;-743266.124000001698732;-1043419.293999999761581;0
6230;-742317.590999998152256;-1043059.730999998748302;0
4132;-742818.859999999403954;-1044067.969999998807907;0
333;-742651.000000000000000;-1043996.000000000000000;0
6825;-741380.010000001639128;-1044780.089999999850988;0
7174;-742639.019999999552965;-1044564.949999999254942;0
6128;-742313.668999999761581;-1043069.186000000685453;0
344;-742557.000000000000000;-1043847.000000000000000;0
4749;-742884.420000001788139;-1042760.329999998211861;0
5746;-743415.399000000208616;-1043698.644000001251698;0
351;-742509.000000000000000;-1043739.000000000000000;0
1594;-742304.000000000000000;-1044977.000000000000000;0
8262;-742129.620000001043081;-1042698.079999998211861;0
6165;-742315.407000001519918;-1043066.436000000685453;0
1705;-741257.219999998807907;-1044695.690000001341105;0
838;-742043.000000000000000;-1042524.000000000000000;0
529;-742162.000000000000000;-1043803.000000000000000;0
6572;-741295.410000000149012;-1044112.980000000447035;0
