OID_;X;Y;TEMPERATURE
3612;-744996.545000001788139;-1042292.646000001579523;0
2758;-743919.949999999254942;-1043488.059999998658895;0
3211;-743651.409000001847744;-1042483.458999998867512;0
5787;-743470.390000000596046;-1042099.079999998211861;0
7409;-743521.629999998956919;-1045356.570000000298023;0
7147;-742827.925000000745058;-1044451.385000001639128;0
3233;-744152.962999999523163;-1042686.791999999433756;0
467;-741757.000000000000000;-1043352.000000000000000;0
6;-743464.000000000000000;-1042594.000000000000000;57
3656;-744550.905000001192093;-1042638.070000000298023;0
1929;-743440.000000000000000;-1044410.000000000000000;0
3701;-744582.008000001311302;-1042507.443999998271465;0
4070;-742925.285000000149012;-1043783.565000001341105;0
1732;-741840.000000000000000;-1045226.000000000000000;0
1843;-743041.600000001490116;-1044324.489999998360872;0
746;-741714.000000000000000;-1043020.000000000000000;0
7829;-743509.649999998509884;-1045166.399999998509884;0
513;-742083.000000000000000;-1043145.000000000000000;0
4075;-742947.934999998658895;-1043903.649999998509884;0
2237;-743368.000000000000000;-1045238.000000000000000;0
2805;-743893.609999999403954;-1043543.980000000447035;0
3811;-743244.620000001043081;-1042809.420000001788139;0
7155;-742920.776999998837709;-1044546.934000000357628;0
3280;-743624.243999999016523;-1042811.839999999850988;0
1705;-741257.219999998807907;-1044695.690000001341105;0
1629;-742450.000000000000000;-1044518.000000000000000;0
1487;-741117.000000000000000;-1044216.000000000000000;0
1714;-741239.129999998956919;-1044887.079999998211861;0
728;-741997.000000000000000;-1042918.000000000000000;0
3216;-743615.890999998897314;-1042451.129999998956919;0
1879;-743302.000000000000000;-1044264.000000000000000;0
528;-742187.000000000000000;-1043838.000000000000000;0
2886;-744104.953999999910593;-1043172.171999998390675;0
730;-741948.000000000000000;-1042998.000000000000000;0
1698;-741464.000000000000000;-1044668.000000000000000;0
3377;-743832.151999998837709;-1042925.721000000834465;0
2325;-742559.000000000000000;-1045494.000000000000000;0
7008;-742899.559999998658895;-1044224.074999999254942;0
1810;-743136.000000000000000;-1044544.000000000000000;0
3456;-745096.247000001370907;-1042705.502999998629093;0
204;-743208.000000000000000;-1043588.000000000000000;0
2096;-743154.000000000000000;-1044724.000000000000000;0
7168;-742792.969999998807907;-1044547.879999998956919;0
2151;-742827.000000000000000;-1045047.000000000000000;0
578;-742023.000000000000000;-1043464.000000000000000;0
2016;-743230.000000000000000;-1044873.000000000000000;0
2075;-743114.000000000000000;-1044772.000000000000000;0
1946;-743281.000000000000000;-1044437.000000000000000;0
2270;-742954.000000000000000;-1045592.000000000000000;0
4086;-742813.079999998211861;-1043631.730000000447035;0
4083;-742820.771999999880791;-1043708.657000001519918;0
529;-742162.000000000000000;-1043803.000000000000000;0
7022;-743155.660000000149012;-1044074.410000000149012;0
5306;-743103.326999999582767;-1043193.129000000655651;0
4235;-742390.041999999433756;-1043492.094999998807907;0
1097;-741414.000000000000000;-1044558.000000000000000;0
2217;-743112.000000000000000;-1045360.000000000000000;0
281;-743045.000000000000000;-1043848.000000000000000;0
348;-742525.000000000000000;-1043787.000000000000000;0
1058;-741667.000000000000000;-1045072.000000000000000;0
1016;-742147.000000000000000;-1044590.000000000000000;0
3261;-743581.445999998599291;-1042690.379999998956919;0
2440;-742596.000000000000000;-1044193.000000000000000;0
7171;-742671.969999998807907;-1044508.219999998807907;0
2161;-742876.000000000000000;-1045153.000000000000000;0
2227;-743029.000000000000000;-1045506.000000000000000;0
3586;-744920.728000000119209;-1042505.664999999105930;0
6856;-741514.510999999940395;-1044912.175999999046326;0
378;-742514.000000000000000;-1043703.000000000000000;0
4052;-743252.954999998211861;-1043843.585000000894070;0
6811;-741110.469999998807907;-1044663.493000000715256;0
2056;-743436.000000000000000;-1045065.000000000000000;0
1196;-741677.000000000000000;-1043894.000000000000000;0
3760;-743233.829999998211861;-1042978.739999998360872;0
2474;-743439.000000000000000;-1044900.000000000000000;0
7159;-743013.767000000923872;-1044544.160999998450279;0
4154;-742544.524999998509884;-1044048.190000001341105;0
7183;-742606.379999998956919;-1044692.969999998807907;0
5271;-742995.381999999284744;-1043229.673000000417233;0
1561;-743186.000000000000000;-1045098.000000000000000;0
350;-742505.000000000000000;-1043757.000000000000000;0
1814;-743095.000000000000000;-1044510.000000000000000;0
4025;-743202.881000000983477;-1043852.008000001311302;0
1229;-742244.000000000000000;-1044253.000000000000000;0
7031;-743301.824999999254942;-1044080.774999998509884;0
1692;-741125.000000000000000;-1044816.000000000000000;0
1587;-742372.000000000000000;-1044806.000000000000000;0
397;-742355.000000000000000;-1043861.000000000000000;0
7050;-743438.070999998599291;-1044185.932000000029802;0
6713;-742278.905999999493361;-1044887.284000001847744;0
929;-744056.000000000000000;-1043306.000000000000000;0
224;-742904.000000000000000;-1043522.000000000000000;0
1781;-741247.000000000000000;-1043923.000000000000000;0
599;-741837.000000000000000;-1043243.000000000000000;0
882;-741825.000000000000000;-1042788.000000000000000;0
335;-742635.000000000000000;-1043966.000000000000000;0
6506;-741743.019999999552965;-1044571.050000000745058;0
4145;-742687.109999999403954;-1043837.125000000000000;53
4558;-742373.019999999552965;-1042506.949999999254942;0
1916;-743371.000000000000000;-1044484.000000000000000;0
5116;-742947.859000001102686;-1043386.767000000923872;0
1554;-741348.000000000000000;-1044238.000000000000000;0
6699;-742301.118999999016523;-1044484.282999999821186;0
3783;-743211.559999998658895;-1042920.120000001043081;0
1992;-743482.000000000000000;-1044954.000000000000000;0
4811;-743040.379999998956919;-1042799.609999999403954;0
2286;-742894.000000000000000;-1045440.000000000000000;0
1905;-743446.000000000000000;-1044312.000000000000000;0
1849;-742732.000000000000000;-1044228.000000000000000;157
1819;-743034.000000000000000;-1044350.000000000000000;0
1920;-743384.000000000000000;-1044363.000000000000000;0
1661;-741426.000000000000000;-1044846.000000000000000;0
7046;-743398.329999998211861;-1044186.289999999105930;0
696;-742077.000000000000000;-1042913.000000000000000;0
7084;-743318.609999999403954;-1044521.789999999105930;0
4466;-742177.620000001043081;-1042567.899999998509884;0
504;-741937.000000000000000;-1043164.000000000000000;0
4236;-742406.842999998480082;-1043504.015000000596046;0
7397;-743021.859999999403954;-1045682.989999998360872;0
7015;-742554.570000000298023;-1044360.725000001490116;0
7780;-743046.243000000715256;-1045844.168999999761581;0
5993;-743947.829999998211861;-1042646.350000001490116;0
1042;-741883.000000000000000;-1044682.000000000000000;0
2503;-742753.000000000000000;-1045484.000000000000000;0
4732;-742777.550000000745058;-1042653.539999999105930;0
4243;-742194.050000000745058;-1043431.899999998509884;0
918;-743437.000000000000000;-1043904.000000000000000;0
4339;-742459.269000001251698;-1043367.923000000417233;0
7325;-743032.969999998807907;-1045186.298999998718500;0
8073;-742120.640000000596046;-1045259.500000000000000;0
677;-742425.000000000000000;-1043200.000000000000000;0
4499;-742338.899999998509884;-1042707.250000000000000;0
549;-742290.000000000000000;-1043770.000000000000000;0
7986;-741040.829999998211861;-1044408.250000000000000;0
634;-742117.000000000000000;-1043309.000000000000000;0
737;-741849.000000000000000;-1043021.000000000000000;0
4008;-743250.114999998360872;-1044043.905999999493361;0
3802;-743068.190000001341105;-1042879.710000000894070;0
1426;-742056.000000000000000;-1044228.000000000000000;0
8046;-742169.109999999403954;-1044835.660000000149012;0
3309;-743830.328000001609325;-1042834.535000000149012;0
4927;-742447.969999998807907;-1042874.710000000894070;0
6355;-741920.949999999254942;-1042700.510000001639128;0
3389;-743919.920000001788139;-1043153.510000001639128;0
2435;-742452.000000000000000;-1044222.000000000000000;0
3162;-743983.820000000298023;-1042541.004999998956919;0
4134;-742772.309999998658895;-1044078.870000001043081;0
1415;-741623.000000000000000;-1044561.000000000000000;0
514;-742119.000000000000000;-1043141.000000000000000;0
4959;-742331.289999999105930;-1043002.690000001341105;0
1966;-743413.000000000000000;-1044746.000000000000000;0
7262;-742990.940000001341105;-1044886.989999998360872;0
1128;-741655.000000000000000;-1044448.000000000000000;0
4629;-742630.986000001430511;-1042626.096000000834465;0
1591;-742378.000000000000000;-1044910.000000000000000;0
1525;-741738.000000000000000;-1043823.000000000000000;0
8122;-742826.149999998509884;-1045713.260000001639128;0
5296;-743058.934999998658895;-1043177.035000000149012;0
1140;-741475.000000000000000;-1044461.000000000000000;0
8080;-741989.600000001490116;-1045310.420000001788139;0
7197;-742570.949000000953674;-1044895.548999998718500;0
4222;-742187.096999999135733;-1043485.890000000596046;0
679;-742404.000000000000000;-1043185.000000000000000;0
4203;-742299.442000001668930;-1043608.692000001668930;0
8281;-742164.160000000149012;-1042778.140000000596046;0
4039;-743159.070000000298023;-1043772.795000001788139;0
3836;-743096.070000000298023;-1042561.879999998956919;0
5250;-743328.995000001043081;-1043178.495000001043081;0
4976;-742494.337000001221895;-1043009.743000000715256;0
1608;-742391.000000000000000;-1044383.000000000000000;0
4588;-742421.668999999761581;-1042556.124000001698732;0
5198;-743259.600999999791384;-1043302.061000000685453;0
707;-741897.000000000000000;-1042863.000000000000000;0
7118;-743468.750000000000000;-1044677.690000001341105;0
1295;-742082.000000000000000;-1044456.000000000000000;0
4705;-742714.100000001490116;-1042599.829999998211861;0
5449;-743124.745000001043081;-1043406.449000000953674;0
7994;-741529.219999998807907;-1045148.010000001639128;0
1988;-743481.000000000000000;-1044849.000000000000000;0
2139;-742936.000000000000000;-1045103.000000000000000;0
1171;-741882.000000000000000;-1044375.000000000000000;0
4652;-742775.500000000000000;-1042533.997999999672174;0
5108;-742876.219999998807907;-1043431.129999998956919;0
5746;-743415.399000000208616;-1043698.644000001251698;0
2358;-742370.000000000000000;-1045593.000000000000000;0
4464;-742182.309999998658895;-1042571.379999998956919;0
2020;-743260.000000000000000;-1044941.000000000000000;0
3335;-743976.318999998271465;-1042991.258999999612570;0
4939;-742448.866999998688698;-1043072.822999998927116;0
8257;-742149.809999998658895;-1045048.399999998509884;0
2523;-742181.000000000000000;-1044140.000000000000000;0
1314;-741695.000000000000000;-1044866.000000000000000;0
1759;-741128.000000000000000;-1044097.000000000000000;0
1110;-741220.730000000447035;-1044598.480000000447035;0
3832;-743029.390000000596046;-1042595.910000000149012;0
4424;-742225.300000000745058;-1043033.250000000000000;0
5066;-742827.379000000655651;-1043252.267999999225140;0
5208;-743237.954999998211861;-1043368.065999999642372;0
7164;-742596.114999998360872;-1044447.173000000417233;0
4170;-742407.245000001043081;-1043945.519999999552965;0
1702;-741348.000000000000000;-1044682.000000000000000;0
1520;-741777.000000000000000;-1043939.000000000000000;0
1598;-742351.000000000000000;-1045090.000000000000000;0
7283;-742804.480000000447035;-1044732.769999999552965;0
1056;-741707.000000000000000;-1045042.000000000000000;0
4320;-742264.149000000208616;-1043259.541999999433756;0
8060;-742295.719999998807907;-1045082.859999999403954;0
1823;-742973.000000000000000;-1044174.000000000000000;0
6138;-742313.561999998986721;-1043067.399000000208616;0
1719;-741406.760000001639128;-1044866.039999999105930;0
952;-742274.000000000000000;-1043018.000000000000000;0
1618;-742405.000000000000000;-1044404.000000000000000;0
4503;-742402.579999998211861;-1042702.839999999850988;0
1311;-741646.000000000000000;-1044831.000000000000000;0
673;-742467.000000000000000;-1043230.000000000000000;0
7656;-742290.328000001609325;-1045294.499000001698732;0
1025;-741989.000000000000000;-1044602.000000000000000;0
2244;-743264.000000000000000;-1045331.000000000000000;0
1004;-741898.000000000000000;-1044565.000000000000000;0
1398;-741753.000000000000000;-1044201.000000000000000;0
1291;-742205.000000000000000;-1044568.000000000000000;0
1181;-741920.000000000000000;-1044230.000000000000000;0
1271;-742240.000000000000000;-1044521.000000000000000;0
7943;-742063.449999999254942;-1044055.260000001639128;0
1962;-743406.000000000000000;-1044664.000000000000000;0
5002;-742561.190000001341105;-1042977.401999998837709;0
5455;-742823.936000000685453;-1043283.644999999552965;0
6648;-741750.510000001639128;-1044080.329999998211861;0
4647;-742705.322999998927116;-1042525.425000000745058;0
1354;-741877.000000000000000;-1044859.000000000000000;0
5221;-743263.820000000298023;-1043556.920000001788139;0
1827;-743033.000000000000000;-1044080.000000000000000;0
2520;-741847.000000000000000;-1045324.000000000000000;0
2398;-742150.000000000000000;-1045370.000000000000000;0
7515;-742273.021999999880791;-1044371.543999999761581;0
3803;-743066.289999999105930;-1042896.320000000298023;0
3413;-743776.791000001132488;-1043071.675000000745058;0
7962;-741640.190000001341105;-1044316.800000000745058;0
6217;-742320.725999999791384;-1043067.133999999612570;0
2081;-742551.000000000000000;-1044621.000000000000000;0
1461;-741473.000000000000000;-1044266.000000000000000;0
6570;-741280.390000000596046;-1044118.620000001043081;0
2362;-742301.000000000000000;-1045580.000000000000000;0
3098;-743918.111000001430511;-1042753.629000000655651;0
1401;-741723.000000000000000;-1044408.000000000000000;0
1511;-741795.000000000000000;-1044159.000000000000000;0
8282;-742183.519999999552965;-1042790.890000000596046;0
1267;-742040.000000000000000;-1044999.000000000000000;0
1125;-741728.000000000000000;-1044435.000000000000000;0
1236;-742156.000000000000000;-1044348.000000000000000;0
3109;-743754.403999999165535;-1042652.872000001370907;0
3531;-744733.070999998599291;-1042679.260000001639128;0
5657;-743429.199999999254942;-1043706.837999999523163;0
184;-743445.000000000000000;-1043450.000000000000000;0
4522;-742668.079999998211861;-1042813.780000001192093;0
586;-741966.000000000000000;-1043374.000000000000000;0
277;-743398.000000000000000;-1043928.000000000000000;0
4078;-742842.960000000894070;-1043832.824999999254942;0
4516;-742588.570000000298023;-1042771.460000000894070;0
5316;-743075.980000000447035;-1043041.059999998658895;0
7234;-742594.870000001043081;-1044815.140000000596046;0
4128;-742915.039999999105930;-1044041.920000001788139;0
4920;-742444.449999999254942;-1042928.980000000447035;0
1756;-742165.000000000000000;-1045209.000000000000000;0
1731;-741456.000000000000000;-1045017.000000000000000;0
4326;-742319.855000000447035;-1043419.918999999761581;0
3581;-744918.206999998539686;-1042631.410000000149012;0
3371;-743840.392999999225140;-1043010.835000000894070;0
2322;-742651.000000000000000;-1045483.000000000000000;0
3990;-743339.489999998360872;-1043987.234999999403954;0
5251;-743317.296000000089407;-1043180.037999998778105;0
1463;-741933.000000000000000;-1043968.000000000000000;0
7706;-742313.239999998360872;-1044319.611999999731779;0
4755;-742734.960000000894070;-1042778.019999999552965;0
5659;-743426.815000001341105;-1043709.059000000357628;0
1101;-741339.000000000000000;-1044568.000000000000000;0
3141;-744035.420000001788139;-1042680.460000000894070;0
2360;-742331.000000000000000;-1045596.000000000000000;0
5737;-743412.636999998241663;-1043691.631000000983477;0
7317;-742579.670000001788139;-1045022.239999998360872;0
5141;-743039.598000001162291;-1043495.265000000596046;0
396;-742388.000000000000000;-1043886.000000000000000;0
3017;-744468.008999999612570;-1042806.090999998152256;0
6776;-741098.559999998658895;-1044491.530000001192093;0
2215;-743135.000000000000000;-1045335.000000000000000;0
1793;-742166.000000000000000;-1044246.000000000000000;0
5133;-742976.300000000745058;-1043502.951999999582767;0
7149;-742823.379000000655651;-1044496.758000001311302;0
1040;-741904.000000000000000;-1044623.000000000000000;0
6658;-741538.879999998956919;-1044165.440000001341105;0
7217;-742516.318999998271465;-1044582.890000000596046;0
3325;-743911.068999998271465;-1042947.052000001072884;0
7138;-742917.554999999701977;-1044421.774999998509884;0
6360;-742004.925000000745058;-1042692.804000001400709;0
4878;-742876.434000000357628;-1042964.004000000655651;0
1447;-741541.000000000000000;-1044744.000000000000000;0
556;-742222.000000000000000;-1043702.000000000000000;0
5590;-743422.570000000298023;-1043679.642000000923872;0
4969;-742465.059999998658895;-1043095.034000001847744;0
2364;-742504.000000000000000;-1045563.000000000000000;0
6182;-742317.399000000208616;-1043067.136999998241663;0
7682;-742503.329999998211861;-1045169.949999999254942;0
994;-741946.000000000000000;-1044433.000000000000000;0
5323;-743049.401000000536442;-1043038.131000000983477;0
574;-742068.000000000000000;-1043538.000000000000000;0
4737;-742718.399999998509884;-1042684.079999998211861;0
4087;-742811.609999999403954;-1043604.190000001341105;0
4921;-742444.739999998360872;-1042908.420000001788139;0
3065;-744092.028999999165535;-1042868.519000001251698;0
560;-742181.000000000000000;-1043665.000000000000000;0
1218;-742120.000000000000000;-1044309.000000000000000;0
2381;-742313.000000000000000;-1045438.000000000000000;0
5736;-743414.859999999403954;-1043691.462999999523163;0
6190;-742318.782999999821186;-1043068.206000000238419;0
5648;-743429.164000000804663;-1043695.905999999493361;0
1507;-741673.000000000000000;-1044223.000000000000000;0
6251;-742377.396999999880791;-1043042.284000001847744;0
4876;-742826.449999999254942;-1042944.910000000149012;0
6387;-742159.980000000447035;-1042496.210000000894070;0
4760;-742826.947000000625849;-1042799.914000000804663;0
1015;-742126.000000000000000;-1044599.000000000000000;0
7540;-742660.390000000596046;-1045368.829999998211861;0
5203;-743386.346000000834465;-1043274.958000000566244;0
7947;-742030.969999998807907;-1044096.679999999701977;0
5999;-741991.910000000149012;-1043282.079999998211861;0
2385;-742167.000000000000000;-1045479.000000000000000;0
839;-742021.000000000000000;-1042510.000000000000000;0
1421;-741587.000000000000000;-1044356.000000000000000;0
1934;-743294.000000000000000;-1044407.000000000000000;0
6272;-742325.379000000655651;-1043017.383000001311302;0
569;-742096.000000000000000;-1043601.000000000000000;0
5177;-743336.440999999642372;-1043440.883999999612570;0
6180;-742311.429000001400709;-1043057.635999999940395;0
4137;-742705.739999998360872;-1044094.100000001490116;0
1129;-741672.000000000000000;-1044438.000000000000000;0
1033;-741968.000000000000000;-1044843.000000000000000;0
4509;-742502.519999999552965;-1042732.079999998211861;0
2542;-741813.000000000000000;-1044224.000000000000000;0
4828;-743048.579999998211861;-1042941.179999999701977;0
885;-741739.000000000000000;-1042777.000000000000000;0
5370;-742580.300999999046326;-1042977.140999998897314;0
1126;-741684.000000000000000;-1044450.000000000000000;0
1253;-742084.000000000000000;-1044730.000000000000000;0
876;-741953.000000000000000;-1042636.000000000000000;0
1559;-741190.000000000000000;-1044242.000000000000000;0
5693;-743415.905000001192093;-1043640.377000000327826;0
711;-741828.000000000000000;-1042860.000000000000000;0
3980;-743339.260000001639128;-1043798.940000001341105;0
4129;-742890.405000001192093;-1044048.370000001043081;0
6722;-742357.717000000178814;-1044705.708000000566244;0
4570;-742347.760000001639128;-1042540.809999998658895;0
4803;-743043.410999998450279;-1042699.506000000983477;0
7220;-742418.820000000298023;-1044813.199999999254942;0
4030;-743133.280000001192093;-1043791.552000001072884;0
4669;-742823.199999999254942;-1042658.309999998658895;0
6275;-742314.603999998420477;-1043016.407999999821186;0
3455;-745119.375999998301268;-1042713.640999998897314;0
883;-741802.000000000000000;-1042773.000000000000000;0
6771;-741345.015999998897314;-1044413.647999998182058;0
4998;-742514.109000001102686;-1042978.602000001817942;0
4612;-742515.302000001072884;-1042595.046999998390675;0
6156;-742314.791999999433756;-1043066.736000001430511;0
6242;-742366.677999999374151;-1043062.949000000953674;0
641;-742008.000000000000000;-1043304.000000000000000;0
7959;-741699.170000001788139;-1044292.620000001043081;0
4702;-742669.300000000745058;-1042747.399999998509884;0
5728;-743421.517999999225140;-1043638.609000001102686;0
1217;-742120.000000000000000;-1044339.000000000000000;0
4701;-742687.780000001192093;-1042761.660000000149012;0
6657;-741565.760000001639128;-1044156.980000000447035;0
6369;-741962.675000000745058;-1042665.013999998569489;0
4816;-742976.510000001639128;-1042798.309999998658895;0
732;-741860.000000000000000;-1043003.000000000000000;0
4073;-742939.109999999403954;-1043858.504999998956919;0
3956;-743414.039999999105930;-1043561.081999998539686;0
4972;-742479.962999999523163;-1043052.368999999016523;0
7963;-741608.199999999254942;-1044329.510000001639128;0
4774;-742900.078999999910593;-1042854.859000001102686;0
1088;-741617.000000000000000;-1044547.000000000000000;0
756;-741681.000000000000000;-1042695.000000000000000;0
1385;-742194.000000000000000;-1044974.000000000000000;0
4474;-741831.079999998211861;-1042685.068999998271465;0
2499;-741884.000000000000000;-1044011.000000000000000;0
4599;-742625.879999998956919;-1042698.820000000298023;0
4749;-742884.420000001788139;-1042760.329999998211861;0
1478;-741443.000000000000000;-1044220.000000000000000;0
1323;-741859.000000000000000;-1044941.000000000000000;0
2250;-743234.000000000000000;-1045435.000000000000000;0
2374;-742473.000000000000000;-1045546.000000000000000;0
2375;-742438.000000000000000;-1045570.000000000000000;0
3343;-743911.989000000059605;-1043070.489000000059605;0
1153;-741245.000000000000000;-1044480.000000000000000;0
4021;-743293.295000001788139;-1043876.995000001043081;0
845;-742126.000000000000000;-1042505.000000000000000;0
6357;-741947.870000001043081;-1042701.129999998956919;0
7965;-741515.510000001639128;-1044348.350000001490116;0
6268;-742340.850000001490116;-1043018.881000000983477;0
2149;-742819.000000000000000;-1045024.000000000000000;0
1679;-741116.550000000745058;-1044578.600000001490116;0
1837;-743015.000000000000000;-1044249.000000000000000;0
6246;-742370.552999999374151;-1043055.625999998301268;0
5513;-743426.734999999403954;-1043606.184000000357628;0
1342;-741721.000000000000000;-1044783.000000000000000;0
270;-743230.000000000000000;-1043721.000000000000000;0
4739;-742751.690000001341105;-1042699.230000000447035;0
786;-741706.000000000000000;-1042606.000000000000000;0
6707;-742271.293999999761581;-1044721.274999998509884;0
4905;-742467.730000000447035;-1042815.620000001043081;0
878;-741947.000000000000000;-1042573.000000000000000;0
3843;-743139.170000001788139;-1042650.050000000745058;0
1136;-741520.000000000000000;-1044455.000000000000000;0
1761;-741194.000000000000000;-1044104.000000000000000;0
7979;-741161.500000000000000;-1044398.210000000894070;0
2303;-742481.000000000000000;-1045422.000000000000000;0
2340;-742764.000000000000000;-1045532.000000000000000;0
5744;-743412.905999999493361;-1043695.221000000834465;0
4852;-742992.449999999254942;-1042849.890000000596046;0
4809;-743081.589999999850988;-1042799.800000000745058;0
6167;-742313.859999999403954;-1043063.607000000774860;0
6254;-742379.344000000506639;-1043038.363000001758337;0
4850;-742956.164000000804663;-1042923.403000000864267;0
621;-742285.000000000000000;-1043282.000000000000000;0
6121;-742069.784000001847744;-1043299.828000001609325;0
914;-741715.000000000000000;-1042583.000000000000000;0
7249;-742789.010999999940395;-1044830.250000000000000;0
1038;-741956.000000000000000;-1044977.000000000000000;0
5411;-742776.079999998211861;-1042905.300000000745058;0
6365;-741979.230000000447035;-1042656.230000000447035;0
7185;-742600.515000000596046;-1044717.333999998867512;0
5517;-743427.287000000476837;-1043618.956999998539686;0
5703;-743417.385000001639128;-1043633.592000000178814;0
3752;-743213.949999999254942;-1042902.719999998807907;0
1413;-741631.000000000000000;-1044621.000000000000000;0
1159;-741137.000000000000000;-1044493.000000000000000;0
7651;-742295.381000000983477;-1045479.861999999731779;0
1143;-741415.000000000000000;-1044457.000000000000000;0
5596;-743415.271999999880791;-1043680.212999999523163;0
5722;-743419.659000001847744;-1043631.798000000417233;0
2562;-741090.000000000000000;-1044404.000000000000000;0
5968;-742288.989000000059605;-1044168.456999998539686;0
631;-742153.000000000000000;-1043288.000000000000000;0
1545;-742236.000000000000000;-1044234.000000000000000;0
5688;-743415.267000000923872;-1043631.945000000298023;0
3804;-743040.109999999403954;-1042895.410000000149012;0
910;-742219.000000000000000;-1042529.000000000000000;0
982;-741992.000000000000000;-1044416.000000000000000;0
4744;-742848.129999998956919;-1042759.629999998956919;0
5518;-743427.500999998301268;-1043621.975000001490116;0
6193;-742316.486000001430511;-1043063.991000000387430;0
4511;-742539.859999999403954;-1042744.070000000298023;0
5142;-743039.870000001043081;-1043473.929999999701977;0
1324;-741943.000000000000000;-1044994.000000000000000;0
5020;-742572.699999999254942;-1042891.372999999672174;0
4529;-742762.920000001788139;-1042885.809999998658895;0
1061;-741586.000000000000000;-1045133.000000000000000;0
709;-741861.000000000000000;-1042862.000000000000000;0
6260;-742377.692999999970198;-1043022.434000000357628;0
3572;-744646.515000000596046;-1042584.320000000298023;0
4834;-742972.708000000566244;-1042657.809000000357628;0
1443;-741727.000000000000000;-1044386.000000000000000;0
544;-742343.910000000149012;-1043796.500000000000000;0
3297;-743706.958999998867512;-1042868.114999998360872;0
5295;-743047.995000001043081;-1043185.530000001192093;0
5675;-743407.907999999821186;-1043716.054999999701977;0
7223;-742409.149999998509884;-1044822.649999998509884;0
109;-744134.000000000000000;-1042768.000000000000000;0
3819;-743120.250000000000000;-1042679.620000001043081;0
1451;-741522.000000000000000;-1044602.000000000000000;0
884;-741771.000000000000000;-1042776.000000000000000;0
4703;-742697.859000001102686;-1042783.011999998241663;0
4430;-742235.070000000298023;-1043092.839999999850988;0
4775;-742898.375999998301268;-1042802.914000000804663;0
2388;-742096.000000000000000;-1045422.000000000000000;0
201;-743229.000000000000000;-1043614.000000000000000;0
7009;-742877.537000000476837;-1044242.370000001043081;0
1601;-742452.000000000000000;-1044939.000000000000000;0
4309;-742042.329999998211861;-1043492.329999998211861;0
1437;-741840.000000000000000;-1044336.000000000000000;0
4758;-742854.840999998152256;-1042811.914000000804663;0
682;-742380.000000000000000;-1043151.000000000000000;0
2380;-742308.000000000000000;-1045401.000000000000000;0
1265;-742047.000000000000000;-1044960.000000000000000;0
8045;-742173.070000000298023;-1044806.519999999552965;0
394;-742405.000000000000000;-1043863.000000000000000;0
3373;-743814.043000001460314;-1043018.168000001460314;0
4804;-743020.045000001788139;-1042704.315999999642372;0
1226;-742204.000000000000000;-1044247.000000000000000;0
995;-741906.000000000000000;-1044434.000000000000000;0
7957;-741692.839999999850988;-1044277.559999998658895;0
4767;-742786.899999998509884;-1042835.736000001430511;0
6004;-742061.723000001162291;-1043300.859999999403954;0
6128;-742313.668999999761581;-1043069.186000000685453;0
1192;-741801.000000000000000;-1044083.000000000000000;0
4229;-742146.929000001400709;-1043334.585000000894070;0
4520;-742651.079999998211861;-1042798.449999999254942;0
1923;-743395.000000000000000;-1044274.000000000000000;0
5502;-743427.894999999552965;-1043706.885000001639128;0
7542;-742623.890000000596046;-1045372.899999998509884;0
6146;-742314.942000001668930;-1043068.475999999791384;0
4206;-742342.340999998152256;-1043547.063000001013279;0
