OID_;X;Y;TEMPERATURE
3614;-744984.548999998718500;-1042283.640999998897314;0
3019;-744463.447999998927116;-1042784.646000001579523;0
3568;-744718.817999999970198;-1042588.614999998360872;0
3692;-744525.876499999314547;-1042540.534000001847744;0
3580;-744924.973999999463558;-1042593.699999999254942;0
2605;-745393.842999998480082;-1042860.796000000089407;0
5975;-745052.346999999135733;-1042674.673000000417233;0
118;-745135.000000000000000;-1042687.000000000000000;0
3542;-744575.274000000208616;-1042656.160000000149012;0
2696;-743477.489999998360872;-1042038.000000000000000;0
2520;-741847.000000000000000;-1045324.000000000000000;0
7259;-742935.280000001192093;-1044869.829999998211861;0
3066;-744075.627000000327826;-1042883.837000001221895;0
6;-743464.000000000000000;-1042594.000000000000000;0
3216;-743615.890999998897314;-1042451.129999998956919;0
651;-742490.000000000000000;-1043564.000000000000000;0
6946;-742974.765000000596046;-1043929.388000000268221;0
2226;-743057.000000000000000;-1045470.000000000000000;0
3211;-743651.409000001847744;-1042483.458999998867512;0
7716;-743023.190999999642372;-1045843.241999998688698;0
6872;-741751.719999998807907;-1045296.679999999701977;0
7397;-743021.859999999403954;-1045682.989999998360872;0
1756;-742165.000000000000000;-1045209.000000000000000;0
2275;-742845.000000000000000;-1045719.000000000000000;0
7744;-742941.256999999284744;-1045533.171000000089407;0
2760;-743863.331000000238419;-1043483.304000001400709;0
7347;-742557.690000001341105;-1045177.440000001341105;0
2755;-744003.879000000655651;-1043471.734000001102686;0
2316;-742823.000000000000000;-1045463.000000000000000;0
2334;-742872.000000000000000;-1045519.000000000000000;0
1584;-742368.000000000000000;-1044717.000000000000000;0
2404;-742179.000000000000000;-1045467.000000000000000;0
350;-742505.000000000000000;-1043757.000000000000000;0
2274;-742870.000000000000000;-1045732.000000000000000;0
3919;-743904.947000000625849;-1043493.929999999701977;0
6746;-742405.083999998867512;-1044259.199999999254942;0
3107;-743778.888000000268221;-1042682.131999999284744;0
2322;-742651.000000000000000;-1045483.000000000000000;0
1824;-742963.809999998658895;-1044143.929999999701977;0
4332;-742410.359000001102686;-1043282.916000001132488;0
7516;-742248.390000000596046;-1044368.907999999821186;0
2326;-742523.000000000000000;-1045498.000000000000000;0
2255;-743181.000000000000000;-1045372.000000000000000;0
7538;-742701.420000001788139;-1045364.109999999403954;0
2740;-744042.611999999731779;-1043335.940000001341105;0
2641;-743432.578999999910593;-1042583.418999999761581;0
3268;-743594.046999998390675;-1042721.412999998778105;0
5408;-743696.881000000983477;-1042878.024999998509884;0
5434;-744042.467999998480082;-1043135.986999999731779;0
6705;-742279.050999999046326;-1044655.923000000417233;0
1250;-742103.000000000000000;-1044672.000000000000000;0
2337;-742783.000000000000000;-1045544.000000000000000;0
7043;-743398.899999998509884;-1044106.629999998956919;0
7217;-742516.318999998271465;-1044582.890000000596046;0
2309;-742322.000000000000000;-1045519.000000000000000;0
7721;-742941.157000001519918;-1044215.368000000715256;0
1629;-742450.000000000000000;-1044518.000000000000000;0
2304;-742442.000000000000000;-1045429.000000000000000;0
2375;-742438.000000000000000;-1045570.000000000000000;0
4087;-742811.609999999403954;-1043604.190000001341105;0
7658;-742333.647999998182058;-1045313.331999998539686;0
408;-742317.000000000000000;-1044182.000000000000000;0
1423;-742167.000000000000000;-1044150.000000000000000;0
1792;-742165.000000000000000;-1044209.000000000000000;0
2891;-744029.914000000804663;-1043200.478000000119209;0
6975;-743116.140000000596046;-1044506.469999998807907;0
1767;-741261.000000000000000;-1044168.000000000000000;0
3392;-743913.699999999254942;-1043165.480000000447035;0
3368;-743901.462000001221895;-1043012.500999998301268;0
285;-743021.000000000000000;-1043730.000000000000000;0
710;-741829.000000000000000;-1042878.000000000000000;0
1426;-742056.000000000000000;-1044228.000000000000000;0
1986;-743480.000000000000000;-1044794.000000000000000;0
3321;-743903.500999998301268;-1042936.324999999254942;0
314;-742585.000000000000000;-1044184.000000000000000;0
4031;-743135.774000000208616;-1043769.622000001370907;0
744;-741666.000000000000000;-1042994.000000000000000;0
2236;-743391.000000000000000;-1045242.000000000000000;0
1600;-742418.000000000000000;-1044944.000000000000000;0
2395;-742244.000000000000000;-1045363.000000000000000;0
2098;-743134.000000000000000;-1044763.000000000000000;0
4339;-742459.269000001251698;-1043367.923000000417233;0
2256;-743156.000000000000000;-1045353.000000000000000;0
1533;-741832.000000000000000;-1043879.000000000000000;0
4063;-742855.079999998211861;-1043654.695000000298023;0
7247;-742774.480000000447035;-1044839.850000001490116;0
3836;-743096.070000000298023;-1042561.879999998956919;0
2146;-742845.000000000000000;-1044968.000000000000000;0
2043;-743471.000000000000000;-1044959.000000000000000;0
4164;-742476.478000000119209;-1044110.528000000864267;0
2467;-743434.000000000000000;-1044742.000000000000000;0
4079;-742836.170000001788139;-1043800.960000000894070;0
1760;-741162.000000000000000;-1044101.000000000000000;0
2085;-742426.000000000000000;-1044797.000000000000000;0
385;-742436.000000000000000;-1043742.000000000000000;0
7360;-743228.008000001311302;-1045144.625999998301268;0
403;-742307.000000000000000;-1043931.000000000000000;0
1772;-741277.000000000000000;-1044012.000000000000000;0
4107;-742652.458999998867512;-1043744.934000000357628;0
2166;-743016.000000000000000;-1045179.000000000000000;0
3233;-744152.962999999523163;-1042686.791999999433756;0
2016;-743230.000000000000000;-1044873.000000000000000;0
3409;-743790.434999998658895;-1043040.907999999821186;0
1357;-741935.000000000000000;-1044871.000000000000000;0
7967;-741508.109999999403954;-1044369.239999998360872;0
7047;-743395.495000001043081;-1044210.765000000596046;0
4069;-742920.684999998658895;-1043755.420000001788139;0
343;-742575.000000000000000;-1043857.000000000000000;0
3781;-743273.059999998658895;-1042814.050000000745058;0
4170;-742407.245000001043081;-1043945.519999999552965;0
1381;-742115.000000000000000;-1044999.000000000000000;0
2075;-743114.000000000000000;-1044772.000000000000000;0
4213;-742218.094999998807907;-1043529.954999998211861;0
1808;-743187.000000000000000;-1044539.000000000000000;0
7277;-742796.870000001043081;-1044653.429999999701977;0
7010;-742857.964999999850988;-1044251.155000001192093;0
6982;-743055.109999999403954;-1044342.629999998956919;0
1026;-741986.000000000000000;-1044631.000000000000000;0
8078;-742024.710000000894070;-1045262.460000000894070;0
7185;-742600.515000000596046;-1044717.333999998867512;0
465;-741728.000000000000000;-1043309.000000000000000;0
2391;-742060.000000000000000;-1045336.000000000000000;0
3372;-743823.475000001490116;-1043010.432999998331070;0
226;-742879.000000000000000;-1043516.000000000000000;0
4023;-743246.635000001639128;-1043864.364999998360872;0
1854;-742675.000000000000000;-1044271.000000000000000;0
7829;-743509.649999998509884;-1045166.399999998509884;0
1970;-743380.000000000000000;-1044854.000000000000000;0
7146;-742819.425000000745058;-1044426.225000001490116;0
993;-741977.000000000000000;-1044436.000000000000000;0
529;-742162.000000000000000;-1043803.000000000000000;0
6660;-741490.809999998658895;-1044176.750000000000000;0
8280;-742150.949999999254942;-1042770.420000001788139;0
7210;-742559.789999999105930;-1045047.809999998658895;0
3313;-743774.447000000625849;-1042903.081999998539686;0
7015;-742554.570000000298023;-1044360.725000001490116;0
4200;-742219.350000001490116;-1043727.980999998748302;0
3101;-743922.754999998956919;-1042745.195000000298023;0
6814;-741118.537999998778105;-1044802.493000000715256;0
1818;-743046.000000000000000;-1044380.000000000000000;0
4461;-742218.370000001043081;-1042583.800000000745058;0
336;-742616.000000000000000;-1043959.000000000000000;0
1267;-742040.000000000000000;-1044999.000000000000000;0
1038;-741956.000000000000000;-1044977.000000000000000;0
3433;-743896.050000000745058;-1042546.662000000476837;0
1516;-741928.000000000000000;-1044062.000000000000000;0
6945;-742955.907000001519918;-1043932.182999998331070;0
6833;-741571.423000000417233;-1044909.473999999463558;0
7139;-742919.179999999701977;-1044444.434999998658895;0
7148;-742828.445000000298023;-1044472.094999998807907;0
4235;-742390.041999999433756;-1043492.094999998807907;0
3816;-743149.379999998956919;-1042748.489999998360872;0
582;-741994.000000000000000;-1043417.000000000000000;0
7325;-743032.969999998807907;-1045186.298999998718500;0
6004;-742061.723000001162291;-1043300.859999999403954;0
6338;-742247.910000000149012;-1042851.670000001788139;0
5405;-744043.826000001281500;-1042674.686000000685453;0
3134;-743932.910999998450279;-1042615.767999999225140;0
543;-742361.000000000000000;-1043823.000000000000000;0
5015;-742575.741000000387430;-1043008.607999999076128;0
4126;-742851.335000000894070;-1044085.449999999254942;0
4251;-742136.420000001788139;-1043379.969999998807907;0
8150;-743304.219999998807907;-1043217.539999999105930;0
5324;-743025.329999998211861;-1043045.789999999105930;0
204;-743208.000000000000000;-1043588.000000000000000;0
1092;-741549.000000000000000;-1044556.000000000000000;0
1486;-741150.000000000000000;-1044219.000000000000000;0
620;-742253.000000000000000;-1043281.000000000000000;0
3096;-743906.309999998658895;-1042750.539999999105930;0
5267;-743190.021999999880791;-1043149.807000000029802;0
1408;-741647.000000000000000;-1044201.000000000000000;0
2510;-743015.000000000000000;-1044050.000000000000000;0
3759;-743267.609999999403954;-1042971.300000000745058;0
2485;-741285.420000001788139;-1044820.140000000596046;0
399;-742339.000000000000000;-1043884.000000000000000;0
7959;-741699.170000001788139;-1044292.620000001043081;0
1216;-742093.000000000000000;-1044333.000000000000000;0
4234;-742349.850000001490116;-1043459.410000000149012;0
3989;-743307.815000001341105;-1044034.914999999105930;0
7735;-742196.594999998807907;-1045243.149999998509884;0
1981;-743406.000000000000000;-1044627.000000000000000;0
1306;-741783.000000000000000;-1044653.000000000000000;0
514;-742119.000000000000000;-1043141.000000000000000;0
1344;-741750.000000000000000;-1044808.000000000000000;0
7199;-742570.910000000149012;-1044916.410000000149012;0
6203;-742316.357000000774860;-1043062.256000000983477;0
2155;-742797.000000000000000;-1045124.000000000000000;0
2537;-741975.000000000000000;-1044131.000000000000000;0
2143;-742859.000000000000000;-1045086.000000000000000;0
4024;-743223.734999999403954;-1043859.954999998211861;0
1498;-741382.000000000000000;-1044310.000000000000000;0
5203;-743386.346000000834465;-1043274.958000000566244;0
322;-742701.000000000000000;-1044153.000000000000000;0
1047;-741816.000000000000000;-1044867.000000000000000;0
1436;-741869.000000000000000;-1044323.000000000000000;0
6391;-742109.269999999552965;-1042498.320000000298023;0
7946;-742007.769999999552965;-1044091.789999999105930;0
4147;-742649.245000001043081;-1043870.320000000298023;0
1445;-741553.000000000000000;-1044757.000000000000000;0
700;-742008.000000000000000;-1042895.000000000000000;0
733;-741963.000000000000000;-1043018.000000000000000;0
4709;-742775.800000000745058;-1042600.690000001341105;0
3998;-743432.704999998211861;-1043914.274999998509884;0
6838;-741701.057999998331070;-1044977.087000001221895;0
7174;-742639.019999999552965;-1044564.949999999254942;0
4121;-742721.160000000149012;-1043948.695000000298023;0
885;-741739.000000000000000;-1042777.000000000000000;0
1117;-741066.000000000000000;-1044603.000000000000000;0
4724;-742870.089999999850988;-1042658.210000000894070;0
1597;-742338.000000000000000;-1045064.000000000000000;0
1466;-741838.000000000000000;-1044041.000000000000000;0
6514;-741730.449999999254942;-1044087.109999999403954;0
3885;-742418.339999999850988;-1042442.059999998658895;0
4826;-743043.850000001490116;-1042979.600000001490116;0
598;-741853.000000000000000;-1043233.000000000000000;0
4040;-743224.710000000894070;-1043766.050000000745058;0
1334;-741769.000000000000000;-1044799.000000000000000;0
1332;-741793.000000000000000;-1044755.000000000000000;0
3750;-743221.379999998956919;-1042925.429999999701977;0
610;-742011.000000000000000;-1043270.000000000000000;0
4073;-742939.109999999403954;-1043858.504999998956919;0
8258;-742053.760000001639128;-1042683.769999999552965;0
5687;-743415.142000000923872;-1043630.285999998450279;0
1964;-743412.000000000000000;-1044708.000000000000000;0
6712;-742273.328000001609325;-1044860.912000000476837;0
4242;-742214.469999998807907;-1043415.800000000745058;0
2130;-743095.000000000000000;-1045126.000000000000000;0
6701;-742295.142000000923872;-1044533.372000001370907;0
927;-742021.000000000000000;-1043498.000000000000000;0
8046;-742169.109999999403954;-1044835.660000000149012;0
676;-742442.000000000000000;-1043196.000000000000000;0
2480;-741251.739999998360872;-1044639.480000000447035;0
2061;-742681.000000000000000;-1044491.000000000000000;0
1245;-742114.000000000000000;-1044548.000000000000000;0
4115;-742757.210000000894070;-1044109.620000001043081;0
599;-741837.000000000000000;-1043243.000000000000000;0
1524;-741710.000000000000000;-1043844.000000000000000;0
4142;-742777.425000000745058;-1044013.440000001341105;0
6121;-742069.784000001847744;-1043299.828000001609325;0
1947;-743286.000000000000000;-1044465.000000000000000;0
3959;-743417.421999998390675;-1043577.730000000447035;0
7026;-743217.644999999552965;-1044082.329999998211861;0
1168;-741825.000000000000000;-1044403.000000000000000;0
3985;-743312.765000000596046;-1043928.164999999105930;0
2092;-742917.000000000000000;-1044617.000000000000000;0
5212;-743283.975000001490116;-1043373.589999999850988;0
1727;-741495.000000000000000;-1045103.000000000000000;0
1912;-743461.000000000000000;-1044430.000000000000000;0
5178;-743386.421000000089407;-1043452.486000001430511;0
4849;-742966.960000000894070;-1042893.583999998867512;0
6366;-741957.399999998509884;-1042652.609999999403954;0
538;-742113.000000000000000;-1043652.000000000000000;0
6185;-742315.103999998420477;-1043062.923000000417233;0
1940;-743286.000000000000000;-1044339.000000000000000;0
1996;-743484.000000000000000;-1045063.000000000000000;0
7706;-742313.239999998360872;-1044319.611999999731779;0
8054;-742230.239999998360872;-1044988.530000001192093;0
1181;-741920.000000000000000;-1044230.000000000000000;0
510;-742048.000000000000000;-1043150.000000000000000;0
3795;-743173.190000001341105;-1042842.170000001788139;0
5595;-743416.488000001758337;-1043680.118999999016523;0
1723;-741611.000000000000000;-1045092.000000000000000;0
5714;-743423.756000000983477;-1043635.103999998420477;0
5703;-743417.385000001639128;-1043633.592000000178814;0
5224;-743293.449999999254942;-1043542.160000000149012;0
1150;-741290.000000000000000;-1044485.000000000000000;0
3839;-743112.140000000596046;-1042558.280000001192093;0
1590;-742377.000000000000000;-1044885.000000000000000;0
4873;-742775.690000001341105;-1042931.829999998211861;0
6295;-742653.399999998509884;-1042696.070000000298023;0
2093;-742915.000000000000000;-1044642.000000000000000;0
4577;-742376.686000000685453;-1042590.309999998658895;0
4218;-742263.436999998986721;-1043615.100999999791384;0
1212;-742038.000000000000000;-1044383.000000000000000;0
4649;-742732.228999998420477;-1042525.100000001490116;0
3784;-743187.730000000447035;-1042922.429999999701977;0
6449;-743140.379999998956919;-1043395.559999998658895;0
6273;-742321.806000001728535;-1043017.085000000894070;0
5135;-742979.611000001430511;-1043468.912999998778105;0
1110;-741220.730000000447035;-1044598.480000000447035;0
6178;-742312.960000000894070;-1043060.445999998599291;0
6167;-742313.859999999403954;-1043063.607000000774860;0
1285;-742198.000000000000000;-1044467.000000000000000;0
1699;-741435.000000000000000;-1044671.000000000000000;0
266;-743321.000000000000000;-1043735.000000000000000;0
6723;-742592.894999999552965;-1044408.905000001192093;0
4459;-742274.829999998211861;-1042644.269999999552965;0
5233;-743347.210000000894070;-1043435.807000000029802;0
5062;-742798.513999998569489;-1043227.370999999344349;0
7977;-741271.370000001043081;-1044404.390000000596046;0
1193;-741740.000000000000000;-1043981.000000000000000;0
6847;-741591.993999999016523;-1044992.927999999374151;0
1234;-742162.000000000000000;-1044314.000000000000000;0
4725;-742875.100000001490116;-1042678.230000000447035;0
7021;-743129.019999999552965;-1044076.230000000447035;0
722;-742139.000000000000000;-1043009.000000000000000;48
159;-742965.000000000000000;-1042641.000000000000000;0
568;-742116.000000000000000;-1043604.000000000000000;0
1254;-742090.000000000000000;-1044750.000000000000000;0
5455;-742823.936000000685453;-1043283.644999999552965;0
1875;-743367.000000000000000;-1044261.000000000000000;0
4958;-742349.620000001043081;-1043004.539999999105930;0
6269;-742337.300000000745058;-1043018.486000001430511;0
506;-741980.000000000000000;-1043158.000000000000000;0
736;-741880.000000000000000;-1043017.000000000000000;0
5157;-743178.671999998390675;-1043354.681000001728535;0
621;-742285.000000000000000;-1043282.000000000000000;0
4823;-742936.660000000149012;-1042868.949999999254942;0
531;-742157.000000000000000;-1043778.000000000000000;0
4506;-742419.730000000447035;-1042717.019999999552965;0
4961;-742309.460000000894070;-1043010.730000000447035;0
4894;-742610.888999998569489;-1042819.686999998986721;0
4874;-742795.429999999701977;-1042925.910000000149012;0
2419;-742418.000000000000000;-1045101.000000000000000;0
1491;-741057.000000000000000;-1044333.000000000000000;0
3951;-743433.379999998956919;-1043586.600000001490116;0
613;-742089.000000000000000;-1043271.000000000000000;0
4730;-742831.050000000745058;-1042696.600000001490116;0
4839;-742984.162000000476837;-1042715.425000000745058;0
393;-742384.000000000000000;-1043819.000000000000000;0
3808;-742987.050000000745058;-1042925.350000001490116;0
5779;-742907.197999998927116;-1043414.096999999135733;0
207;-743142.000000000000000;-1043590.000000000000000;0
690;-742306.000000000000000;-1043081.000000000000000;0
1160;-741114.859999999403954;-1044508.120000001043081;0
727;-742001.000000000000000;-1042962.000000000000000;0
5308;-743062.039999999105930;-1043186.831999998539686;0
8049;-742198.890000000596046;-1044891.600000001490116;0
1128;-741655.000000000000000;-1044448.000000000000000;0
4976;-742494.337000001221895;-1043009.743000000715256;0
6149;-742312.646000001579523;-1043064.261999998241663;0
4927;-742447.969999998807907;-1042874.710000000894070;0
5197;-743222.513000000268221;-1043313.989999998360872;0
1261;-742057.000000000000000;-1044894.000000000000000;0
6266;-742349.021000001579523;-1043019.662999998778105;0
6859;-741483.522999998182058;-1044967.043999999761581;0
1121;-741765.000000000000000;-1044444.000000000000000;0
4525;-742716.719999998807907;-1042823.219999998807907;0
6153;-742309.583999998867512;-1043058.640999998897314;0
6162;-742310.199999999254942;-1043058.306000001728535;0
236;-743459.000000000000000;-1043775.000000000000000;0
6825;-741380.010000001639128;-1044780.089999999850988;0
1299;-741943.000000000000000;-1044719.000000000000000;0
4795;-743049.835000000894070;-1042669.013000000268221;0
2026;-743351.000000000000000;-1045022.000000000000000;0
4475;-741839.219000000506639;-1042687.409000001847744;0
681;-742383.000000000000000;-1043170.000000000000000;0
2455;-741012.000000000000000;-1044471.000000000000000;0
5719;-743419.508999999612570;-1043629.817999999970198;0
5958;-742962.513999998569489;-1043517.497999999672174;0
758;-741658.000000000000000;-1042666.000000000000000;0
6294;-742653.550000000745058;-1042686.140000000596046;0
520;-742225.000000000000000;-1043127.000000000000000;0
4843;-742975.057000000029802;-1042729.682000000029802;0
1396;-741798.000000000000000;-1044263.000000000000000;0
4815;-742992.210000000894070;-1042788.359999999403954;0
5640;-743428.425000000745058;-1043686.254000000655651;0
987;-741814.000000000000000;-1044493.000000000000000;0
4978;-742491.822999998927116;-1043028.688000001013279;0
4739;-742751.690000001341105;-1042699.230000000447035;0
3975;-743112.984999999403954;-1043716.375999998301268;0
4501;-742368.980000000447035;-1042705.100000001490116;0
5706;-743417.688999999314547;-1043638.852000001817942;0
4515;-742607.100000001490116;-1042765.780000001192093;0
3805;-743035.760000001639128;-1042913.550000000745058;0
4780;-742928.596000000834465;-1042747.480000000447035;0
914;-741715.000000000000000;-1042583.000000000000000;0
6574;-741292.359999999403954;-1044067.620000001043081;0
5596;-743415.271999999880791;-1043680.212999999523163;0
5284;-743041.022999998182058;-1043277.397999998182058;0
5698;-743416.785999998450279;-1043633.638000000268221;0
5227;-743318.199999999254942;-1043537.510000001639128;0
4834;-742972.708000000566244;-1042657.809000000357628;0
6698;-742304.160999998450279;-1044462.195999998599291;0
5145;-743058.063000001013279;-1043471.706999998539686;0
1413;-741631.000000000000000;-1044621.000000000000000;0
3766;-743053.532999999821186;-1042996.631000000983477;0
4512;-742515.339999999850988;-1042750.230000000447035;0
5936;-743333.519000001251698;-1043956.541999999433756;0
6401;-741992.449999999254942;-1042503.609999999403954;0
5696;-743417.096000000834465;-1043637.135999999940395;0
5026;-742631.168999999761581;-1042903.938999999314547;0
1775;-741246.000000000000000;-1044012.000000000000000;0
6606;-741654.631999999284744;-1043906.848000001162291;0
2550;-741576.000000000000000;-1044342.000000000000000;0
1927;-743501.000000000000000;-1044407.000000000000000;0
4964;-742390.059999998658895;-1043044.839999999850988;0
825;-742171.000000000000000;-1042598.000000000000000;0
5588;-743425.002000000327826;-1043679.451999999582767;0
5590;-743422.570000000298023;-1043679.642000000923872;0
3289;-743584.761999998241663;-1042769.188000001013279;0
6148;-742313.410999998450279;-1043065.666999999433756;0
6139;-742312.807000000029802;-1043066.006000000983477;0
4938;-742469.324999999254942;-1042658.263000000268221;0
6106;-742210.445999998599291;-1043112.203000001609325;0
6246;-742370.552999999374151;-1043055.625999998301268;0
1139;-741487.000000000000000;-1044447.000000000000000;0
7028;-743257.254999998956919;-1044104.574999999254942;0
6277;-742304.633999999612570;-1043024.256000000983477;0
235;-743467.000000000000000;-1043745.000000000000000;0
1607;-742414.000000000000000;-1044379.000000000000000;0
4472;-741816.140000000596046;-1042675.499000001698732;0
4761;-742810.285000000149012;-1042793.122000001370907;0
1401;-741723.000000000000000;-1044408.000000000000000;0
5778;-742917.131000000983477;-1043419.723000001162291;0
6186;-742314.337999999523163;-1043061.517000000923872;0
1053;-741768.000000000000000;-1045023.000000000000000;0
5283;-743032.892000000923872;-1043284.399000000208616;0
1952;-743316.000000000000000;-1044495.000000000000000;0
1374;-742155.000000000000000;-1044854.000000000000000;0
535;-742111.000000000000000;-1043714.000000000000000;0
6227;-742319.839999999850988;-1043063.936000000685453;0
1921;-743387.000000000000000;-1044335.000000000000000;0
3143;-744031.217999998480082;-1042659.508999999612570;0
6158;-742313.261999998241663;-1043063.925999999046326;0
973;-741908.000000000000000;-1044547.000000000000000;0
5513;-743426.734999999403954;-1043606.184000000357628;0
7983;-741127.800000000745058;-1044416.199999999254942;0
6768;-741255.769999999552965;-1044419.920000001788139;0
6829;-741498.170000001788139;-1044764.809999998658895;0
5270;-742989.153999999165535;-1043210.684999998658895;0
335;-742635.000000000000000;-1043966.000000000000000;0
6397;-742033.839999999850988;-1042501.859999999403954;0
4639;-742567.399999998509884;-1042548.592999998480082;0
838;-742043.000000000000000;-1042524.000000000000000;0
1558;-741192.000000000000000;-1044273.000000000000000;0
3831;-743005.140000000596046;-1042638.440000001341105;0
3834;-743079.190000001341105;-1042579.899999998509884;0
1652;-741379.000000000000000;-1044550.000000000000000;0
1619;-742426.000000000000000;-1044401.000000000000000;0
4526;-742696.690000001341105;-1042823.320000000298023;0
6857;-741503.982999999076128;-1044930.340999998152256;0
6143;-742309.690999999642372;-1043060.385000001639128;0
2242;-743321.000000000000000;-1045313.000000000000000;0
6414;-743703.410999998450279;-1042881.958000000566244;0
4673;-742811.420000001788139;-1042756.050000000745058;0
6224;-742315.320000000298023;-1043057.335000000894070;0
3981;-743341.517000000923872;-1043837.353999998420477;0
7153;-742889.646999999880791;-1044547.438000001013279;0
3767;-743033.910000000149012;-1042982.390000000596046;0
261;-743429.000000000000000;-1043723.000000000000000;0
6151;-742311.114999998360872;-1043061.451000001281500;0
5577;-743409.385999999940395;-1043630.826999999582767;0
6240;-742364.495999999344349;-1043067.289999999105930;0
5068;-742837.162999998778105;-1043263.965999998152256;0
878;-741947.000000000000000;-1042573.000000000000000;0
688;-742284.000000000000000;-1043125.000000000000000;0
4574;-742339.980000000447035;-1042661.570000000298023;0
5369;-742583.364999998360872;-1042976.820999998599291;0
2235;-743401.000000000000000;-1045221.000000000000000;0
4693;-742691.399999998509884;-1042612.399999998509884;0
4949;-742369.969999998807907;-1042973.199999999254942;0
4694;-742689.272999998182058;-1042626.495999999344349;0
2017;-743247.000000000000000;-1044884.000000000000000;0
7233;-742606.750000000000000;-1044827.379999998956919;0
4600;-742647.000000000000000;-1042709.000000000000000;0
6232;-742316.034000001847744;-1043057.000000000000000;0
3835;-743050.579999998211861;-1042590.109999999403954;0
1190;-741821.000000000000000;-1044110.000000000000000;0
7411;-743529.510000001639128;-1045393.140000000596046;0
4617;-742561.250999998301268;-1042668.140000000596046;0
1156;-741191.980000000447035;-1044497.850000001490116;0
4504;-742387.329999998211861;-1042714.820000000298023;0
5506;-743427.348000001162291;-1043665.644999999552965;0
6177;-742313.717999998480082;-1043061.859999999403954;0
4963;-742396.510000001639128;-1043031.829999998211861;0
6300;-741836.949999999254942;-1042698.329999998211861;0
6211;-742317.785000000149012;-1043063.318999998271465;0
5688;-743415.267000000923872;-1043631.945000000298023;0
1962;-743406.000000000000000;-1044664.000000000000000;0
1938;-743289.000000000000000;-1044306.000000000000000;0
4706;-742728.070000000298023;-1042610.910000000149012;0
1294;-742061.000000000000000;-1044478.000000000000000;0
1107;-741239.260000001639128;-1044580.940000001341105;0
6205;-742314.800000000745058;-1043059.416999999433756;0
1622;-742495.000000000000000;-1044321.000000000000000;0
1473;-741642.000000000000000;-1044158.000000000000000;0
1697;-741495.000000000000000;-1044664.000000000000000;0
883;-741802.000000000000000;-1042773.000000000000000;0
6189;-742312.041999999433756;-1043057.302000001072884;0
6156;-742314.791999999433756;-1043066.736000001430511;0
6293;-742666.339999999850988;-1042695.188999999314547;0
702;-741961.000000000000000;-1042885.000000000000000;0
794;-741746.000000000000000;-1042595.000000000000000;0
2523;-742181.000000000000000;-1044140.000000000000000;0
225;-742885.000000000000000;-1043535.000000000000000;0
4953;-742431.500999998301268;-1043027.399999998509884;0
6281;-742307.629000000655651;-1043042.113000001758337;0
4746;-742867.769999999552965;-1042768.570000000298023;0
698;-742041.000000000000000;-1042903.000000000000000;0
1923;-743395.000000000000000;-1044274.000000000000000;0
1094;-741513.000000000000000;-1044561.000000000000000;0
4708;-742755.420000001788139;-1042611.309999998658895;0
4752;-742774.460000000894070;-1042743.280000001192093;0
5645;-743428.886999998241663;-1043692.285999998450279;0
1920;-743384.000000000000000;-1044363.000000000000000;0
4623;-742533.778999999165535;-1042585.824000000953674;0
4514;-742555.050000000745058;-1042761.809999998658895;0
2044;-743445.000000000000000;-1044960.000000000000000;0
7410;-743525.730000000447035;-1045377.420000001788139;0
