OID_;X;Y;TEMPERATURE
3614;-744984.548999998718500;-1042283.640999998897314;0
110;-744127.000000000000000;-1042724.000000000000000;0
3019;-744463.447999998927116;-1042784.646000001579523;0
3568;-744718.817999999970198;-1042588.614999998360872;0
3692;-744525.876499999314547;-1042540.534000001847744;0
3580;-744924.973999999463558;-1042593.699999999254942;0
2605;-745393.842999998480082;-1042860.796000000089407;0
5975;-745052.346999999135733;-1042674.673000000417233;0
118;-745135.000000000000000;-1042687.000000000000000;0
3542;-744575.274000000208616;-1042656.160000000149012;0
2696;-743477.489999998360872;-1042038.000000000000000;0
2520;-741847.000000000000000;-1045324.000000000000000;0
696;-742077.000000000000000;-1042913.000000000000000;0
7259;-742935.280000001192093;-1044869.829999998211861;0
1524;-741710.000000000000000;-1043844.000000000000000;0
7;-743479.000000000000000;-1042567.000000000000000;0
2070;-742993.000000000000000;-1044723.000000000000000;0
1521;-741808.000000000000000;-1043917.000000000000000;0
3066;-744075.627000000327826;-1042883.837000001221895;0
3752;-743213.949999999254942;-1042902.719999998807907;0
725;-741983.000000000000000;-1042939.000000000000000;0
2149;-742819.000000000000000;-1045024.000000000000000;0
6;-743464.000000000000000;-1042594.000000000000000;0
3216;-743615.890999998897314;-1042451.129999998956919;0
8077;-742038.989999998360872;-1045265.309999998658895;0
2154;-742805.000000000000000;-1045147.000000000000000;0
465;-741728.000000000000000;-1043309.000000000000000;0
1540;-742005.000000000000000;-1044009.000000000000000;0
4047;-743210.230000000447035;-1043992.289999999105930;0
744;-741666.000000000000000;-1042994.000000000000000;0
509;-741991.000000000000000;-1043143.000000000000000;0
7142;-742872.445000000298023;-1044472.239999998360872;0
1780;-741214.000000000000000;-1043934.000000000000000;0
7147;-742827.925000000745058;-1044451.385000001639128;0
2103;-743182.000000000000000;-1044931.000000000000000;0
7278;-742803.899999998509884;-1044636.800000000745058;0
2091;-742920.000000000000000;-1044593.000000000000000;0
2212;-743217.000000000000000;-1045279.000000000000000;0
283;-743026.000000000000000;-1043788.000000000000000;0
4331;-742391.967999998480082;-1043310.539000000804663;0
6962;-743011.489999998360872;-1044196.070000000298023;0
7162;-743075.840999998152256;-1044541.596000000834465;0
7003;-743074.140000000596046;-1044350.280000001192093;0
6977;-743098.949999999254942;-1044459.879999998956919;0
7000;-743096.190000001341105;-1044426.870000001043081;0
7410;-743525.730000000447035;-1045377.420000001788139;0
1822;-742986.199999999254942;-1044211.969999998807907;0
651;-742490.000000000000000;-1043564.000000000000000;0
2185;-743216.000000000000000;-1045130.000000000000000;0
8284;-742219.410000000149012;-1042809.500000000000000;0
2193;-743531.000000000000000;-1045204.000000000000000;0
6946;-742974.765000000596046;-1043929.388000000268221;0
4060;-742896.530000001192093;-1043699.219999998807907;0
6556;-741290.410000000149012;-1044041.471000000834465;0
4098;-742789.157000001519918;-1043861.918999999761581;0
3092;-743909.377999998629093;-1042780.322999998927116;0
6945;-742955.907000001519918;-1043932.182999998331070;0
2226;-743057.000000000000000;-1045470.000000000000000;0
2237;-743368.000000000000000;-1045238.000000000000000;0
4071;-742929.394999999552965;-1043807.585000000894070;0
3211;-743651.409000001847744;-1042483.458999998867512;0
2321;-742679.000000000000000;-1045480.000000000000000;0
4208;-742372.416999999433756;-1043503.423000000417233;0
1421;-741587.000000000000000;-1044356.000000000000000;0
7207;-742570.620000001043081;-1045016.149999998509884;0
7716;-743023.190999999642372;-1045843.241999998688698;0
738;-741818.000000000000000;-1043024.000000000000000;0
6872;-741751.719999998807907;-1045296.679999999701977;0
7397;-743021.859999999403954;-1045682.989999998360872;0
2247;-743199.000000000000000;-1045400.000000000000000;0
1756;-742165.000000000000000;-1045209.000000000000000;0
2275;-742845.000000000000000;-1045719.000000000000000;0
4080;-742832.480000000447035;-1043782.030000001192093;0
7656;-742290.328000001609325;-1045294.499000001698732;0
2397;-742181.000000000000000;-1045368.000000000000000;0
7744;-742941.256999999284744;-1045533.171000000089407;0
8262;-742129.620000001043081;-1042698.079999998211861;0
2760;-743863.331000000238419;-1043483.304000001400709;0
2562;-741090.000000000000000;-1044404.000000000000000;0
596;-741867.000000000000000;-1043259.000000000000000;0
6727;-742522.868000000715256;-1044395.879999998956919;0
7347;-742557.690000001341105;-1045177.440000001341105;0
4340;-742473.662000000476837;-1043349.048999998718500;0
2095;-743178.000000000000000;-1044734.000000000000000;0
4500;-742315.239999998360872;-1042719.460000000894070;0
2061;-742681.000000000000000;-1044491.000000000000000;0
1487;-741117.000000000000000;-1044216.000000000000000;0
2755;-744003.879000000655651;-1043471.734000001102686;0
2316;-742823.000000000000000;-1045463.000000000000000;0
2334;-742872.000000000000000;-1045519.000000000000000;0
2008;-743242.000000000000000;-1044759.000000000000000;0
3366;-743913.831000000238419;-1043002.796999998390675;0
6096;-742098.760000001639128;-1043615.589999999850988;0
1584;-742368.000000000000000;-1044717.000000000000000;0
2218;-743091.000000000000000;-1045372.000000000000000;0
6448;-744017.179999999701977;-1043123.899999998509884;0
1614;-742388.000000000000000;-1044432.000000000000000;0
2404;-742179.000000000000000;-1045467.000000000000000;0
350;-742505.000000000000000;-1043757.000000000000000;0
503;-741879.000000000000000;-1043158.000000000000000;32
6806;-741090.381000000983477;-1044706.675999999046326;0
2274;-742870.000000000000000;-1045732.000000000000000;0
2741;-744016.675000000745058;-1043336.642999999225140;0
79;-744062.000000000000000;-1043257.000000000000000;0
2021;-743281.000000000000000;-1044948.000000000000000;0
4257;-742056.467000000178814;-1043503.657999999821186;0
2044;-743445.000000000000000;-1044960.000000000000000;0
1994;-743483.000000000000000;-1045010.000000000000000;0
512;-742063.000000000000000;-1043136.000000000000000;0
2418;-742410.000000000000000;-1045109.000000000000000;0
3365;-743840.598999999463558;-1043023.565000001341105;0
4025;-743202.881000000983477;-1043852.008000001311302;0
3919;-743904.947000000625849;-1043493.929999999701977;0
1971;-743385.000000000000000;-1044881.000000000000000;0
3309;-743830.328000001609325;-1042834.535000000149012;0
2892;-744005.317000001668930;-1043204.537000000476837;0
4169;-742414.420000001788139;-1043962.329999998211861;0
1686;-741143.910000000149012;-1044795.120000001043081;0
1600;-742418.000000000000000;-1044944.000000000000000;0
4089;-742812.844999998807907;-1043560.114999998360872;0
5322;-743060.379999998956919;-1043029.589999999850988;0
1444;-741559.000000000000000;-1044786.000000000000000;0
2457;-741016.000000000000000;-1044542.000000000000000;0
1949;-743248.000000000000000;-1044491.000000000000000;0
2049;-743499.000000000000000;-1045071.000000000000000;0
7118;-743468.750000000000000;-1044677.690000001341105;0
4174;-742738.230000000447035;-1043763.155000001192093;0
1319;-741788.000000000000000;-1044905.000000000000000;0
397;-742355.000000000000000;-1043861.000000000000000;0
1618;-742405.000000000000000;-1044404.000000000000000;0
1587;-742372.000000000000000;-1044806.000000000000000;0
7652;-742275.046999998390675;-1045497.052000001072884;0
1436;-741869.000000000000000;-1044323.000000000000000;0
1382;-742096.000000000000000;-1045023.000000000000000;0
3871;-742356.649999998509884;-1042420.543999999761581;0
7740;-742301.949999999254942;-1045061.239000000059605;0
6861;-741491.429999999701977;-1045010.300000000745058;0
1267;-742040.000000000000000;-1044999.000000000000000;0
5303;-743164.818999998271465;-1043211.078000001609325;0
7732;-742611.719000000506639;-1044632.203999999910593;0
7995;-741545.920000001788139;-1045160.100000001490116;0
4059;-743142.649999998509884;-1043612.730000000447035;0
2236;-743391.000000000000000;-1045242.000000000000000;0
7189;-742588.486999999731779;-1044766.690999999642372;0
3760;-743233.829999998211861;-1042978.739999998360872;0
2329;-742432.000000000000000;-1045508.000000000000000;0
5317;-743063.690000001341105;-1043053.769999999552965;0
8150;-743304.219999998807907;-1043217.539999999105930;0
1957;-743402.000000000000000;-1044519.000000000000000;0
6716;-742256.467000000178814;-1044966.368000000715256;0
2394;-742273.000000000000000;-1045360.000000000000000;0
1767;-741261.000000000000000;-1044168.000000000000000;0
224;-742904.000000000000000;-1043522.000000000000000;0
6746;-742405.083999998867512;-1044259.199999999254942;0
1791;-742157.000000000000000;-1044163.000000000000000;0
6843;-741569.070000000298023;-1044975.261999998241663;0
1760;-741162.000000000000000;-1044101.000000000000000;0
2576;-742487.000000000000000;-1045483.000000000000000;0
5969;-742284.809999998658895;-1044169.578000001609325;0
1919;-743381.000000000000000;-1044393.000000000000000;0
2060;-742659.000000000000000;-1044472.000000000000000;0
7245;-742748.780000001192093;-1044837.699999999254942;0
527;-742186.000000000000000;-1043818.000000000000000;0
2081;-742551.000000000000000;-1044621.000000000000000;0
6706;-742275.234999999403954;-1044689.607999999076128;0
6014;-742844.000000000000000;-1043239.482999999076128;0
1036;-741961.000000000000000;-1044922.000000000000000;0
7016;-742557.515000000596046;-1044334.074999999254942;0
7019;-742585.024999998509884;-1044210.725000001490116;0
5706;-743417.688999999314547;-1043638.852000001817942;0
4578;-742381.817000001668930;-1042594.177999999374151;0
3128;-743948.160000000149012;-1042657.320000000298023;0
7928;-743542.539999999105930;-1044784.769999999552965;0
568;-742116.000000000000000;-1043604.000000000000000;0
5117;-742816.081999998539686;-1043298.302999999374151;0
1454;-741521.000000000000000;-1044499.000000000000000;0
6823;-741313.910000000149012;-1044788.510000001639128;0
524;-742255.000000000000000;-1043913.000000000000000;0
1087;-741605.000000000000000;-1044533.000000000000000;0
1964;-743412.000000000000000;-1044708.000000000000000;0
6314;-743939.670000001788139;-1042606.239999998360872;0
1258;-742076.000000000000000;-1044837.000000000000000;0
7012;-742805.839999999850988;-1044263.870000001043081;0
5120;-742868.383999999612570;-1043343.986000001430511;0
4664;-742806.739999998360872;-1042547.980000000447035;0
3314;-743758.675999999046326;-1042905.688999999314547;0
1122;-741749.000000000000000;-1044455.000000000000000;0
1252;-742096.000000000000000;-1044711.000000000000000;0
7202;-742561.410000000149012;-1044949.640000000596046;0
1119;-741791.000000000000000;-1044446.000000000000000;0
302;-742925.000000000000000;-1044109.000000000000000;0
553;-742251.000000000000000;-1043741.000000000000000;0
6365;-741979.230000000447035;-1042656.230000000447035;0
5016;-742572.212000001221895;-1042955.526999998837709;0
1045;-741849.000000000000000;-1044775.000000000000000;0
4199;-742205.142999999225140;-1043745.868000000715256;0
5148;-743071.477000001817942;-1043411.539999999105930;0
7083;-743309.980000000447035;-1044509.500000000000000;0
384;-742471.000000000000000;-1043766.000000000000000;0
1628;-742449.000000000000000;-1044494.000000000000000;0
1355;-741899.000000000000000;-1044858.000000000000000;0
1425;-742080.000000000000000;-1044210.000000000000000;0
3781;-743273.059999998658895;-1042814.050000000745058;0
708;-741854.000000000000000;-1042881.000000000000000;0
679;-742404.000000000000000;-1043185.000000000000000;0
1341;-741687.000000000000000;-1044742.000000000000000;0
1299;-741943.000000000000000;-1044719.000000000000000;0
3791;-743144.839999999850988;-1042881.120000001043081;0
4826;-743043.850000001490116;-1042979.600000001490116;0
4850;-742956.164000000804663;-1042923.403000000864267;0
7325;-743032.969999998807907;-1045186.298999998718500;0
3107;-743778.888000000268221;-1042682.131999999284744;0
1189;-741786.000000000000000;-1044043.000000000000000;0
4823;-742936.660000000149012;-1042868.949999999254942;0
993;-741977.000000000000000;-1044436.000000000000000;0
4152;-742564.589999999850988;-1044089.934999998658895;0
730;-741948.000000000000000;-1042998.000000000000000;0
5956;-742960.690999999642372;-1043513.846999999135733;0
798;-741797.000000000000000;-1042590.000000000000000;0
2322;-742651.000000000000000;-1045483.000000000000000;0
4145;-742687.109999999403954;-1043837.125000000000000;0
1013;-742076.000000000000000;-1044595.000000000000000;0
3839;-743112.140000000596046;-1042558.280000001192093;0
1946;-743281.000000000000000;-1044437.000000000000000;0
6952;-743044.730999998748302;-1044106.129999998956919;0
1307;-741803.000000000000000;-1044663.000000000000000;0
4223;-742161.556000001728535;-1043473.138999998569489;0
2369;-742503.000000000000000;-1045427.000000000000000;0
885;-741739.000000000000000;-1042777.000000000000000;0
6503;-741647.706000000238419;-1044996.008999999612570;0
6648;-741750.510000001639128;-1044080.329999998211861;0
7026;-743217.644999999552965;-1044082.329999998211861;0
3233;-744152.962999999523163;-1042686.791999999433756;0
5171;-743266.124000001698732;-1043419.293999999761581;0
1178;-741952.000000000000000;-1044311.000000000000000;0
4825;-742908.839999999850988;-1042860.670000001788139;0
705;-741929.000000000000000;-1042865.000000000000000;0
1396;-741798.000000000000000;-1044263.000000000000000;0
1235;-742150.000000000000000;-1044330.000000000000000;0
678;-742421.000000000000000;-1043181.000000000000000;0
4746;-742867.769999999552965;-1042768.570000000298023;0
1215;-742091.000000000000000;-1044365.000000000000000;0
7539;-742682.600000001490116;-1045366.339999999850988;0
7949;-741953.559999998658895;-1044123.660000000149012;0
5580;-743409.831000000238419;-1043636.449000000953674;0
6194;-742315.721000000834465;-1043062.585999999195337;0
340;-742588.000000000000000;-1043906.000000000000000;0
216;-743023.000000000000000;-1043539.000000000000000;0
1935;-743276.000000000000000;-1044289.000000000000000;0
6682;-742329.804000001400709;-1044319.611999999731779;0
6652;-741678.190000001341105;-1044132.780000001192093;0
2524;-742108.000000000000000;-1044191.000000000000000;0
327;-742687.000000000000000;-1044082.000000000000000;0
4810;-743058.420000001788139;-1042810.050000000745058;0
623;-742254.000000000000000;-1043325.000000000000000;0
334;-742631.000000000000000;-1043987.000000000000000;0
1185;-741822.000000000000000;-1044095.000000000000000;0
3985;-743312.765000000596046;-1043928.164999999105930;0
7355;-743348.309999998658895;-1045148.329999998211861;0
3819;-743120.250000000000000;-1042679.620000001043081;0
2134;-743028.000000000000000;-1045111.000000000000000;0
1003;-741913.000000000000000;-1044580.000000000000000;0
4564;-742452.267000000923872;-1042534.980999998748302;0
4934;-742433.807000000029802;-1042730.874000001698732;0
6122;-742071.870000001043081;-1043283.660000000149012;0
788;-741637.000000000000000;-1042607.000000000000000;0
5777;-742926.357000000774860;-1043427.357999999076128;0
5156;-743160.188999999314547;-1043355.291999999433756;0
6702;-742291.596999999135733;-1044564.116999998688698;0
5293;-743043.969999998807907;-1043208.554000001400709;0
2556;-741376.000000000000000;-1044379.000000000000000;0
1495;-741215.000000000000000;-1044324.000000000000000;0
1004;-741898.000000000000000;-1044565.000000000000000;0
264;-743367.000000000000000;-1043732.000000000000000;0
1694;-741582.000000000000000;-1044653.000000000000000;0
6450;-743166.964999999850988;-1043776.383999999612570;0
7031;-743301.824999999254942;-1044080.774999998509884;0
4928;-742444.890000000596046;-1042854.899999998509884;0
4952;-742318.899999998509884;-1042915.589999999850988;0
4327;-742333.449000000953674;-1043399.671000000089407;0
5307;-743082.182000000029802;-1043190.162000000476837;0
5660;-743425.633999999612570;-1043709.497000001370907;0
6131;-742311.329999998211861;-1043064.982999999076128;0
6186;-742314.337999999523163;-1043061.517000000923872;0
3835;-743050.579999998211861;-1042590.109999999403954;0
7962;-741640.190000001341105;-1044316.800000000745058;0
5127;-743019.265000000596046;-1043389.644999999552965;0
1502;-741506.000000000000000;-1044283.000000000000000;0
1452;-741519.000000000000000;-1044574.000000000000000;0
6212;-742317.006000000983477;-1043061.888000000268221;0
2142;-742883.000000000000000;-1045078.000000000000000;0
1875;-743367.000000000000000;-1044261.000000000000000;0
4947;-742399.918000001460314;-1042993.458000000566244;0
5758;-743420.897999998182058;-1043635.921999998390675;0
6827;-741437.300000000745058;-1044772.629999998956919;0
5737;-743412.636999998241663;-1043691.631000000983477;0
794;-741746.000000000000000;-1042595.000000000000000;0
1680;-741122.809999998658895;-1044628.710000000894070;0
6699;-742301.118999999016523;-1044484.282999999821186;0
584;-741980.000000000000000;-1043396.000000000000000;0
3964;-743352.359999999403954;-1043540.780000001192093;0
3418;-743758.105000000447035;-1043107.024999998509884;0
918;-743437.000000000000000;-1043904.000000000000000;0
5236;-743352.302000001072884;-1043362.752000000327826;0
1335;-741752.000000000000000;-1044833.000000000000000;0
5220;-743247.339999999850988;-1043589.050000000745058;0
1152;-741257.000000000000000;-1044489.000000000000000;0
4743;-742812.449999999254942;-1042729.609999999403954;0
583;-741975.000000000000000;-1043434.000000000000000;0
4762;-742854.192000001668930;-1042825.931000001728535;0
4178;-742382.640000000596046;-1044160.138000000268221;0
263;-743389.000000000000000;-1043725.000000000000000;0
4715;-742877.199999999254942;-1042610.059999998658895;0
4954;-742405.539999999105930;-1043024.640000000596046;0
1244;-742127.000000000000000;-1044527.000000000000000;0
6177;-742313.717999998480082;-1043061.859999999403954;0
6283;-742308.969000000506639;-1043049.539999999105930;0
4320;-742264.149000000208616;-1043259.541999999433756;0
1518;-741994.000000000000000;-1044011.000000000000000;0
4953;-742431.500999998301268;-1043027.399999998509884;0
4623;-742533.778999999165535;-1042585.824000000953674;0
7515;-742273.021999999880791;-1044371.543999999761581;0
6004;-742061.723000001162291;-1043300.859999999403954;0
5694;-743417.339999999850988;-1043640.361000001430511;0
3292;-743576.905000001192093;-1042781.315000001341105;0
6659;-741515.070000000298023;-1044171.070000000298023;0
6253;-742378.725000001490116;-1043039.690000001341105;0
5462;-742498.728999998420477;-1042986.947000000625849;0
4688;-742676.179000001400709;-1042555.322999998927116;0
3264;-743565.725000001490116;-1042729.024999998509884;0
6162;-742310.199999999254942;-1043058.306000001728535;0
6205;-742314.800000000745058;-1043059.416999999433756;0
1927;-743501.000000000000000;-1044407.000000000000000;0
4751;-742791.629999998956919;-1042751.460000000894070;0
1317;-741748.000000000000000;-1044884.000000000000000;0
616;-742153.000000000000000;-1043272.000000000000000;0
1923;-743395.000000000000000;-1044274.000000000000000;0
514;-742119.000000000000000;-1043141.000000000000000;0
4727;-742869.390000000596046;-1042700.829999998211861;0
178;-743389.000000000000000;-1043251.000000000000000;0
691;-742293.000000000000000;-1043097.000000000000000;0
4002;-743397.818999998271465;-1044054.317999999970198;0
4202;-742285.475999999791384;-1043627.734999999403954;0
6150;-742311.879999998956919;-1043062.857000000774860;0
4243;-742194.050000000745058;-1043431.899999998509884;0
4426;-742197.589999999850988;-1043031.679999999701977;0
825;-742171.000000000000000;-1042598.000000000000000;0
5776;-742933.609000001102686;-1043433.765999998897314;0
5411;-742776.079999998211861;-1042905.300000000745058;0
5718;-743420.888999998569489;-1043629.666999999433756;0
4057;-743132.184999998658895;-1043648.719999998807907;0
5512;-743426.556000001728535;-1043602.920000001788139;0
277;-743398.000000000000000;-1043928.000000000000000;0
407;-742340.000000000000000;-1044177.000000000000000;0
4604;-742463.967999998480082;-1042613.381999999284744;0
2368;-742507.000000000000000;-1045456.000000000000000;0
6127;-742314.456000000238419;-1043070.548999998718500;0
1212;-742038.000000000000000;-1044383.000000000000000;0
4773;-742888.429000001400709;-1042839.530000001192093;0
837;-741990.000000000000000;-1042511.000000000000000;0
1219;-742137.000000000000000;-1044315.000000000000000;0
6383;-742199.620000001043081;-1042494.440000001341105;0
614;-742111.000000000000000;-1043271.000000000000000;0
5505;-743428.315000001341105;-1043675.633000001311302;0
3973;-743161.204999998211861;-1043723.574999999254942;0
4806;-743138.429999999701977;-1042771.350000001490116;0
1457;-741510.000000000000000;-1044411.000000000000000;0
4515;-742607.100000001490116;-1042765.780000001192093;0
1505;-741606.000000000000000;-1044248.000000000000000;0
4899;-742534.420000001788139;-1042820.899999998509884;0
682;-742380.000000000000000;-1043151.000000000000000;0
6275;-742314.603999998420477;-1043016.407999999821186;0
7977;-741271.370000001043081;-1044404.390000000596046;0
6174;-742316.021999999880791;-1043066.065000001341105;0
7305;-742795.050000000745058;-1045069.809999998658895;0
5727;-743422.451999999582767;-1043637.473000001162291;0
6391;-742109.269999999552965;-1042498.320000000298023;0
4966;-742377.289999999105930;-1043071.030000001192093;0
1052;-741761.000000000000000;-1045002.000000000000000;0
1874;-743379.000000000000000;-1044247.000000000000000;0
4707;-742743.519999999552965;-1042600.359999999403954;0
6142;-742310.477000001817942;-1043061.813000001013279;0
6279;-742306.210000000894070;-1043033.421999998390675;0
1593;-742192.000000000000000;-1044826.000000000000000;0
4557;-742381.019999999552965;-1042528.550000000745058;0
3787;-743130.989999998360872;-1042979.320000000298023;0
1376;-742165.000000000000000;-1044873.000000000000000;0
4530;-742732.859999999403954;-1042860.920000001788139;0
4614;-742493.800000000745058;-1042636.896000001579523;0
6307;-741835.620000001043081;-1042765.149999998509884;0
6305;-741836.559999998658895;-1042745.190000001341105;0
1464;-741899.000000000000000;-1043994.000000000000000;0
5700;-743416.574000000953674;-1043630.223999999463558;0
4739;-742751.690000001341105;-1042699.230000000447035;0
7050;-743438.070999998599291;-1044185.932000000029802;0
6173;-742316.787000000476837;-1043067.471000000834465;0
588;-741950.000000000000000;-1043352.000000000000000;0
1026;-741986.000000000000000;-1044631.000000000000000;0
4514;-742555.050000000745058;-1042761.809999998658895;0
554;-742238.000000000000000;-1043717.000000000000000;0
6224;-742315.320000000298023;-1043057.335000000894070;0
5745;-743415.129000000655651;-1043695.054000001400709;0
893;-742956.000000000000000;-1042572.000000000000000;0
1824;-742963.809999998658895;-1044143.929999999701977;0
4142;-742777.425000000745058;-1044013.440000001341105;0
5015;-742575.741000000387430;-1043008.607999999076128;0
6784;-741318.109999999403954;-1044460.920000001788139;0
3276;-743673.931000001728535;-1042836.190999999642372;0
4476;-741849.620000001043081;-1042690.190000001341105;0
271;-743417.000000000000000;-1043795.000000000000000;0
5227;-743318.199999999254942;-1043537.510000001639128;0
6002;-742018.502000000327826;-1043294.918999999761581;0
4800;-742990.043000001460314;-1042700.708000000566244;0
3942;-743420.800000000745058;-1043492.339999999850988;0
6154;-742316.324000000953674;-1043069.546000000089407;0
875;-741783.000000000000000;-1042677.000000000000000;0
4851;-742991.500000000000000;-1042818.243000000715256;0
4580;-742393.905000001192093;-1042551.807000000029802;0
1520;-741777.000000000000000;-1043939.000000000000000;0
1095;-741452.000000000000000;-1044553.000000000000000;0
1271;-742240.000000000000000;-1044521.000000000000000;0
4660;-742801.596999999135733;-1042487.965999998152256;0
4956;-742383.579999998211861;-1043007.739999998360872;0
6715;-742291.912999998778105;-1044948.105999998748302;0
1704;-741289.000000000000000;-1044690.000000000000000;0
4742;-742822.300000000745058;-1042747.920000001788139;0
309;-742721.000000000000000;-1044157.000000000000000;0
6358;-741993.554999999701977;-1042717.964000001549721;0
1702;-741348.000000000000000;-1044682.000000000000000;0
2032;-743526.000000000000000;-1044797.000000000000000;0
6121;-742069.784000001847744;-1043299.828000001609325;0
1655;-741391.000000000000000;-1044651.000000000000000;0
4665;-742824.410000000149012;-1042592.260000001639128;0
5245;-743368.859999999403954;-1043290.789999999105930;0
5716;-743423.320999998599291;-1043631.197000000625849;0
4116;-742740.429999999701977;-1044064.789999999105930;0
4584;-742417.721999999135733;-1042627.620999999344349;0
5659;-743426.815000001341105;-1043709.059000000357628;0
6136;-742315.081999998539686;-1043070.210000000894070;0
4525;-742716.719999998807907;-1042823.219999998807907;0
5508;-743426.105999998748302;-1043645.960999999195337;0
1867;-743474.000000000000000;-1044257.000000000000000;0
7035;-743299.831999998539686;-1044176.241999998688698;0
1157;-741172.000000000000000;-1044489.000000000000000;0
6135;-742308.289000000804663;-1043059.340999998152256;0
843;-742085.000000000000000;-1042507.000000000000000;0
3978;-743342.695000000298023;-1043756.835000000894070;0
3308;-743813.059999998658895;-1042830.515000000596046;0
4650;-742749.989000000059605;-1042534.539999999105930;0
8259;-742072.089999999850988;-1042687.219999998807907;0
6113;-742229.061000000685453;-1043368.359000001102686;0
5637;-743428.151000000536442;-1043682.633999999612570;0
5746;-743415.399000000208616;-1043698.644000001251698;0
6414;-743703.410999998450279;-1042881.958000000566244;0
5713;-743423.890999998897314;-1043636.899999998509884;0
4160;-742443.074999999254942;-1043885.804999999701977;0
7956;-741777.379999998956919;-1044260.170000001788139;0
5014;-742563.771999999880791;-1042993.241999998688698;0
5728;-743421.517999999225140;-1043638.609000001102686;0
4741;-742787.859999999403954;-1042715.800000000745058;0
4519;-742665.160000000149012;-1042790.820000000298023;0
4780;-742928.596000000834465;-1042747.480000000447035;0
4697;-742675.329999998211861;-1042689.179999999701977;0
8280;-742150.949999999254942;-1042770.420000001788139;0
5698;-743416.785999998450279;-1043633.638000000268221;0
516;-742160.000000000000000;-1043135.000000000000000;0
4963;-742396.510000001639128;-1043031.829999998211861;0
4997;-742492.638000000268221;-1042962.833999998867512;0
1140;-741475.000000000000000;-1044461.000000000000000;0
2479;-741247.800000000745058;-1044609.379999998956919;0
6187;-742313.572999998927116;-1043060.111999999731779;0
5370;-742580.300999999046326;-1042977.140999998897314;0
4999;-742534.149999998509884;-1042966.892999999225140;0
3275;-743665.002000000327826;-1042826.396999999880791;0
6261;-742373.956999998539686;-1043022.041999999433756;0
1256;-742084.000000000000000;-1044787.000000000000000;0
1101;-741339.000000000000000;-1044568.000000000000000;0
6193;-742316.486000001430511;-1043063.991000000387430;0
6163;-742316.921000000089407;-1043069.223000001162291;0
1890;-743522.000000000000000;-1044402.000000000000000;0
5011;-742644.307999998331070;-1042994.813999999314547;0
1829;-742968.539999999105930;-1044100.210000000894070;0
4636;-742576.870999999344349;-1042687.116999998688698;0
1423;-742167.000000000000000;-1044150.000000000000000;0
4808;-743110.859999999403954;-1042784.829999998211861;0
4559;-742400.530000001192093;-1042503.760000001639128;0
6276;-742310.815999999642372;-1043016.000999998301268;0
6908;-741713.539999999105930;-1045085.160000000149012;0
3842;-743141.300000000745058;-1042637.030000001192093;0
3844;-743184.170000001788139;-1042586.949999999254942;0
541;-742258.000000000000000;-1043678.000000000000000;0
4589;-742408.243000000715256;-1042542.631999999284744;0
5502;-743427.894999999552965;-1043706.885000001639128;0
2296;-742678.000000000000000;-1045399.000000000000000;0
954;-742231.000000000000000;-1043024.000000000000000;0
1401;-741723.000000000000000;-1044408.000000000000000;0
1395;-741799.000000000000000;-1044291.000000000000000;0
5708;-743418.927999999374151;-1043640.519000001251698;0
265;-743344.000000000000000;-1043735.000000000000000;0
1062;-741560.000000000000000;-1045151.000000000000000;0
