OID_;X;Y;TEMPERATURE
2261;-743009.000000000000000;-1045657.000000000000000;0
5382;-744377.920000001788139;-1042814.201000001281500;0
7782;-743012.350000001490116;-1045871.938999999314547;0
1524;-741710.000000000000000;-1043844.000000000000000;0
3919;-743904.947000000625849;-1043493.929999999701977;0
2277;-742826.000000000000000;-1045653.000000000000000;0
3752;-743213.949999999254942;-1042902.719999998807907;0
6820;-741224.105999998748302;-1044799.311999998986721;0
4079;-742836.170000001788139;-1043800.960000000894070;0
7732;-742611.719000000506639;-1044632.203999999910593;0
7259;-742935.280000001192093;-1044869.829999998211861;0
525;-742233.000000000000000;-1043884.000000000000000;0
2222;-743058.000000000000000;-1045420.000000000000000;0
4074;-742943.350000001490116;-1043880.304999999701977;5
281;-743045.000000000000000;-1043848.000000000000000;0
1187;-741805.000000000000000;-1044071.000000000000000;0
7911;-743564.839999999850988;-1045408.649999998509884;0
882;-741825.000000000000000;-1042788.000000000000000;0
2237;-743368.000000000000000;-1045238.000000000000000;0
6746;-742405.083999998867512;-1044259.199999999254942;0
3522;-744830.425000000745058;-1042686.690000001341105;0
7939;-741306.171999998390675;-1043955.960000000894070;0
7025;-743199.914999999105930;-1044070.515000000596046;0
6574;-741292.359999999403954;-1044067.620000001043081;0
3109;-743754.403999999165535;-1042652.872000001370907;0
1659;-741420.000000000000000;-1044790.000000000000000;0
1994;-743483.000000000000000;-1045010.000000000000000;0
2343;-742674.000000000000000;-1045557.000000000000000;0
1450;-741527.000000000000000;-1044632.000000000000000;0
873;-741728.000000000000000;-1042672.000000000000000;0
2083;-742588.000000000000000;-1044663.000000000000000;0
1924;-743359.000000000000000;-1044320.000000000000000;0
7233;-742606.750000000000000;-1044827.379999998956919;0
2357;-742388.000000000000000;-1045577.000000000000000;0
6875;-741808.350000001490116;-1045257.269999999552965;0
4086;-742813.079999998211861;-1043631.730000000447035;0
4148;-742631.269999999552965;-1043885.870000001043081;0
1004;-741898.000000000000000;-1044565.000000000000000;0
6119;-743582.679999999701977;-1042696.969999998807907;0
1519;-741754.000000000000000;-1043956.000000000000000;0
382;-742481.000000000000000;-1043751.000000000000000;0
4064;-742879.655000001192093;-1043647.420000001788139;0
6721;-742321.052999999374151;-1044705.548000000417233;0
2886;-744104.953999999910593;-1043172.171999998390675;0
1693;-741613.000000000000000;-1044649.000000000000000;0
5785;-743436.010000001639128;-1042105.550000000745058;0
31;-743485.000000000000000;-1042645.000000000000000;0
9;-743512.000000000000000;-1042512.000000000000000;133
1394;-741822.000000000000000;-1044310.000000000000000;0
7139;-742919.179999999701977;-1044444.434999998658895;0
1131;-741643.000000000000000;-1044433.000000000000000;0
5067;-742813.465999998152256;-1043267.335999999195337;0
982;-741992.000000000000000;-1044416.000000000000000;0
2028;-743371.000000000000000;-1045054.000000000000000;0
4461;-742218.370000001043081;-1042583.800000000745058;0
4582;-742390.164999999105930;-1042606.546000000089407;0
2079;-742688.000000000000000;-1044428.000000000000000;0
7291;-742809.960000000894070;-1044827.300000000745058;0
5316;-743075.980000000447035;-1043041.059999998658895;0
3209;-743668.293999999761581;-1042492.478999998420477;0
4240;-742471.613000001758337;-1043552.366000000387430;0
1272;-742237.000000000000000;-1044545.000000000000000;0
2400;-742087.000000000000000;-1045374.000000000000000;0
6726;-742476.517999999225140;-1044410.600000001490116;0
3614;-744984.548999998718500;-1042283.640999998897314;0
1264;-742059.000000000000000;-1044942.000000000000000;0
1144;-741402.000000000000000;-1044470.000000000000000;0
1954;-743372.000000000000000;-1044497.000000000000000;0
4956;-742383.579999998211861;-1043007.739999998360872;0
4606;-742512.769000001251698;-1042608.333000000566244;0
2245;-743239.000000000000000;-1045356.000000000000000;0
8075;-742072.149999998509884;-1045261.399999998509884;0
205;-743173.000000000000000;-1043599.000000000000000;0
3032;-744506.962000001221895;-1042717.704999998211861;0
1602;-742507.000000000000000;-1044924.000000000000000;0
4877;-742845.760000001639128;-1042956.589999999850988;0
2467;-743434.000000000000000;-1044742.000000000000000;0
5456;-742761.041000001132488;-1043254.350999999791384;0
535;-742111.000000000000000;-1043714.000000000000000;0
1012;-742060.000000000000000;-1044582.000000000000000;0
3846;-743149.390000000596046;-1042549.600000001490116;0
3561;-744699.155999999493361;-1042614.903999999165535;0
725;-741983.000000000000000;-1042939.000000000000000;0
6338;-742247.910000000149012;-1042851.670000001788139;0
577;-742038.000000000000000;-1043521.000000000000000;0
3704;-744530.350000001490116;-1042519.798999998718500;0
612;-742064.000000000000000;-1043270.000000000000000;0
80;-744067.000000000000000;-1043330.000000000000000;0
164;-743392.000000000000000;-1043230.000000000000000;0
4558;-742373.019999999552965;-1042506.949999999254942;0
1036;-741961.000000000000000;-1044922.000000000000000;0
669;-742510.000000000000000;-1043260.000000000000000;0
2403;-742211.000000000000000;-1045436.000000000000000;0
4076;-742855.589999999850988;-1043882.670000001788139;0
331;-742664.000000000000000;-1044024.000000000000000;0
5779;-742907.197999998927116;-1043414.096999999135733;0
4329;-742363.315000001341105;-1043352.173999998718500;0
2314;-742884.000000000000000;-1045456.000000000000000;0
3063;-744133.098999999463558;-1042851.478999998420477;0
2381;-742313.000000000000000;-1045438.000000000000000;0
5231;-743342.107000000774860;-1043497.627000000327826;0
6100;-741950.760000001639128;-1043408.109999999403954;0
926;-741894.000000000000000;-1042999.000000000000000;0
4105;-742678.771999999880791;-1043769.206000000238419;0
1286;-742221.460000000894070;-1044465.969999998807907;0
5777;-742926.357000000774860;-1043427.357999999076128;0
597;-741855.000000000000000;-1043268.000000000000000;0
5996;-742061.879000000655651;-1043284.276999998837709;0
3758;-743284.129999998956919;-1042964.100000001490116;0
4776;-742909.276000000536442;-1042820.587000001221895;0
7360;-743228.008000001311302;-1045144.625999998301268;0
4052;-743252.954999998211861;-1043843.585000000894070;0
3241;-744178.436999998986721;-1042649.513999998569489;0
1909;-743446.000000000000000;-1044375.000000000000000;0
6961;-743023.579999998211861;-1044221.129999998956919;0
5957;-742962.627000000327826;-1043510.905000001192093;0
5167;-743219.324999999254942;-1043405.249000001698732;0
1432;-741958.000000000000000;-1044285.000000000000000;33
2490;-742063.000000000000000;-1044273.000000000000000;0
1792;-742165.000000000000000;-1044209.000000000000000;0
2059;-742625.000000000000000;-1044459.000000000000000;0
1472;-741677.000000000000000;-1044145.000000000000000;0
7542;-742623.890000000596046;-1045372.899999998509884;0
2132;-743058.000000000000000;-1045118.000000000000000;0
6715;-742291.912999998778105;-1044948.105999998748302;0
2020;-743260.000000000000000;-1044941.000000000000000;0
1655;-741391.000000000000000;-1044651.000000000000000;0
844;-742138.000000000000000;-1042519.000000000000000;0
5691;-743415.714000001549721;-1043637.241000000387430;0
2205;-743136.000000000000000;-1045304.000000000000000;0
3465;-745090.089999999850988;-1042676.664999999105930;0
4055;-743119.070000000298023;-1043694.109999999403954;0
1926;-743301.000000000000000;-1044321.000000000000000;0
3850;-743037.969999998807907;-1042473.780000001192093;0
4097;-742806.000000000000000;-1043874.793999999761581;0
6401;-741992.449999999254942;-1042503.609999999403954;0
3812;-743231.179999999701977;-1042815.199999999254942;0
7214;-742470.679999999701977;-1044531.269999999552965;406
7349;-742516.719999998807907;-1045170.359999999403954;0
6855;-741501.394999999552965;-1045027.784000001847744;0
5508;-743426.105999998748302;-1043645.960999999195337;0
2447;-742772.000000000000000;-1044159.000000000000000;0
1905;-743446.000000000000000;-1044312.000000000000000;0
7041;-743381.004999998956919;-1044158.699999999254942;0
3134;-743932.910999998450279;-1042615.767999999225140;0
4083;-742820.771999999880791;-1043708.657000001519918;0
743;-741682.000000000000000;-1043020.000000000000000;0
2193;-743531.000000000000000;-1045204.000000000000000;0
2334;-742872.000000000000000;-1045519.000000000000000;0
4653;-742788.747999999672174;-1042524.557000000029802;0
709;-741861.000000000000000;-1042862.000000000000000;0
4059;-743142.649999998509884;-1043612.730000000447035;0
3128;-743948.160000000149012;-1042657.320000000298023;0
4214;-742229.274999998509884;-1043511.745000001043081;0
6505;-741746.570000000298023;-1044600.429999999701977;0
4926;-742452.660000000149012;-1042896.190000001341105;0
4948;-742386.929999999701977;-1042992.239999998360872;0
2163;-742944.000000000000000;-1045168.000000000000000;0
8049;-742198.890000000596046;-1044891.600000001490116;0
7143;-742850.414999999105930;-1044473.449999999254942;0
7947;-742030.969999998807907;-1044096.679999999701977;0
622;-742271.000000000000000;-1043302.000000000000000;0
6806;-741090.381000000983477;-1044706.675999999046326;0
4426;-742197.589999999850988;-1043031.679999999701977;0
700;-742008.000000000000000;-1042895.000000000000000;0
5135;-742979.611000001430511;-1043468.912999998778105;0
7740;-742301.949999999254942;-1045061.239000000059605;0
651;-742490.000000000000000;-1043564.000000000000000;0
984;-741917.000000000000000;-1044411.000000000000000;0
7155;-742920.776999998837709;-1044546.934000000357628;0
2319;-742734.000000000000000;-1045474.000000000000000;0
4738;-742733.910000000149012;-1042704.890000000596046;0
4890;-742605.287000000476837;-1042838.535000000149012;0
1387;-742155.000000000000000;-1044999.000000000000000;0
4031;-743135.774000000208616;-1043769.622000001370907;0
1827;-743033.000000000000000;-1044080.000000000000000;0
4836;-742984.245999999344349;-1042653.127999998629093;0
7957;-741692.839999999850988;-1044277.559999998658895;0
1046;-741838.000000000000000;-1044805.000000000000000;0
6245;-742369.682000000029802;-1043057.377000000327826;0
4796;-743054.247999999672174;-1042682.918000001460314;0
6105;-742213.883000001311302;-1043111.734000001102686;0
1539;-741977.000000000000000;-1043997.000000000000000;0
7049;-743420.177000001072884;-1044168.629999998956919;0
6830;-741526.739999998360872;-1044761.309000000357628;0
1665;-741012.000000000000000;-1044351.000000000000000;0
506;-741980.000000000000000;-1043158.000000000000000;0
509;-741991.000000000000000;-1043143.000000000000000;0
275;-743361.000000000000000;-1043904.000000000000000;0
559;-742191.000000000000000;-1043693.000000000000000;0
2098;-743134.000000000000000;-1044763.000000000000000;0
4154;-742544.524999998509884;-1044048.190000001341105;0
7399;-742999.699999999254942;-1045733.309999998658895;0
6270;-742333.412999998778105;-1043018.204999998211861;0
7224;-742399.359999999403954;-1044829.829999998211861;0
5215;-743342.890000000596046;-1043380.368000000715256;0
7028;-743257.254999998956919;-1044104.574999999254942;0
5451;-743276.109000001102686;-1043331.000999998301268;0
1134;-741558.000000000000000;-1044450.000000000000000;0
2576;-742487.000000000000000;-1045483.000000000000000;0
3176;-743891.085999999195337;-1042631.991999998688698;0
6788;-741212.809999998658895;-1044473.129999998956919;0
1220;-742147.000000000000000;-1044283.000000000000000;0
6160;-742311.730999998748302;-1043061.116000000387430;0
6370;-741968.780000001192093;-1042685.250000000000000;0
7515;-742273.021999999880791;-1044371.543999999761581;0
1970;-743380.000000000000000;-1044854.000000000000000;0
3792;-743110.019999999552965;-1042846.530000001192093;0
6112;-742237.710000000894070;-1043370.434999998658895;0
1811;-743175.000000000000000;-1044525.000000000000000;0
6491;-742157.708000000566244;-1044457.421999998390675;0
4500;-742315.239999998360872;-1042719.460000000894070;0
2338;-742797.000000000000000;-1045528.000000000000000;0
1447;-741541.000000000000000;-1044744.000000000000000;0
6705;-742279.050999999046326;-1044655.923000000417233;0
3818;-743130.217999998480082;-1042703.293000001460314;0
1612;-742429.000000000000000;-1044425.000000000000000;0
8081;-741974.019999999552965;-1045331.530000001192093;0
1029;-741978.000000000000000;-1044721.000000000000000;0
5693;-743415.905000001192093;-1043640.377000000327826;0
392;-742418.000000000000000;-1043843.000000000000000;0
2369;-742503.000000000000000;-1045427.000000000000000;0
4117;-742733.614999998360872;-1044043.129999998956919;0
4161;-742506.254999998956919;-1044181.925000000745058;0
7203;-742571.300000000745058;-1044963.219999998807907;0
1119;-741791.000000000000000;-1044446.000000000000000;0
4690;-742679.162999998778105;-1042583.138999998569489;0
2561;-741214.000000000000000;-1044393.000000000000000;0
4705;-742714.100000001490116;-1042599.829999998211861;0
7154;-742908.467000000178814;-1044547.784000001847744;0
1669;-741077.000000000000000;-1044092.000000000000000;0
5243;-743357.622000001370907;-1043407.258999999612570;0
1287;-742217.000000000000000;-1044486.000000000000000;0
1049;-741795.000000000000000;-1044923.000000000000000;0
7695;-742479.807000000029802;-1045130.127000000327826;0
8066;-742286.199999999254942;-1045237.250000000000000;0
1623;-742524.000000000000000;-1044319.000000000000000;0
7182;-742597.789999999105930;-1044678.260000001639128;0
5727;-743422.451999999582767;-1043637.473000001162291;0
5960;-743141.460999999195337;-1043339.964999999850988;0
4801;-742998.943999998271465;-1042721.118000000715256;0
6213;-742316.227000001817942;-1043060.478999998420477;0
8280;-742150.949999999254942;-1042770.420000001788139;0
6096;-742098.760000001639128;-1043615.589999999850988;0
3954;-743409.050999999046326;-1043550.699999999254942;0
1496;-741253.000000000000000;-1044321.000000000000000;0
1584;-742368.000000000000000;-1044717.000000000000000;0
4510;-742483.149999998509884;-1042738.460000000894070;0
516;-742160.000000000000000;-1043135.000000000000000;0
7015;-742554.570000000298023;-1044360.725000001490116;0
4334;-742384.170000001788139;-1043468.820000000298023;0
201;-743229.000000000000000;-1043614.000000000000000;0
6659;-741515.070000000298023;-1044171.070000000298023;0
3369;-743878.633000001311302;-1043011.739000000059605;0
7090;-743353.289999999105930;-1044571.760000001639128;0
4888;-742649.925999999046326;-1042830.767000000923872;0
2559;-741323.000000000000000;-1044399.000000000000000;0
4973;-742480.098000001162291;-1043031.443999998271465;0
2124;-743275.000000000000000;-1045023.000000000000000;0
3756;-743319.230000000447035;-1042949.019999999552965;0
7284;-742811.789999999105930;-1044718.210000000894070;0
2045;-743418.000000000000000;-1044961.000000000000000;0
6871;-741730.899000000208616;-1045309.688000001013279;0
5149;-743072.195999998599291;-1043377.370999999344349;0
1343;-741714.000000000000000;-1044765.000000000000000;0
5126;-743012.193999998271465;-1043403.521000001579523;0
793;-741697.000000000000000;-1042588.000000000000000;0
556;-742222.000000000000000;-1043702.000000000000000;0
6001;-742006.079999998211861;-1043292.300000000745058;0
4587;-742482.011999998241663;-1042641.392999999225140;0
4716;-742893.160000000149012;-1042622.780000001192093;0
6197;-742313.425000000745058;-1043058.370999999344349;0
3766;-743053.532999999821186;-1042996.631000000983477;0
1515;-741913.000000000000000;-1044072.000000000000000;0
5306;-743103.326999999582767;-1043193.129000000655651;0
2480;-741251.739999998360872;-1044639.480000000447035;0
527;-742186.000000000000000;-1043818.000000000000000;0
1338;-741629.000000000000000;-1045045.000000000000000;0
1487;-741117.000000000000000;-1044216.000000000000000;0
6930;-742046.030000001192093;-1045191.489999998360872;0
4139;-742859.625999998301268;-1044000.574999999254942;0
7617;-742345.934000000357628;-1045300.958999998867512;0
8260;-742091.730000000447035;-1042690.769999999552965;0
6298;-741804.910000000149012;-1042692.300000000745058;0
5372;-742084.010000001639128;-1043008.550000000745058;0
6201;-742317.888999998569489;-1043065.035000000149012;0
6769;-741281.120000001043081;-1044417.780000001192093;0
3869;-742407.539999999105930;-1042414.850000001490116;0
5221;-743263.820000000298023;-1043556.920000001788139;0
3101;-743922.754999998956919;-1042745.195000000298023;0
4037;-743205.375000000000000;-1043771.175000000745058;0
1458;-741506.000000000000000;-1044384.000000000000000;0
4894;-742610.888999998569489;-1042819.686999998986721;0
1319;-741788.000000000000000;-1044905.000000000000000;0
463;-741703.000000000000000;-1043287.000000000000000;0
169;-743433.000000000000000;-1043334.000000000000000;0
7651;-742295.381000000983477;-1045479.861999999731779;0
3786;-743150.480000000447035;-1042925.960000000894070;0
3945;-743388.361000001430511;-1043434.486000001430511;0
6173;-742316.787000000476837;-1043067.471000000834465;0
6923;-742061.469999998807907;-1045089.760000001639128;0
3314;-743758.675999999046326;-1042905.688999999314547;0
4966;-742377.289999999105930;-1043071.030000001192093;0
4596;-742597.181000001728535;-1042670.653000000864267;0
4704;-742680.000000000000000;-1042776.750000000000000;0
6260;-742377.692999999970198;-1043022.434000000357628;0
7151;-742842.649000000208616;-1044545.307000000029802;0
5294;-743056.328999999910593;-1043196.096999999135733;0
7008;-742899.559999998658895;-1044224.074999999254942;0
1819;-743034.000000000000000;-1044350.000000000000000;129
3807;-743008.690000001341105;-1042928.690000001341105;0
5175;-743313.734999999403954;-1043433.749000001698732;0
7928;-743542.539999999105930;-1044784.769999999552965;0
343;-742575.000000000000000;-1043857.000000000000000;0
1091;-741531.480000000447035;-1044543.440000001341105;0
7970;-741444.739999998360872;-1044384.980000000447035;0
5594;-743417.704999998211861;-1043680.022999998182058;0
6114;-742234.250000000000000;-1043361.324999999254942;0
4733;-742767.890000000596046;-1042671.010000001639128;0
1020;-742293.000000000000000;-1044615.000000000000000;0
4763;-742847.094000000506639;-1042842.671000000089407;0
3562;-744682.454999998211861;-1042610.877000000327826;0
1224;-742174.000000000000000;-1044253.000000000000000;0
544;-742343.910000000149012;-1043796.500000000000000;0
674;-742463.000000000000000;-1043211.000000000000000;0
2158;-742781.000000000000000;-1045197.000000000000000;0
5014;-742563.771999999880791;-1042993.241999998688698;0
1255;-742077.000000000000000;-1044770.000000000000000;0
3944;-743390.002000000327826;-1043413.532999999821186;0
1158;-741152.320000000298023;-1044503.030000001192093;0
5205;-743251.475000001490116;-1043328.679000001400709;0
6163;-742316.921000000089407;-1043069.223000001162291;0
2140;-742924.000000000000000;-1045088.000000000000000;0
3309;-743830.328000001609325;-1042834.535000000149012;0
1253;-742084.000000000000000;-1044730.000000000000000;0
7350;-742556.390000000596046;-1045185.980000000447035;0
308;-742754.000000000000000;-1044149.000000000000000;0
6853;-741548.899000000208616;-1045052.295000001788139;0
1306;-741783.000000000000000;-1044653.000000000000000;0
4936;-742454.684000000357628;-1042685.620999999344349;0
6254;-742379.344000000506639;-1043038.363000001758337;0
4999;-742534.149999998509884;-1042966.892999999225140;0
408;-742317.000000000000000;-1044182.000000000000000;0
1808;-743187.000000000000000;-1044539.000000000000000;0
2149;-742819.000000000000000;-1045024.000000000000000;0
4671;-742824.179999999701977;-1042687.210000000894070;0
3983;-743317.089999999850988;-1043883.160000000149012;0
1764;-741163.000000000000000;-1044144.000000000000000;0
6208;-742320.098000001162291;-1043067.458999998867512;0
6148;-742313.410999998450279;-1043065.666999999433756;0
3367;-743914.585000000894070;-1043020.743999999016523;0
2017;-743247.000000000000000;-1044884.000000000000000;0
2009;-743221.000000000000000;-1044770.000000000000000;0
2091;-742920.000000000000000;-1044593.000000000000000;0
6294;-742653.550000000745058;-1042686.140000000596046;0
4225;-742115.607999999076128;-1043452.125000000000000;0
8270;-742019.480000000447035;-1042725.870000001043081;0
6186;-742314.337999999523163;-1043061.517000000923872;0
3284;-743642.822000000625849;-1042852.340999998152256;0
4529;-742762.920000001788139;-1042885.809999998658895;0
5216;-743284.217999998480082;-1043325.638999998569489;0
4002;-743397.818999998271465;-1044054.317999999970198;0
386;-742457.000000000000000;-1043786.000000000000000;0
3388;-743940.289999999105930;-1043154.210000000894070;0
7703;-742462.714000001549721;-1044818.045000001788139;0
1162;-741087.000000000000000;-1044511.000000000000000;0
7745;-742933.037000000476837;-1045523.714999999850988;0
4252;-742124.022999998182058;-1043390.519000001251698;0
3039;-744416.278999999165535;-1042696.848999999463558;0
4326;-742319.855000000447035;-1043419.918999999761581;0
3409;-743790.434999998658895;-1043040.907999999821186;0
3586;-744920.728000000119209;-1042505.664999999105930;0
6169;-742312.320000000298023;-1043060.791999999433756;0
3268;-743594.046999998390675;-1042721.412999998778105;0
1790;-742152.000000000000000;-1044138.000000000000000;0
4009;-743231.157999999821186;-1044047.155000001192093;0
400;-742356.000000000000000;-1043931.000000000000000;0
3978;-743342.695000000298023;-1043756.835000000894070;0
797;-741796.000000000000000;-1042574.000000000000000;0
1621;-742467.000000000000000;-1044322.000000000000000;0
4609;-742557.414000000804663;-1042621.583999998867512;0
7208;-742560.289999999105930;-1045023.789999999105930;0
8285;-742232.780000001192093;-1042821.149999998509884;0
6996;-743116.699999999254942;-1044476.469999998807907;0
5252;-743283.517000000923872;-1043176.197999998927116;0
3132;-743939.052000001072884;-1042650.916999999433756;0
3974;-743140.660000000149012;-1043725.350000001490116;0
598;-741853.000000000000000;-1043233.000000000000000;0
1053;-741768.000000000000000;-1045023.000000000000000;0
6126;-743428.385999999940395;-1043621.800000000745058;0
6833;-741571.423000000417233;-1044909.473999999463558;0
3791;-743144.839999999850988;-1042881.120000001043081;0
6268;-742340.850000001490116;-1043018.881000000983477;0
6847;-741591.993999999016523;-1044992.927999999374151;0
2346;-742654.000000000000000;-1045546.000000000000000;0
7009;-742877.537000000476837;-1044242.370000001043081;0
4573;-742341.550000000745058;-1042629.699999999254942;0
4770;-742872.535000000149012;-1042899.679000001400709;0
1698;-741464.000000000000000;-1044668.000000000000000;0
1552;-741351.000000000000000;-1044295.000000000000000;0
6682;-742329.804000001400709;-1044319.611999999731779;0
1940;-743286.000000000000000;-1044339.000000000000000;0
6695;-742306.234000001102686;-1044816.138999998569489;0
1918;-743377.000000000000000;-1044428.000000000000000;0
4512;-742515.339999999850988;-1042750.230000000447035;0
5016;-742572.212000001221895;-1042955.526999998837709;0
4828;-743048.579999998211861;-1042941.179999999701977;0
4324;-742269.346000000834465;-1043165.410999998450279;0
7156;-742944.515000000596046;-1044546.140000000596046;0
1910;-743460.000000000000000;-1044391.000000000000000;0
7734;-741656.309000000357628;-1044953.727000001817942;0
5391;-744691.945000000298023;-1042667.405000001192093;0
1543;-742235.000000000000000;-1044164.000000000000000;0
7966;-741489.800000000745058;-1044356.219999998807907;0
5203;-743386.346000000834465;-1043274.958000000566244;0
5178;-743386.421000000089407;-1043452.486000001430511;0
6297;-742506.859999999403954;-1042634.250000000000000;0
3290;-743573.385000001639128;-1042757.348999999463558;0
4600;-742647.000000000000000;-1042709.000000000000000;0
5712;-743423.701000001281500;-1043638.675999999046326;0
610;-742011.000000000000000;-1043270.000000000000000;0
5002;-742561.190000001341105;-1042977.401999998837709;0
4128;-742915.039999999105930;-1044041.920000001788139;0
5597;-743414.056000001728535;-1043680.309000000357628;0
1138;-741500.000000000000000;-1044458.000000000000000;0
1335;-741752.000000000000000;-1044833.000000000000000;0
1719;-741406.760000001639128;-1044866.039999999105930;0
4427;-742190.519999999552965;-1043099.440000001341105;0
318;-742434.000000000000000;-1044213.000000000000000;0
545;-742337.000000000000000;-1043805.000000000000000;0
4309;-742042.329999998211861;-1043492.329999998211861;0
5959;-742962.548999998718500;-1043523.155000001192093;0
1957;-743402.000000000000000;-1044519.000000000000000;0
5517;-743427.287000000476837;-1043618.956999998539686;0
5730;-743418.855999998748302;-1043638.949000000953674;0
2424;-742476.000000000000000;-1045132.000000000000000;0
1026;-741986.000000000000000;-1044631.000000000000000;0
4954;-742405.539999999105930;-1043024.640000000596046;0
1159;-741137.000000000000000;-1044493.000000000000000;0
1590;-742377.000000000000000;-1044885.000000000000000;0
4899;-742534.420000001788139;-1042820.899999998509884;0
684;-742358.000000000000000;-1043136.000000000000000;0
6354;-741928.410000000149012;-1042711.350000001490116;0
4905;-742467.730000000447035;-1042815.620000001043081;0
1302;-741842.000000000000000;-1044693.000000000000000;0
5599;-743411.622999999672174;-1043680.499000001698732;0
1045;-741849.000000000000000;-1044775.000000000000000;0
943;-742292.000000000000000;-1043017.000000000000000;0
7086;-743333.149999998509884;-1044527.250000000000000;0
1559;-741190.000000000000000;-1044242.000000000000000;0
2386;-742139.000000000000000;-1045460.000000000000000;0
6007;-743187.807000000029802;-1043302.019000001251698;0
220;-742969.000000000000000;-1043530.000000000000000;0
1267;-742040.000000000000000;-1044999.000000000000000;0
3366;-743913.831000000238419;-1043002.796999998390675;0
3761;-743202.559999998658895;-1042981.710000000894070;0
4632;-742615.638999998569489;-1042624.039999999105930;0
1677;-741109.160000000149012;-1044522.699999999254942;0
1254;-742090.000000000000000;-1044750.000000000000000;0
2580;-742501.000000000000000;-1045602.000000000000000;0
4325;-742270.679000001400709;-1043141.787999998778105;0
4023;-743246.635000001639128;-1043864.364999998360872;0
4998;-742514.109000001102686;-1042978.602000001817942;0
6703;-742288.903999999165535;-1044591.625999998301268;0
5792;-743363.984999999403954;-1043442.513999998569489;0
6253;-742378.725000001490116;-1043039.690000001341105;0
7750;-742972.960000000894070;-1044053.329999998211861;0
221;-742951.000000000000000;-1043544.000000000000000;0
5657;-743429.199999999254942;-1043706.837999999523163;0
3378;-743818.598999999463558;-1042922.491999998688698;0
4982;-742559.320999998599291;-1043012.914000000804663;0
4816;-742976.510000001639128;-1042798.309999998658895;0
941;-742098.000000000000000;-1043132.000000000000000;0
7212;-742559.410000000149012;-1045073.070000000298023;0
7949;-741953.559999998658895;-1044123.660000000149012;0
1027;-741984.000000000000000;-1044660.000000000000000;0
3888;-742331.469999998807907;-1042455.429999999701977;0
4008;-743250.114999998360872;-1044043.905999999493361;0
4893;-742637.320000000298023;-1042818.600999999791384;0
4169;-742414.420000001788139;-1043962.329999998211861;0
5747;-743413.175999999046326;-1043698.811000000685453;0
5589;-743423.785999998450279;-1043679.548000000417233;0
1323;-741859.000000000000000;-1044941.000000000000000;0
3159;-743996.506000000983477;-1042545.605000000447035;0
3837;-743093.699999999254942;-1042577.890000000596046;0
602;-741828.000000000000000;-1043190.000000000000000;0
184;-743445.000000000000000;-1043450.000000000000000;0
1522;-741841.000000000000000;-1043893.000000000000000;0
4689;-742688.114999998360872;-1042568.859999999403954;0
6146;-742314.942000001668930;-1043068.475999999791384;0
2440;-742596.000000000000000;-1044193.000000000000000;0
3952;-743407.521999999880791;-1043538.500999998301268;0
4067;-742913.594999998807907;-1043714.640000000596046;0
1701;-741378.000000000000000;-1044678.000000000000000;0
5583;-743410.274999998509884;-1043642.072000000625849;0
4505;-742434.910000000149012;-1042706.170000001788139;0
1192;-741801.000000000000000;-1044083.000000000000000;0
7248;-742757.960000000894070;-1044826.929999999701977;0
1248;-742109.000000000000000;-1044631.000000000000000;0
6840;-741746.993999999016523;-1044999.993999999016523;0
