OID_;X;Y;TEMPERATURE
3614;-744984.548999998718500;-1042283.640999998897314;0
3019;-744463.447999998927116;-1042784.646000001579523;0
3568;-744718.817999999970198;-1042588.614999998360872;0
3692;-744525.876499999314547;-1042540.534000001847744;0
3580;-744924.973999999463558;-1042593.699999999254942;0
2605;-745393.842999998480082;-1042860.796000000089407;0
5975;-745052.346999999135733;-1042674.673000000417233;0
118;-745135.000000000000000;-1042687.000000000000000;0
3542;-744575.274000000208616;-1042656.160000000149012;0
2696;-743477.489999998360872;-1042038.000000000000000;0
2520;-741847.000000000000000;-1045324.000000000000000;0
6872;-741751.719999998807907;-1045296.679999999701977;0
2760;-743863.331000000238419;-1043483.304000001400709;0
2755;-744003.879000000655651;-1043471.734000001102686;0
2404;-742179.000000000000000;-1045467.000000000000000;0
3919;-743904.947000000625849;-1043493.929999999701977;0
3107;-743778.888000000268221;-1042682.131999999284744;0
2740;-744042.611999999731779;-1043335.940000001341105;0
1486;-741150.000000000000000;-1044219.000000000000000;0
6828;-741465.309999998658895;-1044768.940000001341105;0
7411;-743529.510000001639128;-1045393.140000000596046;0
8079;-742021.839999999850988;-1045292.179999999701977;0
2070;-742993.000000000000000;-1044723.000000000000000;0
2097;-743143.000000000000000;-1044742.000000000000000;0
7263;-743009.559999998658895;-1044894.379999998956919;0
383;-742450.000000000000000;-1043722.000000000000000;0
4238;-742440.263000000268221;-1043528.236000001430511;0
7654;-742242.081000000238419;-1045273.263999998569489;0
2394;-742273.000000000000000;-1045360.000000000000000;0
2160;-742849.000000000000000;-1045147.000000000000000;0
2161;-742876.000000000000000;-1045153.000000000000000;0
8073;-742120.640000000596046;-1045259.500000000000000;0
4075;-742947.934999998658895;-1043903.649999998509884;0
7947;-742030.969999998807907;-1044096.679999999701977;0
524;-742255.000000000000000;-1043913.000000000000000;0
1780;-741214.000000000000000;-1043934.000000000000000;0
738;-741818.000000000000000;-1043024.000000000000000;0
1983;-743474.000000000000000;-1044709.000000000000000;0
1519;-741754.000000000000000;-1043956.000000000000000;0
748;-741671.000000000000000;-1042971.000000000000000;0
110;-744127.000000000000000;-1042724.000000000000000;0
7022;-743155.660000000149012;-1044074.410000000149012;0
1764;-741163.000000000000000;-1044144.000000000000000;0
735;-741910.000000000000000;-1043014.000000000000000;0
514;-742119.000000000000000;-1043141.000000000000000;0
510;-742048.000000000000000;-1043150.000000000000000;0
2050;-743460.000000000000000;-1045072.000000000000000;0
2008;-743242.000000000000000;-1044759.000000000000000;0
6722;-742357.717000000178814;-1044705.708000000566244;0
1561;-743186.000000000000000;-1045098.000000000000000;0
1251;-742091.000000000000000;-1044690.000000000000000;0
7;-743479.000000000000000;-1042567.000000000000000;0
17;-743587.000000000000000;-1042394.000000000000000;0
5303;-743164.818999998271465;-1043211.078000001609325;0
1492;-741096.000000000000000;-1044331.000000000000000;0
4332;-742410.359000001102686;-1043282.916000001132488;0
3204;-743715.278999999165535;-1042506.118999999016523;0
6;-743464.000000000000000;-1042594.000000000000000;0
2133;-743040.000000000000000;-1045127.000000000000000;0
2151;-742827.000000000000000;-1045047.000000000000000;0
2166;-743016.000000000000000;-1045179.000000000000000;0
7324;-742833.980000000447035;-1044949.109999999403954;0
4162;-742497.193999998271465;-1044160.030000001192093;0
6746;-742405.083999998867512;-1044259.199999999254942;0
1515;-741913.000000000000000;-1044072.000000000000000;0
1371;-742089.000000000000000;-1044807.000000000000000;0
2235;-743401.000000000000000;-1045221.000000000000000;0
884;-741771.000000000000000;-1042776.000000000000000;0
1013;-742076.000000000000000;-1044595.000000000000000;0
2189;-743472.000000000000000;-1045183.000000000000000;0
727;-742001.000000000000000;-1042962.000000000000000;0
1091;-741531.480000000447035;-1044543.440000001341105;0
728;-741997.000000000000000;-1042918.000000000000000;0
696;-742077.000000000000000;-1042913.000000000000000;0
2212;-743217.000000000000000;-1045279.000000000000000;0
3326;-744036.002000000327826;-1042922.574999999254942;0
2226;-743057.000000000000000;-1045470.000000000000000;0
504;-741937.000000000000000;-1043164.000000000000000;0
5062;-742798.513999998569489;-1043227.370999999344349;0
1970;-743380.000000000000000;-1044854.000000000000000;0
1987;-743480.000000000000000;-1044820.000000000000000;0
3387;-743960.368000000715256;-1043194.717000000178814;0
2255;-743181.000000000000000;-1045372.000000000000000;0
2256;-743156.000000000000000;-1045353.000000000000000;0
3233;-744152.962999999523163;-1042686.791999999433756;0
7776;-743089.784000001847744;-1045773.409000001847744;0
4232;-742315.057999998331070;-1043428.918999999761581;0
1915;-743468.000000000000000;-1044494.000000000000000;0
5119;-742850.592999998480082;-1043328.484999999403954;0
5434;-744042.467999998480082;-1043135.986999999731779;0
7520;-742808.589999999850988;-1045680.519999999552965;0
5135;-742979.611000001430511;-1043468.912999998778105;0
7087;-743339.940000001341105;-1044536.690000001341105;0
7350;-742556.390000000596046;-1045185.980000000447035;0
5111;-742892.337999999523163;-1043424.370999999344349;0
1945;-743270.000000000000000;-1044454.000000000000000;0
1058;-741667.000000000000000;-1045072.000000000000000;0
6791;-741047.329999998211861;-1044765.467999998480082;0
1875;-743367.000000000000000;-1044261.000000000000000;0
3839;-743112.140000000596046;-1042558.280000001192093;0
2262;-742999.000000000000000;-1045686.000000000000000;0
2887;-744098.480000000447035;-1043192.508000001311302;0
531;-742157.000000000000000;-1043778.000000000000000;0
1926;-743301.000000000000000;-1044321.000000000000000;0
5292;-743055.866000000387430;-1043215.710999999195337;0
7188;-742583.839999999850988;-1044742.870000001043081;0
599;-741837.000000000000000;-1043243.000000000000000;0
5272;-743000.013999998569489;-1043245.364000000059605;0
2344;-742691.000000000000000;-1045541.000000000000000;0
639;-741958.000000000000000;-1043294.000000000000000;0
4070;-742925.285000000149012;-1043783.565000001341105;0
2488;-742083.000000000000000;-1044303.000000000000000;0
4067;-742913.594999998807907;-1043714.640000000596046;0
496;-741768.000000000000000;-1043197.000000000000000;0
4342;-742506.473000001162291;-1043301.100000001490116;0
7651;-742295.381000000983477;-1045479.861999999731779;0
674;-742463.000000000000000;-1043211.000000000000000;0
4212;-742205.245000001043081;-1043548.410000000149012;0
1238;-742150.000000000000000;-1044384.000000000000000;0
1243;-742122.000000000000000;-1044502.000000000000000;0
1433;-741895.000000000000000;-1044328.000000000000000;0
5223;-743283.699999999254942;-1043535.940000001341105;0
826;-742191.000000000000000;-1042616.000000000000000;0
2491;-742059.000000000000000;-1044251.000000000000000;0
7217;-742516.318999998271465;-1044582.890000000596046;0
467;-741757.000000000000000;-1043352.000000000000000;0
463;-741703.000000000000000;-1043287.000000000000000;0
1299;-741943.000000000000000;-1044719.000000000000000;0
1052;-741761.000000000000000;-1045002.000000000000000;0
910;-742219.000000000000000;-1042529.000000000000000;0
7744;-742941.256999999284744;-1045533.171000000089407;0
1171;-741882.000000000000000;-1044375.000000000000000;0
3273;-743642.442999999970198;-1042796.677999999374151;0
6943;-742902.013999998569489;-1043932.647999998182058;0
6825;-741380.010000001639128;-1044780.089999999850988;0
281;-743045.000000000000000;-1043848.000000000000000;0
3289;-743584.761999998241663;-1042769.188000001013279;0
2526;-741087.000000000000000;-1044616.000000000000000;0
226;-742879.000000000000000;-1043516.000000000000000;0
7147;-742827.925000000745058;-1044451.385000001639128;0
8018;-741974.039999999105930;-1044442.870000001043081;0
1539;-741977.000000000000000;-1043997.000000000000000;0
583;-741975.000000000000000;-1043434.000000000000000;0
7965;-741515.510000001639128;-1044348.350000001490116;0
4006;-743302.763000000268221;-1044052.298999998718500;0
1138;-741500.000000000000000;-1044458.000000000000000;0
4236;-742406.842999998480082;-1043504.015000000596046;0
2501;-742746.000000000000000;-1045430.000000000000000;0
6710;-742260.203000001609325;-1044803.609999999403954;0
7026;-743217.644999999552965;-1044082.329999998211861;0
6095;-742082.920000001788139;-1043614.710000000894070;0
7033;-743303.864999998360872;-1044132.750000000000000;0
527;-742186.000000000000000;-1043818.000000000000000;0
7180;-742618.809000000357628;-1044646.109000001102686;0
3408;-743789.511999998241663;-1043022.425000000745058;0
1061;-741586.000000000000000;-1045133.000000000000000;0
1865;-743458.000000000000000;-1044233.000000000000000;0
3781;-743273.059999998658895;-1042814.050000000745058;0
570;-742098.000000000000000;-1043582.000000000000000;0
3752;-743213.949999999254942;-1042902.719999998807907;0
4218;-742263.436999998986721;-1043615.100999999791384;0
3373;-743814.043000001460314;-1043018.168000001460314;0
7218;-742534.100000001490116;-1044603.559999998658895;0
1656;-741395.000000000000000;-1044688.000000000000000;0
555;-742230.000000000000000;-1043726.000000000000000;0
1922;-743390.000000000000000;-1044308.000000000000000;0
544;-742343.910000000149012;-1043796.500000000000000;0
1920;-743384.000000000000000;-1044363.000000000000000;0
1905;-743446.000000000000000;-1044312.000000000000000;0
2513;-742574.000000000000000;-1044441.000000000000000;0
7044;-743400.635000001639128;-1044135.579999998211861;0
2478;-741241.859999999403954;-1044562.089999999850988;0
7104;-743423.739999998360872;-1044624.530000001192093;0
6313;-743936.949999999254942;-1042594.780000001192093;0
3155;-743969.353000000119209;-1042568.828000001609325;0
382;-742481.000000000000000;-1043751.000000000000000;0
576;-742054.000000000000000;-1043517.000000000000000;0
1849;-742732.000000000000000;-1044228.000000000000000;0
6092;-742001.309999998658895;-1043482.089999999850988;0
1707;-741196.219999998807907;-1044702.390000000596046;0
348;-742525.000000000000000;-1043787.000000000000000;0
627;-742223.000000000000000;-1043335.000000000000000;0
4026;-743178.984999999403954;-1043847.989999998360872;0
786;-741706.000000000000000;-1042606.000000000000000;0
6821;-741256.649999998509884;-1044796.100000001490116;0
4145;-742687.109999999403954;-1043837.125000000000000;0
1357;-741935.000000000000000;-1044871.000000000000000;0
7018;-742577.747000001370907;-1044239.712999999523163;0
1101;-741339.000000000000000;-1044568.000000000000000;0
4023;-743246.635000001639128;-1043864.364999998360872;0
1648;-741373.000000000000000;-1044431.000000000000000;0
1128;-741655.000000000000000;-1044448.000000000000000;0
6391;-742109.269999999552965;-1042498.320000000298023;0
4808;-743110.859999999403954;-1042784.829999998211861;0
6000;-741980.750000000000000;-1043285.629999998956919;0
2300;-742561.000000000000000;-1045413.000000000000000;0
616;-742153.000000000000000;-1043272.000000000000000;0
613;-742089.000000000000000;-1043271.000000000000000;0
636;-742160.000000000000000;-1043325.000000000000000;0
1449;-741533.000000000000000;-1044684.000000000000000;0
1693;-741613.000000000000000;-1044649.000000000000000;0
6104;-742208.646999999880791;-1043103.999000001698732;0
3746;-743261.420000001788139;-1042982.839999999850988;0
713;-741800.000000000000000;-1042859.000000000000000;0
1325;-741894.000000000000000;-1044959.000000000000000;0
3976;-743088.861000001430511;-1043707.728000000119209;0
881;-741806.000000000000000;-1042815.000000000000000;0
1611;-742400.000000000000000;-1044442.000000000000000;0
6700;-742298.611000001430511;-1044507.315999999642372;0
6703;-742288.903999999165535;-1044591.625999998301268;0
7246;-742736.730000000447035;-1044825.399999998509884;0
1823;-742973.000000000000000;-1044174.000000000000000;0
6721;-742321.052999999374151;-1044705.548000000417233;0
7010;-742857.964999999850988;-1044251.155000001192093;4
4680;-742759.370000001043081;-1042864.140000000596046;0
4058;-743138.765000000596046;-1043625.405000001192093;0
4057;-743132.184999998658895;-1043648.719999998807907;0
1620;-742439.000000000000000;-1044323.000000000000000;0
1314;-741695.000000000000000;-1044866.000000000000000;0
1310;-741623.000000000000000;-1044829.000000000000000;0
1042;-741883.000000000000000;-1044682.000000000000000;0
7516;-742248.390000000596046;-1044368.907999999821186;0
677;-742425.000000000000000;-1043200.000000000000000;0
6718;-742339.493000000715256;-1044956.921999998390675;0
1692;-741125.000000000000000;-1044816.000000000000000;0
3949;-743420.780000001192093;-1043527.820000000298023;0
6507;-741738.839999999850988;-1044541.820000000298023;0
6662;-741466.800000000745058;-1044192.359999999403954;0
4768;-742862.888000000268221;-1042936.997999999672174;0
4166;-742448.504999998956919;-1044046.885000001639128;0
2016;-743230.000000000000000;-1044873.000000000000000;0
1424;-742134.000000000000000;-1044171.000000000000000;0
337;-742621.000000000000000;-1043941.000000000000000;0
5232;-743347.087000001221895;-1043476.425000000745058;0
4175;-742721.254999998956919;-1043775.890000000596046;0
1163;-741072.820000000298023;-1044501.940000001341105;0
6013;-743372.780000001192093;-1043377.921999998390675;0
2575;-742484.000000000000000;-1045453.000000000000000;0
1387;-742155.000000000000000;-1044999.000000000000000;0
1598;-742351.000000000000000;-1045090.000000000000000;0
1342;-741721.000000000000000;-1044783.000000000000000;0
1350;-741814.000000000000000;-1044844.000000000000000;0
2375;-742438.000000000000000;-1045570.000000000000000;0
3986;-743313.355000000447035;-1043956.986999999731779;0
1330;-741817.000000000000000;-1044709.000000000000000;0
2309;-742322.000000000000000;-1045519.000000000000000;0
1385;-742194.000000000000000;-1044974.000000000000000;0
4134;-742772.309999998658895;-1044078.870000001043081;0
2329;-742432.000000000000000;-1045508.000000000000000;0
2446;-742750.000000000000000;-1044164.000000000000000;0
6842;-741574.894000001251698;-1044962.013999998569489;0
1590;-742377.000000000000000;-1044885.000000000000000;0
3822;-743065.039999999105930;-1042594.239999998360872;0
2322;-742651.000000000000000;-1045483.000000000000000;0
4064;-742879.655000001192093;-1043647.420000001788139;0
817;-741937.000000000000000;-1042586.000000000000000;0
1993;-743483.000000000000000;-1044984.000000000000000;0
4063;-742855.079999998211861;-1043654.695000000298023;0
8284;-742219.410000000149012;-1042809.500000000000000;0
2086;-742404.000000000000000;-1044796.000000000000000;0
2041;-743531.000000000000000;-1044957.000000000000000;0
8283;-742198.600000001490116;-1042801.980000000447035;0
2419;-742418.000000000000000;-1045101.000000000000000;0
1269;-742246.000000000000000;-1044462.000000000000000;0
6573;-741294.089999999850988;-1044091.679999999701977;0
4789;-742979.506000000983477;-1042555.324999999254942;0
3841;-743159.929999999701977;-1042641.120000001043081;0
7736;-742342.260000001639128;-1045113.918000001460314;0
332;-742645.000000000000000;-1044014.000000000000000;0
4656;-742827.763000000268221;-1042494.379999998956919;0
4678;-742775.910000000149012;-1042839.929999999701977;0
4538;-742291.464000001549721;-1042734.344000000506639;0
6862;-741438.085999999195337;-1045031.583999998867512;0
4858;-742955.339999999850988;-1042963.960000000894070;0
6656;-741590.160000000149012;-1044150.480000000447035;0
4481;-741766.089999999850988;-1042627.859999999403954;0
2565;-741043.000000000000000;-1044424.000000000000000;0
522;-742261.000000000000000;-1043122.000000000000000;0
4826;-743043.850000001490116;-1042979.600000001490116;0
688;-742284.000000000000000;-1043125.000000000000000;0
4036;-743246.920000001788139;-1043771.574999999254942;0
623;-742254.000000000000000;-1043325.000000000000000;0
3766;-743053.532999999821186;-1042996.631000000983477;0
872;-741698.000000000000000;-1042669.000000000000000;0
4425;-742208.820000000298023;-1043035.230000000447035;0
4650;-742749.989000000059605;-1042534.539999999105930;0
1397;-741771.000000000000000;-1044236.000000000000000;0
2548;-741672.000000000000000;-1044304.000000000000000;0
3786;-743150.480000000447035;-1042925.960000000894070;0
2017;-743247.000000000000000;-1044884.000000000000000;0
6726;-742476.517999999225140;-1044410.600000001490116;0
2028;-743371.000000000000000;-1045054.000000000000000;0
7315;-742603.960000000894070;-1045022.870000001043081;0
2060;-742659.000000000000000;-1044472.000000000000000;0
7175;-742651.780000001192093;-1044558.149999998509884;0
4132;-742818.859999999403954;-1044067.969999998807907;0
4099;-742773.870000001043081;-1043846.135999999940395;0
6009;-743896.859000001102686;-1042750.497000001370907;0
1382;-742096.000000000000000;-1045023.000000000000000;0
1520;-741777.000000000000000;-1043939.000000000000000;0
2318;-742763.000000000000000;-1045470.000000000000000;0
821;-742048.000000000000000;-1042601.000000000000000;0
4503;-742402.579999998211861;-1042702.839999999850988;0
3090;-743913.418999999761581;-1042804.416999999433756;0
5636;-743427.432000000029802;-1043681.359999999403954;0
1604;-742552.000000000000000;-1044918.000000000000000;0
5241;-743365.063000001013279;-1043245.954999998211861;0
5035;-742658.587999999523163;-1043006.899000000208616;0
6280;-742306.918999999761581;-1043038.083000000566244;0
7152;-742867.331999998539686;-1044547.015999998897314;0
5258;-743356.739999998360872;-1043230.039999999105930;0
7750;-742972.960000000894070;-1044053.329999998211861;0
7156;-742944.515000000596046;-1044546.140000000596046;0
6127;-742314.456000000238419;-1043070.548999998718500;0
1822;-742986.199999999254942;-1044211.969999998807907;0
4957;-742366.010000001639128;-1043006.059999998658895;0
4558;-742373.019999999552965;-1042506.949999999254942;0
277;-743398.000000000000000;-1043928.000000000000000;0
5689;-743415.442000001668930;-1043633.646000001579523;0
3336;-743972.239999998360872;-1043004.743000000715256;0
4749;-742884.420000001788139;-1042760.329999998211861;0
4570;-742347.760000001639128;-1042540.809999998658895;0
1528;-741698.000000000000000;-1043770.000000000000000;0
3361;-743933.616000000387430;-1042980.793000001460314;0
1524;-741710.000000000000000;-1043844.000000000000000;0
4723;-742883.429999999701977;-1042644.829999998211861;0
1817;-743058.000000000000000;-1044411.000000000000000;0
4898;-742571.280000001192093;-1042840.859999999403954;0
4463;-742198.989999998360872;-1042569.030000001192093;0
8260;-742091.730000000447035;-1042690.769999999552965;0
4706;-742728.070000000298023;-1042610.910000000149012;0
4813;-743013.550000000745058;-1042793.390000000596046;0
3305;-743801.410000000149012;-1042874.962999999523163;0
4800;-742990.043000001460314;-1042700.708000000566244;0
1260;-742070.000000000000000;-1044876.000000000000000;0
6709;-742264.587999999523163;-1044776.254999998956919;0
6181;-742318.164999999105930;-1043068.541999999433756;0
3870;-742381.989999998360872;-1042417.679999999701977;0
1509;-741741.000000000000000;-1044196.000000000000000;0
2314;-742884.000000000000000;-1045456.000000000000000;0
263;-743389.000000000000000;-1043725.000000000000000;0
6647;-741767.690000001341105;-1044068.160000000149012;0
5766;-742429.719999998807907;-1042597.699999999254942;0
5735;-743414.589999999850988;-1043687.874000001698732;0
6354;-741928.410000000149012;-1042711.350000001490116;0
6211;-742317.785000000149012;-1043063.318999998271465;0
7281;-742801.859999999403954;-1044705.300000000745058;0
7980;-741198.179999999701977;-1044410.339999999850988;0
5700;-743416.574000000953674;-1043630.223999999463558;0
4947;-742399.918000001460314;-1042993.458000000566244;0
1006;-741930.000000000000000;-1044565.000000000000000;0
1363;-742095.000000000000000;-1044934.000000000000000;0
5959;-742962.548999998718500;-1043523.155000001192093;0
6145;-742315.708000000566244;-1043069.881999999284744;0
6159;-742312.495999999344349;-1043062.521000001579523;0
3820;-743111.699999999254942;-1042659.320000000298023;0
6142;-742310.477000001817942;-1043061.813000001013279;0
4896;-742589.649999998509884;-1042838.989999998360872;0
4753;-742764.600000001490116;-1042761.899999998509884;0
5022;-742578.440000001341105;-1042849.350000001490116;0
6373;-741992.809999998658895;-1042677.000000000000000;0
7704;-742256.021000001579523;-1044313.592999998480082;0
4814;-743000.489999998360872;-1042803.920000001788139;0
542;-742367.629999998956919;-1043814.379999998956919;0
6125;-743428.124000001698732;-1043615.223999999463558;0
5509;-743425.144999999552965;-1043637.853000000119209;0
6677;-742304.892999999225140;-1044202.831999998539686;0
5704;-743417.484999999403954;-1043635.530999999493361;0
7143;-742850.414999999105930;-1044473.449999999254942;0
6253;-742378.725000001490116;-1043039.690000001341105;0
5665;-743419.725000001490116;-1043711.682000000029802;0
1495;-741215.000000000000000;-1044324.000000000000000;0
398;-742372.000000000000000;-1043909.000000000000000;0
5173;-743291.175999999046326;-1043426.754999998956919;0
6995;-743129.710000000894070;-1044496.579999998211861;0
4098;-742789.157000001519918;-1043861.918999999761581;0
1527;-741676.000000000000000;-1043775.000000000000000;0
4939;-742448.866999998688698;-1043072.822999998927116;0
1361;-742037.000000000000000;-1044911.000000000000000;0
6169;-742312.320000000298023;-1043060.791999999433756;0
4995;-742476.986000001430511;-1042961.239000000059605;0
7285;-742806.960000000894070;-1044758.379999998956919;0
5584;-743408.885000001639128;-1043643.532000001519918;0
4849;-742966.960000000894070;-1042893.583999998867512;0
6300;-741836.949999999254942;-1042698.329999998211861;0
3788;-743134.440000001341105;-1042956.210000000894070;0
6177;-742313.717999998480082;-1043061.859999999403954;0
6130;-742312.136999998241663;-1043066.344000000506639;0
4677;-742787.309999998658895;-1042797.899999998509884;0
6123;-743427.453000001609325;-1043603.083000000566244;0
6256;-742380.723000001162291;-1043035.640000000596046;0
5651;-743429.440999999642372;-1043699.524999998509884;0
4799;-743008.011999998241663;-1042697.245999999344349;0
1189;-741786.000000000000000;-1044043.000000000000000;0
6978;-743090.239999998360872;-1044436.379999998956919;0
6153;-742309.583999998867512;-1043058.640999998897314;0
5204;-743246.423999998718500;-1043308.298999998718500;0
4975;-742477.829999998211861;-1043016.923000000417233;0
4744;-742848.129999998956919;-1042759.629999998956919;0
4624;-742577.815000001341105;-1042600.907999999821186;0
6139;-742312.807000000029802;-1043066.006000000983477;0
6284;-742309.677999999374151;-1043054.043999999761581;0
1612;-742429.000000000000000;-1044425.000000000000000;0
5712;-743423.701000001281500;-1043638.675999999046326;0
275;-743361.000000000000000;-1043904.000000000000000;0
7223;-742409.149999998509884;-1044822.649999998509884;0
8274;-742065.089999999850988;-1042742.109999999403954;0
5209;-743271.947999998927116;-1043361.392000000923872;0
5710;-743421.574999999254942;-1043640.598000001162291;0
6166;-742314.649999998509884;-1043065.006999999284744;0
6449;-743140.379999998956919;-1043395.559999998658895;0
7162;-743075.840999998152256;-1044541.596000000834465;0
5577;-743409.385999999940395;-1043630.826999999582767;0
4900;-742508.089999999850988;-1042815.289999999105930;0
1793;-742166.000000000000000;-1044246.000000000000000;0
4759;-742842.945999998599291;-1042806.664000000804663;0
7809;-741981.809999998658895;-1044560.280000001192093;0
4891;-742595.048999998718500;-1042857.274999998509884;0
6151;-742311.114999998360872;-1043061.451000001281500;0
6213;-742316.227000001817942;-1043060.478999998420477;0
5136;-742992.278000000864267;-1043472.440000001341105;0
4170;-742407.245000001043081;-1043945.519999999552965;0
4607;-742508.469999998807907;-1042623.089000001549721;0
1551;-741353.000000000000000;-1044326.000000000000000;0
6180;-742311.429000001400709;-1043057.635999999940395;0
1553;-741350.000000000000000;-1044268.000000000000000;0
1123;-741734.000000000000000;-1044442.000000000000000;0
4252;-742124.022999998182058;-1043390.519000001251698;0
5505;-743428.315000001341105;-1043675.633000001311302;0
3999;-743412.539999999105930;-1043918.725000001490116;0
6673;-742244.289999999105930;-1044153.350000001490116;0
1545;-742236.000000000000000;-1044234.000000000000000;0
301;-742613.000000000000000;-1043903.000000000000000;0
2332;-742899.000000000000000;-1045516.000000000000000;0
1831;-742994.000000000000000;-1044105.000000000000000;0
6191;-742318.017000000923872;-1043066.800999999046326;0
6861;-741491.429999999701977;-1045010.300000000745058;0
6212;-742317.006000000983477;-1043061.888000000268221;0
4510;-742483.149999998509884;-1042738.460000000894070;0
2556;-741376.000000000000000;-1044379.000000000000000;0
1838;-743004.480000000447035;-1044216.030000001192093;0
5684;-743397.274000000208616;-1043719.995999999344349;0
5648;-743429.164000000804663;-1043695.905999999493361;0
2499;-741884.000000000000000;-1044011.000000000000000;0
5419;-742434.690000001341105;-1042846.280000001192093;0
6134;-742309.011999998241663;-1043060.703000001609325;0
2242;-743321.000000000000000;-1045313.000000000000000;0
4621;-742536.945999998599291;-1042552.296000000089407;0
2211;-743248.000000000000000;-1045258.000000000000000;0
6163;-742316.921000000089407;-1043069.223000001162291;0
4902;-742480.460000000894070;-1042802.989999998360872;0
5688;-743415.267000000923872;-1043631.945000000298023;0
818;-741961.000000000000000;-1042598.000000000000000;0
1126;-741684.000000000000000;-1044450.000000000000000;0
5512;-743426.556000001728535;-1043602.920000001788139;0
4765;-742822.897999998182058;-1042850.499000001698732;0
4604;-742463.967999998480082;-1042613.381999999284744;0
5409;-743745.201000001281500;-1042902.750000000000000;0
5676;-743406.725999999791384;-1043716.493000000715256;0
6137;-742314.326999999582767;-1043068.837000001221895;0
5681;-743400.820000000298023;-1043718.682000000029802;0
1438;-741809.000000000000000;-1044350.000000000000000;0
7136;-742914.329999998211861;-1044374.469999998807907;0
6216;-742313.892000000923872;-1043056.272999998182058;0
6144;-742308.925000000745058;-1043059.002000000327826;0
4704;-742680.000000000000000;-1042776.750000000000000;0
6167;-742313.859999999403954;-1043063.607000000774860;0
6219;-742319.168999999761581;-1043064.293999999761581;0
1813;-743118.000000000000000;-1044528.000000000000000;0
5134;-742995.984000001102686;-1043497.364000000059605;0
5001;-742560.092999998480082;-1042966.206999998539686;0
6198;-742312.659000001847744;-1043056.964999999850988;0
6245;-742369.682000000029802;-1043057.377000000327826;0
1364;-742077.000000000000000;-1044936.000000000000000;0
5696;-743417.096000000834465;-1043637.135999999940395;0
5196;-743199.263000000268221;-1043326.401000000536442;0
4633;-742625.931000001728535;-1042639.918999999761581;0
3310;-743829.561999998986721;-1042854.063000001013279;0
4599;-742625.879999998956919;-1042698.820000000298023;0
6473;-741931.359999999403954;-1044555.109999999403954;0
4731;-742802.002999998629093;-1042654.546000000089407;0
5589;-743423.785999998450279;-1043679.548000000417233;0
4771;-742890.828000001609325;-1042889.975000001490116;0
3371;-743840.392999999225140;-1043010.835000000894070;0
4784;-742945.712999999523163;-1042685.611999999731779;0
7142;-742872.445000000298023;-1044472.239999998360872;0
6140;-742311.999000001698732;-1043064.638999998569489;0
4835;-742967.660000000149012;-1042677.690000001341105;0
4223;-742161.556000001728535;-1043473.138999998569489;0
6262;-742370.024999998509884;-1043021.666000001132488;0
6250;-742374.638999998569489;-1043047.576999999582767;0
5678;-743404.363000001758337;-1043717.368999999016523;0
6156;-742314.791999999433756;-1043066.736000001430511;0
4979;-742507.703000001609325;-1043016.118000000715256;0
5578;-743409.534000001847744;-1043632.701000001281500;0
1602;-742507.000000000000000;-1044924.000000000000000;0
4853;-742981.855000000447035;-1042884.537000000476837;0
1460;-741482.000000000000000;-1044302.000000000000000;0
5714;-743423.756000000983477;-1043635.103999998420477;0
6147;-742314.177000001072884;-1043067.070999998599291;0
