OID_;X;Y;TEMPERATURE
3614;-744984.548999998718500;-1042283.640999998897314;0
110;-744127.000000000000000;-1042724.000000000000000;3
3019;-744463.447999998927116;-1042784.646000001579523;0
3568;-744718.817999999970198;-1042588.614999998360872;0
3692;-744525.876499999314547;-1042540.534000001847744;0
3580;-744924.973999999463558;-1042593.699999999254942;0
2605;-745393.842999998480082;-1042860.796000000089407;0
5975;-745052.346999999135733;-1042674.673000000417233;0
118;-745135.000000000000000;-1042687.000000000000000;0
3542;-744575.274000000208616;-1042656.160000000149012;0
2696;-743477.489999998360872;-1042038.000000000000000;0
2520;-741847.000000000000000;-1045324.000000000000000;0
6946;-742974.765000000596046;-1043929.388000000268221;0
6874;-741789.789999999105930;-1045272.100000001490116;0
696;-742077.000000000000000;-1042913.000000000000000;0
7259;-742935.280000001192093;-1044869.829999998211861;0
7246;-742736.730000000447035;-1044825.399999998509884;0
1524;-741710.000000000000000;-1043844.000000000000000;0
7;-743479.000000000000000;-1042567.000000000000000;0
2009;-743221.000000000000000;-1044770.000000000000000;0
2070;-742993.000000000000000;-1044723.000000000000000;0
2021;-743281.000000000000000;-1044948.000000000000000;0
7411;-743529.510000001639128;-1045393.140000000596046;0
1449;-741533.000000000000000;-1044684.000000000000000;0
1521;-741808.000000000000000;-1043917.000000000000000;0
2276;-742865.000000000000000;-1045649.000000000000000;0
1816;-743070.000000000000000;-1044444.000000000000000;0
2748;-743933.984000001102686;-1043445.734000001102686;0
2007;-743231.000000000000000;-1044741.000000000000000;0
7046;-743398.329999998211861;-1044186.289999999105930;0
930;-744068.000000000000000;-1043405.000000000000000;0
5436;-744076.484000001102686;-1043296.519999999552965;0
3921;-743909.208999998867512;-1043541.574000000953674;0
3066;-744075.627000000327826;-1042883.837000001221895;0
3752;-743213.949999999254942;-1042902.719999998807907;0
709;-741861.000000000000000;-1042862.000000000000000;0
6448;-744017.179999999701977;-1043123.899999998509884;0
725;-741983.000000000000000;-1042939.000000000000000;0
3811;-743244.620000001043081;-1042809.420000001788139;0
3111;-743727.034000001847744;-1042625.182999998331070;0
7188;-742583.839999999850988;-1044742.870000001043081;0
1764;-741163.000000000000000;-1044144.000000000000000;0
5065;-742796.800999999046326;-1043254.010000001639128;0
2149;-742819.000000000000000;-1045024.000000000000000;0
3393;-743910.969999998807907;-1043143.960000000894070;0
7706;-742313.239999998360872;-1044319.611999999731779;0
1369;-742029.000000000000000;-1044788.000000000000000;0
4333;-742428.420000001788139;-1043255.609999999403954;0
4239;-742454.206000000238419;-1043538.927999999374151;0
1775;-741246.000000000000000;-1044012.000000000000000;0
1012;-742060.000000000000000;-1044582.000000000000000;0
3211;-743651.409000001847744;-1042483.458999998867512;0
4156;-742513.734999999403954;-1043978.035000000149012;0
1415;-741623.000000000000000;-1044561.000000000000000;0
3274;-743652.714999999850988;-1042812.727000001817942;0
6;-743464.000000000000000;-1042594.000000000000000;0
4153;-742555.934999998658895;-1044073.285000000149012;0
2132;-743058.000000000000000;-1045118.000000000000000;0
6675;-742272.140000000596046;-1044167.469999998807907;0
3216;-743615.890999998897314;-1042451.129999998956919;0
524;-742255.000000000000000;-1043913.000000000000000;0
5121;-742889.114000000059605;-1043362.250000000000000;0
2043;-743471.000000000000000;-1044959.000000000000000;0
7152;-742867.331999998539686;-1044547.015999998897314;0
7516;-742248.390000000596046;-1044368.907999999821186;0
7284;-742811.789999999105930;-1044718.210000000894070;0
2512;-743070.000000000000000;-1044052.000000000000000;0
6791;-741047.329999998211861;-1044765.467999998480082;0
2211;-743248.000000000000000;-1045258.000000000000000;0
6721;-742321.052999999374151;-1044705.548000000417233;0
8077;-742038.989999998360872;-1045265.309999998658895;0
1587;-742372.000000000000000;-1044806.000000000000000;0
2398;-742150.000000000000000;-1045370.000000000000000;0
7829;-743509.649999998509884;-1045166.399999998509884;0
825;-742171.000000000000000;-1042598.000000000000000;0
1038;-741956.000000000000000;-1044977.000000000000000;0
1476;-741531.000000000000000;-1044196.000000000000000;0
345;-742559.000000000000000;-1043826.000000000000000;0
381;-742465.000000000000000;-1043700.000000000000000;0
5058;-742837.528999999165535;-1043170.686000000685453;0
2242;-743321.000000000000000;-1045313.000000000000000;0
6821;-741256.649999998509884;-1044796.100000001490116;0
8056;-742242.379999998956919;-1045023.460000000894070;0
3759;-743267.609999999403954;-1042971.300000000745058;0
2384;-742191.000000000000000;-1045494.000000000000000;0
7002;-743079.250000000000000;-1044377.170000001788139;0
6833;-741571.423000000417233;-1044909.473999999463558;0
527;-742186.000000000000000;-1043818.000000000000000;0
7146;-742819.425000000745058;-1044426.225000001490116;0
730;-741948.000000000000000;-1042998.000000000000000;0
2061;-742681.000000000000000;-1044491.000000000000000;0
543;-742361.000000000000000;-1043823.000000000000000;0
301;-742613.000000000000000;-1043903.000000000000000;0
1984;-743476.000000000000000;-1044743.000000000000000;0
5128;-743040.467000000178814;-1043389.765999998897314;0
2051;-743434.000000000000000;-1045074.000000000000000;0
5107;-742857.611999999731779;-1043458.278000000864267;0
4089;-742812.844999998807907;-1043560.114999998360872;0
2154;-742805.000000000000000;-1045147.000000000000000;0
1990;-743482.000000000000000;-1044906.000000000000000;0
465;-741728.000000000000000;-1043309.000000000000000;0
1666;-741017.000000000000000;-1044315.000000000000000;0
1849;-742732.000000000000000;-1044228.000000000000000;0
4214;-742229.274999998509884;-1043511.745000001043081;0
7732;-742611.719000000506639;-1044632.203999999910593;0
8071;-742174.120000001043081;-1045257.530000001192093;0
6923;-742061.469999998807907;-1045089.760000001639128;0
1629;-742450.000000000000000;-1044518.000000000000000;0
2104;-743176.000000000000000;-1044964.000000000000000;0
1821;-742995.000000000000000;-1044239.000000000000000;0
6993;-743172.409000001847744;-1044501.339000001549721;0
4124;-742751.265000000596046;-1043878.414999999105930;0
2515;-742517.000000000000000;-1044420.000000000000000;0
3847;-743122.146999999880791;-1042525.489999998360872;0
2084;-742447.000000000000000;-1044797.000000000000000;0
1166;-741020.000000000000000;-1044520.000000000000000;0
3412;-743772.947000000625849;-1043053.557999998331070;0
1426;-742056.000000000000000;-1044228.000000000000000;0
7650;-742315.337000001221895;-1045462.039999999105930;0
1969;-743376.000000000000000;-1044829.000000000000000;0
316;-742490.000000000000000;-1044202.000000000000000;0
7658;-742333.647999998182058;-1045313.331999998539686;0
3767;-743033.910000000149012;-1042982.390000000596046;0
7107;-743425.260000001639128;-1044646.199999999254942;0
3297;-743706.958999998867512;-1042868.114999998360872;0
500;-741861.000000000000000;-1043174.000000000000000;0
738;-741818.000000000000000;-1043024.000000000000000;0
1540;-742005.000000000000000;-1044009.000000000000000;0
1343;-741714.000000000000000;-1044765.000000000000000;0
1170;-741893.000000000000000;-1044403.000000000000000;0
560;-742181.000000000000000;-1043665.000000000000000;0
8285;-742232.780000001192093;-1042821.149999998509884;0
2138;-742958.000000000000000;-1045095.000000000000000;0
4047;-743210.230000000447035;-1043992.289999999105930;0
3366;-743913.831000000238419;-1043002.796999998390675;0
276;-743382.000000000000000;-1043905.000000000000000;0
819;-741987.000000000000000;-1042599.000000000000000;0
2217;-743112.000000000000000;-1045360.000000000000000;0
4555;-742337.140000000596046;-1042512.379999998956919;0
325;-742700.000000000000000;-1044114.000000000000000;0
1720;-741436.000000000000000;-1044862.000000000000000;0
6505;-741746.570000000298023;-1044600.429999999701977;0
2314;-742884.000000000000000;-1045456.000000000000000;0
2250;-743234.000000000000000;-1045435.000000000000000;0
5325;-742997.480000000447035;-1043042.289999999105930;39
6710;-742260.203000001609325;-1044803.609999999403954;0
7350;-742556.390000000596046;-1045185.980000000447035;0
1265;-742047.000000000000000;-1044960.000000000000000;0
5208;-743237.954999998211861;-1043368.065999999642372;0
2172;-742886.000000000000000;-1045182.000000000000000;0
1042;-741883.000000000000000;-1044682.000000000000000;0
1619;-742426.000000000000000;-1044401.000000000000000;0
1089;-741567.949999999254942;-1044538.820000000298023;0
4184;-742311.379999998956919;-1044164.660000000149012;0
744;-741666.000000000000000;-1042994.000000000000000;0
1654;-741387.000000000000000;-1044621.000000000000000;0
7018;-742577.747000001370907;-1044239.712999999523163;0
3311;-743816.037999998778105;-1042845.728999998420477;0
3834;-743079.190000001341105;-1042579.899999998509884;0
1040;-741904.000000000000000;-1044623.000000000000000;0
1500;-741441.000000000000000;-1044299.000000000000000;0
4500;-742315.239999998360872;-1042719.460000000894070;0
1935;-743276.000000000000000;-1044289.000000000000000;0
8046;-742169.109999999403954;-1044835.660000000149012;0
4145;-742687.109999999403954;-1043837.125000000000000;0
1423;-742167.000000000000000;-1044150.000000000000000;258
7010;-742857.964999999850988;-1044251.155000001192093;4
4138;-742883.587000001221895;-1043997.287999998778105;0
4131;-742844.625000000000000;-1044059.980000000447035;0
6013;-743372.780000001192093;-1043377.921999998390675;0
2359;-742348.000000000000000;-1045581.000000000000000;0
4310;-742031.800000000745058;-1043475.199999999254942;0
4211;-742193.190000001341105;-1043565.660000000149012;0
6838;-741701.057999998331070;-1044977.087000001221895;0
509;-741991.000000000000000;-1043143.000000000000000;0
4053;-743260.039999999105930;-1043823.480000000447035;0
1252;-742096.000000000000000;-1044711.000000000000000;0
2885;-744122.791999999433756;-1043190.208000000566244;0
5134;-742995.984000001102686;-1043497.364000000059605;0
1291;-742205.000000000000000;-1044568.000000000000000;0
7388;-743052.050000000745058;-1045513.859999999403954;0
4086;-742813.079999998211861;-1043631.730000000447035;0
1557;-741193.000000000000000;-1044306.000000000000000;0
1448;-741537.000000000000000;-1044716.000000000000000;0
2322;-742651.000000000000000;-1045483.000000000000000;0
6961;-743023.579999998211861;-1044221.129999998956919;0
1189;-741786.000000000000000;-1044043.000000000000000;0
1047;-741816.000000000000000;-1044867.000000000000000;0
4325;-742270.679000001400709;-1043141.787999998778105;0
5157;-743178.671999998390675;-1043354.681000001728535;0
4613;-742506.557000000029802;-1042597.938000001013279;0
875;-741783.000000000000000;-1042677.000000000000000;0
4989;-742648.756000000983477;-1043019.318999998271465;0
4874;-742795.429999999701977;-1042925.910000000149012;0
4120;-742715.179999999701977;-1043974.089999999850988;0
2326;-742523.000000000000000;-1045498.000000000000000;0
516;-742160.000000000000000;-1043135.000000000000000;0
7744;-742941.256999999284744;-1045533.171000000089407;0
3842;-743141.300000000745058;-1042637.030000001192093;0
4257;-742056.467000000178814;-1043503.657999999821186;0
4029;-743130.695999998599291;-1043815.427999999374151;0
609;-741984.000000000000000;-1043272.000000000000000;0
7142;-742872.445000000298023;-1044472.239999998360872;0
6569;-741287.850000001490116;-1044136.660000000149012;0
5113;-742946.795000001788139;-1043444.427999999374151;0
2536;-742003.000000000000000;-1044113.000000000000000;0
4966;-742377.289999999105930;-1043071.030000001192093;0
5242;-743357.030000001192093;-1043419.239999998360872;0
2479;-741247.800000000745058;-1044609.379999998956919;0
4320;-742264.149000000208616;-1043259.541999999433756;206
600;-741840.000000000000000;-1043212.000000000000000;0
1780;-741214.000000000000000;-1043934.000000000000000;0
7742;-741703.945999998599291;-1045067.738000001758337;0
1334;-741769.000000000000000;-1044799.000000000000000;0
3788;-743134.440000001341105;-1042956.210000000894070;0
1179;-741934.000000000000000;-1044251.000000000000000;0
6119;-743582.679999999701977;-1042696.969999998807907;0
4074;-742943.350000001490116;-1043880.304999999701977;0
592;-741913.000000000000000;-1043311.000000000000000;0
1387;-742155.000000000000000;-1044999.000000000000000;0
1537;-741924.000000000000000;-1043954.000000000000000;0
307;-742781.000000000000000;-1044143.000000000000000;0
2501;-742746.000000000000000;-1045430.000000000000000;0
4661;-742816.708000000566244;-1042503.918999999761581;0
7025;-743199.914999999105930;-1044070.515000000596046;0
1187;-741805.000000000000000;-1044071.000000000000000;0
3093;-743925.421999998390675;-1042803.127000000327826;12
4340;-742473.662000000476837;-1043349.048999998718500;0
1400;-741719.000000000000000;-1044132.000000000000000;0
4770;-742872.535000000149012;-1042899.679000001400709;0
8258;-742053.760000001639128;-1042683.769999999552965;0
1402;-741699.000000000000000;-1044419.000000000000000;0
5736;-743414.859999999403954;-1043691.462999999523163;0
6769;-741281.120000001043081;-1044417.780000001192093;0
7158;-742984.796999998390675;-1044545.407999999821186;11
6003;-742038.201000001281500;-1043299.010999999940395;0
6252;-742378.052000001072884;-1043040.958000000566244;0
1594;-742304.000000000000000;-1044977.000000000000000;0
576;-742054.000000000000000;-1043517.000000000000000;0
5420;-742442.920000001788139;-1042740.519999999552965;0
4225;-742115.607999999076128;-1043452.125000000000000;0
296;-742950.170000001788139;-1044097.429999999701977;0
1378;-742161.000000000000000;-1044904.000000000000000;0
7031;-743301.824999999254942;-1044080.774999998509884;0
757;-741673.000000000000000;-1042678.000000000000000;0
4814;-743000.489999998360872;-1042803.920000001788139;0
884;-741771.000000000000000;-1042776.000000000000000;0
4520;-742651.079999998211861;-1042798.449999999254942;0
2543;-741788.000000000000000;-1044237.000000000000000;0
6189;-742312.041999999433756;-1043057.302000001072884;0
5955;-742960.732999999076128;-1043520.888999998569489;0
1550;-741356.000000000000000;-1044363.000000000000000;0
3803;-743066.289999999105930;-1042896.320000000298023;0
4758;-742854.840999998152256;-1042811.914000000804663;0
8018;-741974.039999999105930;-1044442.870000001043081;0
261;-743429.000000000000000;-1043723.000000000000000;0
2186;-743184.000000000000000;-1045146.000000000000000;0
6852;-741571.519999999552965;-1045065.932999998331070;0
4002;-743397.818999998271465;-1044054.317999999970198;0
5459;-742368.519000001251698;-1043474.221999999135733;0
5227;-743318.199999999254942;-1043537.510000001639128;0
6819;-741194.784000001847744;-1044802.818999998271465;0
4425;-742208.820000000298023;-1043035.230000000447035;0
1408;-741647.000000000000000;-1044201.000000000000000;0
3794;-743091.015000000596046;-1042800.471999999135733;0
3830;-743013.879999998956919;-1042612.359999999403954;0
6369;-741962.675000000745058;-1042665.013999998569489;0
4948;-742386.929999999701977;-1042992.239999998360872;0
4963;-742396.510000001639128;-1043031.829999998211861;0
846;-742175.000000000000000;-1042517.000000000000000;0
513;-742083.000000000000000;-1043145.000000000000000;0
4619;-742460.010000001639128;-1042480.890000000596046;0
785;-741702.000000000000000;-1042622.000000000000000;0
4975;-742477.829999998211861;-1043016.923000000417233;0
3312;-743789.184999998658895;-1042904.234000001102686;0
3960;-743418.563000001013279;-1043583.526000000536442;0
5595;-743416.488000001758337;-1043680.118999999016523;0
1137;-741538.000000000000000;-1044442.000000000000000;0
6127;-742314.456000000238419;-1043070.548999998718500;0
4082;-742825.565000001341105;-1043737.364999998360872;0
6354;-741928.410000000149012;-1042711.350000001490116;0
4071;-742929.394999999552965;-1043807.585000000894070;0
4197;-742179.633999999612570;-1043776.899000000208616;0
4563;-742461.379999998956919;-1042526.230000000447035;0
7207;-742570.620000001043081;-1045016.149999998509884;0
2233;-743461.000000000000000;-1045218.000000000000000;0
2262;-742999.000000000000000;-1045686.000000000000000;0
1942;-743283.000000000000000;-1044370.000000000000000;0
4935;-742447.241999998688698;-1042699.399000000208616;0
1918;-743377.000000000000000;-1044428.000000000000000;0
6846;-741505.875000000000000;-1044995.949000000953674;0
1355;-741899.000000000000000;-1044858.000000000000000;0
1950;-743271.000000000000000;-1044490.000000000000000;0
6205;-742314.800000000745058;-1043059.416999999433756;0
4905;-742467.730000000447035;-1042815.620000001043081;0
3989;-743307.815000001341105;-1044034.914999999105930;0
1160;-741114.859999999403954;-1044508.120000001043081;0
6214;-742315.447999998927116;-1043059.026000000536442;0
1873;-743410.000000000000000;-1044260.000000000000000;0
4834;-742972.708000000566244;-1042657.809000000357628;0
4562;-742471.000000000000000;-1042510.920000001788139;0
1437;-741840.000000000000000;-1044336.000000000000000;0
7695;-742479.807000000029802;-1045130.127000000327826;0
5258;-743356.739999998360872;-1043230.039999999105930;0
7121;-743339.839999999850988;-1044620.059999998658895;0
1158;-741152.320000000298023;-1044503.030000001192093;0
1143;-741415.000000000000000;-1044457.000000000000000;0
4835;-742967.660000000149012;-1042677.690000001341105;0
5252;-743283.517000000923872;-1043176.197999998927116;0
4030;-743133.280000001192093;-1043791.552000001072884;0
1657;-741399.000000000000000;-1044717.000000000000000;0
2632;-743260.298999998718500;-1042362.980000000447035;0
1718;-741366.219999998807907;-1044870.989999998360872;0
6266;-742349.021000001579523;-1043019.662999998778105;0
534;-742087.000000000000000;-1043699.000000000000000;0
4609;-742557.414000000804663;-1042621.583999998867512;0
1220;-742147.000000000000000;-1044283.000000000000000;0
4249;-742151.910000000149012;-1043354.719999998807907;0
4055;-743119.070000000298023;-1043694.109999999403954;0
6169;-742312.320000000298023;-1043060.791999999433756;0
5267;-743190.021999999880791;-1043149.807000000029802;0
6308;-741823.129999998956919;-1042770.370000001043081;0
4665;-742824.410000000149012;-1042592.260000001639128;0
6316;-743949.877999998629093;-1042656.561999998986721;0
4160;-742443.074999999254942;-1043885.804999999701977;0
5581;-743409.978999998420477;-1043638.324000000953674;0
1921;-743387.000000000000000;-1044335.000000000000000;0
4525;-742716.719999998807907;-1042823.219999998807907;0
4649;-742732.228999998420477;-1042525.100000001490116;0
759;-741659.000000000000000;-1042650.000000000000000;0
4614;-742493.800000000745058;-1042636.896000001579523;0
201;-743229.000000000000000;-1043614.000000000000000;0
2548;-741672.000000000000000;-1044304.000000000000000;0
4572;-742343.539999999105930;-1042598.289999999105930;0
5684;-743397.274000000208616;-1043719.995999999344349;0
7807;-742647.802999999374151;-1044543.524000000208616;0
6175;-742315.256999999284744;-1043064.660999998450279;0
7087;-743339.940000001341105;-1044536.690000001341105;0
2433;-742514.000000000000000;-1045081.000000000000000;0
6485;-741795.653999999165535;-1044513.458000000566244;0
555;-742230.000000000000000;-1043726.000000000000000;0
2340;-742764.000000000000000;-1045532.000000000000000;0
1096;-741474.000000000000000;-1044566.000000000000000;0
6263;-742365.719000000506639;-1043021.282999999821186;0
4839;-742984.162000000476837;-1042715.425000000745058;0
648;-742246.000000000000000;-1043363.000000000000000;0
4995;-742476.986000001430511;-1042961.239000000059605;0
3181;-743898.234999999403954;-1042567.133000001311302;0
6156;-742314.791999999433756;-1043066.736000001430511;0
5294;-743056.328999999910593;-1043196.096999999135733;0
1287;-742217.000000000000000;-1044486.000000000000000;0
3986;-743313.355000000447035;-1043956.986999999731779;0
549;-742290.000000000000000;-1043770.000000000000000;0
210;-743112.000000000000000;-1043566.000000000000000;0
6143;-742309.690999999642372;-1043060.385000001639128;0
4726;-742863.519999999552965;-1042684.000000000000000;0
4920;-742444.449999999254942;-1042928.980000000447035;0
5645;-743428.886999998241663;-1043692.285999998450279;0
1114;-741151.059999998658895;-1044607.410000000149012;0
5081;-742917.046000000089407;-1043356.515999998897314;0
6276;-742310.815999999642372;-1043016.000999998301268;0
4067;-742913.594999998807907;-1043714.640000000596046;0
350;-742505.000000000000000;-1043757.000000000000000;0
3131;-743940.644999999552965;-1042662.771000001579523;0
827;-742218.000000000000000;-1042626.000000000000000;0
7147;-742827.925000000745058;-1044451.385000001639128;0
4824;-742918.673000000417233;-1042871.875000000000000;0
6244;-742368.587000001221895;-1043059.245999999344349;0
7945;-742063.179999999701977;-1044077.379999998956919;0
6208;-742320.098000001162291;-1043067.458999998867512;0
7351;-742529.339999999850988;-1045181.269999999552965;0
6787;-741242.429999999701977;-1044471.370000001043081;0
4959;-742331.289999999105930;-1043002.690000001341105;0
4592;-742448.190999999642372;-1042642.517999999225140;0
1083;-741667.000000000000000;-1044526.000000000000000;0
4472;-741816.140000000596046;-1042675.499000001698732;0
1216;-742093.000000000000000;-1044333.000000000000000;0
3348;-743960.361000001430511;-1043015.629999998956919;0
6765;-741163.449999999254942;-1044427.199999999254942;0
1294;-742061.000000000000000;-1044478.000000000000000;0
5510;-743424.346000000834465;-1043626.458999998867512;0
1861;-743457.000000000000000;-1044175.000000000000000;0
1156;-741191.980000000447035;-1044497.850000001490116;0
6397;-742033.839999999850988;-1042501.859999999403954;0
3289;-743584.761999998241663;-1042769.188000001013279;0
4798;-743028.991999998688698;-1042693.375000000000000;0
1945;-743270.000000000000000;-1044454.000000000000000;0
1438;-741809.000000000000000;-1044350.000000000000000;0
4974;-742489.458999998867512;-1043047.024999998509884;0
1892;-743525.000000000000000;-1044425.000000000000000;0
517;-742207.000000000000000;-1043117.000000000000000;0
4634;-742635.980000000447035;-1042656.144999999552965;0
4513;-742579.030000001192093;-1042753.609999999403954;0
4733;-742767.890000000596046;-1042671.010000001639128;0
3423;-743731.600000001490116;-1043092.067999999970198;0
632;-742130.000000000000000;-1043287.000000000000000;0
5664;-743420.907000001519918;-1043711.245999999344349;0
7801;-742459.168999999761581;-1044490.660000000149012;0
4221;-742209.576000001281500;-1043499.238000001758337;0
2369;-742503.000000000000000;-1045427.000000000000000;0
6176;-742314.491000000387430;-1043063.256000000983477;0
4738;-742733.910000000149012;-1042704.890000000596046;0
1389;-742281.250000000000000;-1044962.859999999403954;0
4961;-742309.460000000894070;-1043010.730000000447035;0
4087;-742811.609999999403954;-1043604.190000001341105;0
6157;-742314.026999998837709;-1043065.331000000238419;0
4054;-743269.304999999701977;-1043797.405000001192093;0
5656;-743429.752999998629093;-1043705.570000000298023;0
4714;-742856.359999999403954;-1042618.210000000894070;0
2351;-742525.000000000000000;-1045576.000000000000000;0
1943;-743264.000000000000000;-1044421.000000000000000;0
1498;-741382.000000000000000;-1044310.000000000000000;0
6152;-742310.348999999463558;-1043060.046999998390675;0
729;-741986.000000000000000;-1042998.000000000000000;0
6361;-742016.024999998509884;-1042677.243999999016523;0
6167;-742313.859999999403954;-1043063.607000000774860;0
7782;-743012.350000001490116;-1045871.938999999314547;0
4070;-742925.285000000149012;-1043783.565000001341105;0
4522;-742668.079999998211861;-1042813.780000001192093;0
4696;-742682.817000001668930;-1042658.543999999761581;0
6753;-742485.511999998241663;-1044950.206999998539686;0
236;-743459.000000000000000;-1043775.000000000000000;0
5230;-743335.399999998509884;-1043517.670000001788139;0
4232;-742315.057999998331070;-1043428.918999999761581;0
6339;-742245.460000000894070;-1042835.780000001192093;0
2516;-742500.000000000000000;-1044414.000000000000000;0
683;-742362.000000000000000;-1043155.000000000000000;0
5296;-743058.934999998658895;-1043177.035000000149012;0
1271;-742240.000000000000000;-1044521.000000000000000;0
1269;-742246.000000000000000;-1044462.000000000000000;0
5712;-743423.701000001281500;-1043638.675999999046326;0
5461;-742442.704999998211861;-1043234.515000000596046;0
7086;-743333.149999998509884;-1044527.250000000000000;0
2432;-742549.000000000000000;-1045078.000000000000000;0
1613;-742408.000000000000000;-1044428.000000000000000;0
248;-743439.000000000000000;-1043748.000000000000000;0
7318;-742578.910000000149012;-1045033.530000001192093;0
5682;-743399.638000000268221;-1043719.120999999344349;0
1584;-742368.000000000000000;-1044717.000000000000000;0
4170;-742407.245000001043081;-1043945.519999999552965;0
6228;-742319.103999998420477;-1043062.592000000178814;0
5220;-743247.339999999850988;-1043589.050000000745058;0
1731;-741456.000000000000000;-1045017.000000000000000;0
6387;-742159.980000000447035;-1042496.210000000894070;0
2103;-743182.000000000000000;-1044931.000000000000000;0
1855;-742642.000000000000000;-1044286.000000000000000;0
4786;-742953.361000001430511;-1042655.886999998241663;0
6836;-741643.532000001519918;-1044947.486999999731779;0
6703;-742288.903999999165535;-1044591.625999998301268;0
3955;-743412.653000000864267;-1043555.727000001817942;0
6210;-742318.541000001132488;-1043064.662999998778105;0
2328;-742459.000000000000000;-1045505.000000000000000;0
7678;-742388.550999999046326;-1045109.184000000357628;0
4896;-742589.649999998509884;-1042838.989999998360872;0
3807;-743008.690000001341105;-1042928.690000001341105;0
7349;-742516.719999998807907;-1045170.359999999403954;0
6126;-743428.385999999940395;-1043621.800000000745058;0
2345;-742636.000000000000000;-1045561.000000000000000;0
4512;-742515.339999999850988;-1042750.230000000447035;0
6607;-741674.456000000238419;-1043925.333999998867512;0
403;-742307.000000000000000;-1043931.000000000000000;0
5369;-742583.364999998360872;-1042976.820999998599291;0
6242;-742366.677999999374151;-1043062.949000000953674;0
4463;-742198.989999998360872;-1042569.030000001192093;0
1300;-741917.410000000149012;-1044719.769999999552965;0
2271;-742945.000000000000000;-1045771.000000000000000;0
6139;-742312.807000000029802;-1043066.006000000983477;0
6499;-741707.811000000685453;-1044907.068999998271465;0
1456;-741513.000000000000000;-1044437.000000000000000;0
8282;-742183.519999999552965;-1042790.890000000596046;0
1475;-741565.000000000000000;-1044185.000000000000000;0
6186;-742314.337999999523163;-1043061.517000000923872;0
6144;-742308.925000000745058;-1043059.002000000327826;0
6704;-742282.179999999701977;-1044623.793999999761581;0
4632;-742615.638999998569489;-1042624.039999999105930;0
3959;-743417.421999998390675;-1043577.730000000447035;0
7809;-741981.809999998658895;-1044560.280000001192093;0
1129;-741672.000000000000000;-1044438.000000000000000;0
7204;-742561.000000000000000;-1044976.910000000149012;0
5000;-742542.798000000417233;-1042978.486999999731779;0
4246;-742193.159000001847744;-1043412.537000000476837;0
4804;-743020.045000001788139;-1042704.315999999642372;0
5707;-743417.815000001341105;-1043640.510999999940395;0
2275;-742845.000000000000000;-1045719.000000000000000;0
6415;-743180.657999999821186;-1043208.993999999016523;0
515;-742176.000000000000000;-1043121.000000000000000;0
5725;-743422.388000000268221;-1043634.186999998986721;0
222;-742939.000000000000000;-1043526.000000000000000;0
164;-743392.000000000000000;-1043230.000000000000000;0
952;-742274.000000000000000;-1043018.000000000000000;0
4702;-742669.300000000745058;-1042747.399999998509884;0
6249;-742373.554999999701977;-1043049.822000000625849;0
4742;-742822.300000000745058;-1042747.920000001788139;0
3282;-743619.890999998897314;-1042841.907000001519918;0
6251;-742377.396999999880791;-1043042.284000001847744;0
677;-742425.000000000000000;-1043200.000000000000000;0
5140;-743035.789999999105930;-1043514.489999998360872;0
943;-742292.000000000000000;-1043017.000000000000000;0
3958;-743416.328000001609325;-1043572.265999998897314;0
4793;-743035.089999999850988;-1042650.028000000864267;0
