OID_;X;Y;TEMPERATURE
3614;-744984.548999998718500;-1042283.640999998897314;0
110;-744127.000000000000000;-1042724.000000000000000;3
3019;-744463.447999998927116;-1042784.646000001579523;0
3568;-744718.817999999970198;-1042588.614999998360872;0
3692;-744525.876499999314547;-1042540.534000001847744;0
3580;-744924.973999999463558;-1042593.699999999254942;0
2605;-745393.842999998480082;-1042860.796000000089407;0
5975;-745052.346999999135733;-1042674.673000000417233;0
118;-745135.000000000000000;-1042687.000000000000000;0
3542;-744575.274000000208616;-1042656.160000000149012;0
2696;-743477.489999998360872;-1042038.000000000000000;0
2520;-741847.000000000000000;-1045324.000000000000000;0
6946;-742974.765000000596046;-1043929.388000000268221;0
6874;-741789.789999999105930;-1045272.100000001490116;0
696;-742077.000000000000000;-1042913.000000000000000;0
7259;-742935.280000001192093;-1044869.829999998211861;0
7246;-742736.730000000447035;-1044825.399999998509884;0
1524;-741710.000000000000000;-1043844.000000000000000;0
7;-743479.000000000000000;-1042567.000000000000000;0
2009;-743221.000000000000000;-1044770.000000000000000;0
2070;-742993.000000000000000;-1044723.000000000000000;0
2021;-743281.000000000000000;-1044948.000000000000000;0
7411;-743529.510000001639128;-1045393.140000000596046;0
1449;-741533.000000000000000;-1044684.000000000000000;0
284;-743022.000000000000000;-1043758.000000000000000;0
1521;-741808.000000000000000;-1043917.000000000000000;0
2276;-742865.000000000000000;-1045649.000000000000000;0
1816;-743070.000000000000000;-1044444.000000000000000;0
2748;-743933.984000001102686;-1043445.734000001102686;0
2007;-743231.000000000000000;-1044741.000000000000000;0
7046;-743398.329999998211861;-1044186.289999999105930;0
930;-744068.000000000000000;-1043405.000000000000000;0
5436;-744076.484000001102686;-1043296.519999999552965;0
3921;-743909.208999998867512;-1043541.574000000953674;0
3066;-744075.627000000327826;-1042883.837000001221895;0
3752;-743213.949999999254942;-1042902.719999998807907;0
709;-741861.000000000000000;-1042862.000000000000000;0
6448;-744017.179999999701977;-1043123.899999998509884;0
725;-741983.000000000000000;-1042939.000000000000000;0
3811;-743244.620000001043081;-1042809.420000001788139;0
3111;-743727.034000001847744;-1042625.182999998331070;0
8282;-742183.519999999552965;-1042790.890000000596046;0
7188;-742583.839999999850988;-1044742.870000001043081;0
2263;-742989.000000000000000;-1045714.000000000000000;0
7779;-743059.598999999463558;-1045828.806000001728535;0
1764;-741163.000000000000000;-1044144.000000000000000;0
5065;-742796.800999999046326;-1043254.010000001639128;0
2293;-742786.000000000000000;-1045387.000000000000000;0
2149;-742819.000000000000000;-1045024.000000000000000;0
3393;-743910.969999998807907;-1043143.960000000894070;0
7706;-742313.239999998360872;-1044319.611999999731779;0
1369;-742029.000000000000000;-1044788.000000000000000;0
4333;-742428.420000001788139;-1043255.609999999403954;0
4239;-742454.206000000238419;-1043538.927999999374151;0
1775;-741246.000000000000000;-1044012.000000000000000;0
1012;-742060.000000000000000;-1044582.000000000000000;0
3211;-743651.409000001847744;-1042483.458999998867512;0
4156;-742513.734999999403954;-1043978.035000000149012;0
1415;-741623.000000000000000;-1044561.000000000000000;0
3269;-743600.679000001400709;-1042731.660000000149012;0
3274;-743652.714999999850988;-1042812.727000001817942;0
6;-743464.000000000000000;-1042594.000000000000000;0
4153;-742555.934999998658895;-1044073.285000000149012;0
2132;-743058.000000000000000;-1045118.000000000000000;0
6675;-742272.140000000596046;-1044167.469999998807907;0
3216;-743615.890999998897314;-1042451.129999998956919;0
524;-742255.000000000000000;-1043913.000000000000000;0
5121;-742889.114000000059605;-1043362.250000000000000;0
2043;-743471.000000000000000;-1044959.000000000000000;0
7152;-742867.331999998539686;-1044547.015999998897314;0
7516;-742248.390000000596046;-1044368.907999999821186;0
7284;-742811.789999999105930;-1044718.210000000894070;0
2512;-743070.000000000000000;-1044052.000000000000000;0
6791;-741047.329999998211861;-1044765.467999998480082;0
2211;-743248.000000000000000;-1045258.000000000000000;0
6721;-742321.052999999374151;-1044705.548000000417233;0
8077;-742038.989999998360872;-1045265.309999998658895;0
1587;-742372.000000000000000;-1044806.000000000000000;0
2398;-742150.000000000000000;-1045370.000000000000000;0
7829;-743509.649999998509884;-1045166.399999998509884;0
825;-742171.000000000000000;-1042598.000000000000000;0
1038;-741956.000000000000000;-1044977.000000000000000;0
1476;-741531.000000000000000;-1044196.000000000000000;0
345;-742559.000000000000000;-1043826.000000000000000;0
381;-742465.000000000000000;-1043700.000000000000000;0
5058;-742837.528999999165535;-1043170.686000000685453;0
2242;-743321.000000000000000;-1045313.000000000000000;0
6821;-741256.649999998509884;-1044796.100000001490116;0
8056;-742242.379999998956919;-1045023.460000000894070;0
3759;-743267.609999999403954;-1042971.300000000745058;0
2384;-742191.000000000000000;-1045494.000000000000000;0
7002;-743079.250000000000000;-1044377.170000001788139;0
6833;-741571.423000000417233;-1044909.473999999463558;0
527;-742186.000000000000000;-1043818.000000000000000;0
5307;-743082.182000000029802;-1043190.162000000476837;0
7146;-742819.425000000745058;-1044426.225000001490116;0
730;-741948.000000000000000;-1042998.000000000000000;0
2061;-742681.000000000000000;-1044491.000000000000000;0
543;-742361.000000000000000;-1043823.000000000000000;0
301;-742613.000000000000000;-1043903.000000000000000;0
5303;-743164.818999998271465;-1043211.078000001609325;0
1984;-743476.000000000000000;-1044743.000000000000000;0
5128;-743040.467000000178814;-1043389.765999998897314;0
2051;-743434.000000000000000;-1045074.000000000000000;0
5107;-742857.611999999731779;-1043458.278000000864267;0
4089;-742812.844999998807907;-1043560.114999998360872;0
4330;-742377.440999999642372;-1043332.162999998778105;0
2154;-742805.000000000000000;-1045147.000000000000000;0
1990;-743482.000000000000000;-1044906.000000000000000;0
465;-741728.000000000000000;-1043309.000000000000000;0
1703;-741320.000000000000000;-1044686.000000000000000;0
6726;-742476.517999999225140;-1044410.600000001490116;0
1666;-741017.000000000000000;-1044315.000000000000000;0
400;-742356.000000000000000;-1043931.000000000000000;0
1849;-742732.000000000000000;-1044228.000000000000000;0
4214;-742229.274999998509884;-1043511.745000001043081;0
7732;-742611.719000000506639;-1044632.203999999910593;0
8071;-742174.120000001043081;-1045257.530000001192093;0
6923;-742061.469999998807907;-1045089.760000001639128;0
1629;-742450.000000000000000;-1044518.000000000000000;0
2104;-743176.000000000000000;-1044964.000000000000000;0
1821;-742995.000000000000000;-1044239.000000000000000;0
6993;-743172.409000001847744;-1044501.339000001549721;0
4124;-742751.265000000596046;-1043878.414999999105930;0
2515;-742517.000000000000000;-1044420.000000000000000;0
3847;-743122.146999999880791;-1042525.489999998360872;0
2084;-742447.000000000000000;-1044797.000000000000000;0
1166;-741020.000000000000000;-1044520.000000000000000;0
3412;-743772.947000000625849;-1043053.557999998331070;0
1426;-742056.000000000000000;-1044228.000000000000000;0
6837;-741677.875999998301268;-1044964.791999999433756;0
7650;-742315.337000001221895;-1045462.039999999105930;0
1969;-743376.000000000000000;-1044829.000000000000000;0
316;-742490.000000000000000;-1044202.000000000000000;0
7658;-742333.647999998182058;-1045313.331999998539686;0
3767;-743033.910000000149012;-1042982.390000000596046;0
7107;-743425.260000001639128;-1044646.199999999254942;0
3297;-743706.958999998867512;-1042868.114999998360872;0
500;-741861.000000000000000;-1043174.000000000000000;0
738;-741818.000000000000000;-1043024.000000000000000;0
1540;-742005.000000000000000;-1044009.000000000000000;0
1343;-741714.000000000000000;-1044765.000000000000000;0
1170;-741893.000000000000000;-1044403.000000000000000;0
560;-742181.000000000000000;-1043665.000000000000000;0
1601;-742452.000000000000000;-1044939.000000000000000;29
8285;-742232.780000001192093;-1042821.149999998509884;0
7212;-742559.410000000149012;-1045073.070000000298023;0
2138;-742958.000000000000000;-1045095.000000000000000;0
4047;-743210.230000000447035;-1043992.289999999105930;0
3366;-743913.831000000238419;-1043002.796999998390675;0
276;-743382.000000000000000;-1043905.000000000000000;0
819;-741987.000000000000000;-1042599.000000000000000;0
554;-742238.000000000000000;-1043717.000000000000000;0
2217;-743112.000000000000000;-1045360.000000000000000;0
4555;-742337.140000000596046;-1042512.379999998956919;0
325;-742700.000000000000000;-1044114.000000000000000;0
1720;-741436.000000000000000;-1044862.000000000000000;0
1286;-742221.460000000894070;-1044465.969999998807907;0
6505;-741746.570000000298023;-1044600.429999999701977;0
2314;-742884.000000000000000;-1045456.000000000000000;0
2250;-743234.000000000000000;-1045435.000000000000000;0
5325;-742997.480000000447035;-1043042.289999999105930;0
5295;-743047.995000001043081;-1043185.530000001192093;0
6710;-742260.203000001609325;-1044803.609999999403954;0
7350;-742556.390000000596046;-1045185.980000000447035;0
1265;-742047.000000000000000;-1044960.000000000000000;0
786;-741706.000000000000000;-1042606.000000000000000;0
5208;-743237.954999998211861;-1043368.065999999642372;0
1441;-741744.000000000000000;-1044392.000000000000000;0
532;-742114.000000000000000;-1043737.000000000000000;0
2172;-742886.000000000000000;-1045182.000000000000000;0
1982;-743408.000000000000000;-1044646.000000000000000;0
1042;-741883.000000000000000;-1044682.000000000000000;0
1619;-742426.000000000000000;-1044401.000000000000000;0
1089;-741567.949999999254942;-1044538.820000000298023;0
4184;-742311.379999998956919;-1044164.660000000149012;0
744;-741666.000000000000000;-1042994.000000000000000;0
1654;-741387.000000000000000;-1044621.000000000000000;0
7018;-742577.747000001370907;-1044239.712999999523163;0
878;-741947.000000000000000;-1042573.000000000000000;0
3311;-743816.037999998778105;-1042845.728999998420477;0
3834;-743079.190000001341105;-1042579.899999998509884;0
1040;-741904.000000000000000;-1044623.000000000000000;0
1500;-741441.000000000000000;-1044299.000000000000000;0
4961;-742309.460000000894070;-1043010.730000000447035;0
4500;-742315.239999998360872;-1042719.460000000894070;0
1909;-743446.000000000000000;-1044375.000000000000000;0
1935;-743276.000000000000000;-1044289.000000000000000;0
8046;-742169.109999999403954;-1044835.660000000149012;0
6789;-741187.510000001639128;-1044470.660000000149012;0
1000;-741828.000000000000000;-1044502.000000000000000;0
8150;-743304.219999998807907;-1043217.539999999105930;0
4145;-742687.109999999403954;-1043837.125000000000000;0
1423;-742167.000000000000000;-1044150.000000000000000;0
1149;-741311.000000000000000;-1044471.000000000000000;0
5958;-742962.513999998569489;-1043517.497999999672174;0
7010;-742857.964999999850988;-1044251.155000001192093;4
5251;-743317.296000000089407;-1043180.037999998778105;0
4138;-742883.587000001221895;-1043997.287999998778105;0
4131;-742844.625000000000000;-1044059.980000000447035;0
6013;-743372.780000001192093;-1043377.921999998390675;0
2359;-742348.000000000000000;-1045581.000000000000000;0
683;-742362.000000000000000;-1043155.000000000000000;0
1955;-743374.000000000000000;-1044515.000000000000000;0
4310;-742031.800000000745058;-1043475.199999999254942;0
4211;-742193.190000001341105;-1043565.660000000149012;0
7958;-741664.710000000894070;-1044289.879999998956919;0
6838;-741701.057999998331070;-1044977.087000001221895;0
509;-741991.000000000000000;-1043143.000000000000000;0
4053;-743260.039999999105930;-1043823.480000000447035;0
1252;-742096.000000000000000;-1044711.000000000000000;0
2885;-744122.791999999433756;-1043190.208000000566244;0
1648;-741373.000000000000000;-1044431.000000000000000;0
5134;-742995.984000001102686;-1043497.364000000059605;0
1291;-742205.000000000000000;-1044568.000000000000000;0
7388;-743052.050000000745058;-1045513.859999999403954;0
4086;-742813.079999998211861;-1043631.730000000447035;0
1557;-741193.000000000000000;-1044306.000000000000000;0
1448;-741537.000000000000000;-1044716.000000000000000;0
2322;-742651.000000000000000;-1045483.000000000000000;0
6961;-743023.579999998211861;-1044221.129999998956919;0
1189;-741786.000000000000000;-1044043.000000000000000;0
7164;-742596.114999998360872;-1044447.173000000417233;0
1047;-741816.000000000000000;-1044867.000000000000000;0
6655;-741614.039999999105930;-1044145.320000000298023;0
4325;-742270.679000001400709;-1043141.787999998778105;0
5157;-743178.671999998390675;-1043354.681000001728535;0
4613;-742506.557000000029802;-1042597.938000001013279;0
875;-741783.000000000000000;-1042677.000000000000000;0
6701;-742295.142000000923872;-1044533.372000001370907;0
207;-743142.000000000000000;-1043590.000000000000000;0
4035;-743274.690000001341105;-1043779.739999998360872;0
4474;-741831.079999998211861;-1042685.068999998271465;0
1238;-742150.000000000000000;-1044384.000000000000000;0
4989;-742648.756000000983477;-1043019.318999998271465;0
4083;-742820.771999999880791;-1043708.657000001519918;0
4874;-742795.429999999701977;-1042925.910000000149012;0
4120;-742715.179999999701977;-1043974.089999999850988;0
2326;-742523.000000000000000;-1045498.000000000000000;0
516;-742160.000000000000000;-1043135.000000000000000;0
7744;-742941.256999999284744;-1045533.171000000089407;0
3842;-743141.300000000745058;-1042637.030000001192093;0
4895;-742596.936999998986721;-1042829.168000001460314;0
7203;-742571.300000000745058;-1044963.219999998807907;0
2505;-742762.000000000000000;-1045562.000000000000000;0
3169;-743932.120000001043081;-1042582.179999999701977;0
4257;-742056.467000000178814;-1043503.657999999821186;0
4029;-743130.695999998599291;-1043815.427999999374151;0
91;-744044.000000000000000;-1043053.000000000000000;0
609;-741984.000000000000000;-1043272.000000000000000;0
7142;-742872.445000000298023;-1044472.239999998360872;0
6569;-741287.850000001490116;-1044136.660000000149012;0
3370;-743858.489999998360872;-1043011.370999999344349;0
5674;-743409.089999999850988;-1043715.618000000715256;0
5685;-743396.092999998480082;-1043720.434000000357628;0
4623;-742533.778999999165535;-1042585.824000000953674;0
5113;-742946.795000001788139;-1043444.427999999374151;0
4901;-742520.120000001043081;-1042823.960000000894070;0
1226;-742204.000000000000000;-1044247.000000000000000;0
2536;-742003.000000000000000;-1044113.000000000000000;0
4565;-742462.576999999582767;-1042533.901999998837709;0
4966;-742377.289999999105930;-1043071.030000001192093;0
5242;-743357.030000001192093;-1043419.239999998360872;0
2479;-741247.800000000745058;-1044609.379999998956919;0
4766;-742803.037999998778105;-1042842.532999999821186;0
4227;-742108.530000001192093;-1043326.289999999105930;0
6182;-742317.399000000208616;-1043067.136999998241663;0
4320;-742264.149000000208616;-1043259.541999999433756;0
600;-741840.000000000000000;-1043212.000000000000000;0
2372;-742466.000000000000000;-1045488.000000000000000;0
6809;-741079.942999999970198;-1044626.942000001668930;0
1727;-741495.000000000000000;-1045103.000000000000000;0
1780;-741214.000000000000000;-1043934.000000000000000;0
7742;-741703.945999998599291;-1045067.738000001758337;0
385;-742436.000000000000000;-1043742.000000000000000;0
1334;-741769.000000000000000;-1044799.000000000000000;0
3788;-743134.440000001341105;-1042956.210000000894070;0
3869;-742407.539999999105930;-1042414.850000001490116;0
1179;-741934.000000000000000;-1044251.000000000000000;0
4146;-742666.940000001341105;-1043854.829999998211861;0
1542;-742043.000000000000000;-1044057.000000000000000;0
6119;-743582.679999999701977;-1042696.969999998807907;0
4074;-742943.350000001490116;-1043880.304999999701977;0
592;-741913.000000000000000;-1043311.000000000000000;0
1387;-742155.000000000000000;-1044999.000000000000000;0
1537;-741924.000000000000000;-1043954.000000000000000;0
4674;-742806.475999999791384;-1042703.594999998807907;0
307;-742781.000000000000000;-1044143.000000000000000;0
5221;-743263.820000000298023;-1043556.920000001788139;0
6357;-741947.870000001043081;-1042701.129999998956919;0
2501;-742746.000000000000000;-1045430.000000000000000;0
893;-742956.000000000000000;-1042572.000000000000000;0
4661;-742816.708000000566244;-1042503.918999999761581;0
7025;-743199.914999999105930;-1044070.515000000596046;0
1187;-741805.000000000000000;-1044071.000000000000000;0
3093;-743925.421999998390675;-1042803.127000000327826;12
4693;-742691.399999998509884;-1042612.399999998509884;0
6253;-742378.725000001490116;-1043039.690000001341105;0
611;-742037.000000000000000;-1043267.000000000000000;0
4059;-743142.649999998509884;-1043612.730000000447035;0
6145;-742315.708000000566244;-1043069.881999999284744;0
4340;-742473.662000000476837;-1043349.048999998718500;0
650;-742263.000000000000000;-1043381.000000000000000;0
5659;-743426.815000001341105;-1043709.059000000357628;0
2423;-742482.000000000000000;-1045106.000000000000000;0
1400;-741719.000000000000000;-1044132.000000000000000;0
4801;-742998.943999998271465;-1042721.118000000715256;0
4770;-742872.535000000149012;-1042899.679000001400709;0
8258;-742053.760000001639128;-1042683.769999999552965;0
1402;-741699.000000000000000;-1044419.000000000000000;0
5736;-743414.859999999403954;-1043691.462999999523163;0
628;-742217.370000001043081;-1043308.559999998658895;0
6769;-741281.120000001043081;-1044417.780000001192093;0
4039;-743159.070000000298023;-1043772.795000001788139;0
3963;-743372.780000001192093;-1043538.789999999105930;0
7158;-742984.796999998390675;-1044545.407999999821186;11
6003;-742038.201000001281500;-1043299.010999999940395;0
6252;-742378.052000001072884;-1043040.958000000566244;0
2559;-741323.000000000000000;-1044399.000000000000000;0
1594;-742304.000000000000000;-1044977.000000000000000;0
576;-742054.000000000000000;-1043517.000000000000000;0
2430;-742493.000000000000000;-1045120.000000000000000;0
1731;-741456.000000000000000;-1045017.000000000000000;0
5420;-742442.920000001788139;-1042740.519999999552965;0
4658;-742804.655000001192093;-1042456.622000001370907;0
4225;-742115.607999999076128;-1043452.125000000000000;0
296;-742950.170000001788139;-1044097.429999999701977;0
6232;-742316.034000001847744;-1043057.000000000000000;0
1378;-742161.000000000000000;-1044904.000000000000000;0
7031;-743301.824999999254942;-1044080.774999998509884;0
757;-741673.000000000000000;-1042678.000000000000000;0
1091;-741531.480000000447035;-1044543.440000001341105;0
4710;-742796.730000000447035;-1042611.769999999552965;0
3793;-743101.820000000298023;-1042826.379999998956919;0
4814;-743000.489999998360872;-1042803.920000001788139;0
6293;-742666.339999999850988;-1042695.188999999314547;0
4429;-742222.260000001639128;-1043102.250000000000000;0
6257;-742381.556000001728535;-1043033.991000000387430;0
4947;-742399.918000001460314;-1042993.458000000566244;0
884;-741771.000000000000000;-1042776.000000000000000;0
1923;-743395.000000000000000;-1044274.000000000000000;0
3988;-743309.704999998211861;-1044008.570000000298023;0
2487;-742101.000000000000000;-1044308.000000000000000;0
4728;-742862.960000000894070;-1042727.210000000894070;0
5720;-743418.223000001162291;-1043629.960999999195337;0
7316;-742603.460000000894070;-1045033.969999998807907;0
6144;-742308.925000000745058;-1043059.002000000327826;0
5197;-743222.513000000268221;-1043313.989999998360872;0
6272;-742325.379000000655651;-1043017.383000001311302;0
4520;-742651.079999998211861;-1042798.449999999254942;0
2543;-741788.000000000000000;-1044237.000000000000000;0
6189;-742312.041999999433756;-1043057.302000001072884;0
522;-742261.000000000000000;-1043122.000000000000000;0
4773;-742888.429000001400709;-1042839.530000001192093;0
3144;-744012.590999998152256;-1042662.508000001311302;0
5955;-742960.732999999076128;-1043520.888999998569489;0
1550;-741356.000000000000000;-1044363.000000000000000;0
3803;-743066.289999999105930;-1042896.320000000298023;0
5692;-743415.782999999821186;-1043638.765000000596046;0
6720;-742286.954999998211861;-1044705.997999999672174;0
4758;-742854.840999998152256;-1042811.914000000804663;0
8018;-741974.039999999105930;-1044442.870000001043081;0
261;-743429.000000000000000;-1043723.000000000000000;0
5767;-742424.269999999552965;-1042581.609000001102686;0
2186;-743184.000000000000000;-1045146.000000000000000;0
6852;-741571.519999999552965;-1045065.932999998331070;0
4002;-743397.818999998271465;-1044054.317999999970198;0
5459;-742368.519000001251698;-1043474.221999999135733;0
8278;-742119.929999999701977;-1042758.710000000894070;0
1813;-743118.000000000000000;-1044528.000000000000000;0
5711;-743422.837999999523163;-1043640.131000000983477;0
1875;-743367.000000000000000;-1044261.000000000000000;0
5227;-743318.199999999254942;-1043537.510000001639128;0
6819;-741194.784000001847744;-1044802.818999998271465;0
6216;-742313.892000000923872;-1043056.272999998182058;0
544;-742343.910000000149012;-1043796.500000000000000;0
4425;-742208.820000000298023;-1043035.230000000447035;0
1408;-741647.000000000000000;-1044201.000000000000000;0
3794;-743091.015000000596046;-1042800.471999999135733;0
5599;-743411.622999999672174;-1043680.499000001698732;0
3830;-743013.879999998956919;-1042612.359999999403954;0
6157;-742314.026999998837709;-1043065.331000000238419;0
5653;-743429.589999999850988;-1043701.940999999642372;0
6369;-741962.675000000745058;-1042665.013999998569489;0
2408;-742369.000000000000000;-1045125.000000000000000;0
943;-742292.000000000000000;-1043017.000000000000000;0
4734;-742762.920000001788139;-1042698.820000000298023;0
5665;-743419.725000001490116;-1043711.682000000029802;0
4948;-742386.929999999701977;-1042992.239999998360872;0
4241;-742225.929999999701977;-1043394.530000001192093;0
3993;-743345.100000001490116;-1043930.980000000447035;0
3766;-743053.532999999821186;-1042996.631000000983477;0
6829;-741498.170000001788139;-1044764.809999998658895;0
8062;-742311.170000001788139;-1045127.960000000894070;0
4963;-742396.510000001639128;-1043031.829999998211861;0
4726;-742863.519999999552965;-1042684.000000000000000;0
5509;-743425.144999999552965;-1043637.853000000119209;0
846;-742175.000000000000000;-1042517.000000000000000;0
513;-742083.000000000000000;-1043145.000000000000000;0
5715;-743423.747000001370907;-1043633.157999999821186;0
4619;-742460.010000001639128;-1042480.890000000596046;0
3155;-743969.353000000119209;-1042568.828000001609325;0
4838;-742981.304999999701977;-1042697.471000000834465;0
1244;-742127.000000000000000;-1044527.000000000000000;0
6180;-742311.429000001400709;-1043057.635999999940395;0
5504;-743428.977000001817942;-1043686.274000000208616;0
4032;-743136.934999998658895;-1043750.375000000000000;0
2422;-742473.000000000000000;-1045096.000000000000000;0
785;-741702.000000000000000;-1042622.000000000000000;0
876;-741953.000000000000000;-1042636.000000000000000;0
6135;-742308.289000000804663;-1043059.340999998152256;0
4975;-742477.829999998211861;-1043016.923000000417233;0
4589;-742408.243000000715256;-1042542.631999999284744;0
3312;-743789.184999998658895;-1042904.234000001102686;0
3960;-743418.563000001013279;-1043583.526000000536442;0
1677;-741109.160000000149012;-1044522.699999999254942;0
2547;-741724.000000000000000;-1044282.000000000000000;0
1347;-741791.000000000000000;-1044816.000000000000000;0
2483;-741266.219999998807907;-1044755.030000001192093;0
4740;-742757.410000000149012;-1042715.589999999850988;0
6691;-742386.879000000655651;-1045082.589000001549721;0
5595;-743416.488000001758337;-1043680.118999999016523;0
1137;-741538.000000000000000;-1044442.000000000000000;0
3848;-743094.383999999612570;-1042505.245000001043081;0
6127;-742314.456000000238419;-1043070.548999998718500;0
1548;-742220.000000000000000;-1044216.000000000000000;0
6184;-742315.868999999016523;-1043064.326999999582767;0
4702;-742669.300000000745058;-1042747.399999998509884;0
6258;-742382.381999999284744;-1043032.370999999344349;0
2328;-742459.000000000000000;-1045505.000000000000000;0
6229;-742318.326000001281500;-1043061.204999998211861;0
4082;-742825.565000001341105;-1043737.364999998360872;0
6354;-741928.410000000149012;-1042711.350000001490116;0
690;-742306.000000000000000;-1043081.000000000000000;0
7215;-742484.320000000298023;-1044546.620000001043081;0
4071;-742929.394999999552965;-1043807.585000000894070;0
4956;-742383.579999998211861;-1043007.739999998360872;0
180;-743414.000000000000000;-1043320.000000000000000;0
3451;-743684.017000000923872;-1042986.991000000387430;0
5462;-742498.728999998420477;-1042986.947000000625849;0
4197;-742179.633999999612570;-1043776.899000000208616;0
4904;-742460.050000000745058;-1042796.739999998360872;0
3981;-743341.517000000923872;-1043837.353999998420477;0
4063;-742855.079999998211861;-1043654.695000000298023;0
4563;-742461.379999998956919;-1042526.230000000447035;0
7207;-742570.620000001043081;-1045016.149999998509884;0
2233;-743461.000000000000000;-1045218.000000000000000;0
6305;-741836.559999998658895;-1042745.190000001341105;0
4819;-742941.910000000149012;-1042776.670000001788139;0
6183;-742316.633999999612570;-1043065.732000000774860;0
2262;-742999.000000000000000;-1045686.000000000000000;0
1942;-743283.000000000000000;-1044370.000000000000000;0
4601;-742631.969999998807907;-1042675.629999998956919;0
688;-742284.000000000000000;-1043125.000000000000000;0
1811;-743175.000000000000000;-1044525.000000000000000;0
1090;-741581.000000000000000;-1044552.000000000000000;0
6704;-742282.179999999701977;-1044623.793999999761581;0
5591;-743421.353999998420477;-1043679.738000001758337;0
4935;-742447.241999998688698;-1042699.399000000208616;0
7144;-742803.668999999761581;-1044378.798999998718500;0
5680;-743402.000000000000000;-1043718.245000001043081;0
4505;-742434.910000000149012;-1042706.170000001788139;0
4634;-742635.980000000447035;-1042656.144999999552965;0
2546;-741750.000000000000000;-1044271.000000000000000;0
6156;-742314.791999999433756;-1043066.736000001430511;0
2052;-743403.000000000000000;-1045075.000000000000000;0
1918;-743377.000000000000000;-1044428.000000000000000;0
6846;-741505.875000000000000;-1044995.949000000953674;0
6193;-742316.486000001430511;-1043063.991000000387430;0
1355;-741899.000000000000000;-1044858.000000000000000;0
843;-742085.000000000000000;-1042507.000000000000000;0
679;-742404.000000000000000;-1043185.000000000000000;0
1950;-743271.000000000000000;-1044490.000000000000000;0
7170;-742667.579999998211861;-1044492.469999998807907;0
4738;-742733.910000000149012;-1042704.890000000596046;0
6205;-742314.800000000745058;-1043059.416999999433756;0
4691;-742693.760000001639128;-1042596.969999998807907;0
4969;-742465.059999998658895;-1043095.034000001847744;0
2330;-742403.000000000000000;-1045511.000000000000000;0
4201;-742269.000000000000000;-1043651.563000001013279;0
5026;-742631.168999999761581;-1042903.938999999314547;0
1245;-742114.000000000000000;-1044548.000000000000000;0
4229;-742146.929000001400709;-1043334.585000000894070;0
4905;-742467.730000000447035;-1042815.620000001043081;0
3989;-743307.815000001341105;-1044034.914999999105930;0
5229;-743327.379999998956919;-1043528.620000001043081;0
7961;-741602.260000001639128;-1044314.350000001490116;0
1160;-741114.859999999403954;-1044508.120000001043081;0
6133;-742309.820000000298023;-1043062.171999998390675;0
6214;-742315.447999998927116;-1043059.026000000536442;0
1123;-741734.000000000000000;-1044442.000000000000000;0
1030;-741975.000000000000000;-1044753.000000000000000;0
283;-743026.000000000000000;-1043788.000000000000000;0
6147;-742314.177000001072884;-1043067.070999998599291;0
7649;-742319.399999998509884;-1045429.557000000029802;0
5020;-742572.699999999254942;-1042891.372999999672174;0
280;-743053.000000000000000;-1043875.000000000000000;0
4466;-742177.620000001043081;-1042567.899999998509884;0
1873;-743410.000000000000000;-1044260.000000000000000;0
6240;-742364.495999999344349;-1043067.289999999105930;0
