OID_;X;Y;TEMPERATURE
110;-744127.000000000000000;-1042724.000000000000000;0
7;-743479.000000000000000;-1042567.000000000000000;0
3064;-744117.098999999463558;-1042868.348999999463558;0
5788;-743488.300000000745058;-1042088.320000000298023;0
7077;-743564.359000001102686;-1045385.210000000894070;0
2322;-742651.000000000000000;-1045483.000000000000000;0
3209;-743668.293999999761581;-1042492.478999998420477;0
5995;-744441.440999999642372;-1042779.568999998271465;0
2241;-743319.000000000000000;-1045289.000000000000000;0
8;-743496.000000000000000;-1042539.000000000000000;0
3613;-744986.447999998927116;-1042275.537999998778105;0
7261;-742970.839999999850988;-1044878.739999998360872;0
502;-741901.000000000000000;-1043169.000000000000000;0
1693;-741613.000000000000000;-1044649.000000000000000;0
4826;-743043.850000001490116;-1042979.600000001490116;0
2255;-743181.000000000000000;-1045372.000000000000000;0
1382;-742096.000000000000000;-1045023.000000000000000;0
3782;-743285.429999999701977;-1042842.460000000894070;0
3306;-743787.127999998629093;-1042847.872999999672174;0
3289;-743584.761999998241663;-1042769.188000001013279;0
283;-743026.000000000000000;-1043788.000000000000000;0
1531;-741782.000000000000000;-1043838.000000000000000;0
4080;-742832.480000000447035;-1043782.030000001192093;0
1573;-742358.000000000000000;-1044452.000000000000000;0
3537;-744632.945000000298023;-1042671.657000001519918;0
80;-744067.000000000000000;-1043330.000000000000000;0
1187;-741805.000000000000000;-1044071.000000000000000;0
3531;-744733.070999998599291;-1042679.260000001639128;0
2026;-743351.000000000000000;-1045022.000000000000000;0
2149;-742819.000000000000000;-1045024.000000000000000;0
2506;-741267.000000000000000;-1044015.000000000000000;0
872;-741698.000000000000000;-1042669.000000000000000;0
575;-742053.000000000000000;-1043541.000000000000000;0
696;-742077.000000000000000;-1042913.000000000000000;0
3585;-744920.065000001341105;-1042522.129999998956919;0
1253;-742084.000000000000000;-1044730.000000000000000;0
7214;-742470.679999999701977;-1044531.269999999552965;51
4070;-742925.285000000149012;-1043783.565000001341105;3
2520;-741847.000000000000000;-1045324.000000000000000;0
2886;-744104.953999999910593;-1043172.171999998390675;0
728;-741997.000000000000000;-1042918.000000000000000;0
4237;-742425.385000001639128;-1043517.421000000089407;0
2894;-743960.129000000655651;-1043216.409000001847744;0
4459;-742274.829999998211861;-1042644.269999999552965;0
7006;-742995.760000001639128;-1043976.245000001043081;0
1614;-742388.000000000000000;-1044432.000000000000000;0
6825;-741380.010000001639128;-1044780.089999999850988;0
733;-741963.000000000000000;-1043018.000000000000000;0
531;-742157.000000000000000;-1043778.000000000000000;0
5456;-742761.041000001132488;-1043254.350999999791384;0
2082;-742569.000000000000000;-1044642.000000000000000;0
224;-742904.000000000000000;-1043522.000000000000000;0
2161;-742876.000000000000000;-1045153.000000000000000;0
6946;-742974.765000000596046;-1043929.388000000268221;0
7046;-743398.329999998211861;-1044186.289999999105930;0
4041;-743227.600000001490116;-1043746.495000001043081;0
383;-742450.000000000000000;-1043722.000000000000000;0
2370;-742460.000000000000000;-1045433.000000000000000;0
8281;-742164.160000000149012;-1042778.140000000596046;0
5441;-743196.690000001341105;-1043289.765000000596046;0
5113;-742946.795000001788139;-1043444.427999999374151;0
510;-742048.000000000000000;-1043150.000000000000000;0
7955;-741807.699999999254942;-1044246.519999999552965;0
1760;-741162.000000000000000;-1044101.000000000000000;0
823;-742110.000000000000000;-1042596.000000000000000;0
6355;-741920.949999999254942;-1042700.510000001639128;0
3982;-743325.135000001639128;-1043857.684999998658895;0
2516;-742500.000000000000000;-1044414.000000000000000;0
1810;-743136.000000000000000;-1044544.000000000000000;0
1924;-743359.000000000000000;-1044320.000000000000000;0
2133;-743040.000000000000000;-1045127.000000000000000;0
1431;-741926.000000000000000;-1044313.000000000000000;129
2433;-742514.000000000000000;-1045081.000000000000000;0
6722;-742357.717000000178814;-1044705.708000000566244;0
1425;-742080.000000000000000;-1044210.000000000000000;0
274;-743359.000000000000000;-1043833.000000000000000;0
708;-741854.000000000000000;-1042881.000000000000000;0
7721;-742941.157000001519918;-1044215.368000000715256;0
4141;-742804.644999999552965;-1044008.964999999850988;0
1587;-742372.000000000000000;-1044806.000000000000000;0
884;-741771.000000000000000;-1042776.000000000000000;0
2502;-742750.000000000000000;-1045457.000000000000000;0
7735;-742196.594999998807907;-1045243.149999998509884;0
6316;-743949.877999998629093;-1042656.561999998986721;0
7781;-743030.026999998837709;-1045857.486000001430511;0
1325;-741894.000000000000000;-1044959.000000000000000;0
1020;-742293.000000000000000;-1044615.000000000000000;0
5923;-742953.765000000596046;-1043015.067999999970198;0
6692;-742222.114999998360872;-1044818.673000000417233;0
1015;-742126.000000000000000;-1044599.000000000000000;0
6753;-742485.511999998241663;-1044950.206999998539686;0
4691;-742693.760000001639128;-1042596.969999998807907;0
3322;-743927.326000001281500;-1042934.425999999046326;0
4086;-742813.079999998211861;-1043631.730000000447035;0
7140;-742921.300000000745058;-1044469.335000000894070;0
3097;-743920.339999999850988;-1042769.188999999314547;0
1345;-741741.000000000000000;-1044789.000000000000000;0
3848;-743094.383999999612570;-1042505.245000001043081;0
3344;-743932.276000000536442;-1043064.493999999016523;0
207;-743142.000000000000000;-1043590.000000000000000;0
6852;-741571.519999999552965;-1045065.932999998331070;0
1474;-741604.000000000000000;-1044172.000000000000000;0
390;-742429.000000000000000;-1043827.000000000000000;0
2261;-743009.000000000000000;-1045657.000000000000000;0
1332;-741793.000000000000000;-1044755.000000000000000;0
1126;-741684.000000000000000;-1044450.000000000000000;0
4213;-742218.094999998807907;-1043529.954999998211861;238
2489;-742079.000000000000000;-1044278.000000000000000;0
8019;-741972.039999999105930;-1044557.089999999850988;0
3752;-743213.949999999254942;-1042902.719999998807907;0
4248;-742157.039999999105930;-1043376.699999999254942;0
3466;-745113.802000001072884;-1042675.725000001490116;0
1235;-742150.000000000000000;-1044330.000000000000000;0
4144;-742704.414999999105930;-1043822.484999999403954;0
2225;-743041.000000000000000;-1045477.000000000000000;0
1622;-742495.000000000000000;-1044321.000000000000000;0
6387;-742159.980000000447035;-1042496.210000000894070;0
5461;-742442.704999998211861;-1043234.515000000596046;0
2467;-743434.000000000000000;-1044742.000000000000000;0
4526;-742696.690000001341105;-1042823.320000000298023;0
1318;-741838.000000000000000;-1044940.000000000000000;0
6103;-742213.102000001817942;-1043103.528999999165535;0
7739;-742301.399000000208616;-1045040.431000001728535;0
7965;-741515.510000001639128;-1044348.350000001490116;0
401;-742324.000000000000000;-1043907.000000000000000;0
5212;-743283.975000001490116;-1043373.589999999850988;0
87;-743857.000000000000000;-1043557.000000000000000;0
2336;-742837.000000000000000;-1045523.000000000000000;0
3425;-743730.254000000655651;-1043071.712000001221895;0
2757;-743949.300000000745058;-1043488.500000000000000;0
610;-742011.000000000000000;-1043270.000000000000000;0
529;-742162.000000000000000;-1043803.000000000000000;0
6830;-741526.739999998360872;-1044761.309000000357628;0
6837;-741677.875999998301268;-1044964.791999999433756;0
1730;-741428.000000000000000;-1045052.000000000000000;0
5144;-743052.642000000923872;-1043488.940000001341105;0
6996;-743116.699999999254942;-1044476.469999998807907;0
4815;-742992.210000000894070;-1042788.359999999403954;0
5966;-742483.469999998807907;-1043066.721999999135733;0
168;-743427.000000000000000;-1043311.000000000000000;0
2383;-742220.000000000000000;-1045517.000000000000000;0
6271;-742329.282000001519918;-1043017.853999998420477;0
3757;-743300.960000000894070;-1042956.699999999254942;0
1963;-743410.000000000000000;-1044689.000000000000000;0
4063;-742855.079999998211861;-1043654.695000000298023;0
1134;-741558.000000000000000;-1044450.000000000000000;0
509;-741991.000000000000000;-1043143.000000000000000;0
304;-742868.000000000000000;-1044122.000000000000000;0
2397;-742181.000000000000000;-1045368.000000000000000;0
7960;-741633.300000000745058;-1044301.980000000447035;0
1471;-741711.000000000000000;-1044132.000000000000000;0
5294;-743056.328999999910593;-1043196.096999999135733;0
2301;-742533.000000000000000;-1045416.000000000000000;0
3678;-744586.715999998152256;-1042494.697000000625849;0
2536;-742003.000000000000000;-1044113.000000000000000;0
6834;-741594.763000000268221;-1044922.236000001430511;0
1519;-741754.000000000000000;-1043956.000000000000000;0
5225;-743277.453999999910593;-1043558.087999999523163;0
3181;-743898.234999999403954;-1042567.133000001311302;0
7153;-742889.646999999880791;-1044547.438000001013279;0
5447;-743129.958999998867512;-1043365.166000001132488;0
178;-743389.000000000000000;-1043251.000000000000000;0
4330;-742377.440999999642372;-1043332.162999998778105;0
5240;-743364.164000000804663;-1043254.934000000357628;0
7170;-742667.579999998211861;-1044492.469999998807907;0
4455;-741714.589000001549721;-1042663.557000000029802;0
537;-742099.000000000000000;-1043663.000000000000000;194
2480;-741251.739999998360872;-1044639.480000000447035;0
6714;-742287.171000000089407;-1044923.995999999344349;0
2278;-742791.000000000000000;-1045657.000000000000000;0
1487;-741117.000000000000000;-1044216.000000000000000;0
6982;-743055.109999999403954;-1044342.629999998956919;0
7808;-741986.629999998956919;-1044440.109999999403954;0
1766;-741257.000000000000000;-1044204.000000000000000;0
6273;-742321.806000001728535;-1043017.085000000894070;0
7019;-742585.024999998509884;-1044210.725000001490116;0
1195;-741696.000000000000000;-1043920.000000000000000;0
4052;-743252.954999998211861;-1043843.585000000894070;0
1357;-741935.000000000000000;-1044871.000000000000000;0
3110;-743743.295000001788139;-1042640.627000000327826;0
2260;-743019.000000000000000;-1045622.000000000000000;0
515;-742176.000000000000000;-1043121.000000000000000;0
1537;-741924.000000000000000;-1043954.000000000000000;0
1423;-742167.000000000000000;-1044150.000000000000000;0
845;-742126.000000000000000;-1042505.000000000000000;0
1849;-742732.000000000000000;-1044228.000000000000000;0
5066;-742827.379000000655651;-1043252.267999999225140;0
4030;-743133.280000001192093;-1043791.552000001072884;0
5145;-743058.063000001013279;-1043471.706999998539686;0
7516;-742248.390000000596046;-1044368.907999999821186;0
3965;-743388.850000001490116;-1043528.160000000149012;0
7648;-742317.809000000357628;-1045414.322000000625849;0
7084;-743318.609999999403954;-1044521.789999999105930;0
1059;-741637.000000000000000;-1045095.000000000000000;0
913;-741742.000000000000000;-1042579.000000000000000;0
1687;-741142.120000001043081;-1044817.019999999552965;0
1503;-741537.000000000000000;-1044272.000000000000000;0
1297;-742120.000000000000000;-1044453.000000000000000;0
7033;-743303.864999998360872;-1044132.750000000000000;0
5231;-743342.107000000774860;-1043497.627000000327826;0
1968;-743397.000000000000000;-1044793.000000000000000;0
4707;-742743.519999999552965;-1042600.359999999403954;0
4428;-742206.750000000000000;-1043097.800000000745058;0
4154;-742544.524999998509884;-1044048.190000001341105;0
543;-742361.000000000000000;-1043823.000000000000000;0
4137;-742705.739999998360872;-1044094.100000001490116;0
8079;-742021.839999999850988;-1045292.179999999701977;0
6931;-742050.949999999254942;-1045191.190000001341105;0
1452;-741519.000000000000000;-1044574.000000000000000;0
4122;-742732.074999999254942;-1043923.995000001043081;0
7248;-742757.960000000894070;-1044826.929999999701977;0
6496;-742290.655999999493361;-1044438.502999998629093;0
7946;-742007.769999999552965;-1044091.789999999105930;0
590;-741935.000000000000000;-1043331.000000000000000;0
1416;-741628.000000000000000;-1044523.000000000000000;0
4205;-742325.267999999225140;-1043571.951000001281500;0
1910;-743460.000000000000000;-1044391.000000000000000;50
4781;-742926.519000001251698;-1042695.502999998629093;0
6264;-742357.280000001192093;-1043020.445999998599291;0
2563;-741065.000000000000000;-1044421.000000000000000;0
316;-742490.000000000000000;-1044202.000000000000000;0
4587;-742482.011999998241663;-1042641.392999999225140;0
547;-742316.910000000149012;-1043790.309999998658895;0
632;-742130.000000000000000;-1043287.000000000000000;0
4167;-742438.315000001341105;-1044021.960000000894070;0
4812;-743027.170000001788139;-1042810.219999998807907;0
1682;-741129.769999999552965;-1044685.559999998658895;0
2511;-743050.000000000000000;-1044050.000000000000000;0
1260;-742070.000000000000000;-1044876.000000000000000;0
1561;-743186.000000000000000;-1045098.000000000000000;0
380;-742501.000000000000000;-1043722.000000000000000;0
5409;-743745.201000001281500;-1042902.750000000000000;0
1167;-741836.000000000000000;-1044429.000000000000000;0
739;-741789.000000000000000;-1043028.000000000000000;0
2017;-743247.000000000000000;-1044884.000000000000000;0
3369;-743878.633000001311302;-1043011.739000000059605;0
4562;-742471.000000000000000;-1042510.920000001788139;0
5283;-743032.892000000923872;-1043284.399000000208616;0
4859;-742966.710000000894070;-1042996.302999999374151;0
6677;-742304.892999999225140;-1044202.831999998539686;0
1026;-741986.000000000000000;-1044631.000000000000000;0
462;-741707.000000000000000;-1043294.000000000000000;0
1144;-741402.000000000000000;-1044470.000000000000000;0
2357;-742388.000000000000000;-1045577.000000000000000;0
1162;-741087.000000000000000;-1044511.000000000000000;0
6297;-742506.859999999403954;-1042634.250000000000000;0
5647;-743429.070999998599291;-1043694.699000000953674;0
8277;-742111.260000001639128;-1042746.399999998509884;0
1852;-742739.000000000000000;-1044210.000000000000000;0
995;-741906.000000000000000;-1044434.000000000000000;0
8046;-742169.109999999403954;-1044835.660000000149012;0
4792;-743051.280000001192093;-1042654.962999999523163;0
4159;-742455.734999999403954;-1043898.035000000149012;0
3273;-743642.442999999970198;-1042796.677999999374151;0
345;-742559.000000000000000;-1043826.000000000000000;0
6654;-741635.289999999105930;-1044140.820000000298023;0
6648;-741750.510000001639128;-1044080.329999998211861;0
334;-742631.000000000000000;-1043987.000000000000000;0
4898;-742571.280000001192093;-1042840.859999999403954;0
1827;-743033.000000000000000;-1044080.000000000000000;0
4332;-742410.359000001102686;-1043282.916000001132488;0
2377;-742390.000000000000000;-1045527.000000000000000;0
555;-742230.000000000000000;-1043726.000000000000000;0
1995;-743484.000000000000000;-1045036.000000000000000;0
1401;-741723.000000000000000;-1044408.000000000000000;0
1939;-743269.000000000000000;-1044355.000000000000000;0
1042;-741883.000000000000000;-1044682.000000000000000;0
7208;-742560.289999999105930;-1045023.789999999105930;0
4828;-743048.579999998211861;-1042941.179999999701977;0
3818;-743130.217999998480082;-1042703.293000001460314;0
3825;-743056.390000000596046;-1042570.079999998211861;0
6276;-742310.815999999642372;-1043016.000999998301268;0
1124;-741715.000000000000000;-1044452.000000000000000;0
2604;-745373.923999998718500;-1042834.581000000238419;0
3787;-743130.989999998360872;-1042979.320000000298023;0
6723;-742592.894999999552965;-1044408.905000001192093;0
930;-744068.000000000000000;-1043405.000000000000000;0
748;-741671.000000000000000;-1042971.000000000000000;0
1955;-743374.000000000000000;-1044515.000000000000000;0
2327;-742491.000000000000000;-1045502.000000000000000;0
2216;-743108.000000000000000;-1045349.000000000000000;0
2286;-742894.000000000000000;-1045440.000000000000000;0
6256;-742380.723000001162291;-1043035.640000000596046;0
1550;-741356.000000000000000;-1044363.000000000000000;0
6280;-742306.918999999761581;-1043038.083000000566244;0
7660;-742321.396999999880791;-1045335.578999999910593;0
4748;-742895.730000000447035;-1042781.289999999105930;0
6127;-742314.456000000238419;-1043070.548999998718500;0
4662;-742819.471000000834465;-1042530.037000000476837;0
4938;-742469.324999999254942;-1042658.263000000268221;0
5267;-743190.021999999880791;-1043149.807000000029802;0
4972;-742479.962999999523163;-1043052.368999999016523;0
7180;-742618.809000000357628;-1044646.109000001102686;0
7148;-742828.445000000298023;-1044472.094999998807907;0
1376;-742165.000000000000000;-1044873.000000000000000;0
1546;-742219.000000000000000;-1044147.000000000000000;0
4878;-742876.434000000357628;-1042964.004000000655651;0
205;-743173.000000000000000;-1043599.000000000000000;0
3949;-743420.780000001192093;-1043527.820000000298023;0
4585;-742437.502000000327826;-1042630.243999999016523;0
4740;-742757.410000000149012;-1042715.589999999850988;0
5168;-743228.796000000089407;-1043420.092000000178814;0
1960;-743386.000000000000000;-1044623.000000000000000;0
3303;-743810.967999998480082;-1042865.596000000834465;0
6682;-742329.804000001400709;-1044319.611999999731779;0
4965;-742383.620000001043081;-1043057.500000000000000;0
4623;-742533.778999999165535;-1042585.824000000953674;0
4894;-742610.888999998569489;-1042819.686999998986721;0
2512;-743070.000000000000000;-1044052.000000000000000;0
6166;-742314.649999998509884;-1043065.006999999284744;0
1941;-743267.000000000000000;-1044384.000000000000000;0
6299;-741803.309999998658895;-1042718.690000001341105;0
620;-742253.000000000000000;-1043281.000000000000000;0
7040;-743356.140000000596046;-1044164.359999999403954;0
4665;-742824.410000000149012;-1042592.260000001639128;0
250;-743428.000000000000000;-1043794.000000000000000;0
7043;-743398.899999998509884;-1044106.629999998956919;0
4009;-743231.157999999821186;-1044047.155000001192093;0
2533;-743542.000000000000000;-1044816.000000000000000;0
5659;-743426.815000001341105;-1043709.059000000357628;0
2142;-742883.000000000000000;-1045078.000000000000000;0
3510;-744982.017000000923872;-1042686.442999999970198;0
1291;-742205.000000000000000;-1044568.000000000000000;0
1521;-741808.000000000000000;-1043917.000000000000000;0
7145;-742812.874000001698732;-1044402.199000000953674;0
5591;-743421.353999998420477;-1043679.738000001758337;0
688;-742284.000000000000000;-1043125.000000000000000;0
4836;-742984.245999999344349;-1042653.127999998629093;0
7233;-742606.750000000000000;-1044827.379999998956919;0
6751;-742426.350000001490116;-1044371.070000000298023;0
2097;-743143.000000000000000;-1044742.000000000000000;0
7154;-742908.467000000178814;-1044547.784000001847744;0
4208;-742372.416999999433756;-1043503.423000000417233;0
627;-742223.000000000000000;-1043335.000000000000000;0
618;-742203.000000000000000;-1043272.000000000000000;0
5112;-742942.920000001788139;-1043441.850000001490116;0
1305;-741826.000000000000000;-1044678.000000000000000;0
5645;-743428.886999998241663;-1043692.285999998450279;0
1308;-741589.000000000000000;-1044811.000000000000000;0
4811;-743040.379999998956919;-1042799.609999999403954;0
7956;-741777.379999998956919;-1044260.170000001788139;0
4958;-742349.620000001043081;-1043004.539999999105930;0
5418;-742434.890000000596046;-1042864.780000001192093;0
3228;-744128.969999998807907;-1042651.059000000357628;0
7317;-742579.670000001788139;-1045022.239999998360872;0
8265;-742197.820000000298023;-1042704.260000001639128;0
5682;-743399.638000000268221;-1043719.120999999344349;0
6373;-741992.809999998658895;-1042677.000000000000000;0
3887;-742347.760000001639128;-1042449.881000000983477;0
7027;-743237.269999999552965;-1044095.524999998509884;0
1248;-742109.000000000000000;-1044631.000000000000000;0
7221;-742394.890000000596046;-1044813.550000000745058;0
190;-743443.000000000000000;-1043597.000000000000000;0
1981;-743406.000000000000000;-1044627.000000000000000;0
2560;-741251.000000000000000;-1044390.000000000000000;0
1942;-743283.000000000000000;-1044370.000000000000000;0
382;-742481.000000000000000;-1043751.000000000000000;0
6242;-742366.677999999374151;-1043062.949000000953674;0
586;-741966.000000000000000;-1043374.000000000000000;0
1598;-742351.000000000000000;-1045090.000000000000000;0
4997;-742492.638000000268221;-1042962.833999998867512;0
2034;-743468.000000000000000;-1044800.000000000000000;0
810;-741934.000000000000000;-1042519.000000000000000;0
4571;-742345.710000000894070;-1042568.989999998360872;0
1148;-741324.000000000000000;-1044481.000000000000000;0
7002;-743079.250000000000000;-1044377.170000001788139;0
4180;-742368.370000001043081;-1044115.471999999135733;0
2384;-742191.000000000000000;-1045494.000000000000000;0
4787;-742962.412000000476837;-1042621.662000000476837;0
6872;-741751.719999998807907;-1045296.679999999701977;0
8242;-742568.629999998956919;-1045197.829999998211861;0
209;-743108.000000000000000;-1043583.000000000000000;0
736;-741880.000000000000000;-1043017.000000000000000;0
4664;-742806.739999998360872;-1042547.980000000447035;0
2033;-743500.000000000000000;-1044798.000000000000000;0
640;-741983.000000000000000;-1043299.000000000000000;0
7966;-741489.800000000745058;-1044356.219999998807907;0
5173;-743291.175999999046326;-1043426.754999998956919;0
7281;-742801.859999999403954;-1044705.300000000745058;0
6210;-742318.541000001132488;-1043064.662999998778105;0
5211;-743299.236000001430511;-1043364.945000000298023;0
879;-741947.000000000000000;-1042541.000000000000000;0
6190;-742318.782999999821186;-1043068.206000000238419;0
674;-742463.000000000000000;-1043211.000000000000000;0
4599;-742625.879999998956919;-1042698.820000000298023;0
3805;-743035.760000001639128;-1042913.550000000745058;0
4620;-742539.574000000953674;-1042537.307999998331070;0
3581;-744918.206999998539686;-1042631.410000000149012;0
519;-742239.000000000000000;-1043113.000000000000000;0
6245;-742369.682000000029802;-1043057.377000000327826;0
617;-742179.000000000000000;-1043272.000000000000000;0
1385;-742194.000000000000000;-1044974.000000000000000;0
6231;-742316.769000001251698;-1043058.344000000506639;0
5036;-742666.855999998748302;-1042990.710000000894070;0
159;-742965.000000000000000;-1042641.000000000000000;0
2454;-741003.000000000000000;-1044441.000000000000000;0
6823;-741313.910000000149012;-1044788.510000001639128;0
6156;-742314.791999999433756;-1043066.736000001430511;0
4240;-742471.613000001758337;-1043552.366000000387430;0
3795;-743173.190000001341105;-1042842.170000001788139;0
691;-742293.000000000000000;-1043097.000000000000000;0
4637;-742572.578000001609325;-1042742.510999999940395;0
4530;-742732.859999999403954;-1042860.920000001788139;0
2043;-743471.000000000000000;-1044959.000000000000000;0
7385;-743182.811000000685453;-1045457.984000001102686;0
7282;-742809.410000000149012;-1044693.629999998956919;0
2235;-743401.000000000000000;-1045221.000000000000000;0
4922;-742443.129999998956919;-1042886.510000001639128;0
6963;-743004.519999999552965;-1044166.870000001043081;0
4018;-743153.285000000149012;-1043925.850000001490116;0
4724;-742870.089999999850988;-1042658.210000000894070;0
639;-741958.000000000000000;-1043294.000000000000000;0
684;-742358.000000000000000;-1043136.000000000000000;0
1599;-742237.000000000000000;-1044977.000000000000000;0
524;-742255.000000000000000;-1043913.000000000000000;0
3993;-743345.100000001490116;-1043930.980000000447035;0
3820;-743111.699999999254942;-1042659.320000000298023;0
5412;-742582.037000000476837;-1042571.986000001430511;0
4909;-742383.146000001579523;-1042799.159000001847744;0
4426;-742197.589999999850988;-1043031.679999999701977;0
1133;-741604.000000000000000;-1044433.000000000000000;0
5996;-742061.879000000655651;-1043284.276999998837709;0
2574;-742481.000000000000000;-1045423.000000000000000;0
4667;-742823.039999999105930;-1042631.620000001043081;0
1097;-741414.000000000000000;-1044558.000000000000000;0
3098;-743918.111000001430511;-1042753.629000000655651;0
2018;-743244.000000000000000;-1044909.000000000000000;0
1049;-741795.000000000000000;-1044923.000000000000000;0
7657;-742317.228999998420477;-1045306.000999998301268;0
2080;-742685.000000000000000;-1044460.000000000000000;0
1168;-741825.000000000000000;-1044403.000000000000000;0
6393;-742076.660000000149012;-1042499.879999998956919;0
4824;-742918.673000000417233;-1042871.875000000000000;0
4146;-742666.940000001341105;-1043854.829999998211861;0
7647;-742319.918000001460314;-1045405.197999998927116;0
1327;-742001.000000000000000;-1045024.000000000000000;0
2052;-743403.000000000000000;-1045075.000000000000000;0
1451;-741522.000000000000000;-1044602.000000000000000;0
2526;-741087.000000000000000;-1044616.000000000000000;0
6259;-742383.170000001788139;-1043030.809000000357628;0
4007;-743275.230999998748302;-1044049.184999998658895;0
1161;-741106.550000000745058;-1044497.769999999552965;0
4245;-742160.210000000894070;-1043410.570000000298023;0
2401;-742253.000000000000000;-1045390.000000000000000;0
1359;-742000.000000000000000;-1044897.000000000000000;0
6139;-742312.807000000029802;-1043066.006000000983477;0
4531;-742746.070000000298023;-1042885.980000000447035;0
4999;-742534.149999998509884;-1042966.892999999225140;0
1923;-743395.000000000000000;-1044274.000000000000000;0
8280;-742150.949999999254942;-1042770.420000001788139;0
7828;-743537.940000001341105;-1045170.530000001192093;0
6147;-742314.177000001072884;-1043067.070999998599291;0
4713;-742844.640000000596046;-1042605.980000000447035;0
649;-742233.000000000000000;-1043382.000000000000000;0
4896;-742589.649999998509884;-1042838.989999998360872;0
4502;-742349.309999998658895;-1042718.199999999254942;0
4850;-742956.164000000804663;-1042923.403000000864267;0
5309;-743033.405000001192093;-1043187.043999999761581;0
1708;-741170.820000000298023;-1044705.589999999850988;0
1657;-741399.000000000000000;-1044717.000000000000000;0
6246;-742370.552999999374151;-1043055.625999998301268;0
4975;-742477.829999998211861;-1043016.923000000417233;0
2075;-743114.000000000000000;-1044772.000000000000000;0
885;-741739.000000000000000;-1042777.000000000000000;0
6694;-742280.806000001728535;-1044814.875999998301268;0
7245;-742748.780000001192093;-1044837.699999999254942;0
5665;-743419.725000001490116;-1043711.682000000029802;0
4954;-742405.539999999105930;-1043024.640000000596046;0
7355;-743348.309999998658895;-1045148.329999998211861;0
5107;-742857.611999999731779;-1043458.278000000864267;0
6952;-743044.730999998748302;-1044106.129999998956919;0
3101;-743922.754999998956919;-1042745.195000000298023;0
3985;-743312.765000000596046;-1043928.164999999105930;0
5165;-743191.168000001460314;-1043398.304000001400709;0
603;-741810.000000000000000;-1043205.000000000000000;0
1152;-741257.000000000000000;-1044489.000000000000000;0
5421;-742337.905999999493361;-1042777.837999999523163;0
1551;-741353.000000000000000;-1044326.000000000000000;0
6389;-742141.199999999254942;-1042497.030000001192093;0
2029;-743393.000000000000000;-1045068.000000000000000;0
578;-742023.000000000000000;-1043464.000000000000000;0
1141;-741454.000000000000000;-1044453.000000000000000;0
1676;-741033.000000000000000;-1044755.000000000000000;0
4032;-743136.934999998658895;-1043750.375000000000000;0
1797;-743098.000000000000000;-1044099.000000000000000;0
549;-742290.000000000000000;-1043770.000000000000000;0
7354;-743365.449000000953674;-1045150.535999998450279;0
3961;-743419.609999999403954;-1043589.497000001370907;0
615;-742129.000000000000000;-1043271.000000000000000;0
5679;-743403.182000000029802;-1043717.807000000029802;0
6362;-742039.230999998748302;-1042680.660000000149012;0
4228;-742132.969999998807907;-1043331.449999999254942;0
4888;-742649.925999999046326;-1042830.767000000923872;0
7644;-742295.089000001549721;-1045373.164999999105930;0
2478;-741241.859999999403954;-1044562.089999999850988;0
2559;-741323.000000000000000;-1044399.000000000000000;0
4617;-742561.250999998301268;-1042668.140000000596046;0
6212;-742317.006000000983477;-1043061.888000000268221;0
4575;-742336.600000001490116;-1042692.170000001788139;0
6153;-742309.583999998867512;-1043058.640999998897314;0
