OID_;X;Y;TEMPERATURE
2050;-743460.000000000000000;-1045072.000000000000000;0
1171;-741882.000000000000000;-1044375.000000000000000;0
1584;-742368.000000000000000;-1044717.000000000000000;0
2403;-742211.000000000000000;-1045436.000000000000000;0
7995;-741545.920000001788139;-1045160.100000001490116;0
872;-741698.000000000000000;-1042669.000000000000000;0
1040;-741904.000000000000000;-1044623.000000000000000;0
1496;-741253.000000000000000;-1044321.000000000000000;0
1286;-742221.460000000894070;-1044465.969999998807907;0
2132;-743058.000000000000000;-1045118.000000000000000;0
1758;-741097.000000000000000;-1044094.000000000000000;0
514;-742119.000000000000000;-1043141.000000000000000;0
2185;-743216.000000000000000;-1045130.000000000000000;0
1698;-741464.000000000000000;-1044668.000000000000000;0
2393;-742054.000000000000000;-1045282.000000000000000;0
2321;-742679.000000000000000;-1045480.000000000000000;0
430;-742185.000000000000000;-1043888.000000000000000;0
7829;-743509.649999998509884;-1045166.399999998509884;0
1488;-741088.000000000000000;-1044212.000000000000000;0
2228;-743044.000000000000000;-1045502.000000000000000;0
4190;-742301.250000000000000;-1044166.100000001490116;0
4235;-742390.041999999433756;-1043492.094999998807907;0
80;-744067.000000000000000;-1043330.000000000000000;0
4162;-742497.193999998271465;-1044160.030000001192093;0
504;-741937.000000000000000;-1043164.000000000000000;283
342;-742573.000000000000000;-1043878.000000000000000;0
4047;-743210.230000000447035;-1043992.289999999105930;0
1818;-743046.000000000000000;-1044380.000000000000000;0
6977;-743098.949999999254942;-1044459.879999998956919;0
7778;-743070.728000000119209;-1045812.342000000178814;0
6703;-742288.903999999165535;-1044591.625999998301268;0
8069;-742226.440000001341105;-1045255.949999999254942;0
3917;-743967.182999998331070;-1043516.284000001847744;0
4138;-742883.587000001221895;-1043997.287999998778105;0
741;-741730.000000000000000;-1043035.000000000000000;0
1666;-741017.000000000000000;-1044315.000000000000000;0
7515;-742273.021999999880791;-1044371.543999999761581;0
2516;-742500.000000000000000;-1044414.000000000000000;0
4070;-742925.285000000149012;-1043783.565000001341105;0
4859;-742966.710000000894070;-1042996.302999999374151;0
1293;-742037.000000000000000;-1044462.000000000000000;0
1120;-741778.000000000000000;-1044457.000000000000000;0
7142;-742872.445000000298023;-1044472.239999998360872;0
4069;-742920.684999998658895;-1043755.420000001788139;0
2073;-743069.000000000000000;-1044754.000000000000000;0
1922;-743390.000000000000000;-1044308.000000000000000;0
4214;-742229.274999998509884;-1043511.745000001043081;232
3768;-743006.370000001043081;-1042978.829999998211861;0
543;-742361.000000000000000;-1043823.000000000000000;0
4748;-742895.730000000447035;-1042781.289999999105930;0
3781;-743273.059999998658895;-1042814.050000000745058;0
4332;-742410.359000001102686;-1043282.916000001132488;0
587;-741944.000000000000000;-1043391.000000000000000;0
1030;-741975.000000000000000;-1044753.000000000000000;0
394;-742405.000000000000000;-1043863.000000000000000;0
4119;-742717.223999999463558;-1043999.837999999523163;0
2547;-741724.000000000000000;-1044282.000000000000000;0
6014;-742844.000000000000000;-1043239.482999999076128;0
4975;-742477.829999998211861;-1043016.923000000417233;0
1530;-741753.000000000000000;-1043814.000000000000000;0
1932;-743359.000000000000000;-1044408.000000000000000;0
2260;-743019.000000000000000;-1045622.000000000000000;0
2315;-742854.000000000000000;-1045460.000000000000000;0
881;-741806.000000000000000;-1042815.000000000000000;0
5292;-743055.866000000387430;-1043215.710999999195337;0
4064;-742879.655000001192093;-1043647.420000001788139;0
6995;-743129.710000000894070;-1044496.579999998211861;0
2146;-742845.000000000000000;-1044968.000000000000000;0
7083;-743309.980000000447035;-1044509.500000000000000;0
4167;-742438.315000001341105;-1044021.960000000894070;0
2274;-742870.000000000000000;-1045732.000000000000000;0
2244;-743264.000000000000000;-1045331.000000000000000;0
1780;-741214.000000000000000;-1043934.000000000000000;0
2479;-741247.800000000745058;-1044609.379999998956919;0
512;-742063.000000000000000;-1043136.000000000000000;0
7945;-742063.179999999701977;-1044077.379999998956919;0
8274;-742065.089999999850988;-1042742.109999999403954;0
1214;-742064.000000000000000;-1044358.000000000000000;0
1435;-741903.000000000000000;-1044306.000000000000000;0
2495;-741982.000000000000000;-1044140.000000000000000;0
1545;-742236.000000000000000;-1044234.000000000000000;0
2007;-743231.000000000000000;-1044741.000000000000000;0
5372;-742084.010000001639128;-1043008.550000000745058;0
2511;-743050.000000000000000;-1044050.000000000000000;0
701;-742023.000000000000000;-1042885.000000000000000;206
2325;-742559.000000000000000;-1045494.000000000000000;0
6414;-743703.410999998450279;-1042881.958000000566244;0
2891;-744029.914000000804663;-1043200.478000000119209;0
1852;-742739.000000000000000;-1044210.000000000000000;0
4122;-742732.074999999254942;-1043923.995000001043081;0
2360;-742331.000000000000000;-1045596.000000000000000;0
3108;-743768.699999999254942;-1042671.241999998688698;0
555;-742230.000000000000000;-1043726.000000000000000;0
2138;-742958.000000000000000;-1045095.000000000000000;0
4518;-742623.960000000894070;-1042786.719999998807907;0
1573;-742358.000000000000000;-1044452.000000000000000;0
6312;-743933.359999999403954;-1042580.719999998807907;0
5230;-743335.399999998509884;-1043517.670000001788139;0
737;-741849.000000000000000;-1043021.000000000000000;37
1533;-741832.000000000000000;-1043879.000000000000000;0
2155;-742797.000000000000000;-1045124.000000000000000;0
8045;-742173.070000000298023;-1044806.519999999552965;0
7180;-742618.809000000357628;-1044646.109000001102686;0
5111;-742892.337999999523163;-1043424.370999999344349;0
7244;-742713.559999998658895;-1044823.719999998807907;0
274;-743359.000000000000000;-1043833.000000000000000;0
8283;-742198.600000001490116;-1042801.980000000447035;0
1838;-743004.480000000447035;-1044216.030000001192093;0
5110;-742876.271999999880791;-1043449.013000000268221;0
1310;-741623.000000000000000;-1044829.000000000000000;0
1097;-741414.000000000000000;-1044558.000000000000000;0
6827;-741437.300000000745058;-1044772.629999998956919;0
882;-741825.000000000000000;-1042788.000000000000000;0
2698;-743513.489999998360872;-1042042.620000001043081;0
5265;-743188.572999998927116;-1043226.513999998569489;0
4876;-742826.449999999254942;-1042944.910000000149012;0
3303;-743810.967999998480082;-1042865.596000000834465;0
4711;-742803.300000000745058;-1042601.140000000596046;0
758;-741658.000000000000000;-1042666.000000000000000;0
1591;-742378.000000000000000;-1044910.000000000000000;0
3848;-743094.383999999612570;-1042505.245000001043081;0
1619;-742426.000000000000000;-1044401.000000000000000;0
3214;-743628.813000001013279;-1042457.677000001072884;0
3758;-743284.129999998956919;-1042964.100000001490116;0
4591;-742426.813000001013279;-1042640.035000000149012;0
2237;-743368.000000000000000;-1045238.000000000000000;0
1128;-741655.000000000000000;-1044448.000000000000000;0
1503;-741537.000000000000000;-1044272.000000000000000;0
6142;-742310.477000001817942;-1043061.813000001013279;0
2419;-742418.000000000000000;-1045101.000000000000000;0
1915;-743468.000000000000000;-1044494.000000000000000;0
4463;-742198.989999998360872;-1042569.030000001192093;0
1162;-741087.000000000000000;-1044511.000000000000000;0
675;-742446.000000000000000;-1043215.000000000000000;0
3342;-743922.624000001698732;-1043077.261999998241663;0
6830;-741526.739999998360872;-1044761.309000000357628;0
7743;-741707.912999998778105;-1045072.826999999582767;0
7143;-742850.414999999105930;-1044473.449999999254942;0
2524;-742108.000000000000000;-1044191.000000000000000;0
3097;-743920.339999999850988;-1042769.188999999314547;0
4426;-742197.589999999850988;-1043031.679999999701977;0
3789;-743137.469999998807907;-1042933.670000001788139;0
8080;-741989.600000001490116;-1045310.420000001788139;0
2327;-742491.000000000000000;-1045502.000000000000000;0
4336;-742416.888999998569489;-1043431.418000001460314;0
4114;-742764.195000000298023;-1044131.760000001639128;0
2892;-744005.317000001668930;-1043204.537000000476837;0
7211;-742570.070000000298023;-1045065.679999999701977;0
2080;-742685.000000000000000;-1044460.000000000000000;116
7008;-742899.559999998658895;-1044224.074999999254942;28
5296;-743058.934999998658895;-1043177.035000000149012;0
3534;-744667.721000000834465;-1042664.578000001609325;0
6214;-742315.447999998927116;-1043059.026000000536442;0
1324;-741943.000000000000000;-1044994.000000000000000;0
3988;-743309.704999998211861;-1044008.570000000298023;0
6677;-742304.892999999225140;-1044202.831999998539686;0
4494;-741874.920000001788139;-1042616.660000000149012;0
4054;-743269.304999999701977;-1043797.405000001192093;0
3212;-743646.699000000953674;-1042469.458999998867512;0
1136;-741520.000000000000000;-1044455.000000000000000;0
284;-743022.000000000000000;-1043758.000000000000000;0
2092;-742917.000000000000000;-1044617.000000000000000;0
164;-743392.000000000000000;-1043230.000000000000000;0
7261;-742970.839999999850988;-1044878.739999998360872;0
7027;-743237.269999999552965;-1044095.524999998509884;0
3032;-744506.962000001221895;-1042717.704999998211861;0
7187;-742595.019999999552965;-1044739.962000001221895;0
6789;-741187.510000001639128;-1044470.660000000149012;0
4663;-742820.800000000745058;-1042560.039999999105930;0
1242;-742137.000000000000000;-1044481.000000000000000;0
5418;-742434.890000000596046;-1042864.780000001192093;0
5175;-743313.734999999403954;-1043433.749000001698732;0
1111;-741167.030000001192093;-1044590.170000001788139;0
7740;-742301.949999999254942;-1045061.239000000059605;0
561;-742172.000000000000000;-1043675.000000000000000;0
2488;-742083.000000000000000;-1044303.000000000000000;0
1962;-743406.000000000000000;-1044664.000000000000000;0
5688;-743415.267000000923872;-1043631.945000000298023;0
3957;-743415.125000000000000;-1043567.214999999850988;0
6943;-742902.013999998569489;-1043932.647999998182058;0
3510;-744982.017000000923872;-1042686.442999999970198;0
3458;-745043.431000001728535;-1042697.631000000983477;0
3580;-744924.973999999463558;-1042593.699999999254942;0
8044;-742176.640000000596046;-1044778.420000001788139;0
3335;-743976.318999998271465;-1042991.258999999612570;0
4889;-742621.425000000745058;-1042831.109999999403954;0
1828;-743007.000000000000000;-1044088.000000000000000;0
1692;-741125.000000000000000;-1044816.000000000000000;0
5766;-742429.719999998807907;-1042597.699999999254942;0
4031;-743135.774000000208616;-1043769.622000001370907;0
5755;-743415.670000001788139;-1043702.254000000655651;0
707;-741897.000000000000000;-1042863.000000000000000;0
2475;-743411.000000000000000;-1044901.000000000000000;0
6610;-741694.364999998360872;-1043961.170000001788139;0
6573;-741294.089999999850988;-1044091.679999999701977;0
1447;-741541.000000000000000;-1044744.000000000000000;0
4691;-742693.760000001639128;-1042596.969999998807907;0
6843;-741569.070000000298023;-1044975.261999998241663;0
6321;-745084.927999999374151;-1042675.171000000089407;0
5721;-743418.407999999821186;-1043631.800000000745058;0
6654;-741635.289999999105930;-1044140.820000000298023;0
1090;-741581.000000000000000;-1044552.000000000000000;0
680;-742402.109999999403954;-1043166.679999999701977;0
1318;-741838.000000000000000;-1044940.000000000000000;0
2034;-743468.000000000000000;-1044800.000000000000000;0
4848;-742977.940000001341105;-1042862.019999999552965;0
1648;-741373.000000000000000;-1044431.000000000000000;0
2486;-741289.250000000000000;-1044848.829999998211861;0
4531;-742746.070000000298023;-1042885.980000000447035;0
3287;-743711.173999998718500;-1042886.515999998897314;0
4004;-743345.877000000327826;-1044053.135999999940395;0
3679;-744571.809999998658895;-1042497.875999998301268;0
5258;-743356.739999998360872;-1043230.039999999105930;0
4949;-742369.969999998807907;-1042973.199999999254942;0
2026;-743351.000000000000000;-1045022.000000000000000;0
6292;-743660.304999999701977;-1042964.543999999761581;0
1185;-741822.000000000000000;-1044095.000000000000000;0
351;-742509.000000000000000;-1043739.000000000000000;0
5;-743466.000000000000000;-1042616.000000000000000;0
6185;-742315.103999998420477;-1043062.923000000417233;0
5718;-743420.888999998569489;-1043629.666999999433756;0
6338;-742247.910000000149012;-1042851.670000001788139;0
4981;-742536.340999998152256;-1043014.929999999701977;0
918;-743437.000000000000000;-1043904.000000000000000;0
3210;-743664.019000001251698;-1042478.668999999761581;0
6861;-741491.429999999701977;-1045010.300000000745058;0
2482;-741262.739999998360872;-1044725.530000001192093;0
4593;-742510.820000000298023;-1042652.203999999910593;0
1453;-741525.000000000000000;-1044529.000000000000000;0
1623;-742524.000000000000000;-1044319.000000000000000;0
1926;-743301.000000000000000;-1044321.000000000000000;0
5138;-743030.936000000685453;-1043483.587999999523163;0
7033;-743303.864999998360872;-1044132.750000000000000;0
4599;-742625.879999998956919;-1042698.820000000298023;0
4514;-742555.050000000745058;-1042761.809999998658895;0
3532;-744710.912999998778105;-1042677.949999999254942;0
5250;-743328.995000001043081;-1043178.495000001043081;0
2256;-743156.000000000000000;-1045353.000000000000000;0
3887;-742347.760000001639128;-1042449.881000000983477;0
1262;-742066.000000000000000;-1044917.000000000000000;0
7285;-742806.960000000894070;-1044758.379999998956919;0
515;-742176.000000000000000;-1043121.000000000000000;0
7252;-742775.109999999403954;-1044855.940000001341105;0
631;-742153.000000000000000;-1043288.000000000000000;0
3203;-743724.272999998182058;-1042522.517000000923872;0
3943;-743413.429000001400709;-1043376.822000000625849;0
4669;-742823.199999999254942;-1042658.309999998658895;0
2103;-743182.000000000000000;-1044931.000000000000000;0
1766;-741257.000000000000000;-1044204.000000000000000;0
1501;-741475.000000000000000;-1044292.000000000000000;0
4321;-742265.214999999850988;-1043235.418999999761581;0
5146;-743064.554000001400709;-1043452.671999998390675;0
208;-743146.000000000000000;-1043573.000000000000000;0
5211;-743299.236000001430511;-1043364.945000000298023;0
262;-743408.000000000000000;-1043731.000000000000000;0
3267;-743587.203000001609325;-1042710.840999998152256;0
2043;-743471.000000000000000;-1044959.000000000000000;0
5394;-744802.909000001847744;-1042664.260999999940395;0
6849;-741635.855999998748302;-1045019.947999998927116;0
3096;-743906.309999998658895;-1042750.539999999105930;0
4701;-742687.780000001192093;-1042761.660000000149012;0
8051;-742213.199999999254942;-1044935.890000000596046;0
4795;-743049.835000000894070;-1042669.013000000268221;0
6284;-742309.677999999374151;-1043054.043999999761581;0
6504;-741755.193999998271465;-1044619.083000000566244;0
6395;-742057.429999999701977;-1042500.809999998658895;0
3228;-744128.969999998807907;-1042651.059000000357628;0
597;-741855.000000000000000;-1043268.000000000000000;0
4225;-742115.607999999076128;-1043452.125000000000000;0
3569;-744704.920000001788139;-1042585.679999999701977;0
3801;-743091.350000001490116;-1042882.719999998807907;0
1795;-742155.000000000000000;-1044231.000000000000000;0
1523;-741679.000000000000000;-1043865.000000000000000;0
1116;-741125.980000000447035;-1044610.410000000149012;0
3171;-743937.730000000447035;-1042607.039999999105930;0
1288;-742189.000000000000000;-1044543.000000000000000;0
4935;-742447.241999998688698;-1042699.399000000208616;0
7107;-743425.260000001639128;-1044646.199999999254942;0
6324;-745068.543000001460314;-1042720.445999998599291;0
2888;-744082.749000001698732;-1043174.458999998867512;0
3407;-743772.385999999940395;-1043008.706999998539686;0
466;-741743.000000000000000;-1043331.000000000000000;0
6770;-741306.423999998718500;-1044414.120999999344349;0
530;-742139.000000000000000;-1043771.000000000000000;0
3795;-743173.190000001341105;-1042842.170000001788139;0
2503;-742753.000000000000000;-1045484.000000000000000;0
3738;-745043.339999999850988;-1042389.901000000536442;0
6296;-742543.019999999552965;-1042643.350000001490116;0
4944;-742430.605999998748302;-1043013.879000000655651;0
6092;-742001.309999998658895;-1043482.089999999850988;0
6364;-742003.519999999552965;-1042660.690000001341105;0
8276;-742095.079999998211861;-1042752.519999999552965;0
5413;-742651.872000001370907;-1042662.627999998629093;0
1866;-743456.000000000000000;-1044201.000000000000000;0
1344;-741750.000000000000000;-1044808.000000000000000;0
3760;-743233.829999998211861;-1042978.739999998360872;0
2692;-743430.750000000000000;-1042085.649999998509884;0
3471;-745015.947000000625849;-1042270.480000000447035;0
2172;-742886.000000000000000;-1045182.000000000000000;0
1862;-743477.000000000000000;-1044188.000000000000000;0
4751;-742791.629999998956919;-1042751.460000000894070;0
1147;-741346.000000000000000;-1044466.000000000000000;0
6325;-745069.041000001132488;-1042716.723000001162291;0
309;-742721.000000000000000;-1044157.000000000000000;0
6008;-743902.607000000774860;-1042749.771000001579523;0
3614;-744984.548999998718500;-1042283.640999998897314;0
5134;-742995.984000001102686;-1043497.364000000059605;0
3412;-743772.947000000625849;-1043053.557999998331070;0
4991;-742675.414999999105930;-1043031.236000001430511;0
7197;-742570.949000000953674;-1044895.548999998718500;0
4063;-742855.079999998211861;-1043654.695000000298023;0
4726;-742863.519999999552965;-1042684.000000000000000;0
1258;-742076.000000000000000;-1044837.000000000000000;0
629;-742200.000000000000000;-1043289.000000000000000;0
1466;-741838.000000000000000;-1044041.000000000000000;0
5683;-743398.456000000238419;-1043719.557999998331070;0
6782;-741303.329999998211861;-1044447.660000000149012;0
7214;-742470.679999999701977;-1044531.269999999552965;406
5590;-743422.570000000298023;-1043679.642000000923872;0
3585;-744920.065000001341105;-1042522.129999998956919;0
4201;-742269.000000000000000;-1043651.563000001013279;0
5204;-743246.423999998718500;-1043308.298999998718500;0
4132;-742818.859999999403954;-1044067.969999998807907;0
1390;-742129.000000000000000;-1045069.000000000000000;0
5127;-743019.265000000596046;-1043389.644999999552965;0
1352;-741840.000000000000000;-1044854.000000000000000;0
7044;-743400.635000001639128;-1044135.579999998211861;0
3526;-744799.361999999731779;-1042683.306000001728535;0
3408;-743789.511999998241663;-1043022.425000000745058;0
4086;-742813.079999998211861;-1043631.730000000447035;0
6125;-743428.124000001698732;-1043615.223999999463558;0
5684;-743397.274000000208616;-1043719.995999999344349;0
5216;-743284.217999998480082;-1043325.638999998569489;0
7;-743479.000000000000000;-1042567.000000000000000;0
4973;-742480.098000001162291;-1043031.443999998271465;0
7177;-742643.059999998658895;-1044579.679999999701977;0
1306;-741783.000000000000000;-1044653.000000000000000;0
4056;-743125.315000001341105;-1043671.969999998807907;0
7121;-743339.839999999850988;-1044620.059999998658895;0
3157;-743935.576000001281500;-1042567.035000000149012;0
4818;-742949.140000000596046;-1042791.660000000149012;0
6004;-742061.723000001162291;-1043300.859999999403954;0
4621;-742536.945999998599291;-1042552.296000000089407;0
7161;-743056.383000001311302;-1044541.903999999165535;0
6257;-742381.556000001728535;-1043033.991000000387430;0
4858;-742955.339999999850988;-1042963.960000000894070;0
4239;-742454.206000000238419;-1043538.927999999374151;0
4107;-742652.458999998867512;-1043744.934000000357628;0
4459;-742274.829999998211861;-1042644.269999999552965;0
4780;-742928.596000000834465;-1042747.480000000447035;0
4676;-742792.579999998211861;-1042771.519999999552965;0
6105;-742213.883000001311302;-1043111.734000001102686;0
5232;-743347.087000001221895;-1043476.425000000745058;0
4830;-743043.449999999254942;-1042882.359999999403954;0
1272;-742237.000000000000000;-1044545.000000000000000;0
3839;-743112.140000000596046;-1042558.280000001192093;0
5745;-743415.129000000655651;-1043695.054000001400709;0
6015;-742854.607999999076128;-1043226.870999999344349;0
4580;-742393.905000001192093;-1042551.807000000029802;0
1906;-743459.000000000000000;-1044325.000000000000000;0
6370;-741968.780000001192093;-1042685.250000000000000;0
3268;-743594.046999998390675;-1042721.412999998778105;0
8242;-742568.629999998956919;-1045197.829999998211861;0
3787;-743130.989999998360872;-1042979.320000000298023;0
602;-741828.000000000000000;-1043190.000000000000000;0
2632;-743260.298999998718500;-1042362.980000000447035;0
5597;-743414.056000001728535;-1043680.309000000357628;0
6258;-742382.381999999284744;-1043032.370999999344349;0
7224;-742399.359999999403954;-1044829.829999998211861;0
5642;-743428.609999999403954;-1043688.666999999433756;0
1003;-741913.000000000000000;-1044580.000000000000000;0
4517;-742638.449999999254942;-1042779.280000001192093;0
1370;-742061.000000000000000;-1044797.000000000000000;0
3262;-743572.423999998718500;-1042699.197000000625849;0
5382;-744377.920000001788139;-1042814.201000001281500;0
1541;-742026.000000000000000;-1044034.000000000000000;0
6963;-743004.519999999552965;-1044166.870000001043081;0
3367;-743914.585000000894070;-1043020.743999999016523;0
5417;-742604.429000001400709;-1042550.491999998688698;0
3409;-743790.434999998658895;-1043040.907999999821186;0
4995;-742476.986000001430511;-1042961.239000000059605;0
3523;-744849.190999999642372;-1042676.142999999225140;0
4630;-742646.271999999880791;-1042652.089999999850988;0
3544;-744891.706999998539686;-1042640.835999999195337;0
6720;-742286.954999998211861;-1044705.997999999672174;0
733;-741963.000000000000000;-1043018.000000000000000;175
5087;-742847.622999999672174;-1043250.081000000238419;0
7647;-742319.918000001460314;-1045405.197999998927116;0
4009;-743231.157999999821186;-1044047.155000001192093;0
5002;-742561.190000001341105;-1042977.401999998837709;0
7136;-742914.329999998211861;-1044374.469999998807907;0
4954;-742405.539999999105930;-1043024.640000000596046;0
6169;-742312.320000000298023;-1043060.791999999433756;0
4073;-742939.109999999403954;-1043858.504999998956919;0
8073;-742120.640000000596046;-1045259.500000000000000;0
3656;-744550.905000001192093;-1042638.070000000298023;0
7780;-743046.243000000715256;-1045844.168999999761581;0
5205;-743251.475000001490116;-1043328.679000001400709;0
5221;-743263.820000000298023;-1043556.920000001788139;0
4982;-742559.320999998599291;-1043012.914000000804663;0
4570;-742347.760000001639128;-1042540.809999998658895;0
5389;-744380.177000001072884;-1042796.489000000059605;0
1251;-742091.000000000000000;-1044690.000000000000000;0
4895;-742596.936999998986721;-1042829.168000001460314;0
525;-742233.000000000000000;-1043884.000000000000000;0
1246;-742120.000000000000000;-1044570.000000000000000;0
3127;-743955.348000001162291;-1042668.469000000506639;0
4046;-743205.699999999254942;-1044009.719999998807907;0
1070;-741665.000000000000000;-1044736.000000000000000;0
3233;-744152.962999999523163;-1042686.791999999433756;0
586;-741966.000000000000000;-1043374.000000000000000;0
3842;-743141.300000000745058;-1042637.030000001192093;0
4777;-742910.034000001847744;-1042759.350999999791384;0
2760;-743863.331000000238419;-1043483.304000001400709;0
1349;-741824.000000000000000;-1044818.000000000000000;0
6158;-742313.261999998241663;-1043063.925999999046326;0
4324;-742269.346000000834465;-1043165.410999998450279;0
7970;-741444.739999998360872;-1044384.980000000447035;0
1219;-742137.000000000000000;-1044315.000000000000000;0
1362;-742017.000000000000000;-1044913.000000000000000;0
4845;-742978.655999999493361;-1042776.048000000417233;0
6243;-742367.739999998360872;-1043061.098000001162291;0
3344;-743932.276000000536442;-1043064.493999999016523;0
4528;-742714.350000001490116;-1042840.010000001639128;0
2690;-743516.828000001609325;-1042088.217999998480082;0
3265;-743560.760000001639128;-1042741.429000001400709;0
4007;-743275.230999998748302;-1044049.184999998658895;0
6267;-742344.767999999225140;-1043019.272999998182058;0
1406;-741663.000000000000000;-1044277.000000000000000;0
7729;-742623.480999998748302;-1044601.217000000178814;0
3578;-744924.046000000089407;-1042547.359000001102686;0
4020;-743160.616000000387430;-1043872.782999999821186;0
1677;-741109.160000000149012;-1044522.699999999254942;0
3483;-745211.359999999403954;-1042783.331000000238419;0
3141;-744035.420000001788139;-1042680.460000000894070;0
1663;-741455.000000000000000;-1044433.000000000000000;0
6162;-742310.199999999254942;-1043058.306000001728535;0
5510;-743424.346000000834465;-1043626.458999998867512;0
462;-741707.000000000000000;-1043294.000000000000000;0
3308;-743813.059999998658895;-1042830.515000000596046;0
350;-742505.000000000000000;-1043757.000000000000000;0
5736;-743414.859999999403954;-1043691.462999999523163;0
6501;-741689.493000000715256;-1044942.905000001192093;0
4248;-742157.039999999105930;-1043376.699999999254942;0
3830;-743013.879999998956919;-1042612.359999999403954;0
2537;-741975.000000000000000;-1044131.000000000000000;0
4703;-742697.859000001102686;-1042783.011999998241663;0
4753;-742764.600000001490116;-1042761.899999998509884;0
5207;-743208.434999998658895;-1043365.236999999731779;0
4151;-742573.039999999105930;-1044109.035000000149012;0
110;-744127.000000000000000;-1042724.000000000000000;0
5996;-742061.879000000655651;-1043284.276999998837709;0
202;-743240.000000000000000;-1043597.000000000000000;0
4749;-742884.420000001788139;-1042760.329999998211861;0
6432;-742029.997999999672174;-1043511.272999998182058;0
819;-741987.000000000000000;-1042599.000000000000000;0
6157;-742314.026999998837709;-1043065.331000000238419;0
4461;-742218.370000001043081;-1042583.800000000745058;0
4825;-742908.839999999850988;-1042860.670000001788139;0
5993;-743947.829999998211861;-1042646.350000001490116;0
6119;-743582.679999999701977;-1042696.969999998807907;0
6244;-742368.587000001221895;-1043059.245999999344349;0
6171;-742310.780999999493361;-1043057.971000000834465;0
3809;-742980.300000000745058;-1042944.469999998807907;0
4974;-742489.458999998867512;-1043047.024999998509884;0
190;-743443.000000000000000;-1043597.000000000000000;0
115;-745228.000000000000000;-1042764.000000000000000;0
1363;-742095.000000000000000;-1044934.000000000000000;0
7290;-742819.100000001490116;-1044794.800000000745058;0
4085;-742812.431000001728535;-1043657.114000000059605;0
5166;-743202.493000000715256;-1043412.614999998360872;0
1117;-741066.000000000000000;-1044603.000000000000000;0
4803;-743043.410999998450279;-1042699.506000000983477;0
3465;-745090.089999999850988;-1042676.664999999105930;0
7016;-742557.515000000596046;-1044334.074999999254942;0
3101;-743922.754999998956919;-1042745.195000000298023;0
823;-742110.000000000000000;-1042596.000000000000000;0
4854;-742971.159000001847744;-1042912.429000001400709;0
384;-742471.000000000000000;-1043766.000000000000000;0
6997;-743109.160000000149012;-1044453.600000001490116;0
3998;-743432.704999998211861;-1043914.274999998509884;0
5022;-742578.440000001341105;-1042849.350000001490116;0
7144;-742803.668999999761581;-1044378.798999998718500;0
3841;-743159.929999999701977;-1042641.120000001043081;0
4946;-742411.739000000059605;-1043002.199999999254942;0
3796;-743161.100000001490116;-1042834.149999998509884;0
7026;-743217.644999999552965;-1044082.329999998211861;0
1372;-742118.000000000000000;-1044815.000000000000000;0
5162;-743180.460999999195337;-1043323.660000000149012;0
650;-742263.000000000000000;-1043381.000000000000000;0
2543;-741788.000000000000000;-1044237.000000000000000;0
5455;-742823.936000000685453;-1043283.644999999552965;0
1321;-741825.000000000000000;-1044923.000000000000000;0
4989;-742648.756000000983477;-1043019.318999998271465;0
5681;-743400.820000000298023;-1043718.682000000029802;0
4934;-742433.807000000029802;-1042730.874000001698732;0
1483;-741252.000000000000000;-1044224.000000000000000;0
5994;-743358.609999999403954;-1043460.469999998807907;0
7644;-742295.089000001549721;-1045373.164999999105930;0
7986;-741040.829999998211861;-1044408.250000000000000;0
