OID_;X;Y;TEMPERATURE
7077;-743564.359000001102686;-1045385.210000000894070;0
5995;-744441.440999999642372;-1042779.568999998271465;0
3527;-744805.695999998599291;-1042671.809000000357628;0
3538;-744616.304000001400709;-1042656.734000001102686;0
3585;-744920.065000001341105;-1042522.129999998956919;0
3460;-744993.289000000804663;-1042693.587000001221895;0
3466;-745113.802000001072884;-1042675.725000001490116;0
3612;-744996.545000001788139;-1042292.646000001579523;0
2892;-744005.317000001668930;-1043204.537000000476837;0
3752;-743213.949999999254942;-1042902.719999998807907;0
3706;-744567.589999999850988;-1042534.585000000894070;0
3537;-744632.945000000298023;-1042671.657000001519918;0
7;-743479.000000000000000;-1042567.000000000000000;0
514;-742119.000000000000000;-1043141.000000000000000;0
3068;-744158.921000000089407;-1042812.230999998748302;0
1584;-742368.000000000000000;-1044717.000000000000000;0
2520;-741847.000000000000000;-1045324.000000000000000;0
1248;-742109.000000000000000;-1044631.000000000000000;0
2276;-742865.000000000000000;-1045649.000000000000000;0
4070;-742925.285000000149012;-1043783.565000001341105;0
6119;-743582.679999999701977;-1042696.969999998807907;0
7155;-742920.776999998837709;-1044546.934000000357628;0
2758;-743919.949999999254942;-1043488.059999998658895;0
7397;-743021.859999999403954;-1045682.989999998360872;0
2209;-743309.000000000000000;-1045217.000000000000000;0
1984;-743476.000000000000000;-1044743.000000000000000;0
725;-741983.000000000000000;-1042939.000000000000000;0
2189;-743472.000000000000000;-1045183.000000000000000;0
1527;-741676.000000000000000;-1043775.000000000000000;0
885;-741739.000000000000000;-1042777.000000000000000;0
3204;-743715.278999999165535;-1042506.118999999016523;0
6708;-742268.296999998390675;-1044748.438000001013279;0
7018;-742577.747000001370907;-1044239.712999999523163;0
1487;-741117.000000000000000;-1044216.000000000000000;0
1872;-743422.000000000000000;-1044246.000000000000000;0
1029;-741978.000000000000000;-1044721.000000000000000;0
7170;-742667.579999998211861;-1044492.469999998807907;0
1296;-742100.000000000000000;-1044473.000000000000000;0
4208;-742372.416999999433756;-1043503.423000000417233;0
4878;-742876.434000000357628;-1042964.004000000655651;0
3843;-743139.170000001788139;-1042650.050000000745058;86
2007;-743231.000000000000000;-1044741.000000000000000;0
1514;-741882.000000000000000;-1044096.000000000000000;0
512;-742063.000000000000000;-1043136.000000000000000;0
2075;-743114.000000000000000;-1044772.000000000000000;0
505;-741917.000000000000000;-1043153.000000000000000;0
6121;-742069.784000001847744;-1043299.828000001609325;0
3889;-742335.008999999612570;-1042489.949000000953674;0
1621;-742467.000000000000000;-1044322.000000000000000;0
1395;-741799.000000000000000;-1044291.000000000000000;0
1775;-741246.000000000000000;-1044012.000000000000000;0
6980;-743071.769999999552965;-1044387.548999998718500;0
737;-741849.000000000000000;-1043021.000000000000000;37
8076;-742050.429999999701977;-1045256.199999999254942;0
599;-741837.000000000000000;-1043243.000000000000000;0
4120;-742715.179999999701977;-1043974.089999999850988;0
2383;-742220.000000000000000;-1045517.000000000000000;0
709;-741861.000000000000000;-1042862.000000000000000;0
1471;-741711.000000000000000;-1044132.000000000000000;0
2306;-742392.000000000000000;-1045461.000000000000000;0
745;-741649.000000000000000;-1042968.000000000000000;0
4235;-742390.041999999433756;-1043492.094999998807907;0
3228;-744128.969999998807907;-1042651.059000000357628;0
7515;-742273.021999999880791;-1044371.543999999761581;0
672;-742484.000000000000000;-1043226.000000000000000;0
3107;-743778.888000000268221;-1042682.131999999284744;0
3274;-743652.714999999850988;-1042812.727000001817942;0
2477;-741238.370000001043081;-1044535.289999999105930;0
5267;-743190.021999999880791;-1043149.807000000029802;0
1941;-743267.000000000000000;-1044384.000000000000000;0
988;-741820.000000000000000;-1044516.000000000000000;0
927;-742021.000000000000000;-1043498.000000000000000;0
3759;-743267.609999999403954;-1042971.300000000745058;0
8281;-742164.160000000149012;-1042778.140000000596046;0
6606;-741654.631999999284744;-1043906.848000001162291;0
379;-742479.000000000000000;-1043679.000000000000000;342
4464;-742182.309999998658895;-1042571.379999998956919;0
1414;-741627.000000000000000;-1044593.000000000000000;0
1171;-741882.000000000000000;-1044375.000000000000000;0
1432;-741958.000000000000000;-1044285.000000000000000;0
5295;-743047.995000001043081;-1043185.530000001192093;0
5240;-743364.164000000804663;-1043254.934000000357628;0
1521;-741808.000000000000000;-1043917.000000000000000;3
2332;-742899.000000000000000;-1045516.000000000000000;0
5408;-743696.881000000983477;-1042878.024999998509884;0
2400;-742087.000000000000000;-1045374.000000000000000;0
7008;-742899.559999998658895;-1044224.074999999254942;0
2486;-741289.250000000000000;-1044848.829999998211861;0
4144;-742704.414999999105930;-1043822.484999999403954;0
7809;-741981.809999998658895;-1044560.280000001192093;0
7022;-743155.660000000149012;-1044074.410000000149012;0
3769;-742978.969999998807907;-1042975.300000000745058;0
1629;-742450.000000000000000;-1044518.000000000000000;0
1491;-741057.000000000000000;-1044333.000000000000000;0
2223;-743053.000000000000000;-1045437.000000000000000;0
8045;-742173.070000000298023;-1044806.519999999552965;0
4498;-741866.120000001043081;-1042718.471000000834465;0
4213;-742218.094999998807907;-1043529.954999998211861;0
1763;-741167.000000000000000;-1044108.000000000000000;0
7031;-743301.824999999254942;-1044080.774999998509884;0
7038;-743316.394999999552965;-1044240.155000001192093;0
4075;-742947.934999998658895;-1043903.649999998509884;0
1320;-741870.000000000000000;-1044957.000000000000000;0
6726;-742476.517999999225140;-1044410.600000001490116;0
1369;-742029.000000000000000;-1044788.000000000000000;0
3313;-743774.447000000625849;-1042903.081999998539686;0
5165;-743191.168000001460314;-1043398.304000001400709;0
2289;-742915.000000000000000;-1045426.000000000000000;0
1289;-742211.000000000000000;-1044521.000000000000000;0
7260;-742953.010000001639128;-1044873.530000001192093;0
3811;-743244.620000001043081;-1042809.420000001788139;0
2248;-743201.000000000000000;-1045423.000000000000000;0
6240;-742364.495999999344349;-1043067.289999999105930;0
7094;-743370.620000001043081;-1044578.289999999105930;0
590;-741935.000000000000000;-1043331.000000000000000;0
836;-742006.000000000000000;-1042525.000000000000000;0
4071;-742929.394999999552965;-1043807.585000000894070;0
914;-741715.000000000000000;-1042583.000000000000000;0
1547;-742220.000000000000000;-1044181.000000000000000;0
630;-742179.000000000000000;-1043289.000000000000000;0
4341;-742488.855000000447035;-1043325.412999998778105;0
524;-742255.000000000000000;-1043913.000000000000000;0
2216;-743108.000000000000000;-1045349.000000000000000;0
1426;-742056.000000000000000;-1044228.000000000000000;0
1767;-741261.000000000000000;-1044168.000000000000000;0
4921;-742444.739999998360872;-1042908.420000001788139;0
7659;-742336.048000000417233;-1045327.868000000715256;0
7943;-742063.449999999254942;-1044055.260000001639128;0
3847;-743122.146999999880791;-1042525.489999998360872;0
7782;-743012.350000001490116;-1045871.938999999314547;0
4517;-742638.449999999254942;-1042779.280000001192093;0
2474;-743439.000000000000000;-1044900.000000000000000;0
6658;-741538.879999998956919;-1044165.440000001341105;0
1811;-743175.000000000000000;-1044525.000000000000000;0
1660;-741423.000000000000000;-1044818.000000000000000;0
2641;-743432.578999999910593;-1042583.418999999761581;0
4511;-742539.859999999403954;-1042744.070000000298023;0
2372;-742466.000000000000000;-1045488.000000000000000;0
4151;-742573.039999999105930;-1044109.035000000149012;0
4689;-742688.114999998360872;-1042568.859999999403954;0
1217;-742120.000000000000000;-1044339.000000000000000;190
1729;-741449.000000000000000;-1045068.000000000000000;0
6613;-741749.640000000596046;-1044032.820000000298023;0
2318;-742763.000000000000000;-1045470.000000000000000;0
5724;-743422.230999998748302;-1043632.715999998152256;0
1701;-741378.000000000000000;-1044678.000000000000000;0
1994;-743483.000000000000000;-1045010.000000000000000;0
4906;-742448.370000001043081;-1042815.789999999105930;0
8263;-742151.089999999850988;-1042702.239999998360872;0
6360;-742004.925000000745058;-1042692.804000001400709;0
1017;-742167.000000000000000;-1044603.000000000000000;0
1376;-742165.000000000000000;-1044873.000000000000000;0
4576;-742354.388000000268221;-1042588.285999998450279;0
1538;-741948.000000000000000;-1043973.000000000000000;0
1794;-742151.000000000000000;-1044190.000000000000000;0
1106;-741293.000000000000000;-1044589.000000000000000;0
296;-742950.170000001788139;-1044097.429999999701977;0
4846;-742981.635999999940395;-1042805.254000000655651;0
6997;-743109.160000000149012;-1044453.600000001490116;0
8057;-742238.839999999850988;-1045047.489999998360872;0
1545;-742236.000000000000000;-1044234.000000000000000;0
4019;-743157.434999998658895;-1043897.410000000149012;0
3959;-743417.421999998390675;-1043577.730000000447035;0
2132;-743058.000000000000000;-1045118.000000000000000;0
1456;-741513.000000000000000;-1044437.000000000000000;0
1838;-743004.480000000447035;-1044216.030000001192093;0
1586;-742372.000000000000000;-1044785.000000000000000;0
1388;-742152.000000000000000;-1045026.000000000000000;0
8071;-742174.120000001043081;-1045257.530000001192093;0
5371;-742052.149999998509884;-1043011.940000001341105;0
2483;-741266.219999998807907;-1044755.030000001192093;0
3947;-743403.787999998778105;-1043488.118999999016523;0
909;-742183.000000000000000;-1042503.000000000000000;0
677;-742425.000000000000000;-1043200.000000000000000;0
3415;-743772.855999998748302;-1043081.368000000715256;0
5112;-742942.920000001788139;-1043441.850000001490116;0
6704;-742282.179999999701977;-1044623.793999999761581;0
4178;-742382.640000000596046;-1044160.138000000268221;0
4331;-742391.967999998480082;-1043310.539000000804663;0
280;-743053.000000000000000;-1043875.000000000000000;0
4589;-742408.243000000715256;-1042542.631999999284744;0
3768;-743006.370000001043081;-1042978.829999998211861;0
504;-741937.000000000000000;-1043164.000000000000000;0
395;-742369.000000000000000;-1043840.000000000000000;0
5143;-743052.232000000774860;-1043454.120000001043081;0
7020;-743104.175000000745058;-1044078.344999998807907;0
1628;-742449.000000000000000;-1044494.000000000000000;0
7142;-742872.445000000298023;-1044472.239999998360872;0
5022;-742578.440000001341105;-1042849.350000001490116;0
3974;-743140.660000000149012;-1043725.350000001490116;0
1590;-742377.000000000000000;-1044885.000000000000000;0
6843;-741569.070000000298023;-1044975.261999998241663;0
79;-744062.000000000000000;-1043257.000000000000000;0
2495;-741982.000000000000000;-1044140.000000000000000;0
626;-742236.000000000000000;-1043317.000000000000000;0
6370;-741968.780000001192093;-1042685.250000000000000;0
1920;-743384.000000000000000;-1044363.000000000000000;0
1312;-741659.000000000000000;-1044848.000000000000000;0
4504;-742387.329999998211861;-1042714.820000000298023;0
2322;-742651.000000000000000;-1045483.000000000000000;0
2308;-742345.000000000000000;-1045499.000000000000000;0
1327;-742001.000000000000000;-1045024.000000000000000;0
3208;-743682.739000000059605;-1042488.668999999761581;0
1592;-742378.000000000000000;-1044936.000000000000000;0
5230;-743335.399999998509884;-1043517.670000001788139;0
4731;-742802.002999998629093;-1042654.546000000089407;0
1269;-742246.000000000000000;-1044462.000000000000000;0
1218;-742120.000000000000000;-1044309.000000000000000;0
6689;-742384.449999999254942;-1045033.609999999403954;0
3348;-743960.361000001430511;-1043015.629999998956919;0
3323;-743934.361999999731779;-1042945.002999998629093;0
5695;-743417.217999998480082;-1043638.749000001698732;0
3171;-743937.730000000447035;-1042607.039999999105930;0
347;-742542.000000000000000;-1043795.000000000000000;0
1305;-741826.000000000000000;-1044678.000000000000000;0
5231;-743342.107000000774860;-1043497.627000000327826;0
2466;-743460.000000000000000;-1044740.000000000000000;0
3393;-743910.969999998807907;-1043143.960000000894070;0
5111;-742892.337999999523163;-1043424.370999999344349;0
7661;-742294.495999999344349;-1045349.482000000774860;0
4054;-743269.304999999701977;-1043797.405000001192093;0
4984;-742580.537999998778105;-1043025.210999999195337;0
4964;-742390.059999998658895;-1043044.839999999850988;0
4169;-742414.420000001788139;-1043962.329999998211861;0
6560;-741301.682000000029802;-1043959.640000000596046;0
4528;-742714.350000001490116;-1042840.010000001639128;0
4633;-742625.931000001728535;-1042639.918999999761581;0
7318;-742578.910000000149012;-1045033.530000001192093;0
1561;-743186.000000000000000;-1045098.000000000000000;0
330;-742659.000000000000000;-1044043.000000000000000;0
6258;-742382.381999999284744;-1043032.370999999344349;0
297;-742938.000000000000000;-1044069.000000000000000;0
7045;-743400.745000001043081;-1044160.004999998956919;0
7246;-742736.730000000447035;-1044825.399999998509884;0
7543;-742606.199999999254942;-1045375.109999999403954;0
5744;-743412.905999999493361;-1043695.221000000834465;0
794;-741746.000000000000000;-1042595.000000000000000;0
467;-741757.000000000000000;-1043352.000000000000000;0
4561;-742458.059999998658895;-1042497.190000001341105;0
2143;-742859.000000000000000;-1045086.000000000000000;0
1123;-741734.000000000000000;-1044442.000000000000000;0
5456;-742761.041000001132488;-1043254.350999999791384;0
7732;-742611.719000000506639;-1044632.203999999910593;0
2211;-743248.000000000000000;-1045258.000000000000000;0
6241;-742365.649999998509884;-1043065.059999998658895;0
1982;-743408.000000000000000;-1044646.000000000000000;0
3942;-743420.800000000745058;-1043492.339999999850988;0
6255;-742379.991999998688698;-1043037.068999998271465;0
274;-743359.000000000000000;-1043833.000000000000000;0
5087;-742847.622999999672174;-1043250.081000000238419;0
550;-742276.000000000000000;-1043746.000000000000000;0
5139;-743032.489999998360872;-1043533.679999999701977;0
307;-742781.000000000000000;-1044143.000000000000000;0
5042;-742731.719000000506639;-1042890.517000000923872;0
3800;-743098.550000000745058;-1042863.019999999552965;0
1494;-741173.000000000000000;-1044326.000000000000000;0
6189;-742312.041999999433756;-1043057.302000001072884;0
5204;-743246.423999998718500;-1043308.298999998718500;0
701;-742023.000000000000000;-1042885.000000000000000;0
304;-742868.000000000000000;-1044122.000000000000000;0
1089;-741567.949999999254942;-1044538.820000000298023;0
323;-742711.000000000000000;-1044140.000000000000000;0
1478;-741443.000000000000000;-1044220.000000000000000;0
4831;-743041.170000001788139;-1042862.530000001192093;0
1993;-743483.000000000000000;-1044984.000000000000000;0
4087;-742811.609999999403954;-1043604.190000001341105;0
1904;-743459.000000000000000;-1044297.000000000000000;0
181;-743421.000000000000000;-1043350.000000000000000;0
5999;-741991.910000000149012;-1043282.079999998211861;0
5677;-743405.545000001788139;-1043716.931000001728535;0
2151;-742827.000000000000000;-1045047.000000000000000;0
210;-743112.000000000000000;-1043566.000000000000000;0
1057;-741686.000000000000000;-1045058.000000000000000;0
5591;-743421.353999998420477;-1043679.738000001758337;0
335;-742635.000000000000000;-1043966.000000000000000;0
4029;-743130.695999998599291;-1043815.427999999374151;0
6320;-741766.848000001162291;-1042614.989999998360872;0
3090;-743913.418999999761581;-1042804.416999999433756;0
2329;-742432.000000000000000;-1045508.000000000000000;0
1911;-743449.000000000000000;-1044447.000000000000000;0
3920;-743907.039000000804663;-1043516.331000000238419;0
4818;-742949.140000000596046;-1042791.660000000149012;0
3832;-743029.390000000596046;-1042595.910000000149012;0
6233;-742319.057000000029802;-1043072.162999998778105;0
4538;-742291.464000001549721;-1042734.344000000506639;0
844;-742138.000000000000000;-1042519.000000000000000;0
1697;-741495.000000000000000;-1044664.000000000000000;0
943;-742292.000000000000000;-1043017.000000000000000;0
6153;-742309.583999998867512;-1043058.640999998897314;0
2514;-742546.000000000000000;-1044431.000000000000000;0
4064;-742879.655000001192093;-1043647.420000001788139;0
1967;-743405.000000000000000;-1044770.000000000000000;0
4143;-742750.925000000745058;-1044017.960000000894070;0
2431;-742498.000000000000000;-1045094.000000000000000;0
5959;-742962.548999998718500;-1043523.155000001192093;0
1680;-741122.809999998658895;-1044628.710000000894070;0
5292;-743055.866000000387430;-1043215.710999999195337;0
5317;-743063.690000001341105;-1043053.769999999552965;0
5015;-742575.741000000387430;-1043008.607999999076128;0
4332;-742410.359000001102686;-1043282.916000001132488;0
6794;-741124.372999999672174;-1044792.221000000834465;0
4426;-742197.589999999850988;-1043031.679999999701977;0
6149;-742312.646000001579523;-1043064.261999998241663;0
2458;-741019.000000000000000;-1044567.000000000000000;0
1820;-743006.000000000000000;-1044272.000000000000000;0
6167;-742313.859999999403954;-1043063.607000000774860;0
4909;-742383.146000001579523;-1042799.159000001847744;0
649;-742233.000000000000000;-1043382.000000000000000;0
2691;-743451.850000001490116;-1042126.063999999314547;0
6833;-741571.423000000417233;-1044909.473999999463558;0
5708;-743418.927999999374151;-1043640.519000001251698;0
4808;-743110.859999999403954;-1042784.829999998211861;0
5217;-743306.870999999344349;-1043323.228000000119209;0
4248;-742157.039999999105930;-1043376.699999999254942;0
5026;-742631.168999999761581;-1042903.938999999314547;0
1460;-741482.000000000000000;-1044302.000000000000000;0
1379;-742135.000000000000000;-1044975.000000000000000;0
2560;-741251.000000000000000;-1044390.000000000000000;0
2134;-743028.000000000000000;-1045111.000000000000000;0
5756;-743426.113000001758337;-1043680.102000001817942;0
5596;-743415.271999999880791;-1043680.212999999523163;0
202;-743240.000000000000000;-1043597.000000000000000;0
65;-743542.000000000000000;-1042056.000000000000000;0
7284;-742811.789999999105930;-1044718.210000000894070;0
580;-742010.000000000000000;-1043443.000000000000000;0
1228;-742220.539999999105930;-1044250.829999998211861;0
6156;-742314.791999999433756;-1043066.736000001430511;0
569;-742096.000000000000000;-1043601.000000000000000;0
7976;-741301.260000001639128;-1044401.750000000000000;0
1362;-742017.000000000000000;-1044913.000000000000000;0
5595;-743416.488000001758337;-1043680.118999999016523;0
389;-742408.000000000000000;-1043783.000000000000000;0
264;-743367.000000000000000;-1043732.000000000000000;0
2166;-743016.000000000000000;-1045179.000000000000000;0
522;-742261.000000000000000;-1043122.000000000000000;0
1652;-741379.000000000000000;-1044550.000000000000000;0
5024;-742588.655000001192093;-1042886.519000001251698;0
8285;-742232.780000001192093;-1042821.149999998509884;0
277;-743398.000000000000000;-1043928.000000000000000;0
4750;-742784.420000001788139;-1042733.429999999701977;0
1014;-742097.000000000000000;-1044586.000000000000000;0
6186;-742314.337999999523163;-1043061.517000000923872;0
3177;-743877.122000001370907;-1042630.761999998241663;0
6868;-741665.079999998211861;-1045344.670000001788139;0
4983;-742587.776000000536442;-1043013.068999998271465;0
6660;-741490.809999998658895;-1044176.750000000000000;0
5508;-743426.105999998748302;-1043645.960999999195337;0
1932;-743359.000000000000000;-1044408.000000000000000;0
3989;-743307.815000001341105;-1044034.914999999105930;0
6135;-742308.289000000804663;-1043059.340999998152256;0
4839;-742984.162000000476837;-1042715.425000000745058;0
2045;-743418.000000000000000;-1044961.000000000000000;0
7344;-742653.460000000894070;-1045190.980000000447035;0
178;-743389.000000000000000;-1043251.000000000000000;0
5129;-743046.677000001072884;-1043376.409000001847744;0
1319;-741788.000000000000000;-1044905.000000000000000;0
1603;-742525.000000000000000;-1044922.000000000000000;0
697;-742101.000000000000000;-1042908.000000000000000;0
2018;-743244.000000000000000;-1044909.000000000000000;0
2389;-742076.000000000000000;-1045396.000000000000000;0
6223;-742316.076000001281500;-1043058.679000001400709;0
5121;-742889.114000000059605;-1043362.250000000000000;0
4935;-742447.241999998688698;-1042699.399000000208616;0
6693;-742248.197000000625849;-1044816.127000000327826;0
3210;-743664.019000001251698;-1042478.668999999761581;0
4080;-742832.480000000447035;-1043782.030000001192093;0
7187;-742595.019999999552965;-1044739.962000001221895;0
2108;-743147.000000000000000;-1045086.000000000000000;0
4681;-742756.870000001043081;-1042844.710000000894070;0
7221;-742394.890000000596046;-1044813.550000000745058;0
1399;-741736.000000000000000;-1044167.000000000000000;0
624;-742241.000000000000000;-1043343.000000000000000;0
1083;-741667.000000000000000;-1044526.000000000000000;0
4327;-742333.449000000953674;-1043399.671000000089407;0
1405;-741681.000000000000000;-1044325.000000000000000;0
1347;-741791.000000000000000;-1044816.000000000000000;0
7150;-742820.427000001072884;-1044516.962000001221895;0
7146;-742819.425000000745058;-1044426.225000001490116;0
1394;-741822.000000000000000;-1044310.000000000000000;0
6257;-742381.556000001728535;-1043033.991000000387430;0
206;-743179.000000000000000;-1043581.000000000000000;0
6124;-743427.861999999731779;-1043609.043000001460314;0
4004;-743345.877000000327826;-1044053.135999999940395;0
5709;-743420.221999999135733;-1043640.467999998480082;0
3127;-743955.348000001162291;-1042668.469000000506639;0
560;-742181.000000000000000;-1043665.000000000000000;0
6293;-742666.339999999850988;-1042695.188999999314547;0
220;-742969.000000000000000;-1043530.000000000000000;0
8018;-741974.039999999105930;-1044442.870000001043081;0
1363;-742095.000000000000000;-1044934.000000000000000;0
5141;-743039.598000001162291;-1043495.265000000596046;0
2156;-742796.000000000000000;-1045184.000000000000000;0
5110;-742876.271999999880791;-1043449.013000000268221;0
1455;-741517.000000000000000;-1044468.000000000000000;0
6174;-742316.021999999880791;-1043066.065000001341105;0
1821;-742995.000000000000000;-1044239.000000000000000;0
1658;-741404.000000000000000;-1044751.000000000000000;0
6505;-741746.570000000298023;-1044600.429999999701977;0
8283;-742198.600000001490116;-1042801.980000000447035;0
4141;-742804.644999999552965;-1044008.964999999850988;0
4122;-742732.074999999254942;-1043923.995000001043081;0
1159;-741137.000000000000000;-1044493.000000000000000;0
5149;-743072.195999998599291;-1043377.370999999344349;0
6265;-742353.164999999105930;-1043020.054999999701977;0
7696;-742416.806000001728535;-1045134.280000001192093;0
4136;-742726.225000001490116;-1044089.829999998211861;0
4040;-743224.710000000894070;-1043766.050000000745058;0
5941;-742044.835000000894070;-1043561.903999999165535;0
2368;-742507.000000000000000;-1045456.000000000000000;0
4753;-742764.600000001490116;-1042761.899999998509884;0
700;-742008.000000000000000;-1042895.000000000000000;0
5726;-743422.414000000804663;-1043635.760999999940395;0
4764;-742839.835999999195337;-1042859.412999998778105;0
1413;-741631.000000000000000;-1044621.000000000000000;0
1358;-741950.000000000000000;-1044887.000000000000000;0
4799;-743008.011999998241663;-1042697.245999999344349;0
1049;-741795.000000000000000;-1044923.000000000000000;0
4220;-742214.344999998807907;-1043580.359999999403954;0
529;-742162.000000000000000;-1043803.000000000000000;0
4716;-742893.160000000149012;-1042622.780000001192093;0
399;-742339.000000000000000;-1043884.000000000000000;0
4650;-742749.989000000059605;-1042534.539999999105930;0
619;-742229.000000000000000;-1043277.000000000000000;0
1724;-741478.000000000000000;-1045023.000000000000000;0
4596;-742597.181000001728535;-1042670.653000000864267;0
921;-743338.000000000000000;-1043818.000000000000000;0
4848;-742977.940000001341105;-1042862.019999999552965;0
6225;-742314.519999999552965;-1043055.927000001072884;0
7349;-742516.719999998807907;-1045170.359999999403954;0
5637;-743428.151000000536442;-1043682.633999999612570;0
4698;-742673.530000001192093;-1042715.780000001192093;0
7088;-743335.559999998658895;-1044546.359999999403954;0
3983;-743317.089999999850988;-1043883.160000000149012;0
4026;-743178.984999999403954;-1043847.989999998360872;0
4570;-742347.760000001639128;-1042540.809999998658895;0
785;-741702.000000000000000;-1042622.000000000000000;0
4427;-742190.519999999552965;-1043099.440000001341105;0
3108;-743768.699999999254942;-1042671.241999998688698;0
4251;-742136.420000001788139;-1043379.969999998807907;0
5146;-743064.554000001400709;-1043452.671999998390675;0
7136;-742914.329999998211861;-1044374.469999998807907;0
4807;-743122.570000000298023;-1042767.850000001490116;0
5643;-743428.701999999582767;-1043689.872999999672174;0
6483;-741773.829999998211861;-1044640.969000000506639;0
4117;-742733.614999998360872;-1044043.129999998956919;0
1610;-742374.000000000000000;-1044447.000000000000000;0
3988;-743309.704999998211861;-1044008.570000000298023;0
7744;-742941.256999999284744;-1045533.171000000089407;0
5700;-743416.574000000953674;-1043630.223999999463558;0
2435;-742452.000000000000000;-1044222.000000000000000;0
4106;-742664.475000001490116;-1043755.761999998241663;0
1036;-741961.000000000000000;-1044922.000000000000000;0
6572;-741295.410000000149012;-1044112.980000000447035;0
7173;-742660.850000001490116;-1044535.730000000447035;0
6823;-741313.910000000149012;-1044788.510000001639128;0
5224;-743293.449999999254942;-1043542.160000000149012;0
1155;-741208.000000000000000;-1044484.000000000000000;0
2059;-742625.000000000000000;-1044459.000000000000000;0
3981;-743341.517000000923872;-1043837.353999998420477;0
984;-741917.000000000000000;-1044411.000000000000000;0
1055;-741747.000000000000000;-1045038.000000000000000;0
4829;-743051.579999998211861;-1042916.609999999403954;0
4526;-742696.690000001341105;-1042823.320000000298023;0
1059;-741637.000000000000000;-1045095.000000000000000;0
4587;-742482.011999998241663;-1042641.392999999225140;0
6294;-742653.550000000745058;-1042686.140000000596046;0
3065;-744092.028999999165535;-1042868.519000001251698;0
4605;-742489.238000001758337;-1042616.754999998956919;0
7277;-742796.870000001043081;-1044653.429999999701977;0
6830;-741526.739999998360872;-1044761.309000000357628;0
6227;-742319.839999999850988;-1043063.936000000685453;0
6250;-742374.638999998569489;-1043047.576999999582767;0
6504;-741755.193999998271465;-1044619.083000000566244;0
4701;-742687.780000001192093;-1042761.660000000149012;0
4342;-742506.473000001162291;-1043301.100000001490116;0
9;-743512.000000000000000;-1042512.000000000000000;0
4951;-742335.579999998211861;-1042934.429999999701977;0
3756;-743319.230000000447035;-1042949.019999999552965;0
344;-742557.000000000000000;-1043847.000000000000000;0
4769;-742881.932000000029802;-1042923.590999998152256;0
4168;-742423.695000000298023;-1043984.135000001639128;0
4057;-743132.184999998658895;-1043648.719999998807907;0
840;-742067.000000000000000;-1042522.000000000000000;0
5419;-742434.690000001341105;-1042846.280000001192093;0
4721;-742883.219999998807907;-1042605.010000001639128;0
973;-741908.000000000000000;-1044547.000000000000000;0
4586;-742464.175000000745058;-1042636.333999998867512;0
4903;-742493.579999998211861;-1042816.620000001043081;0
1484;-741219.000000000000000;-1044224.000000000000000;0
1441;-741744.000000000000000;-1044392.000000000000000;0
2543;-741788.000000000000000;-1044237.000000000000000;0
6450;-743166.964999999850988;-1043776.383999999612570;0
2084;-742447.000000000000000;-1044797.000000000000000;0
4996;-742488.458999998867512;-1042974.723999999463558;0
6839;-741723.412000000476837;-1044988.993000000715256;0
2523;-742181.000000000000000;-1044140.000000000000000;0
4325;-742270.679000001400709;-1043141.787999998778105;0
207;-743142.000000000000000;-1043590.000000000000000;0
6138;-742313.561999998986721;-1043067.399000000208616;0
650;-742263.000000000000000;-1043381.000000000000000;0
