OID_;X;Y;TEMPERATURE
8;-743496.000000000000000;-1042539.000000000000000;178
502;-741901.000000000000000;-1043169.000000000000000;0
1531;-741782.000000000000000;-1043838.000000000000000;0
6872;-741751.719999998807907;-1045296.679999999701977;0
1629;-742450.000000000000000;-1044518.000000000000000;0
6448;-744017.179999999701977;-1043123.899999998509884;0
3068;-744158.921000000089407;-1042812.230999998748302;0
2050;-743460.000000000000000;-1045072.000000000000000;0
31;-743485.000000000000000;-1042645.000000000000000;0
7077;-743564.359000001102686;-1045385.210000000894070;0
3389;-743919.920000001788139;-1043153.510000001639128;0
7706;-742313.239999998360872;-1044319.611999999731779;0
4063;-742855.079999998211861;-1043654.695000000298023;0
1287;-742217.000000000000000;-1044486.000000000000000;0
1986;-743480.000000000000000;-1044794.000000000000000;0
79;-744062.000000000000000;-1043257.000000000000000;0
4146;-742666.940000001341105;-1043854.829999998211861;0
2403;-742211.000000000000000;-1045436.000000000000000;0
3811;-743244.620000001043081;-1042809.420000001788139;0
2256;-743156.000000000000000;-1045353.000000000000000;0
6603;-741616.600000001490116;-1043854.019999999552965;0
7026;-743217.644999999552965;-1044082.329999998211861;0
7514;-742304.866000000387430;-1044375.124000001698732;0
2135;-743006.000000000000000;-1045119.000000000000000;0
5995;-744441.440999999642372;-1042779.568999998271465;0
885;-741739.000000000000000;-1042777.000000000000000;0
4025;-743202.881000000983477;-1043852.008000001311302;0
351;-742509.000000000000000;-1043739.000000000000000;0
1584;-742368.000000000000000;-1044717.000000000000000;0
6996;-743116.699999999254942;-1044476.469999998807907;0
2755;-744003.879000000655651;-1043471.734000001102686;0
2328;-742459.000000000000000;-1045505.000000000000000;0
1669;-741077.000000000000000;-1044092.000000000000000;0
512;-742063.000000000000000;-1043136.000000000000000;121
2103;-743182.000000000000000;-1044931.000000000000000;0
6823;-741313.910000000149012;-1044788.510000001639128;0
741;-741730.000000000000000;-1043035.000000000000000;0
599;-741837.000000000000000;-1043243.000000000000000;0
2325;-742559.000000000000000;-1045494.000000000000000;0
2524;-742108.000000000000000;-1044191.000000000000000;0
3760;-743233.829999998211861;-1042978.739999998360872;0
6843;-741569.070000000298023;-1044975.261999998241663;0
1521;-741808.000000000000000;-1043917.000000000000000;0
6387;-742159.980000000447035;-1042496.210000000894070;0
3679;-744571.809999998658895;-1042497.875999998301268;0
3527;-744805.695999998599291;-1042671.809000000357628;0
8080;-741989.600000001490116;-1045310.420000001788139;0
3538;-744616.304000001400709;-1042656.734000001102686;0
4238;-742440.263000000268221;-1043528.236000001430511;0
3155;-743969.353000000119209;-1042568.828000001609325;0
3922;-743844.574999999254942;-1043491.188999999314547;0
4161;-742506.254999998956919;-1044181.925000000745058;0
6753;-742485.511999998241663;-1044950.206999998539686;0
1485;-741184.000000000000000;-1044223.000000000000000;0
1430;-741993.000000000000000;-1044260.000000000000000;0
3111;-743727.034000001847744;-1042625.182999998331070;0
4330;-742377.440999999642372;-1043332.162999998778105;0
345;-742559.000000000000000;-1043826.000000000000000;0
383;-742450.000000000000000;-1043722.000000000000000;0
1656;-741395.000000000000000;-1044688.000000000000000;0
2257;-742956.000000000000000;-1045558.000000000000000;0
6675;-742272.140000000596046;-1044167.469999998807907;0
7216;-742500.129999998956919;-1044564.390000000596046;0
6039;-742085.370000001043081;-1043669.620999999344349;0
7187;-742595.019999999552965;-1044739.962000001221895;0
4663;-742820.800000000745058;-1042560.039999999105930;0
458;-741726.000000000000000;-1043324.000000000000000;0
3537;-744632.945000000298023;-1042671.657000001519918;0
1910;-743460.000000000000000;-1044391.000000000000000;0
3585;-744920.065000001341105;-1042522.129999998956919;0
3460;-744993.289000000804663;-1042693.587000001221895;0
669;-742510.000000000000000;-1043260.000000000000000;0
7095;-743370.940000001341105;-1044597.230000000447035;0
559;-742191.000000000000000;-1043693.000000000000000;0
4082;-742825.565000001341105;-1043737.364999998360872;0
4228;-742132.969999998807907;-1043331.449999999254942;0
881;-741806.000000000000000;-1042815.000000000000000;0
3153;-743993.857999999076128;-1042576.355000000447035;0
3466;-745113.802000001072884;-1042675.725000001490116;0
1491;-741057.000000000000000;-1044333.000000000000000;0
1773;-741281.000000000000000;-1043977.000000000000000;0
8151;-743319.030000001192093;-1043194.940000001341105;0
8278;-742119.929999999701977;-1042758.710000000894070;0
5025;-742609.543000001460314;-1042894.629000000655651;0
4236;-742406.842999998480082;-1043504.015000000596046;0
3412;-743772.947000000625849;-1043053.557999998331070;0
4510;-742483.149999998509884;-1042738.460000000894070;0
1673;-741122.000000000000000;-1044714.000000000000000;0
6569;-741287.850000001490116;-1044136.660000000149012;0
4034;-743295.410000000149012;-1043786.070000000298023;0
7165;-742711.789999999105930;-1044504.984999999403954;0
4214;-742229.274999998509884;-1043511.745000001043081;0
582;-741994.000000000000000;-1043417.000000000000000;0
7645;-742305.313000001013279;-1045383.625000000000000;0
1925;-743331.000000000000000;-1044321.000000000000000;0
4072;-742934.225000001490116;-1043833.899999998509884;0
4878;-742876.434000000357628;-1042964.004000000655651;0
280;-743053.000000000000000;-1043875.000000000000000;0
430;-742185.000000000000000;-1043888.000000000000000;0
2145;-742825.000000000000000;-1045079.000000000000000;0
2154;-742805.000000000000000;-1045147.000000000000000;0
3612;-744996.545000001788139;-1042292.646000001579523;0
4114;-742764.195000000298023;-1044131.760000001639128;0
4428;-742206.750000000000000;-1043097.800000000745058;0
729;-741986.000000000000000;-1042998.000000000000000;0
700;-742008.000000000000000;-1042895.000000000000000;0
4142;-742777.425000000745058;-1044013.440000001341105;35
7164;-742596.114999998360872;-1044447.173000000417233;0
1757;-742189.000000000000000;-1045219.000000000000000;0
1109;-741204.100000001490116;-1044585.460000000894070;0
542;-742367.629999998956919;-1043814.379999998956919;0
3976;-743088.861000001430511;-1043707.728000000119209;0
1373;-742143.000000000000000;-1044822.000000000000000;0
3212;-743646.699000000953674;-1042469.458999998867512;0
7324;-742833.980000000447035;-1044949.109999999403954;0
7136;-742914.329999998211861;-1044374.469999998807907;0
1461;-741473.000000000000000;-1044266.000000000000000;0
3836;-743096.070000000298023;-1042561.879999998956919;0
3262;-743572.423999998718500;-1042699.197000000625849;0
2580;-742501.000000000000000;-1045602.000000000000000;0
7520;-742808.589999999850988;-1045680.519999999552965;0
2321;-742679.000000000000000;-1045480.000000000000000;0
401;-742324.000000000000000;-1043907.000000000000000;0
303;-742895.000000000000000;-1044116.000000000000000;0
1435;-741903.000000000000000;-1044306.000000000000000;0
995;-741906.000000000000000;-1044434.000000000000000;0
4820;-742927.769999999552965;-1042786.710000000894070;0
3313;-743774.447000000625849;-1042903.081999998539686;0
1187;-741805.000000000000000;-1044071.000000000000000;0
7299;-743117.530000001192093;-1045145.859999999403954;0
1251;-742091.000000000000000;-1044690.000000000000000;0
2220;-743075.000000000000000;-1045396.000000000000000;0
5242;-743357.030000001192093;-1043419.239999998360872;0
3276;-743673.931000001728535;-1042836.190999999642372;0
3951;-743433.379999998956919;-1043586.600000001490116;0
1591;-742378.000000000000000;-1044910.000000000000000;0
4538;-742291.464000001549721;-1042734.344000000506639;0
5371;-742052.149999998509884;-1043011.940000001341105;0
4077;-742849.614999998360872;-1043858.745000001043081;0
4525;-742716.719999998807907;-1042823.219999998807907;0
3886;-742385.100000001490116;-1042445.500000000000000;0
202;-743240.000000000000000;-1043597.000000000000000;0
7263;-743009.559999998658895;-1044894.379999998956919;0
4828;-743048.579999998211861;-1042941.179999999701977;0
3094;-743906.500000000000000;-1042759.554999999701977;0
2009;-743221.000000000000000;-1044770.000000000000000;0
6702;-742291.596999999135733;-1044564.116999998688698;0
5294;-743056.328999999910593;-1043196.096999999135733;0
5135;-742979.611000001430511;-1043468.912999998778105;0
1362;-742017.000000000000000;-1044913.000000000000000;0
1444;-741559.000000000000000;-1044786.000000000000000;0
249;-743433.000000000000000;-1043775.000000000000000;0
6221;-742317.633000001311302;-1043061.541000001132488;0
6751;-742426.350000001490116;-1044371.070000000298023;0
1047;-741816.000000000000000;-1044867.000000000000000;0
2474;-743439.000000000000000;-1044900.000000000000000;0
1693;-741613.000000000000000;-1044649.000000000000000;0
1808;-743187.000000000000000;-1044539.000000000000000;0
1923;-743395.000000000000000;-1044274.000000000000000;0
4894;-742610.888999998569489;-1042819.686999998986721;0
1596;-742323.000000000000000;-1045037.000000000000000;0
4718;-742933.730000000447035;-1042628.039999999105930;0
5961;-742431.225000001490116;-1044003.574999999254942;0
1137;-741538.000000000000000;-1044442.000000000000000;0
5654;-743429.644000001251698;-1043703.151000000536442;0
681;-742383.000000000000000;-1043170.000000000000000;0
1016;-742147.000000000000000;-1044590.000000000000000;0
4039;-743159.070000000298023;-1043772.795000001788139;0
4634;-742635.980000000447035;-1042656.144999999552965;0
3990;-743339.489999998360872;-1043987.234999999403954;0
5999;-741991.910000000149012;-1043282.079999998211861;0
2536;-742003.000000000000000;-1044113.000000000000000;0
6116;-742963.905999999493361;-1042886.313000001013279;0
1031;-741973.000000000000000;-1044784.000000000000000;0
4632;-742615.638999998569489;-1042624.039999999105930;0
4026;-743178.984999999403954;-1043847.989999998360872;0
6155;-742315.557999998331070;-1043068.140999998897314;0
4482;-741768.079999998211861;-1042606.449999999254942;0
4711;-742803.300000000745058;-1042601.140000000596046;0
6359;-742018.440000001341105;-1042712.449999999254942;0
183;-743438.000000000000000;-1043422.000000000000000;0
6532;-741593.359999999403954;-1044141.059999998658895;0
8277;-742111.260000001639128;-1042746.399999998509884;0
3239;-744159.614000000059605;-1042651.675000000745058;0
7982;-741163.039999999105930;-1044413.210000000894070;0
1724;-741478.000000000000000;-1045023.000000000000000;0
1811;-743175.000000000000000;-1044525.000000000000000;0
5206;-743189.870999999344349;-1043360.936000000685453;0
694;-742280.000000000000000;-1043043.000000000000000;0
1166;-741020.000000000000000;-1044520.000000000000000;0
630;-742179.000000000000000;-1043289.000000000000000;0
3752;-743213.949999999254942;-1042902.719999998807907;0
94;-744054.000000000000000;-1042934.000000000000000;0
7809;-741981.809999998658895;-1044560.280000001192093;0
2071;-743018.000000000000000;-1044733.000000000000000;0
4529;-742762.920000001788139;-1042885.809999998658895;0
4952;-742318.899999998509884;-1042915.589999999850988;0
3346;-743958.802000001072884;-1043049.741000000387430;0
5505;-743428.315000001341105;-1043675.633000001311302;0
7211;-742570.070000000298023;-1045065.679999999701977;0
573;-742067.000000000000000;-1043561.000000000000000;0
612;-742064.000000000000000;-1043270.000000000000000;0
2497;-741932.000000000000000;-1044075.000000000000000;0
930;-744068.000000000000000;-1043405.000000000000000;0
4833;-743036.859999999403954;-1042820.050000000745058;0
4698;-742673.530000001192093;-1042715.780000001192093;0
6839;-741723.412000000476837;-1044988.993000000715256;0
4557;-742381.019999999552965;-1042528.550000000745058;0
5258;-743356.739999998360872;-1043230.039999999105930;0
5116;-742947.859000001102686;-1043386.767000000923872;0
1331;-741805.000000000000000;-1044733.000000000000000;0
329;-742675.000000000000000;-1044052.000000000000000;0
6511;-741291.670000001788139;-1044319.690000001341105;0
1328;-742037.000000000000000;-1045043.000000000000000;0
1941;-743267.000000000000000;-1044384.000000000000000;0
7039;-743335.785000000149012;-1044169.030000001192093;0
4737;-742718.399999998509884;-1042684.079999998211861;0
5317;-743063.690000001341105;-1043053.769999999552965;0
6825;-741380.010000001639128;-1044780.089999999850988;0
8078;-742024.710000000894070;-1045262.460000000894070;0
1222;-742157.000000000000000;-1044266.000000000000000;0
7142;-742872.445000000298023;-1044472.239999998360872;0
6415;-743180.657999999821186;-1043208.993999999016523;0
5326;-742969.850000001490116;-1043038.800000000745058;0
4210;-742178.550000000745058;-1043586.035000000149012;0
1285;-742198.000000000000000;-1044467.000000000000000;0
5178;-743386.421000000089407;-1043452.486000001430511;0
702;-741961.000000000000000;-1042885.000000000000000;0
204;-743208.000000000000000;-1043588.000000000000000;0
2435;-742452.000000000000000;-1044222.000000000000000;0
226;-742879.000000000000000;-1043516.000000000000000;0
4610;-742548.888000000268221;-1042601.879000000655651;0
8049;-742198.890000000596046;-1044891.600000001490116;0
2007;-743231.000000000000000;-1044741.000000000000000;0
1964;-743412.000000000000000;-1044708.000000000000000;0
7977;-741271.370000001043081;-1044404.390000000596046;0
4925;-742455.502000000327826;-1042923.307000000029802;0
6105;-742213.883000001311302;-1043111.734000001102686;0
6293;-742666.339999999850988;-1042695.188999999314547;0
4152;-742564.589999999850988;-1044089.934999998658895;0
3987;-743311.475000001490116;-1043983.175000000745058;0
4959;-742331.289999999105930;-1043002.690000001341105;0
1138;-741500.000000000000000;-1044458.000000000000000;0
1147;-741346.000000000000000;-1044466.000000000000000;0
7177;-742643.059999998658895;-1044579.679999999701977;0
7659;-742336.048000000417233;-1045327.868000000715256;0
4978;-742491.822999998927116;-1043028.688000001013279;0
2233;-743461.000000000000000;-1045218.000000000000000;0
6648;-741750.510000001639128;-1044080.329999998211861;0
5068;-742837.162999998778105;-1043263.965999998152256;0
6962;-743011.489999998360872;-1044196.070000000298023;0
568;-742116.000000000000000;-1043604.000000000000000;0
6722;-742357.717000000178814;-1044705.708000000566244;0
4523;-742703.960000000894070;-1042805.670000001788139;0
4722;-742878.030000001192093;-1042626.550000000745058;0
1313;-741681.000000000000000;-1044849.000000000000000;0
5230;-743335.399999998509884;-1043517.670000001788139;0
4572;-742343.539999999105930;-1042598.289999999105930;0
3998;-743432.704999998211861;-1043914.274999998509884;0
1395;-741799.000000000000000;-1044291.000000000000000;0
827;-742218.000000000000000;-1042626.000000000000000;221
4751;-742791.629999998956919;-1042751.460000000894070;0
732;-741860.000000000000000;-1043003.000000000000000;0
7022;-743155.660000000149012;-1044074.410000000149012;0
6695;-742306.234000001102686;-1044816.138999998569489;0
7247;-742774.480000000447035;-1044839.850000001490116;0
6176;-742314.491000000387430;-1043063.256000000983477;0
7012;-742805.839999999850988;-1044263.870000001043081;0
7721;-742941.157000001519918;-1044215.368000000715256;0
649;-742233.000000000000000;-1043382.000000000000000;0
1033;-741968.000000000000000;-1044843.000000000000000;0
2335;-742825.000000000000000;-1045539.000000000000000;0
5016;-742572.212000001221895;-1042955.526999998837709;0
4895;-742596.936999998986721;-1042829.168000001460314;0
180;-743414.000000000000000;-1043320.000000000000000;0
1703;-741320.000000000000000;-1044686.000000000000000;0
4990;-742657.837999999523163;-1043024.199999999254942;0
1126;-741684.000000000000000;-1044450.000000000000000;0
5729;-743420.103000000119209;-1043638.901000000536442;0
5503;-743427.870000001043081;-1043698.647999998182058;0
4716;-742893.160000000149012;-1042622.780000001192093;0
2316;-742823.000000000000000;-1045463.000000000000000;0
4248;-742157.039999999105930;-1043376.699999999254942;0
845;-742126.000000000000000;-1042505.000000000000000;0
4053;-743260.039999999105930;-1043823.480000000447035;0
2124;-743275.000000000000000;-1045023.000000000000000;0
2361;-742323.000000000000000;-1045576.000000000000000;0
4931;-742449.300000000745058;-1042791.403000000864267;0
3834;-743079.190000001341105;-1042579.899999998509884;0
1099;-741376.000000000000000;-1044563.000000000000000;0
7049;-743420.177000001072884;-1044168.629999998956919;0
4581;-742391.460000000894070;-1042586.396999999880791;0
4068;-742917.125000000000000;-1043734.535000000149012;0
8242;-742568.629999998956919;-1045197.829999998211861;0
7017;-742571.059999998658895;-1044267.640000000596046;0
2889;-744074.103999998420477;-1043194.559999998658895;0
1008;-741962.000000000000000;-1044568.000000000000000;0
7807;-742647.802999999374151;-1044543.524000000208616;0
1000;-741828.000000000000000;-1044502.000000000000000;0
8283;-742198.600000001490116;-1042801.980000000447035;0
2386;-742139.000000000000000;-1045460.000000000000000;0
673;-742467.000000000000000;-1043230.000000000000000;0
4815;-742992.210000000894070;-1042788.359999999403954;0
6611;-741711.614000000059605;-1043979.263999998569489;0
7279;-742799.399999998509884;-1044679.829999998211861;0
4934;-742433.807000000029802;-1042730.874000001698732;0
1707;-741196.219999998807907;-1044702.390000000596046;0
1817;-743058.000000000000000;-1044411.000000000000000;0
6944;-742927.063000001013279;-1043928.673000000417233;0
6139;-742312.807000000029802;-1043066.006000000983477;0
5194;-743205.761999998241663;-1043310.581999998539686;0
4602;-742441.269000001251698;-1042596.320000000298023;0
207;-743142.000000000000000;-1043590.000000000000000;0
535;-742111.000000000000000;-1043714.000000000000000;0
7537;-742722.660000000149012;-1045361.410000000149012;0
690;-742306.000000000000000;-1043081.000000000000000;0
2091;-742920.000000000000000;-1044593.000000000000000;0
5455;-742823.936000000685453;-1043283.644999999552965;0
3818;-743130.217999998480082;-1042703.293000001460314;0
1032;-741970.000000000000000;-1044813.000000000000000;0
4896;-742589.649999998509884;-1042838.989999998360872;0
5509;-743425.144999999552965;-1043637.853000000119209;0
6361;-742016.024999998509884;-1042677.243999999016523;0
632;-742130.000000000000000;-1043287.000000000000000;0
1117;-741066.000000000000000;-1044603.000000000000000;0
1114;-741151.059999998658895;-1044607.410000000149012;0
1377;-742146.969999998807907;-1044922.489999998360872;0
2469;-742941.000000000000000;-1045215.000000000000000;0
389;-742408.000000000000000;-1043783.000000000000000;0
954;-742231.000000000000000;-1043024.000000000000000;0
3321;-743903.500999998301268;-1042936.324999999254942;0
4123;-742742.956000000238419;-1043901.826000001281500;0
4200;-742219.350000001490116;-1043727.980999998748302;0
5675;-743407.907999999821186;-1043716.054999999701977;0
4903;-742493.579999998211861;-1042816.620000001043081;0
4679;-742774.199999999254942;-1042819.160000000149012;0
6278;-742305.421999998390675;-1043028.918000001460314;0
2264;-742977.000000000000000;-1045745.000000000000000;0
4905;-742467.730000000447035;-1042815.620000001043081;0
2209;-743309.000000000000000;-1045217.000000000000000;0
4792;-743051.280000001192093;-1042654.962999999523163;0
1454;-741521.000000000000000;-1044499.000000000000000;0
1502;-741506.000000000000000;-1044283.000000000000000;0
2340;-742764.000000000000000;-1045532.000000000000000;0
5958;-742962.513999998569489;-1043517.497999999672174;0
5020;-742572.699999999254942;-1042891.372999999672174;0
1538;-741948.000000000000000;-1043973.000000000000000;0
2227;-743029.000000000000000;-1045506.000000000000000;0
5735;-743414.589999999850988;-1043687.874000001698732;0
6197;-742313.425000000745058;-1043058.370999999344349;0
2690;-743516.828000001609325;-1042088.217999998480082;0
2248;-743201.000000000000000;-1045423.000000000000000;0
1954;-743372.000000000000000;-1044497.000000000000000;0
880;-741793.000000000000000;-1042834.000000000000000;0
6663;-741457.949999999254942;-1044194.329999998211861;0
3974;-743140.660000000149012;-1043725.350000001490116;0
575;-742053.000000000000000;-1043541.000000000000000;0
1389;-742281.250000000000000;-1044962.859999999403954;0
1995;-743484.000000000000000;-1045036.000000000000000;0
2238;-743372.000000000000000;-1045261.000000000000000;0
516;-742160.000000000000000;-1043135.000000000000000;0
4754;-742745.359999999403954;-1042759.160000000149012;0
1215;-742091.000000000000000;-1044365.000000000000000;0
720;-741671.000000000000000;-1042815.000000000000000;0
7162;-743075.840999998152256;-1044541.596000000834465;0
641;-742008.000000000000000;-1043304.000000000000000;0
5775;-743915.925000000745058;-1042818.550999999046326;0
1257;-742070.000000000000000;-1044815.000000000000000;0
7410;-743525.730000000447035;-1045377.420000001788139;0
7696;-742416.806000001728535;-1045134.280000001192093;0
1611;-742400.000000000000000;-1044442.000000000000000;0
1125;-741728.000000000000000;-1044435.000000000000000;0
2239;-743345.000000000000000;-1045263.000000000000000;0
5639;-743428.337999999523163;-1043685.046999998390675;0
757;-741673.000000000000000;-1042678.000000000000000;0
4750;-742784.420000001788139;-1042733.429999999701977;0
4841;-742989.993999999016523;-1042765.850999999791384;0
4937;-742461.982000000774860;-1042671.942000001668930;0
7000;-743096.190000001341105;-1044426.870000001043081;0
1339;-741618.000000000000000;-1045067.000000000000000;0
1304;-741810.000000000000000;-1044684.000000000000000;0
5001;-742560.092999998480082;-1042966.206999998539686;0
6263;-742365.719000000506639;-1043021.282999999821186;0
6809;-741079.942999999970198;-1044626.942000001668930;0
698;-742041.000000000000000;-1042903.000000000000000;0
7198;-742561.769999999552965;-1044881.949999999254942;0
4776;-742909.276000000536442;-1042820.587000001221895;0
5680;-743402.000000000000000;-1043718.245000001043081;0
1262;-742066.000000000000000;-1044917.000000000000000;0
1419;-741603.000000000000000;-1044410.000000000000000;0
5141;-743039.598000001162291;-1043495.265000000596046;0
4040;-743224.710000000894070;-1043766.050000000745058;0
5022;-742578.440000001341105;-1042849.350000001490116;0
1508;-741705.000000000000000;-1044210.000000000000000;0
7994;-741529.219999998807907;-1045148.010000001639128;0
5758;-743420.897999998182058;-1043635.921999998390675;0
6167;-742313.859999999403954;-1043063.607000000774860;0
1749;-742065.000000000000000;-1045064.000000000000000;0
5167;-743219.324999999254942;-1043405.249000001698732;0
1441;-741744.000000000000000;-1044392.000000000000000;0
618;-742203.000000000000000;-1043272.000000000000000;0
4582;-742390.164999999105930;-1042606.546000000089407;0
2503;-742753.000000000000000;-1045484.000000000000000;0
7199;-742570.910000000149012;-1044916.410000000149012;0
1594;-742304.000000000000000;-1044977.000000000000000;0
1132;-741596.000000000000000;-1044446.000000000000000;0
1790;-742152.000000000000000;-1044138.000000000000000;0
2741;-744016.675000000745058;-1043336.642999999225140;0
1214;-742064.000000000000000;-1044358.000000000000000;0
1918;-743377.000000000000000;-1044428.000000000000000;0
5711;-743422.837999999523163;-1043640.131000000983477;0
6829;-741498.170000001788139;-1044764.809999998658895;0
4893;-742637.320000000298023;-1042818.600999999791384;0
2535;-742042.000000000000000;-1044071.000000000000000;0
1271;-742240.000000000000000;-1044521.000000000000000;0
331;-742664.000000000000000;-1044024.000000000000000;0
1294;-742061.000000000000000;-1044478.000000000000000;0
586;-741966.000000000000000;-1043374.000000000000000;0
819;-741987.000000000000000;-1042599.000000000000000;0
4562;-742471.000000000000000;-1042510.920000001788139;0
6280;-742306.918999999761581;-1043038.083000000566244;0
3952;-743407.521999999880791;-1043538.500999998301268;0
6148;-742313.410999998450279;-1043065.666999999433756;0
1819;-743034.000000000000000;-1044350.000000000000000;0
4505;-742434.910000000149012;-1042706.170000001788139;0
6234;-742324.105000000447035;-1043076.613000001758337;0
1413;-741631.000000000000000;-1044621.000000000000000;0
3785;-743172.449999999254942;-1042923.850000001490116;0
1050;-741785.000000000000000;-1044952.000000000000000;0
500;-741861.000000000000000;-1043174.000000000000000;0
5725;-743422.388000000268221;-1043634.186999998986721;0
4745;-742840.800000000745058;-1042742.120000001043081;0
1830;-742961.000000000000000;-1044087.000000000000000;0
4890;-742605.287000000476837;-1042838.535000000149012;0
4220;-742214.344999998807907;-1043580.359999999403954;0
4982;-742559.320999998599291;-1043012.914000000804663;0
3345;-743952.826999999582767;-1043061.079999998211861;0
1648;-741373.000000000000000;-1044431.000000000000000;0
8052;-742218.929999999701977;-1044953.719999998807907;0
1167;-741836.000000000000000;-1044429.000000000000000;0
2037;-743373.000000000000000;-1044805.000000000000000;0
1719;-741406.760000001639128;-1044866.039999999105930;0
4822;-742945.579999998211861;-1042879.910000000149012;0
6393;-742076.660000000149012;-1042499.879999998956919;0
1368;-741998.000000000000000;-1044779.000000000000000;0
1354;-741877.000000000000000;-1044859.000000000000000;0
6486;-741772.072999998927116;-1044516.256000000983477;0
1617;-742384.000000000000000;-1044407.000000000000000;0
6149;-742312.646000001579523;-1043064.261999998241663;0
2693;-743425.660000000149012;-1042065.250000000000000;0
5595;-743416.488000001758337;-1043680.118999999016523;0
5236;-743352.302000001072884;-1043362.752000000327826;0
6975;-743116.140000000596046;-1044506.469999998807907;0
4520;-742651.079999998211861;-1042798.449999999254942;0
1312;-741659.000000000000000;-1044848.000000000000000;0
6216;-742313.892000000923872;-1043056.272999998182058;0
7040;-743356.140000000596046;-1044164.359999999403954;0
6357;-741947.870000001043081;-1042701.129999998956919;0
7154;-742908.467000000178814;-1044547.784000001847744;0
1260;-742070.000000000000000;-1044876.000000000000000;0
4733;-742767.890000000596046;-1042671.010000001639128;0
546;-742323.640000000596046;-1043781.429999999701977;0
4511;-742539.859999999403954;-1042744.070000000298023;0
3822;-743065.039999999105930;-1042594.239999998360872;0
6204;-742315.578999999910593;-1043060.826000001281500;0
6209;-742319.320000000298023;-1043066.114999998360872;0
1219;-742137.000000000000000;-1044315.000000000000000;0
6338;-742247.910000000149012;-1042851.670000001788139;0
5579;-743409.682999998331070;-1043634.574999999254942;0
6479;-741969.831000000238419;-1044454.850000001490116;0
5118;-742835.168000001460314;-1043315.074000000953674;0
5284;-743041.022999998182058;-1043277.397999998182058;0
4997;-742492.638000000268221;-1042962.833999998867512;0
6374;-741977.035000000149012;-1042674.153999999165535;0
5969;-742284.809999998658895;-1044169.578000001609325;0
4242;-742214.469999998807907;-1043415.800000000745058;0
5295;-743047.995000001043081;-1043185.530000001192093;0
4477;-741858.039999999105930;-1042692.129999998956919;0
6493;-742196.574000000953674;-1044452.076999999582767;0
1726;-741516.000000000000000;-1045120.000000000000000;0
633;-742100.000000000000000;-1043296.000000000000000;0
7750;-742972.960000000894070;-1044053.329999998211861;0
5693;-743415.905000001192093;-1043640.377000000327826;0
7085;-743327.129999998956919;-1044533.960000000894070;0
892;-742946.000000000000000;-1042607.000000000000000;0
4725;-742875.100000001490116;-1042678.230000000447035;0
6122;-742071.870000001043081;-1043283.660000000149012;0
531;-742157.000000000000000;-1043778.000000000000000;0
5728;-743421.517999999225140;-1043638.609000001102686;0
7005;-742998.190000001341105;-1043944.824999999254942;0
5140;-743035.789999999105930;-1043514.489999998360872;0
2511;-743050.000000000000000;-1044050.000000000000000;0
2429;-742485.000000000000000;-1045149.000000000000000;0
4159;-742455.734999999403954;-1043898.035000000149012;0
5309;-743033.405000001192093;-1043187.043999999761581;0
6185;-742315.103999998420477;-1043062.923000000417233;0
6217;-742320.725999999791384;-1043067.133999999612570;0
5730;-743418.855999998748302;-1043638.949000000953674;0
4596;-742597.181000001728535;-1042670.653000000864267;0
2276;-742865.000000000000000;-1045649.000000000000000;0
