OID_;X;Y;TEMPERATURE
3919;-743904.947000000625849;-1043493.929999999701977;0
110;-744127.000000000000000;-1042724.000000000000000;0
509;-741991.000000000000000;-1043143.000000000000000;0
1533;-741832.000000000000000;-1043879.000000000000000;0
7;-743479.000000000000000;-1042567.000000000000000;0
6326;-745069.776999998837709;-1042709.401000000536442;0
1539;-741977.000000000000000;-1043997.000000000000000;0
4072;-742934.225000001490116;-1043833.899999998509884;0
3412;-743772.947000000625849;-1043053.557999998331070;0
4334;-742384.170000001788139;-1043468.820000000298023;0
3812;-743231.179999999701977;-1042815.199999999254942;0
4128;-742915.039999999105930;-1044041.920000001788139;0
6874;-741789.789999999105930;-1045272.100000001490116;0
3761;-743202.559999998658895;-1042981.710000000894070;0
1490;-741023.000000000000000;-1044335.000000000000000;0
4197;-742179.633999999612570;-1043776.899000000208616;0
6827;-741437.300000000745058;-1044772.629999998956919;0
2192;-743499.000000000000000;-1045199.000000000000000;0
1618;-742405.000000000000000;-1044404.000000000000000;0
7018;-742577.747000001370907;-1044239.712999999523163;0
7781;-743030.026999998837709;-1045857.486000001430511;0
1020;-742293.000000000000000;-1044615.000000000000000;0
2272;-742922.000000000000000;-1045759.000000000000000;0
2298;-742621.000000000000000;-1045406.000000000000000;0
4087;-742811.609999999403954;-1043604.190000001341105;0
2391;-742060.000000000000000;-1045336.000000000000000;0
2467;-743434.000000000000000;-1044742.000000000000000;0
6505;-741746.570000000298023;-1044600.429999999701977;0
2123;-743299.000000000000000;-1045010.000000000000000;0
2473;-743469.000000000000000;-1044899.000000000000000;0
2755;-744003.879000000655651;-1043471.734000001102686;0
1615;-742367.000000000000000;-1044434.000000000000000;0
6560;-741301.682000000029802;-1043959.640000000596046;0
746;-741714.000000000000000;-1043020.000000000000000;0
1761;-741194.000000000000000;-1044104.000000000000000;0
4143;-742750.925000000745058;-1044017.960000000894070;0
1485;-741184.000000000000000;-1044223.000000000000000;0
4151;-742573.039999999105930;-1044109.035000000149012;0
2478;-741241.859999999403954;-1044562.089999999850988;0
7695;-742479.807000000029802;-1045130.127000000327826;0
3208;-743682.739000000059605;-1042488.668999999761581;0
7158;-742984.796999998390675;-1044545.407999999821186;11
7656;-742290.328000001609325;-1045294.499000001698732;0
4063;-742855.079999998211861;-1043654.695000000298023;0
1516;-741928.000000000000000;-1044062.000000000000000;0
3020;-744427.359000001102686;-1042798.999000001698732;0
2409;-742363.000000000000000;-1045093.000000000000000;0
5250;-743328.995000001043081;-1043178.495000001043081;0
2403;-742211.000000000000000;-1045436.000000000000000;0
377;-742494.000000000000000;-1043658.000000000000000;138
1461;-741473.000000000000000;-1044266.000000000000000;0
1505;-741606.000000000000000;-1044248.000000000000000;0
395;-742369.000000000000000;-1043840.000000000000000;0
398;-742372.000000000000000;-1043909.000000000000000;0
1005;-741944.000000000000000;-1044583.000000000000000;0
3836;-743096.070000000298023;-1042561.879999998956919;0
7142;-742872.445000000298023;-1044472.239999998360872;0
5325;-742997.480000000447035;-1043042.289999999105930;0
7705;-742283.471999999135733;-1044316.339999999850988;44
3679;-744571.809999998658895;-1042497.875999998301268;0
7538;-742701.420000001788139;-1045364.109999999403954;0
31;-743485.000000000000000;-1042645.000000000000000;0
884;-741771.000000000000000;-1042776.000000000000000;0
3531;-744733.070999998599291;-1042679.260000001639128;0
2338;-742797.000000000000000;-1045528.000000000000000;0
500;-741861.000000000000000;-1043174.000000000000000;0
3783;-743211.559999998658895;-1042920.120000001043081;0
5110;-742876.271999999880791;-1043449.013000000268221;0
3389;-743919.920000001788139;-1043153.510000001639128;0
6651;-741697.910000000149012;-1044123.329999998211861;0
2255;-743181.000000000000000;-1045372.000000000000000;0
5293;-743043.969999998807907;-1043208.554000001400709;0
1917;-743374.000000000000000;-1044458.000000000000000;0
3092;-743909.377999998629093;-1042780.322999998927116;0
4029;-743130.695999998599291;-1043815.427999999374151;0
339;-742606.000000000000000;-1043916.000000000000000;0
5142;-743039.870000001043081;-1043473.929999999701977;0
2277;-742826.000000000000000;-1045653.000000000000000;0
5303;-743164.818999998271465;-1043211.078000001609325;0
326;-742682.000000000000000;-1044102.000000000000000;0
3275;-743665.002000000327826;-1042826.396999999880791;0
1309;-741611.000000000000000;-1044813.000000000000000;0
6397;-742033.839999999850988;-1042501.859999999403954;0
4030;-743133.280000001192093;-1043791.552000001072884;0
5239;-743361.096000000834465;-1043279.333999998867512;0
1951;-743289.000000000000000;-1044491.000000000000000;0
4459;-742274.829999998211861;-1042644.269999999552965;0
7107;-743425.260000001639128;-1044646.199999999254942;0
6039;-742085.370000001043081;-1043669.620999999344349;0
6647;-741767.690000001341105;-1044068.160000000149012;0
4145;-742687.109999999403954;-1043837.125000000000000;0
6479;-741969.831000000238419;-1044454.850000001490116;0
1442;-741753.000000000000000;-1044375.000000000000000;0
2096;-743154.000000000000000;-1044724.000000000000000;0
2269;-742933.000000000000000;-1045611.000000000000000;0
7362;-743205.807000000029802;-1045156.089999999850988;0
3267;-743587.203000001609325;-1042710.840999998152256;89
926;-741894.000000000000000;-1042999.000000000000000;0
1246;-742120.000000000000000;-1044570.000000000000000;0
1812;-743149.000000000000000;-1044528.000000000000000;0
1716;-741294.859999999403954;-1044879.870000001043081;0
1267;-742040.000000000000000;-1044999.000000000000000;0
1874;-743379.000000000000000;-1044247.000000000000000;0
4080;-742832.480000000447035;-1043782.030000001192093;0
2329;-742432.000000000000000;-1045508.000000000000000;0
5242;-743357.030000001192093;-1043419.239999998360872;0
7216;-742500.129999998956919;-1044564.390000000596046;0
1254;-742090.000000000000000;-1044750.000000000000000;0
1923;-743395.000000000000000;-1044274.000000000000000;0
3586;-744920.728000000119209;-1042505.664999999105930;0
4714;-742856.359999999403954;-1042618.210000000894070;0
1161;-741106.550000000745058;-1044497.769999999552965;0
1196;-741677.000000000000000;-1043894.000000000000000;0
6432;-742029.997999999672174;-1043511.272999998182058;0
6724;-742590.385000001639128;-1044428.910000000149012;0
1706;-741225.800000000745058;-1044698.800000000745058;0
1120;-741778.000000000000000;-1044457.000000000000000;0
7044;-743400.635000001639128;-1044135.579999998211861;0
1584;-742368.000000000000000;-1044717.000000000000000;0
2492;-742017.000000000000000;-1044210.000000000000000;0
5766;-742429.719999998807907;-1042597.699999999254942;0
688;-742284.000000000000000;-1043125.000000000000000;0
6709;-742264.587999999523163;-1044776.254999998956919;0
3064;-744117.098999999463558;-1042868.348999999463558;0
882;-741825.000000000000000;-1042788.000000000000000;0
5728;-743421.517999999225140;-1043638.609000001102686;0
7170;-742667.579999998211861;-1044492.469999998807907;0
7012;-742805.839999999850988;-1044263.870000001043081;0
1431;-741926.000000000000000;-1044313.000000000000000;0
4341;-742488.855000000447035;-1043325.412999998778105;0
4240;-742471.613000001758337;-1043552.366000000387430;0
4963;-742396.510000001639128;-1043031.829999998211861;0
4154;-742544.524999998509884;-1044048.190000001341105;0
3570;-744649.160000000149012;-1042588.129999998956919;0
1823;-742973.000000000000000;-1044174.000000000000000;0
2511;-743050.000000000000000;-1044050.000000000000000;0
873;-741728.000000000000000;-1042672.000000000000000;0
4951;-742335.579999998211861;-1042934.429999999701977;0
6568;-741292.100000001490116;-1044161.670000001788139;0
3032;-744506.962000001221895;-1042717.704999998211861;0
4329;-742363.315000001341105;-1043352.173999998718500;0
1337;-741723.000000000000000;-1044886.000000000000000;0
680;-742402.109999999403954;-1043166.679999999701977;0
4848;-742977.940000001341105;-1042862.019999999552965;0
2377;-742390.000000000000000;-1045527.000000000000000;0
2163;-742944.000000000000000;-1045168.000000000000000;0
7734;-741656.309000000357628;-1044953.727000001817942;0
1297;-742120.000000000000000;-1044453.000000000000000;0
5003;-742589.811999998986721;-1042974.888999998569489;0
1378;-742161.000000000000000;-1044904.000000000000000;0
7148;-742828.445000000298023;-1044472.094999998807907;0
1237;-742144.000000000000000;-1044365.000000000000000;0
3178;-743875.403999999165535;-1042614.289999999105930;0
318;-742434.000000000000000;-1044213.000000000000000;0
266;-743321.000000000000000;-1043735.000000000000000;0
2085;-742426.000000000000000;-1044797.000000000000000;0
1472;-741677.000000000000000;-1044145.000000000000000;0
1239;-742138.000000000000000;-1044401.000000000000000;0
5117;-742816.081999998539686;-1043298.302999999374151;0
2130;-743095.000000000000000;-1045126.000000000000000;0
2150;-742812.000000000000000;-1045054.000000000000000;0
4010;-743200.372999999672174;-1044041.177999999374151;0
6100;-741950.760000001639128;-1043408.109999999403954;0
1550;-741356.000000000000000;-1044363.000000000000000;0
2223;-743053.000000000000000;-1045437.000000000000000;0
7037;-743316.085000000894070;-1044222.170000001788139;0
1602;-742507.000000000000000;-1044924.000000000000000;0
611;-742037.000000000000000;-1043267.000000000000000;0
6198;-742312.659000001847744;-1043056.964999999850988;0
6277;-742304.633999999612570;-1043024.256000000983477;0
2079;-742688.000000000000000;-1044428.000000000000000;0
3544;-744891.706999998539686;-1042640.835999999195337;0
7180;-742618.809000000357628;-1044646.109000001102686;0
700;-742008.000000000000000;-1042895.000000000000000;0
4688;-742676.179000001400709;-1042555.322999998927116;0
5375;-744998.668000001460314;-1042267.800999999046326;0
1087;-741605.000000000000000;-1044533.000000000000000;0
1970;-743380.000000000000000;-1044854.000000000000000;0
601;-741823.000000000000000;-1043224.000000000000000;0
5788;-743488.300000000745058;-1042088.320000000298023;0
1673;-741122.000000000000000;-1044714.000000000000000;0
6727;-742522.868000000715256;-1044395.879999998956919;0
2464;-743519.000000000000000;-1044697.000000000000000;0
1960;-743386.000000000000000;-1044623.000000000000000;0
1695;-741550.000000000000000;-1044656.000000000000000;0
7218;-742534.100000001490116;-1044603.559999998658895;0
2347;-742597.000000000000000;-1045567.000000000000000;0
5689;-743415.442000001668930;-1043633.646000001579523;0
6136;-742315.081999998539686;-1043070.210000000894070;0
1411;-741639.480000000447035;-1044683.019999999552965;0
1547;-742220.000000000000000;-1044181.000000000000000;0
2131;-743073.000000000000000;-1045134.000000000000000;0
1935;-743276.000000000000000;-1044289.000000000000000;0
1189;-741786.000000000000000;-1044043.000000000000000;0
204;-743208.000000000000000;-1043588.000000000000000;0
1944;-743280.000000000000000;-1044400.000000000000000;0
2524;-742108.000000000000000;-1044191.000000000000000;0
2303;-742481.000000000000000;-1045422.000000000000000;0
8043;-742180.050000000745058;-1044750.160000000149012;0
2399;-742121.000000000000000;-1045372.000000000000000;0
1994;-743483.000000000000000;-1045010.000000000000000;0
5687;-743415.142000000923872;-1043630.285999998450279;0
314;-742585.000000000000000;-1044184.000000000000000;0
5271;-742995.381999999284744;-1043229.673000000417233;0
5408;-743696.881000000983477;-1042878.024999998509884;0
4074;-742943.350000001490116;-1043880.304999999701977;0
877;-741951.000000000000000;-1042610.000000000000000;0
1545;-742236.000000000000000;-1044234.000000000000000;0
5000;-742542.798000000417233;-1042978.486999999731779;0
3799;-743117.550000000745058;-1042868.160000000149012;0
1699;-741435.000000000000000;-1044671.000000000000000;0
6753;-742485.511999998241663;-1044950.206999998539686;0
1059;-741637.000000000000000;-1045095.000000000000000;0
3994;-743394.864000000059605;-1043949.813999999314547;0
673;-742467.000000000000000;-1043230.000000000000000;0
5679;-743403.182000000029802;-1043717.807000000029802;0
2238;-743372.000000000000000;-1045261.000000000000000;0
6157;-742314.026999998837709;-1043065.331000000238419;0
4747;-742866.289999999105930;-1042753.390000000596046;0
4926;-742452.660000000149012;-1042896.190000001341105;0
3946;-743397.693999998271465;-1043460.780999999493361;0
6699;-742301.118999999016523;-1044484.282999999821186;97
6111;-742241.054000001400709;-1043365.475999999791384;0
1031;-741973.000000000000000;-1044784.000000000000000;0
6261;-742373.956999998539686;-1043022.041999999433756;0
182;-743429.000000000000000;-1043385.000000000000000;0
4427;-742190.519999999552965;-1043099.440000001341105;0
4822;-742945.579999998211861;-1042879.910000000149012;0
1305;-741826.000000000000000;-1044678.000000000000000;0
1320;-741870.000000000000000;-1044957.000000000000000;0
7077;-743564.359000001102686;-1045385.210000000894070;0
1359;-742000.000000000000000;-1044897.000000000000000;0
6975;-743116.140000000596046;-1044506.469999998807907;0
4762;-742854.192000001668930;-1042825.931000001728535;0
2055;-743425.000000000000000;-1045038.000000000000000;0
465;-741728.000000000000000;-1043309.000000000000000;0
4144;-742704.414999999105930;-1043822.484999999403954;0
5599;-743411.622999999672174;-1043680.499000001698732;0
1096;-741474.000000000000000;-1044566.000000000000000;0
1097;-741414.000000000000000;-1044558.000000000000000;0
1114;-741151.059999998658895;-1044607.410000000149012;0
4520;-742651.079999998211861;-1042798.449999999254942;0
7698;-742389.168000001460314;-1044818.684000000357628;0
6131;-742311.329999998211861;-1043064.982999999076128;0
7814;-741769.006999999284744;-1044058.535999998450279;0
4321;-742265.214999999850988;-1043235.418999999761581;0
4609;-742557.414000000804663;-1042621.583999998867512;0
3793;-743101.820000000298023;-1042826.379999998956919;0
4945;-742422.162999998778105;-1043009.861000001430511;0
4069;-742920.684999998658895;-1043755.420000001788139;0
7233;-742606.750000000000000;-1044827.379999998956919;0
6160;-742311.730999998748302;-1043061.116000000387430;0
4787;-742962.412000000476837;-1042621.662000000476837;0
1909;-743446.000000000000000;-1044375.000000000000000;0
6439;-741765.070999998599291;-1042636.877999998629093;0
3325;-743911.068999998271465;-1042947.052000001072884;0
227;-742846.000000000000000;-1043520.000000000000000;0
4804;-743020.045000001788139;-1042704.315999999642372;0
1139;-741487.000000000000000;-1044447.000000000000000;0
3782;-743285.429999999701977;-1042842.460000000894070;0
5660;-743425.633999999612570;-1043709.497000001370907;0
7276;-742801.670000001788139;-1044613.309999998658895;0
3888;-742331.469999998807907;-1042455.429999999701977;0
4670;-742810.120000001043081;-1042644.289999999105930;0
1429;-741982.000000000000000;-1044280.000000000000000;0
6751;-742426.350000001490116;-1044371.070000000298023;0
1397;-741771.000000000000000;-1044236.000000000000000;0
6200;-742318.653999999165535;-1043066.462000001221895;0
2285;-742897.000000000000000;-1045467.000000000000000;0
3416;-743754.546000000089407;-1043086.953000001609325;0
7962;-741640.190000001341105;-1044316.800000000745058;0
1346;-741769.000000000000000;-1044817.000000000000000;0
4854;-742971.159000001847744;-1042912.429000001400709;0
3973;-743161.204999998211861;-1043723.574999999254942;0
6004;-742061.723000001162291;-1043300.859999999403954;0
1954;-743372.000000000000000;-1044497.000000000000000;0
1824;-742963.809999998658895;-1044143.929999999701977;0
1126;-741684.000000000000000;-1044450.000000000000000;0
727;-742001.000000000000000;-1042962.000000000000000;0
1385;-742194.000000000000000;-1044974.000000000000000;0
6851;-741595.567000001668930;-1045078.456999998539686;0
4036;-743246.920000001788139;-1043771.574999999254942;0
705;-741929.000000000000000;-1042865.000000000000000;0
3752;-743213.949999999254942;-1042902.719999998807907;0
844;-742138.000000000000000;-1042519.000000000000000;0
7199;-742570.910000000149012;-1044916.410000000149012;0
2136;-742993.000000000000000;-1045103.000000000000000;0
2499;-741884.000000000000000;-1044011.000000000000000;0
4629;-742630.986000001430511;-1042626.096000000834465;0
551;-742269.000000000000000;-1043755.000000000000000;0
5175;-743313.734999999403954;-1043433.749000001698732;0
6139;-742312.807000000029802;-1043066.006000000983477;0
2179;-742953.000000000000000;-1045258.000000000000000;0
7699;-742381.114000000059605;-1044818.644000001251698;0
2018;-743244.000000000000000;-1044909.000000000000000;0
738;-741818.000000000000000;-1043024.000000000000000;0
722;-742139.000000000000000;-1043009.000000000000000;0
7004;-743069.289999999105930;-1044326.469999998807907;0
3305;-743801.410000000149012;-1042874.962999999523163;0
3989;-743307.815000001341105;-1044034.914999999105930;0
4522;-742668.079999998211861;-1042813.780000001192093;0
2740;-744042.611999999731779;-1043335.940000001341105;0
4772;-742879.881999999284744;-1042872.157000001519918;0
1347;-741791.000000000000000;-1044816.000000000000000;0
4528;-742714.350000001490116;-1042840.010000001639128;0
201;-743229.000000000000000;-1043614.000000000000000;0
6001;-742006.079999998211861;-1043292.300000000745058;0
343;-742575.000000000000000;-1043857.000000000000000;0
512;-742063.000000000000000;-1043136.000000000000000;0
4750;-742784.420000001788139;-1042733.429999999701977;0
6648;-741750.510000001639128;-1044080.329999998211861;0
1600;-742418.000000000000000;-1044944.000000000000000;0
4518;-742623.960000000894070;-1042786.719999998807907;0
4033;-743319.719999998807907;-1043793.300000000745058;0
4962;-742387.429999999701977;-1043028.129999998956919;0
8245;-742642.489999998360872;-1045210.670000001788139;0
6193;-742316.486000001430511;-1043063.991000000387430;0
4717;-742914.300000000745058;-1042625.489999998360872;0
627;-742223.000000000000000;-1043335.000000000000000;0
4523;-742703.960000000894070;-1042805.670000001788139;0
522;-742261.000000000000000;-1043122.000000000000000;0
403;-742307.000000000000000;-1043931.000000000000000;0
7345;-742613.339999999850988;-1045185.250000000000000;0
2887;-744098.480000000447035;-1043192.508000001311302;0
5504;-743428.977000001817942;-1043686.274000000208616;0
1728;-741473.000000000000000;-1045087.000000000000000;0
5126;-743012.193999998271465;-1043403.521000001579523;0
4465;-742180.250000000000000;-1042584.370000001043081;0
1752;-742070.000000000000000;-1045197.000000000000000;0
556;-742222.000000000000000;-1043702.000000000000000;0
5165;-743191.168000001460314;-1043398.304000001400709;0
5324;-743025.329999998211861;-1043045.789999999105930;0
4026;-743178.984999999403954;-1043847.989999998360872;0
824;-742142.000000000000000;-1042596.000000000000000;0
4909;-742383.146000001579523;-1042799.159000001847744;0
4517;-742638.449999999254942;-1042779.280000001192093;0
6809;-741079.942999999970198;-1044626.942000001668930;0
349;-742524.000000000000000;-1043764.000000000000000;0
516;-742160.000000000000000;-1043135.000000000000000;0
3998;-743432.704999998211861;-1043914.274999998509884;0
4677;-742787.309999998658895;-1042797.899999998509884;0
117;-745137.000000000000000;-1042704.000000000000000;0
5462;-742498.728999998420477;-1042986.947000000625849;0
8262;-742129.620000001043081;-1042698.079999998211861;0
908;-742211.000000000000000;-1042501.000000000000000;0
4633;-742625.931000001728535;-1042639.918999999761581;0
1592;-742378.000000000000000;-1044936.000000000000000;0
4651;-742756.375000000000000;-1042524.938000001013279;0
5059;-742853.796000000089407;-1043168.151999998837709;0
5206;-743189.870999999344349;-1043360.936000000685453;0
6448;-744017.179999999701977;-1043123.899999998509884;0
1321;-741825.000000000000000;-1044923.000000000000000;0
537;-742099.000000000000000;-1043663.000000000000000;0
1557;-741193.000000000000000;-1044306.000000000000000;0
4429;-742222.260000001639128;-1043102.250000000000000;0
4041;-743227.600000001490116;-1043746.495000001043081;0
6209;-742319.320000000298023;-1043066.114999998360872;0
5652;-743429.532999999821186;-1043700.732000000774860;0
4713;-742844.640000000596046;-1042605.980000000447035;0
6182;-742317.399000000208616;-1043067.136999998241663;0
2160;-742849.000000000000000;-1045147.000000000000000;0
4530;-742732.859999999403954;-1042860.920000001788139;0
4538;-742291.464000001549721;-1042734.344000000506639;0
2535;-742042.000000000000000;-1044071.000000000000000;0
1317;-741748.000000000000000;-1044884.000000000000000;0
1027;-741984.000000000000000;-1044660.000000000000000;0
4931;-742449.300000000745058;-1042791.403000000864267;0
6769;-741281.120000001043081;-1044417.780000001192093;0
3357;-743953.732000000774860;-1043042.298999998718500;0
4573;-742341.550000000745058;-1042629.699999999254942;0
191;-743424.000000000000000;-1043599.000000000000000;0
5108;-742876.219999998807907;-1043431.129999998956919;0
4253;-742109.368000000715256;-1043416.399999998509884;0
6274;-742318.392999999225140;-1043016.747000001370907;0
4590;-742387.043000001460314;-1042535.971000000834465;0
1103;-741306.000000000000000;-1044572.000000000000000;0
8019;-741972.039999999105930;-1044557.089999999850988;0
8052;-742218.929999999701977;-1044953.719999998807907;0
6015;-742854.607999999076128;-1043226.870999999344349;0
6360;-742004.925000000745058;-1042692.804000001400709;0
1488;-741088.000000000000000;-1044212.000000000000000;0
1555;-741196.000000000000000;-1044374.000000000000000;0
839;-742021.000000000000000;-1042510.000000000000000;0
347;-742542.000000000000000;-1043795.000000000000000;0
265;-743344.000000000000000;-1043735.000000000000000;0
3313;-743774.447000000625849;-1042903.081999998539686;0
8281;-742164.160000000149012;-1042778.140000000596046;0
3942;-743420.800000000745058;-1043492.339999999850988;0
7021;-743129.019999999552965;-1044076.230000000447035;0
235;-743467.000000000000000;-1043745.000000000000000;0
4558;-742373.019999999552965;-1042506.949999999254942;0
571;-742082.000000000000000;-1043581.000000000000000;0
6771;-741345.015999998897314;-1044413.647999998182058;0
4115;-742757.210000000894070;-1044109.620000001043081;0
5140;-743035.789999999105930;-1043514.489999998360872;0
6491;-742157.708000000566244;-1044457.421999998390675;0
4949;-742369.969999998807907;-1042973.199999999254942;0
2151;-742827.000000000000000;-1045047.000000000000000;0
6225;-742314.519999999552965;-1043055.927000001072884;0
4507;-742472.469999998807907;-1042720.199999999254942;0
2246;-743218.000000000000000;-1045379.000000000000000;0
3110;-743743.295000001788139;-1042640.627000000327826;0
4790;-743036.497999999672174;-1042635.973999999463558;0
5178;-743386.421000000089407;-1043452.486000001430511;0
394;-742405.000000000000000;-1043863.000000000000000;0
6982;-743055.109999999403954;-1044342.629999998956919;0
4213;-742218.094999998807907;-1043529.954999998211861;0
6845;-741527.188000001013279;-1044989.557000000029802;0
4021;-743293.295000001788139;-1043876.995000001043081;0
4593;-742510.820000000298023;-1042652.203999999910593;0
1136;-741520.000000000000000;-1044455.000000000000000;0
4845;-742978.655999999493361;-1042776.048000000417233;0
4703;-742697.859000001102686;-1042783.011999998241663;0
2469;-742941.000000000000000;-1045215.000000000000000;0
682;-742380.000000000000000;-1043151.000000000000000;0
5726;-743422.414000000804663;-1043635.760999999940395;0
3841;-743159.929999999701977;-1042641.120000001043081;0
4946;-742411.739000000059605;-1043002.199999999254942;0
3158;-744000.453999999910593;-1042558.089000001549721;0
3411;-743769.885999999940395;-1043038.517000000923872;0
527;-742186.000000000000000;-1043818.000000000000000;0
4825;-742908.839999999850988;-1042860.670000001788139;0
6142;-742310.477000001817942;-1043061.813000001013279;0
5119;-742850.592999998480082;-1043328.484999999403954;0
5745;-743415.129000000655651;-1043695.054000001400709;0
4140;-742831.635999999940395;-1044004.828999999910593;0
3975;-743112.984999999403954;-1043716.375999998301268;0
302;-742925.000000000000000;-1044109.000000000000000;0
2146;-742845.000000000000000;-1044968.000000000000000;0
1106;-741293.000000000000000;-1044589.000000000000000;0
4219;-742243.045000001788139;-1043600.660000000149012;0
5688;-743415.267000000923872;-1043631.945000000298023;0
5284;-743041.022999998182058;-1043277.397999998182058;0
7259;-742935.280000001192093;-1044869.829999998211861;0
520;-742225.000000000000000;-1043127.000000000000000;0
5147;-743077.127000000327826;-1043433.221999999135733;0
4922;-742443.129999998956919;-1042886.510000001639128;0
692;-742292.000000000000000;-1043084.000000000000000;0
2401;-742253.000000000000000;-1045390.000000000000000;0
5444;-743183.024000000208616;-1043210.600000001490116;0
5690;-743415.532999999821186;-1043635.447000000625849;0
6220;-742318.432999998331070;-1043062.949999999254942;0
5999;-741991.910000000149012;-1043282.079999998211861;0
2039;-743308.000000000000000;-1044808.000000000000000;0
4728;-742862.960000000894070;-1042727.210000000894070;0
5243;-743357.622000001370907;-1043407.258999999612570;0
1379;-742135.000000000000000;-1044975.000000000000000;0
2330;-742403.000000000000000;-1045511.000000000000000;0
1405;-741681.000000000000000;-1044325.000000000000000;0
825;-742171.000000000000000;-1042598.000000000000000;0
6223;-742316.076000001281500;-1043058.679000001400709;0
7252;-742775.109999999403954;-1044855.940000001341105;0
1308;-741589.000000000000000;-1044811.000000000000000;0
6367;-741928.510000001639128;-1042645.149999998509884;0
4761;-742810.285000000149012;-1042793.122000001370907;0
7025;-743199.914999999105930;-1044070.515000000596046;0
5598;-743412.839999999850988;-1043680.403000000864267;0
3222;-744040.953000001609325;-1042659.842000000178814;0
7290;-742819.100000001490116;-1044794.800000000745058;0
4532;-742760.140000000596046;-1042899.600000001490116;0
1051;-741775.000000000000000;-1044980.000000000000000;0
5720;-743418.223000001162291;-1043629.960999999195337;0
7022;-743155.660000000149012;-1044074.410000000149012;0
1245;-742114.000000000000000;-1044548.000000000000000;0
1697;-741495.000000000000000;-1044664.000000000000000;0
4508;-742449.140000000596046;-1042725.980000000447035;0
4595;-742574.953000001609325;-1042659.344000000506639;0
4902;-742480.460000000894070;-1042802.989999998360872;0
388;-742441.000000000000000;-1043809.000000000000000;0
1525;-741738.000000000000000;-1043823.000000000000000;0
2394;-742273.000000000000000;-1045360.000000000000000;0
6167;-742313.859999999403954;-1043063.607000000774860;0
6693;-742248.197000000625849;-1044816.127000000327826;0
1259;-742064.000000000000000;-1044854.000000000000000;0
1370;-742061.000000000000000;-1044797.000000000000000;0
2257;-742956.000000000000000;-1045558.000000000000000;0
4665;-742824.410000000149012;-1042592.260000001639128;0
7244;-742713.559999998658895;-1044823.719999998807907;0
1651;-741374.000000000000000;-1044519.000000000000000;0
4088;-742812.114999998360872;-1043580.475000001490116;0
3820;-743111.699999999254942;-1042659.320000000298023;0
669;-742510.000000000000000;-1043260.000000000000000;0
5724;-743422.230999998748302;-1043632.715999998152256;0
3310;-743829.561999998986721;-1042854.063000001013279;0
4632;-742615.638999998569489;-1042624.039999999105930;0
4201;-742269.000000000000000;-1043651.563000001013279;0
7540;-742660.390000000596046;-1045368.829999998211861;0
6242;-742366.677999999374151;-1043062.949000000953674;0
6711;-742266.486000001430511;-1044832.896000001579523;0
4777;-742910.034000001847744;-1042759.350999999791384;0
309;-742721.000000000000000;-1044157.000000000000000;0
6308;-741823.129999998956919;-1042770.370000001043081;0
541;-742258.000000000000000;-1043678.000000000000000;0
1028;-741981.000000000000000;-1044692.000000000000000;0
552;-742259.000000000000000;-1043732.000000000000000;0
1700;-741406.000000000000000;-1044677.000000000000000;0
5579;-743409.682999998331070;-1043634.574999999254942;0
273;-743381.000000000000000;-1043820.000000000000000;0
4975;-742477.829999998211861;-1043016.923000000417233;0
5022;-742578.440000001341105;-1042849.350000001490116;0
