OID_;X;Y;TEMPERATURE
3614;-744984.548999998718500;-1042283.640999998897314;0
3019;-744463.447999998927116;-1042784.646000001579523;0
3568;-744718.817999999970198;-1042588.614999998360872;0
3692;-744525.876499999314547;-1042540.534000001847744;0
3580;-744924.973999999463558;-1042593.699999999254942;0
2605;-745393.842999998480082;-1042860.796000000089407;0
5975;-745052.346999999135733;-1042674.673000000417233;0
118;-745135.000000000000000;-1042687.000000000000000;0
3542;-744575.274000000208616;-1042656.160000000149012;0
2696;-743477.489999998360872;-1042038.000000000000000;0
2520;-741847.000000000000000;-1045324.000000000000000;0
6872;-741751.719999998807907;-1045296.679999999701977;0
2760;-743863.331000000238419;-1043483.304000001400709;0
2755;-744003.879000000655651;-1043471.734000001102686;0
2404;-742179.000000000000000;-1045467.000000000000000;0
3919;-743904.947000000625849;-1043493.929999999701977;0
3107;-743778.888000000268221;-1042682.131999999284744;0
2740;-744042.611999999731779;-1043335.940000001341105;0
1486;-741150.000000000000000;-1044219.000000000000000;0
6828;-741465.309999998658895;-1044768.940000001341105;0
7411;-743529.510000001639128;-1045393.140000000596046;0
8079;-742021.839999999850988;-1045292.179999999701977;0
2070;-742993.000000000000000;-1044723.000000000000000;0
2097;-743143.000000000000000;-1044742.000000000000000;0
7263;-743009.559999998658895;-1044894.379999998956919;0
4238;-742440.263000000268221;-1043528.236000001430511;0
7654;-742242.081000000238419;-1045273.263999998569489;0
2394;-742273.000000000000000;-1045360.000000000000000;0
2160;-742849.000000000000000;-1045147.000000000000000;0
2161;-742876.000000000000000;-1045153.000000000000000;0
8073;-742120.640000000596046;-1045259.500000000000000;0
4075;-742947.934999998658895;-1043903.649999998509884;0
7947;-742030.969999998807907;-1044096.679999999701977;0
524;-742255.000000000000000;-1043913.000000000000000;0
1780;-741214.000000000000000;-1043934.000000000000000;0
738;-741818.000000000000000;-1043024.000000000000000;0
1983;-743474.000000000000000;-1044709.000000000000000;0
748;-741671.000000000000000;-1042971.000000000000000;0
110;-744127.000000000000000;-1042724.000000000000000;0
7022;-743155.660000000149012;-1044074.410000000149012;0
1764;-741163.000000000000000;-1044144.000000000000000;0
735;-741910.000000000000000;-1043014.000000000000000;0
514;-742119.000000000000000;-1043141.000000000000000;0
510;-742048.000000000000000;-1043150.000000000000000;0
2050;-743460.000000000000000;-1045072.000000000000000;0
2008;-743242.000000000000000;-1044759.000000000000000;0
6722;-742357.717000000178814;-1044705.708000000566244;0
1561;-743186.000000000000000;-1045098.000000000000000;0
1251;-742091.000000000000000;-1044690.000000000000000;0
7;-743479.000000000000000;-1042567.000000000000000;0
17;-743587.000000000000000;-1042394.000000000000000;0
5303;-743164.818999998271465;-1043211.078000001609325;0
1492;-741096.000000000000000;-1044331.000000000000000;0
4332;-742410.359000001102686;-1043282.916000001132488;0
3204;-743715.278999999165535;-1042506.118999999016523;0
6;-743464.000000000000000;-1042594.000000000000000;0
2133;-743040.000000000000000;-1045127.000000000000000;0
2151;-742827.000000000000000;-1045047.000000000000000;0
2166;-743016.000000000000000;-1045179.000000000000000;0
7324;-742833.980000000447035;-1044949.109999999403954;0
4162;-742497.193999998271465;-1044160.030000001192093;0
6746;-742405.083999998867512;-1044259.199999999254942;0
1515;-741913.000000000000000;-1044072.000000000000000;0
1371;-742089.000000000000000;-1044807.000000000000000;0
884;-741771.000000000000000;-1042776.000000000000000;0
1013;-742076.000000000000000;-1044595.000000000000000;0
2189;-743472.000000000000000;-1045183.000000000000000;0
727;-742001.000000000000000;-1042962.000000000000000;0
1091;-741531.480000000447035;-1044543.440000001341105;0
728;-741997.000000000000000;-1042918.000000000000000;0
696;-742077.000000000000000;-1042913.000000000000000;0
3326;-744036.002000000327826;-1042922.574999999254942;0
2226;-743057.000000000000000;-1045470.000000000000000;0
504;-741937.000000000000000;-1043164.000000000000000;0
5062;-742798.513999998569489;-1043227.370999999344349;0
1970;-743380.000000000000000;-1044854.000000000000000;0
1987;-743480.000000000000000;-1044820.000000000000000;0
3387;-743960.368000000715256;-1043194.717000000178814;0
2256;-743156.000000000000000;-1045353.000000000000000;0
3233;-744152.962999999523163;-1042686.791999999433756;0
7776;-743089.784000001847744;-1045773.409000001847744;0
4232;-742315.057999998331070;-1043428.918999999761581;0
1915;-743468.000000000000000;-1044494.000000000000000;0
5119;-742850.592999998480082;-1043328.484999999403954;0
7520;-742808.589999999850988;-1045680.519999999552965;0
7087;-743339.940000001341105;-1044536.690000001341105;0
7350;-742556.390000000596046;-1045185.980000000447035;0
1945;-743270.000000000000000;-1044454.000000000000000;0
1058;-741667.000000000000000;-1045072.000000000000000;0
6791;-741047.329999998211861;-1044765.467999998480082;0
1875;-743367.000000000000000;-1044261.000000000000000;0
2262;-742999.000000000000000;-1045686.000000000000000;0
1926;-743301.000000000000000;-1044321.000000000000000;0
5292;-743055.866000000387430;-1043215.710999999195337;0
5272;-743000.013999998569489;-1043245.364000000059605;0
4070;-742925.285000000149012;-1043783.565000001341105;0
4342;-742506.473000001162291;-1043301.100000001490116;0
7651;-742295.381000000983477;-1045479.861999999731779;0
4212;-742205.245000001043081;-1043548.410000000149012;0
1238;-742150.000000000000000;-1044384.000000000000000;0
1243;-742122.000000000000000;-1044502.000000000000000;0
5223;-743283.699999999254942;-1043535.940000001341105;0
2491;-742059.000000000000000;-1044251.000000000000000;0
7217;-742516.318999998271465;-1044582.890000000596046;0
1052;-741761.000000000000000;-1045002.000000000000000;0
910;-742219.000000000000000;-1042529.000000000000000;0
1171;-741882.000000000000000;-1044375.000000000000000;0
6943;-742902.013999998569489;-1043932.647999998182058;0
6825;-741380.010000001639128;-1044780.089999999850988;0
281;-743045.000000000000000;-1043848.000000000000000;0
8018;-741974.039999999105930;-1044442.870000001043081;0
4006;-743302.763000000268221;-1044052.298999998718500;0
1138;-741500.000000000000000;-1044458.000000000000000;0
4236;-742406.842999998480082;-1043504.015000000596046;0
7026;-743217.644999999552965;-1044082.329999998211861;0
6095;-742082.920000001788139;-1043614.710000000894070;0
1865;-743458.000000000000000;-1044233.000000000000000;0
3781;-743273.059999998658895;-1042814.050000000745058;0
3752;-743213.949999999254942;-1042902.719999998807907;0
7218;-742534.100000001490116;-1044603.559999998658895;0
1656;-741395.000000000000000;-1044688.000000000000000;0
1922;-743390.000000000000000;-1044308.000000000000000;0
1920;-743384.000000000000000;-1044363.000000000000000;0
1905;-743446.000000000000000;-1044312.000000000000000;0
2513;-742574.000000000000000;-1044441.000000000000000;0
7044;-743400.635000001639128;-1044135.579999998211861;0
7104;-743423.739999998360872;-1044624.530000001192093;0
6313;-743936.949999999254942;-1042594.780000001192093;0
3155;-743969.353000000119209;-1042568.828000001609325;0
627;-742223.000000000000000;-1043335.000000000000000;0
4026;-743178.984999999403954;-1043847.989999998360872;0
6821;-741256.649999998509884;-1044796.100000001490116;0
1101;-741339.000000000000000;-1044568.000000000000000;0
4023;-743246.635000001639128;-1043864.364999998360872;0
2300;-742561.000000000000000;-1045413.000000000000000;0
1449;-741533.000000000000000;-1044684.000000000000000;0
1693;-741613.000000000000000;-1044649.000000000000000;0
713;-741800.000000000000000;-1042859.000000000000000;0
1325;-741894.000000000000000;-1044959.000000000000000;0
3976;-743088.861000001430511;-1043707.728000000119209;0
881;-741806.000000000000000;-1042815.000000000000000;0
1611;-742400.000000000000000;-1044442.000000000000000;0
6700;-742298.611000001430511;-1044507.315999999642372;0
6703;-742288.903999999165535;-1044591.625999998301268;0
7010;-742857.964999999850988;-1044251.155000001192093;4
4058;-743138.765000000596046;-1043625.405000001192093;0
4057;-743132.184999998658895;-1043648.719999998807907;0
1310;-741623.000000000000000;-1044829.000000000000000;0
6718;-742339.493000000715256;-1044956.921999998390675;0
1692;-741125.000000000000000;-1044816.000000000000000;0
6662;-741466.800000000745058;-1044192.359999999403954;0
2016;-743230.000000000000000;-1044873.000000000000000;0
5232;-743347.087000001221895;-1043476.425000000745058;0
2575;-742484.000000000000000;-1045453.000000000000000;0
1387;-742155.000000000000000;-1044999.000000000000000;0
1598;-742351.000000000000000;-1045090.000000000000000;0
2375;-742438.000000000000000;-1045570.000000000000000;0
2309;-742322.000000000000000;-1045519.000000000000000;0
1385;-742194.000000000000000;-1044974.000000000000000;0
2329;-742432.000000000000000;-1045508.000000000000000;0
6842;-741574.894000001251698;-1044962.013999998569489;0
1590;-742377.000000000000000;-1044885.000000000000000;0
4064;-742879.655000001192093;-1043647.420000001788139;0
1993;-743483.000000000000000;-1044984.000000000000000;0
2041;-743531.000000000000000;-1044957.000000000000000;0
2419;-742418.000000000000000;-1045101.000000000000000;0
1269;-742246.000000000000000;-1044462.000000000000000;0
6573;-741294.089999999850988;-1044091.679999999701977;0
7736;-742342.260000001639128;-1045113.918000001460314;0
4036;-743246.920000001788139;-1043771.574999999254942;0
623;-742254.000000000000000;-1043325.000000000000000;0
3766;-743053.532999999821186;-1042996.631000000983477;0
2017;-743247.000000000000000;-1044884.000000000000000;0
6726;-742476.517999999225140;-1044410.600000001490116;0
2028;-743371.000000000000000;-1045054.000000000000000;0
7315;-742603.960000000894070;-1045022.870000001043081;0
1604;-742552.000000000000000;-1044918.000000000000000;0
5241;-743365.063000001013279;-1043245.954999998211861;0
7152;-742867.331999998539686;-1044547.015999998897314;0
5258;-743356.739999998360872;-1043230.039999999105930;0
7156;-742944.515000000596046;-1044546.140000000596046;0
1553;-741350.000000000000000;-1044268.000000000000000;0
4252;-742124.022999998182058;-1043390.519000001251698;0
1126;-741684.000000000000000;-1044450.000000000000000;0
3837;-743093.699999999254942;-1042577.890000000596046;0
1459;-741491.000000000000000;-1044340.000000000000000;0
3847;-743122.146999999880791;-1042525.489999998360872;0
3995;-743393.225000001490116;-1043973.719999998807907;0
2247;-743199.000000000000000;-1045400.000000000000000;0
3287;-743711.173999998718500;-1042886.515999998897314;0
7141;-742895.629999998956919;-1044470.910000000149012;0
1518;-741994.000000000000000;-1044011.000000000000000;0
2286;-742894.000000000000000;-1045440.000000000000000;0
7206;-742559.920000001788139;-1045003.190000001341105;0
4990;-742657.837999999523163;-1043024.199999999254942;0
1619;-742426.000000000000000;-1044401.000000000000000;0
4062;-742830.460000000894070;-1043654.920000001788139;0
7017;-742571.059999998658895;-1044267.640000000596046;0
3413;-743776.791000001132488;-1043071.675000000745058;0
3747;-743250.879999998956919;-1042956.620000001043081;0
2238;-743372.000000000000000;-1045261.000000000000000;0
2232;-743488.000000000000000;-1045234.000000000000000;0
4794;-743065.828999999910593;-1042673.377000000327826;0
1849;-742732.000000000000000;-1044228.000000000000000;0
4079;-742836.170000001788139;-1043800.960000000894070;0
1061;-741586.000000000000000;-1045133.000000000000000;0
2891;-744029.914000000804663;-1043200.478000000119209;0
2888;-744082.749000001698732;-1043174.458999998867512;0
3266;-743585.618999999016523;-1042739.508999999612570;0
3289;-743584.761999998241663;-1042769.188000001013279;0
2213;-743188.000000000000000;-1045298.000000000000000;0
2241;-743319.000000000000000;-1045289.000000000000000;0
3789;-743137.469999998807907;-1042933.670000001788139;0
2526;-741087.000000000000000;-1044616.000000000000000;0
1435;-741903.000000000000000;-1044306.000000000000000;0
4198;-742192.445000000298023;-1043760.521000001579523;0
4505;-742434.910000000149012;-1042706.170000001788139;0
835;-741950.000000000000000;-1042513.000000000000000;0
7146;-742819.425000000745058;-1044426.225000001490116;0
2487;-742101.000000000000000;-1044308.000000000000000;0
4500;-742315.239999998360872;-1042719.460000000894070;0
7958;-741664.710000000894070;-1044289.879999998956919;0
1455;-741517.000000000000000;-1044468.000000000000000;0
1164;-741055.000000000000000;-1044515.000000000000000;0
7508;-742947.440000001341105;-1045540.690000001341105;0
5323;-743049.401000000536442;-1043038.131000000983477;0
1531;-741782.000000000000000;-1043838.000000000000000;0
4106;-742664.475000001490116;-1043755.761999998241663;0
1520;-741777.000000000000000;-1043939.000000000000000;0
4144;-742704.414999999105930;-1043822.484999999403954;0
560;-742181.000000000000000;-1043665.000000000000000;0
4981;-742536.340999998152256;-1043014.929999999701977;0
6854;-741522.427999999374151;-1045038.967999998480082;0
1839;-742994.469999998807907;-1044185.679999999701977;0
574;-742068.000000000000000;-1043538.000000000000000;0
3095;-743923.068999998271465;-1042787.789000000804663;0
3303;-743810.967999998480082;-1042865.596000000834465;0
4097;-742806.000000000000000;-1043874.793999999761581;0
3101;-743922.754999998956919;-1042745.195000000298023;0
4925;-742455.502000000327826;-1042923.307000000029802;0
3304;-743786.739000000059605;-1042873.728999998420477;0
334;-742631.000000000000000;-1043987.000000000000000;0
581;-741991.000000000000000;-1043457.000000000000000;0
5961;-742431.225000001490116;-1044003.574999999254942;0
408;-742317.000000000000000;-1044182.000000000000000;0
4793;-743035.089999999850988;-1042650.028000000864267;0
2560;-741251.000000000000000;-1044390.000000000000000;0
591;-741912.000000000000000;-1043346.000000000000000;0
6763;-741117.219999998807907;-1044428.989999998360872;0
3410;-743766.532000001519918;-1043023.280999999493361;0
1328;-742037.000000000000000;-1045043.000000000000000;0
1306;-741783.000000000000000;-1044653.000000000000000;0
7281;-742801.859999999403954;-1044705.300000000745058;0
346;-742540.000000000000000;-1043816.000000000000000;0
1261;-742057.000000000000000;-1044894.000000000000000;0
2321;-742679.000000000000000;-1045480.000000000000000;0
1008;-741962.000000000000000;-1044568.000000000000000;0
339;-742606.000000000000000;-1043916.000000000000000;0
1005;-741944.000000000000000;-1044583.000000000000000;0
4953;-742431.500999998301268;-1043027.399999998509884;0
826;-742191.000000000000000;-1042616.000000000000000;0
6391;-742109.269999999552965;-1042498.320000000298023;0
834;-742049.000000000000000;-1042541.000000000000000;0
7147;-742827.925000000745058;-1044451.385000001639128;0
1036;-741961.000000000000000;-1044922.000000000000000;0
401;-742324.000000000000000;-1043907.000000000000000;0
224;-742904.000000000000000;-1043522.000000000000000;0
795;-741770.000000000000000;-1042577.000000000000000;0
5116;-742947.859000001102686;-1043386.767000000923872;0
6656;-741590.160000000149012;-1044150.480000000447035;0
2501;-742746.000000000000000;-1045430.000000000000000;0
8281;-742164.160000000149012;-1042778.140000000596046;0
4229;-742146.929000001400709;-1043334.585000000894070;0
8283;-742198.600000001490116;-1042801.980000000447035;0
2084;-742447.000000000000000;-1044797.000000000000000;0
3886;-742385.100000001490116;-1042445.500000000000000;0
1118;-741807.000000000000000;-1044459.000000000000000;0
1705;-741257.219999998807907;-1044695.690000001341105;0
2079;-742688.000000000000000;-1044428.000000000000000;0
7514;-742304.866000000387430;-1044375.124000001698732;0
5419;-742434.690000001341105;-1042846.280000001192093;0
7704;-742256.021000001579523;-1044313.592999998480082;0
5113;-742946.795000001788139;-1043444.427999999374151;0
555;-742230.000000000000000;-1043726.000000000000000;0
7175;-742651.780000001192093;-1044558.149999998509884;0
1498;-741382.000000000000000;-1044310.000000000000000;0
7004;-743069.289999999105930;-1044326.469999998807907;0
4877;-742845.760000001639128;-1042956.589999999850988;0
3943;-743413.429000001400709;-1043376.822000000625849;0
4878;-742876.434000000357628;-1042964.004000000655651;0
500;-741861.000000000000000;-1043174.000000000000000;0
497;-741780.000000000000000;-1043214.000000000000000;0
785;-741702.000000000000000;-1042622.000000000000000;0
1190;-741821.000000000000000;-1044110.000000000000000;0
6648;-741750.510000001639128;-1044080.329999998211861;0
2082;-742569.000000000000000;-1044642.000000000000000;0
3769;-742978.969999998807907;-1042975.300000000745058;0
2320;-742707.000000000000000;-1045477.000000000000000;0
397;-742355.000000000000000;-1043861.000000000000000;0
6653;-741657.920000001788139;-1044136.789999999105930;0
4901;-742520.120000001043081;-1042823.960000000894070;0
4143;-742750.925000000745058;-1044017.960000000894070;0
4848;-742977.940000001341105;-1042862.019999999552965;0
217;-742998.000000000000000;-1043554.000000000000000;0
5020;-742572.699999999254942;-1042891.372999999672174;0
4820;-742927.769999999552965;-1042786.710000000894070;0
6509;-741724.809999998658895;-1044485.162000000476837;0
2317;-742792.000000000000000;-1045467.000000000000000;0
6837;-741677.875999998301268;-1044964.791999999433756;0
1313;-741681.000000000000000;-1044849.000000000000000;0
1824;-742963.809999998658895;-1044143.929999999701977;0
4958;-742349.620000001043081;-1043004.539999999105930;0
7190;-742577.989999998360872;-1044771.690000001341105;0
6362;-742039.230999998748302;-1042680.660000000149012;0
4841;-742989.993999999016523;-1042765.850999999791384;0
1195;-741696.000000000000000;-1043920.000000000000000;0
6705;-742279.050999999046326;-1044655.923000000417233;0
4455;-741714.589000001549721;-1042663.557000000029802;0
6184;-742315.868999999016523;-1043064.326999999582767;0
6230;-742317.590999998152256;-1043059.730999998748302;0
4427;-742190.519999999552965;-1043099.440000001341105;0
551;-742269.000000000000000;-1043755.000000000000000;0
3348;-743960.361000001430511;-1043015.629999998956919;0
6604;-741636.960000000894070;-1043867.217999998480082;0
388;-742441.000000000000000;-1043809.000000000000000;0
4725;-742875.100000001490116;-1042678.230000000447035;0
1331;-741805.000000000000000;-1044733.000000000000000;0
4033;-743319.719999998807907;-1043793.300000000745058;0
7163;-743099.541999999433756;-1044532.261999998241663;0
955;-742230.000000000000000;-1043005.000000000000000;0
1127;-741700.000000000000000;-1044440.000000000000000;0
6783;-741340.728000000119209;-1044457.412000000476837;0
4131;-742844.625000000000000;-1044059.980000000447035;0
3794;-743091.015000000596046;-1042800.471999999135733;0
5597;-743414.056000001728535;-1043680.309000000357628;0
4661;-742816.708000000566244;-1042503.918999999761581;0
5648;-743429.164000000804663;-1043695.905999999493361;0
1349;-741824.000000000000000;-1044818.000000000000000;0
5591;-743421.353999998420477;-1043679.738000001758337;0
4713;-742844.640000000596046;-1042605.980000000447035;0
6144;-742308.925000000745058;-1043059.002000000327826;0
6274;-742318.392999999225140;-1043016.747000001370907;0
4510;-742483.149999998509884;-1042738.460000000894070;0
6974;-743127.620000001043081;-1044518.800000000745058;0
4766;-742803.037999998778105;-1042842.532999999821186;0
461;-741713.000000000000000;-1043304.000000000000000;0
4730;-742831.050000000745058;-1042696.600000001490116;0
5738;-743410.412999998778105;-1043691.800000000745058;0
1220;-742147.000000000000000;-1044283.000000000000000;0
5504;-743428.977000001817942;-1043686.274000000208616;0
1109;-741204.100000001490116;-1044585.460000000894070;0
3352;-743954.622000001370907;-1043015.732999999076128;0
4762;-742854.192000001668930;-1042825.931000001728535;0
6693;-742248.197000000625849;-1044816.127000000327826;0
309;-742721.000000000000000;-1044157.000000000000000;0
1301;-741896.000000000000000;-1044703.000000000000000;0
6215;-742314.692000001668930;-1043057.682000000029802;0
6222;-742316.855000000447035;-1043060.109999999403954;0
4688;-742676.179000001400709;-1042555.322999998927116;0
5996;-742061.879000000655651;-1043284.276999998837709;0
5511;-743426.401000000536442;-1043599.129999998956919;0
4723;-742883.429999999701977;-1042644.829999998211861;0
5517;-743427.287000000476837;-1043618.956999998539686;0
6223;-742316.076000001281500;-1043058.679000001400709;0
4702;-742669.300000000745058;-1042747.399999998509884;0
4750;-742784.420000001788139;-1042733.429999999701977;0
6002;-742018.502000000327826;-1043294.918999999761581;0
1352;-741840.000000000000000;-1044854.000000000000000;0
1355;-741899.000000000000000;-1044858.000000000000000;0
3835;-743050.579999998211861;-1042590.109999999403954;0
2546;-741750.000000000000000;-1044271.000000000000000;0
1028;-741981.000000000000000;-1044692.000000000000000;0
6320;-741766.848000001162291;-1042614.989999998360872;0
4712;-742830.309999998658895;-1042614.969999998807907;0
5126;-743012.193999998271465;-1043403.521000001579523;0
2334;-742872.000000000000000;-1045519.000000000000000;0
4521;-742681.440000001341105;-1042792.960000000894070;0
5646;-743428.978999998420477;-1043693.493000000715256;0
6145;-742315.708000000566244;-1043069.881999999284744;0
6711;-742266.486000001430511;-1044832.896000001579523;0
4600;-742647.000000000000000;-1042709.000000000000000;0
5689;-743415.442000001668930;-1043633.646000001579523;0
4835;-742967.660000000149012;-1042677.690000001341105;0
6366;-741957.399999998509884;-1042652.609999999403954;0
672;-742484.000000000000000;-1043226.000000000000000;0
5168;-743228.796000000089407;-1043420.092000000178814;0
1546;-742219.000000000000000;-1044147.000000000000000;0
5766;-742429.719999998807907;-1042597.699999999254942;0
261;-743429.000000000000000;-1043723.000000000000000;0
6268;-742340.850000001490116;-1043018.881000000983477;0
6270;-742333.412999998778105;-1043018.204999998211861;0
3791;-743144.839999999850988;-1042881.120000001043081;0
5461;-742442.704999998211861;-1043234.515000000596046;0
5138;-743030.936000000685453;-1043483.587999999523163;0
5451;-743276.109000001102686;-1043331.000999998301268;0
457;-741732.000000000000000;-1043333.000000000000000;0
2543;-741788.000000000000000;-1044237.000000000000000;0
3957;-743415.125000000000000;-1043567.214999999850988;0
7956;-741777.379999998956919;-1044260.170000001788139;0
382;-742481.000000000000000;-1043751.000000000000000;0
1299;-741943.000000000000000;-1044719.000000000000000;0
6176;-742314.491000000387430;-1043063.256000000983477;0
4599;-742625.879999998956919;-1042698.820000000298023;0
1529;-741727.000000000000000;-1043794.000000000000000;0
330;-742659.000000000000000;-1044043.000000000000000;0
4218;-742263.436999998986721;-1043615.100999999791384;0
4601;-742631.969999998807907;-1042675.629999998956919;0
379;-742479.000000000000000;-1043679.000000000000000;0
6140;-742311.999000001698732;-1043064.638999998569489;0
450;-741705.000000000000000;-1043312.000000000000000;0
7028;-743257.254999998956919;-1044104.574999999254942;0
4614;-742493.800000000745058;-1042636.896000001579523;0
4430;-742235.070000000298023;-1043092.839999999850988;0
4571;-742345.710000000894070;-1042568.989999998360872;0
4624;-742577.815000001341105;-1042600.907999999821186;0
4670;-742810.120000001043081;-1042644.289999999105930;0
6150;-742311.879999998956919;-1043062.857000000774860;0
6372;-741988.530000001192093;-1042699.339999999850988;0
7249;-742789.010999999940395;-1044830.250000000000000;0
3795;-743173.190000001341105;-1042842.170000001788139;0
5640;-743428.425000000745058;-1043686.254000000655651;0
5161;-743160.846999999135733;-1043333.914999999105930;0
5655;-743429.699000000953674;-1043704.359999999403954;0
5709;-743420.221999999135733;-1043640.467999998480082;0
4476;-741849.620000001043081;-1042690.190000001341105;0
6123;-743427.453000001609325;-1043603.083000000566244;0
684;-742358.000000000000000;-1043136.000000000000000;0
6295;-742653.399999998509884;-1042696.070000000298023;0
4522;-742668.079999998211861;-1042813.780000001192093;0
1149;-741311.000000000000000;-1044471.000000000000000;0
1422;-742199.000000000000000;-1044127.000000000000000;0
515;-742176.000000000000000;-1043121.000000000000000;0
6257;-742381.556000001728535;-1043033.991000000387430;0
5681;-743400.820000000298023;-1043718.682000000029802;0
5714;-743423.756000000983477;-1043635.103999998420477;0
6158;-742313.261999998241663;-1043063.925999999046326;0
1599;-742237.000000000000000;-1044977.000000000000000;0
6152;-742310.348999999463558;-1043060.046999998390675;0
6168;-742313.092999998480082;-1043062.208999998867512;0
6206;-742314.043000001460314;-1043058.028999999165535;0
4798;-743028.991999998688698;-1042693.375000000000000;0
5142;-743039.870000001043081;-1043473.929999999701977;0
5722;-743419.659000001847744;-1043631.798000000417233;0
4710;-742796.730000000447035;-1042611.769999999552965;0
4127;-742837.324999999254942;-1044032.670000001788139;0
6277;-742304.633999999612570;-1043024.256000000983477;0
5217;-743306.870999999344349;-1043323.228000000119209;0
6193;-742316.486000001430511;-1043063.991000000387430;0
4623;-742533.778999999165535;-1042585.824000000953674;0
6191;-742318.017000000923872;-1043066.800999999046326;0
4649;-742732.228999998420477;-1042525.100000001490116;0
635;-742143.000000000000000;-1043317.000000000000000;0
693;-742284.000000000000000;-1043062.000000000000000;0
6174;-742316.021999999880791;-1043066.065000001341105;0
5515;-743426.960000000894070;-1043612.083999998867512;0
6153;-742309.583999998867512;-1043058.640999998897314;0
3343;-743911.989000000059605;-1043070.489000000059605;0
303;-742895.000000000000000;-1044116.000000000000000;0
5599;-743411.622999999672174;-1043680.499000001698732;0
1152;-741257.000000000000000;-1044489.000000000000000;0
7247;-742774.480000000447035;-1044839.850000001490116;0
5595;-743416.488000001758337;-1043680.118999999016523;0
6213;-742316.227000001817942;-1043060.478999998420477;0
1792;-742165.000000000000000;-1044209.000000000000000;0
1797;-743098.000000000000000;-1044099.000000000000000;0
6159;-742312.495999999344349;-1043062.521000001579523;0
6271;-742329.282000001519918;-1043017.853999998420477;0
7001;-743085.660000000149012;-1044400.420000001788139;0
6135;-742308.289000000804663;-1043059.340999998152256;0
4524;-742683.789999999105930;-1042823.579999998211861;0
4478;-741867.359999999403954;-1042693.289999999105930;0
6155;-742315.557999998331070;-1043068.140999998897314;0
3982;-743325.135000001639128;-1043857.684999998658895;0
7703;-742462.714000001549721;-1044818.045000001788139;0
6232;-742316.034000001847744;-1043057.000000000000000;0
4625;-742594.258000001311302;-1042576.114000000059605;0
6207;-742313.287000000476837;-1043056.642000000923872;0
6130;-742312.136999998241663;-1043066.344000000506639;0
7233;-742606.750000000000000;-1044827.379999998956919;0
6194;-742315.721000000834465;-1043062.585999999195337;0
381;-742465.000000000000000;-1043700.000000000000000;0
3999;-743412.539999999105930;-1043918.725000001490116;0
5208;-743237.954999998211861;-1043368.065999999642372;0
690;-742306.000000000000000;-1043081.000000000000000;0
8272;-742042.399999998509884;-1042732.559999998658895;0
7032;-743301.464999999850988;-1044106.190000001341105;0
5693;-743415.905000001192093;-1043640.377000000327826;0
5638;-743428.245000001043081;-1043683.840999998152256;0
4114;-742764.195000000298023;-1044131.760000001639128;0
6104;-742208.646999999880791;-1043103.999000001698732;0
6982;-743055.109999999403954;-1044342.629999998956919;0
4220;-742214.344999998807907;-1043580.359999999403954;0
5592;-743420.136999998241663;-1043679.831999998539686;0
6226;-742320.660999998450279;-1043065.366999998688698;0
599;-741837.000000000000000;-1043243.000000000000000;0
4747;-742866.289999999105930;-1042753.390000000596046;0
5590;-743422.570000000298023;-1043679.642000000923872;0
4706;-742728.070000000298023;-1042610.910000000149012;0
4559;-742400.530000001192093;-1042503.760000001639128;0
6126;-743428.385999999940395;-1043621.800000000745058;0
