OID_;X;Y;TEMPERATURE
7;-743479.000000000000000;-1042567.000000000000000;0
2757;-743949.300000000745058;-1043488.500000000000000;0
5786;-743456.410000000149012;-1042105.250000000000000;0
7519;-742850.620000001043081;-1045673.670000001788139;0
4074;-742943.350000001490116;-1043880.304999999701977;0
3752;-743213.949999999254942;-1042902.719999998807907;0
3269;-743600.679000001400709;-1042731.660000000149012;0
598;-741853.000000000000000;-1043233.000000000000000;0
7776;-743089.784000001847744;-1045773.409000001847744;0
3923;-743845.660000000149012;-1043512.260000001639128;0
2466;-743460.000000000000000;-1044740.000000000000000;0
7409;-743521.629999998956919;-1045356.570000000298023;0
3388;-743940.289999999105930;-1043154.210000000894070;0
6399;-742013.379999998956919;-1042502.739999998360872;0
1629;-742450.000000000000000;-1044518.000000000000000;0
2262;-742999.000000000000000;-1045686.000000000000000;0
3314;-743758.675999999046326;-1042905.688999999314547;0
2488;-742083.000000000000000;-1044303.000000000000000;0
1433;-741895.000000000000000;-1044328.000000000000000;0
2050;-743460.000000000000000;-1045072.000000000000000;0
1197;-741657.000000000000000;-1043865.000000000000000;0
1532;-741805.000000000000000;-1043858.000000000000000;0
826;-742191.000000000000000;-1042616.000000000000000;0
3839;-743112.140000000596046;-1042558.280000001192093;0
4071;-742929.394999999552965;-1043807.585000000894070;0
1915;-743468.000000000000000;-1044494.000000000000000;0
3211;-743651.409000001847744;-1042483.458999998867512;0
3682;-744519.155999999493361;-1042509.840999998152256;0
6751;-742426.350000001490116;-1044371.070000000298023;0
2215;-743135.000000000000000;-1045335.000000000000000;0
3815;-743161.949999999254942;-1042769.750000000000000;0
883;-741802.000000000000000;-1042773.000000000000000;0
8080;-741989.600000001490116;-1045310.420000001788139;0
1323;-741859.000000000000000;-1044941.000000000000000;0
7277;-742796.870000001043081;-1044653.429999999701977;0
6658;-741538.879999998956919;-1044165.440000001341105;0
2226;-743057.000000000000000;-1045470.000000000000000;0
281;-743045.000000000000000;-1043848.000000000000000;205
509;-741991.000000000000000;-1043143.000000000000000;0
3564;-744648.296999998390675;-1042605.850999999791384;0
4169;-742414.420000001788139;-1043962.329999998211861;0
4140;-742831.635999999940395;-1044004.828999999910593;0
6502;-741658.278999999165535;-1044979.149000000208616;0
1674;-741099.000000000000000;-1044736.000000000000000;0
4812;-743027.170000001788139;-1042810.219999998807907;0
3579;-744924.442999999970198;-1042569.135000001639128;0
7177;-742643.059999998658895;-1044579.679999999701977;0
3803;-743066.289999999105930;-1042896.320000000298023;0
1289;-742211.000000000000000;-1044521.000000000000000;0
7182;-742597.789999999105930;-1044678.260000001639128;0
7291;-742809.960000000894070;-1044827.300000000745058;0
982;-741992.000000000000000;-1044416.000000000000000;0
6722;-742357.717000000178814;-1044705.708000000566244;0
1131;-741643.000000000000000;-1044433.000000000000000;0
1725;-741536.000000000000000;-1045136.000000000000000;0
7087;-743339.940000001341105;-1044536.690000001341105;0
4006;-743302.763000000268221;-1044052.298999998718500;0
3352;-743954.622000001370907;-1043015.732999999076128;0
1370;-742061.000000000000000;-1044797.000000000000000;0
5251;-743317.296000000089407;-1043180.037999998778105;0
7745;-742933.037000000476837;-1045523.714999999850988;0
1904;-743459.000000000000000;-1044297.000000000000000;0
1592;-742378.000000000000000;-1044936.000000000000000;0
6828;-741465.309999998658895;-1044768.940000001341105;0
4207;-742354.105999998748302;-1043530.157999999821186;0
2741;-744016.675000000745058;-1043336.642999999225140;0
1687;-741142.120000001043081;-1044817.019999999552965;0
5648;-743429.164000000804663;-1043695.905999999493361;0
795;-741770.000000000000000;-1042577.000000000000000;0
1972;-743389.000000000000000;-1044907.000000000000000;0
6859;-741483.522999998182058;-1044967.043999999761581;0
403;-742307.000000000000000;-1043931.000000000000000;0
2336;-742837.000000000000000;-1045523.000000000000000;0
2516;-742500.000000000000000;-1044414.000000000000000;0
1875;-743367.000000000000000;-1044261.000000000000000;0
331;-742664.000000000000000;-1044024.000000000000000;0
7814;-741769.006999999284744;-1044058.535999998450279;0
741;-741730.000000000000000;-1043035.000000000000000;0
3022;-744385.094000000506639;-1042820.482999999076128;0
1705;-741257.219999998807907;-1044695.690000001341105;0
7200;-742561.710999999195337;-1044911.469999998807907;0
713;-741800.000000000000000;-1042859.000000000000000;0
3976;-743088.861000001430511;-1043707.728000000119209;0
727;-742001.000000000000000;-1042962.000000000000000;0
5968;-742288.989000000059605;-1044168.456999998539686;0
2040;-743285.000000000000000;-1044809.000000000000000;0
6705;-742279.050999999046326;-1044655.923000000417233;0
2133;-743040.000000000000000;-1045127.000000000000000;0
2170;-742897.000000000000000;-1045133.000000000000000;0
2575;-742484.000000000000000;-1045453.000000000000000;0
2535;-742042.000000000000000;-1044071.000000000000000;0
6389;-742141.199999999254942;-1042497.030000001192093;0
2341;-742711.000000000000000;-1045552.000000000000000;0
4197;-742179.633999999612570;-1043776.899000000208616;0
5270;-742989.153999999165535;-1043210.684999998658895;0
3066;-744075.627000000327826;-1042883.837000001221895;0
6155;-742315.557999998331070;-1043068.140999998897314;0
7516;-742248.390000000596046;-1044368.907999999821186;0
1057;-741686.000000000000000;-1045058.000000000000000;0
628;-742217.370000001043081;-1043308.559999998658895;0
6825;-741380.010000001639128;-1044780.089999999850988;0
3457;-745069.765000000596046;-1042699.907000001519918;0
7007;-742923.890000000596046;-1044218.879999998956919;0
2582;-741030.372999999672174;-1044607.635000001639128;0
941;-742098.000000000000000;-1043132.000000000000000;0
1718;-741366.219999998807907;-1044870.989999998360872;0
706;-741897.000000000000000;-1042881.000000000000000;0
5176;-743321.252999998629093;-1043447.495000001043081;0
4228;-742132.969999998807907;-1043331.449999999254942;0
7159;-743013.767000000923872;-1044544.160999998450279;0
1103;-741306.000000000000000;-1044572.000000000000000;0
1808;-743187.000000000000000;-1044539.000000000000000;0
6;-743464.000000000000000;-1042594.000000000000000;0
4211;-742193.190000001341105;-1043565.660000000149012;0
6872;-741751.719999998807907;-1045296.679999999701977;0
1486;-741150.000000000000000;-1044219.000000000000000;0
6557;-741291.730000000447035;-1044031.710000000894070;0
4892;-742663.079999998211861;-1042817.344999998807907;0
7169;-742693.079999998211861;-1044394.177999999374151;0
6766;-741193.449999999254942;-1044424.320000000298023;0
1479;-741407.000000000000000;-1044225.000000000000000;0
110;-744127.000000000000000;-1042724.000000000000000;0
458;-741726.000000000000000;-1043324.000000000000000;0
1032;-741970.000000000000000;-1044813.000000000000000;0
4503;-742402.579999998211861;-1042702.839999999850988;0
6693;-742248.197000000625849;-1044816.127000000327826;0
4765;-742822.897999998182058;-1042850.499000001698732;0
5434;-744042.467999998480082;-1043135.986999999731779;0
4724;-742870.089999999850988;-1042658.210000000894070;0
6000;-741980.750000000000000;-1043285.629999998956919;0
1548;-742220.000000000000000;-1044216.000000000000000;0
7740;-742301.949999999254942;-1045061.239000000059605;0
4981;-742536.340999998152256;-1043014.929999999701977;0
3305;-743801.410000000149012;-1042874.962999999523163;0
8069;-742226.440000001341105;-1045255.949999999254942;0
1562;-743199.000000000000000;-1045122.000000000000000;0
5295;-743047.995000001043081;-1043185.530000001192093;0
3408;-743789.511999998241663;-1043022.425000000745058;0
4033;-743319.719999998807907;-1043793.300000000745058;0
7652;-742275.046999998390675;-1045497.052000001072884;0
4464;-742182.309999998658895;-1042571.379999998956919;0
583;-741975.000000000000000;-1043434.000000000000000;0
651;-742490.000000000000000;-1043564.000000000000000;0
6723;-742592.894999999552965;-1044408.905000001192093;0
1920;-743384.000000000000000;-1044363.000000000000000;0
3843;-743139.170000001788139;-1042650.050000000745058;0
8274;-742065.089999999850988;-1042742.109999999403954;0
2563;-741065.000000000000000;-1044421.000000000000000;0
7966;-741489.800000000745058;-1044356.219999998807907;0
4046;-743205.699999999254942;-1044009.719999998807907;0
1944;-743280.000000000000000;-1044400.000000000000000;0
1310;-741623.000000000000000;-1044829.000000000000000;0
6511;-741291.670000001788139;-1044319.690000001341105;0
6179;-742312.195000000298023;-1043059.041000001132488;0
2103;-743182.000000000000000;-1044931.000000000000000;0
2081;-742551.000000000000000;-1044621.000000000000000;0
5595;-743416.488000001758337;-1043680.118999999016523;0
5316;-743075.980000000447035;-1043041.059999998658895;0
6826;-741405.300000000745058;-1044777.199999999254942;0
1850;-742751.000000000000000;-1044237.000000000000000;0
5138;-743030.936000000685453;-1043483.587999999523163;0
4089;-742812.844999998807907;-1043560.114999998360872;0
758;-741658.000000000000000;-1042666.000000000000000;0
1262;-742066.000000000000000;-1044917.000000000000000;0
5324;-743025.329999998211861;-1043045.789999999105930;0
5508;-743426.105999998748302;-1043645.960999999195337;0
1755;-742144.000000000000000;-1045199.000000000000000;0
735;-741910.000000000000000;-1043014.000000000000000;0
4126;-742851.335000000894070;-1044085.449999999254942;0
1761;-741194.000000000000000;-1044104.000000000000000;0
209;-743108.000000000000000;-1043583.000000000000000;0
4597;-742620.600000001490116;-1042680.690000001341105;0
2355;-742465.000000000000000;-1045568.000000000000000;0
1831;-742994.000000000000000;-1044105.000000000000000;0
1455;-741517.000000000000000;-1044468.000000000000000;0
7658;-742333.647999998182058;-1045313.331999998539686;0
1839;-742994.469999998807907;-1044185.679999999701977;0
1300;-741917.410000000149012;-1044719.769999999552965;0
1405;-741681.000000000000000;-1044325.000000000000000;0
2037;-743373.000000000000000;-1044805.000000000000000;0
6278;-742305.421999998390675;-1043028.918000001460314;0
1464;-741899.000000000000000;-1043994.000000000000000;0
3092;-743909.377999998629093;-1042780.322999998927116;0
2399;-742121.000000000000000;-1045372.000000000000000;0
2300;-742561.000000000000000;-1045413.000000000000000;0
2557;-741318.000000000000000;-1044384.000000000000000;0
3999;-743412.539999999105930;-1043918.725000001490116;0
6485;-741795.653999999165535;-1044513.458000000566244;170
348;-742525.000000000000000;-1043787.000000000000000;0
1224;-742174.000000000000000;-1044253.000000000000000;0
6258;-742382.381999999284744;-1043032.370999999344349;0
2440;-742596.000000000000000;-1044193.000000000000000;0
3130;-743942.151000000536442;-1042673.475999999791384;0
3824;-743038.059999998658895;-1042573.800000000745058;0
7694;-742486.548999998718500;-1045129.752000000327826;0
1450;-741527.000000000000000;-1044632.000000000000000;0
1214;-742064.000000000000000;-1044358.000000000000000;0
333;-742651.000000000000000;-1043996.000000000000000;0
954;-742231.000000000000000;-1043024.000000000000000;0
1940;-743286.000000000000000;-1044339.000000000000000;0
270;-743230.000000000000000;-1043721.000000000000000;0
5048;-742867.500000000000000;-1043381.899999998509884;0
2152;-742814.000000000000000;-1045106.000000000000000;0
2075;-743114.000000000000000;-1044772.000000000000000;0
4799;-743008.011999998241663;-1042697.245999999344349;0
376;-742530.000000000000000;-1043680.000000000000000;0
6284;-742309.677999999374151;-1043054.043999999761581;0
5720;-743418.223000001162291;-1043629.960999999195337;0
3160;-743959.590999998152256;-1042557.386999998241663;0
782;-741695.000000000000000;-1042522.000000000000000;0
1347;-741791.000000000000000;-1044816.000000000000000;0
7143;-742850.414999999105930;-1044473.449999999254942;0
3747;-743250.879999998956919;-1042956.620000001043081;0
576;-742054.000000000000000;-1043517.000000000000000;0
2247;-743199.000000000000000;-1045400.000000000000000;0
4827;-743046.359999999403954;-1042958.140000000596046;0
6862;-741438.085999999195337;-1045031.583999998867512;0
1330;-741817.000000000000000;-1044709.000000000000000;0
6245;-742369.682000000029802;-1043057.377000000327826;0
1508;-741705.000000000000000;-1044210.000000000000000;0
5225;-743277.453999999910593;-1043558.087999999523163;0
2128;-743170.000000000000000;-1045080.000000000000000;0
1366;-742109.000000000000000;-1044948.000000000000000;0
4691;-742693.760000001639128;-1042596.969999998807907;0
1169;-741813.000000000000000;-1044376.000000000000000;0
4127;-742837.324999999254942;-1044032.670000001788139;0
1552;-741351.000000000000000;-1044295.000000000000000;0
6186;-742314.337999999523163;-1043061.517000000923872;0
518;-742194.000000000000000;-1043131.000000000000000;0
4823;-742936.660000000149012;-1042868.949999999254942;0
7036;-743316.204999998211861;-1044198.315000001341105;0
7696;-742416.806000001728535;-1045134.280000001192093;0
172;-743456.000000000000000;-1043433.000000000000000;0
6357;-741947.870000001043081;-1042701.129999998956919;0
3985;-743312.765000000596046;-1043928.164999999105930;0
5674;-743409.089999999850988;-1043715.618000000715256;0
4328;-742347.322000000625849;-1043375.796999998390675;265
316;-742490.000000000000000;-1044202.000000000000000;0
1038;-741956.000000000000000;-1044977.000000000000000;0
4340;-742473.662000000476837;-1043349.048999998718500;0
5957;-742962.627000000327826;-1043510.905000001192093;0
2149;-742819.000000000000000;-1045024.000000000000000;0
2237;-743368.000000000000000;-1045238.000000000000000;0
4173;-742756.320000000298023;-1043749.629999998956919;0
2494;-741985.000000000000000;-1044165.000000000000000;0
1412;-741635.760000001639128;-1044654.449999999254942;0
2140;-742924.000000000000000;-1045088.000000000000000;0
4559;-742400.530000001192093;-1042503.760000001639128;0
4895;-742596.936999998986721;-1042829.168000001460314;0
5120;-742868.383999999612570;-1043343.986000001430511;0
5059;-742853.796000000089407;-1043168.151999998837709;0
4899;-742534.420000001788139;-1042820.899999998509884;0
5155;-743140.712999999523163;-1043357.901999998837709;0
4051;-743236.329999998211861;-1043889.710000000894070;0
4665;-742824.410000000149012;-1042592.260000001639128;0
4603;-742442.480000000447035;-1042617.250000000000000;0
2547;-741724.000000000000000;-1044282.000000000000000;0
6297;-742506.859999999403954;-1042634.250000000000000;0
6339;-742245.460000000894070;-1042835.780000001192093;0
1099;-741376.000000000000000;-1044563.000000000000000;0
340;-742588.000000000000000;-1043906.000000000000000;0
1007;-741976.000000000000000;-1044586.000000000000000;0
4460;-742216.600000001490116;-1042598.850000001490116;0
7539;-742682.600000001490116;-1045366.339999999850988;0
875;-741783.000000000000000;-1042677.000000000000000;0
635;-742143.000000000000000;-1043317.000000000000000;0
4532;-742760.140000000596046;-1042899.600000001490116;0
5221;-743263.820000000298023;-1043556.920000001788139;0
1041;-741893.000000000000000;-1044653.000000000000000;0
5113;-742946.795000001788139;-1043444.427999999374151;0
6265;-742353.164999999105930;-1043020.054999999701977;0
7705;-742283.471999999135733;-1044316.339999999850988;0
4935;-742447.241999998688698;-1042699.399000000208616;0
7021;-743129.019999999552965;-1044076.230000000447035;0
2378;-742372.000000000000000;-1045503.000000000000000;0
5236;-743352.302000001072884;-1043362.752000000327826;0
5117;-742816.081999998539686;-1043298.302999999374151;0
4664;-742806.739999998360872;-1042547.980000000447035;0
1398;-741753.000000000000000;-1044201.000000000000000;0
6170;-742311.548000000417233;-1043059.381000000983477;0
4894;-742610.888999998569489;-1042819.686999998986721;0
6855;-741501.394999999552965;-1045027.784000001847744;0
1496;-741253.000000000000000;-1044321.000000000000000;0
1993;-743483.000000000000000;-1044984.000000000000000;0
4813;-743013.550000000745058;-1042793.390000000596046;0
2296;-742678.000000000000000;-1045399.000000000000000;0
5146;-743064.554000001400709;-1043452.671999998390675;0
222;-742939.000000000000000;-1043526.000000000000000;0
5020;-742572.699999999254942;-1042891.372999999672174;0
6001;-742006.079999998211861;-1043292.300000000745058;0
227;-742846.000000000000000;-1043520.000000000000000;0
549;-742290.000000000000000;-1043770.000000000000000;0
6980;-743071.769999999552965;-1044387.548999998718500;183
1416;-741628.000000000000000;-1044523.000000000000000;0
6148;-742313.410999998450279;-1043065.666999999433756;0
2322;-742651.000000000000000;-1045483.000000000000000;0
1255;-742077.000000000000000;-1044770.000000000000000;0
4771;-742890.828000001609325;-1042889.975000001490116;0
5583;-743410.274999998509884;-1043642.072000000625849;0
1590;-742377.000000000000000;-1044885.000000000000000;0
5966;-742483.469999998807907;-1043066.721999999135733;0
5165;-743191.168000001460314;-1043398.304000001400709;0
1329;-742062.000000000000000;-1045046.000000000000000;0
1245;-742114.000000000000000;-1044548.000000000000000;0
4730;-742831.050000000745058;-1042696.600000001490116;0
4082;-742825.565000001341105;-1043737.364999998360872;0
1151;-741279.000000000000000;-1044475.000000000000000;0
1519;-741754.000000000000000;-1043956.000000000000000;0
7828;-743537.940000001341105;-1045170.530000001192093;0
5164;-743173.335000000894070;-1043404.677000001072884;0
4633;-742625.931000001728535;-1042639.918999999761581;0
6240;-742364.495999999344349;-1043067.289999999105930;0
6714;-742287.171000000089407;-1044923.995999999344349;0
599;-741837.000000000000000;-1043243.000000000000000;0
3956;-743414.039999999105930;-1043561.081999998539686;0
3523;-744849.190999999642372;-1042676.142999999225140;0
4530;-742732.859999999403954;-1042860.920000001788139;0
4224;-742139.756000000983477;-1043462.488000001758337;0
1607;-742414.000000000000000;-1044379.000000000000000;0
7154;-742908.467000000178814;-1044547.784000001847744;0
1030;-741975.000000000000000;-1044753.000000000000000;0
1215;-742091.000000000000000;-1044365.000000000000000;0
4556;-742354.629999998956919;-1042526.789999999105930;0
3353;-743954.399999998509884;-1043021.017999999225140;0
6187;-742313.572999998927116;-1043060.111999999731779;0
4936;-742454.684000000357628;-1042685.620999999344349;0
7206;-742559.920000001788139;-1045003.190000001341105;0
1271;-742240.000000000000000;-1044521.000000000000000;0
725;-741983.000000000000000;-1042939.000000000000000;0
3294;-743583.046999998390675;-1042805.258000001311302;0
3525;-744827.657000001519918;-1042673.842999998480082;0
6369;-741962.675000000745058;-1042665.013999998569489;0
4504;-742387.329999998211861;-1042714.820000000298023;0
1313;-741681.000000000000000;-1044849.000000000000000;0
8285;-742232.780000001192093;-1042821.149999998509884;0
4953;-742431.500999998301268;-1043027.399999998509884;0
671;-742489.000000000000000;-1043245.000000000000000;0
6677;-742304.892999999225140;-1044202.831999998539686;0
4743;-742812.449999999254942;-1042729.609999999403954;0
4565;-742462.576999999582767;-1042533.901999998837709;0
1795;-742155.000000000000000;-1044231.000000000000000;0
6844;-741545.278999999165535;-1044985.256999999284744;0
7689;-742554.140000000596046;-1045198.359999999403954;0
1452;-741519.000000000000000;-1044574.000000000000000;0
4520;-742651.079999998211861;-1042798.449999999254942;0
4513;-742579.030000001192093;-1042753.609999999403954;0
1240;-742145.000000000000000;-1044418.000000000000000;0
7986;-741040.829999998211861;-1044408.250000000000000;0
1236;-742156.000000000000000;-1044348.000000000000000;0
4117;-742733.614999998360872;-1044043.129999998956919;0
5250;-743328.995000001043081;-1043178.495000001043081;0
1429;-741982.000000000000000;-1044280.000000000000000;0
952;-742274.000000000000000;-1043018.000000000000000;0
734;-741935.000000000000000;-1043014.000000000000000;0
6139;-742312.807000000029802;-1043066.006000000983477;0
6974;-743127.620000001043081;-1044518.800000000745058;0
540;-742144.000000000000000;-1043804.000000000000000;0
535;-742111.000000000000000;-1043714.000000000000000;0
4987;-742641.745000001043081;-1043011.309999998658895;0
7011;-742831.309999998658895;-1044257.245000001043081;0
3560;-744715.326000001281500;-1042621.513999998569489;0
5267;-743190.021999999880791;-1043149.807000000029802;0
4160;-742443.074999999254942;-1043885.804999999701977;0
2212;-743217.000000000000000;-1045279.000000000000000;0
2138;-742958.000000000000000;-1045095.000000000000000;0
2020;-743260.000000000000000;-1044941.000000000000000;0
7137;-742916.074999999254942;-1044400.230000000447035;0
581;-741991.000000000000000;-1043457.000000000000000;0
2236;-743391.000000000000000;-1045242.000000000000000;0
544;-742343.910000000149012;-1043796.500000000000000;0
1512;-741829.000000000000000;-1044135.000000000000000;0
7032;-743301.464999999850988;-1044106.190000001341105;0
1681;-741125.980000000447035;-1044656.269999999552965;0
6604;-741636.960000000894070;-1043867.217999998480082;0
1386;-742158.000000000000000;-1044976.000000000000000;0
4137;-742705.739999998360872;-1044094.100000001490116;0
1034;-741964.000000000000000;-1044876.000000000000000;0
4524;-742683.789999999105930;-1042823.579999998211861;0
1551;-741353.000000000000000;-1044326.000000000000000;0
2502;-742750.000000000000000;-1045457.000000000000000;0
2144;-742844.000000000000000;-1045070.000000000000000;0
4704;-742680.000000000000000;-1042776.750000000000000;0
1810;-743136.000000000000000;-1044544.000000000000000;0
4321;-742265.214999999850988;-1043235.418999999761581;0
2403;-742211.000000000000000;-1045436.000000000000000;0
5703;-743417.385000001639128;-1043633.592000000178814;0
4984;-742580.537999998778105;-1043025.210999999195337;0
5667;-743417.361999999731779;-1043712.557000000029802;0
4901;-742520.120000001043081;-1042823.960000000894070;0
5116;-742947.859000001102686;-1043386.767000000923872;0
3413;-743776.791000001132488;-1043071.675000000745058;0
8275;-742087.910000000149012;-1042738.609999999403954;0
7260;-742953.010000001639128;-1044873.530000001192093;0
5126;-743012.193999998271465;-1043403.521000001579523;0
4945;-742422.162999998778105;-1043009.861000001430511;0
6491;-742157.708000000566244;-1044457.421999998390675;0
1016;-742147.000000000000000;-1044590.000000000000000;0
7157;-742964.840999998152256;-1044545.681000001728535;0
543;-742361.000000000000000;-1043823.000000000000000;0
6819;-741194.784000001847744;-1044802.818999998271465;0
1528;-741698.000000000000000;-1043770.000000000000000;0
4144;-742704.414999999105930;-1043822.484999999403954;0
7262;-742990.940000001341105;-1044886.989999998360872;0
4701;-742687.780000001192093;-1042761.660000000149012;0
823;-742110.000000000000000;-1042596.000000000000000;0
8267;-742240.420000001788139;-1042709.160000000149012;0
674;-742463.000000000000000;-1043211.000000000000000;0
505;-741917.000000000000000;-1043153.000000000000000;0
2497;-741932.000000000000000;-1044075.000000000000000;0
6169;-742312.320000000298023;-1043060.791999999433756;0
3759;-743267.609999999403954;-1042971.300000000745058;0
4239;-742454.206000000238419;-1043538.927999999374151;0
4749;-742884.420000001788139;-1042760.329999998211861;0
6195;-742314.956000000238419;-1043061.181000001728535;0
5210;-743253.673999998718500;-1043370.440999999642372;0
538;-742113.000000000000000;-1043652.000000000000000;0
6273;-742321.806000001728535;-1043017.085000000894070;0
1852;-742739.000000000000000;-1044210.000000000000000;0
4429;-742222.260000001639128;-1043102.250000000000000;0
5710;-743421.574999999254942;-1043640.598000001162291;0
5666;-743418.543999999761581;-1043712.120000001043081;0
4425;-742208.820000000298023;-1043035.230000000447035;0
430;-742185.000000000000000;-1043888.000000000000000;0
4077;-742849.614999998360872;-1043858.745000001043081;0
6875;-741808.350000001490116;-1045257.269999999552965;0
6692;-742222.114999998360872;-1044818.673000000417233;0
4747;-742866.289999999105930;-1042753.390000000596046;0
5960;-743141.460999999195337;-1043339.964999999850988;0
5235;-743350.096000000834465;-1043388.881000000983477;0
7141;-742895.629999998956919;-1044470.910000000149012;0
1982;-743408.000000000000000;-1044646.000000000000000;0
707;-741897.000000000000000;-1042863.000000000000000;0
4675;-742805.809999998658895;-1042785.070000000298023;0
4922;-742443.129999998956919;-1042886.510000001639128;0
3242;-744191.513000000268221;-1042647.011999998241663;0
5169;-743240.785000000149012;-1043411.081999998539686;0
692;-742292.000000000000000;-1043084.000000000000000;0
1272;-742237.000000000000000;-1044545.000000000000000;0
1873;-743410.000000000000000;-1044260.000000000000000;0
4227;-742108.530000001192093;-1043326.289999999105930;0
676;-742442.000000000000000;-1043196.000000000000000;0
4893;-742637.320000000298023;-1042818.600999999791384;0
6833;-741571.423000000417233;-1044909.473999999463558;0
6167;-742313.859999999403954;-1043063.607000000774860;0
704;-741929.000000000000000;-1042879.000000000000000;0
5580;-743409.831000000238419;-1043636.449000000953674;0
694;-742280.000000000000000;-1043043.000000000000000;0
501;-741836.000000000000000;-1043163.000000000000000;0
1502;-741506.000000000000000;-1044283.000000000000000;0
391;-742395.000000000000000;-1043802.000000000000000;0
6281;-742307.629000000655651;-1043042.113000001758337;0
4725;-742875.100000001490116;-1042678.230000000447035;0
4084;-742817.504999998956919;-1043681.475000001490116;0
4811;-743040.379999998956919;-1042799.609999999403954;0
907;-742211.000000000000000;-1042511.000000000000000;0
90;-744040.000000000000000;-1043095.000000000000000;0
1820;-743006.000000000000000;-1044272.000000000000000;0
4145;-742687.109999999403954;-1043837.125000000000000;0
91;-744044.000000000000000;-1043053.000000000000000;0
7703;-742462.714000001549721;-1044818.045000001788139;0
6282;-742308.337999999523163;-1043045.984000001102686;0
4717;-742914.300000000745058;-1042625.489999998360872;0
1194;-741721.000000000000000;-1043955.000000000000000;0
4562;-742471.000000000000000;-1042510.920000001788139;0
2105;-743158.000000000000000;-1044971.000000000000000;0
5212;-743283.975000001490116;-1043373.589999999850988;0
6196;-742314.190000001341105;-1043059.774999998509884;0
4890;-742605.287000000476837;-1042838.535000000149012;0
4700;-742659.859999999403954;-1042723.210000000894070;0
569;-742096.000000000000000;-1043601.000000000000000;0
4138;-742883.587000001221895;-1043997.287999998778105;0
6687;-742383.274000000208616;-1044983.381999999284744;0
4151;-742573.039999999105930;-1044109.035000000149012;0
5709;-743420.221999999135733;-1043640.467999998480082;0
6204;-742315.578999999910593;-1043060.826000001281500;0
4964;-742390.059999998658895;-1043044.839999999850988;0
6493;-742196.574000000953674;-1044452.076999999582767;0
522;-742261.000000000000000;-1043122.000000000000000;0
6383;-742199.620000001043081;-1042494.440000001341105;0
602;-741828.000000000000000;-1043190.000000000000000;0
6216;-742313.892000000923872;-1043056.272999998182058;0
4026;-743178.984999999403954;-1043847.989999998360872;0
1258;-742076.000000000000000;-1044837.000000000000000;0
4229;-742146.929000001400709;-1043334.585000000894070;0
2159;-742822.000000000000000;-1045141.000000000000000;0
6691;-742386.879000000655651;-1045082.589000001549721;0
4796;-743054.247999999672174;-1042682.918000001460314;0
3179;-743902.603999998420477;-1042607.138999998569489;0
2507;-742427.000000000000000;-1044437.000000000000000;0
7094;-743370.620000001043081;-1044578.289999999105930;0
1462;-741464.000000000000000;-1044225.000000000000000;0
2142;-742883.000000000000000;-1045078.000000000000000;0
215;-743021.000000000000000;-1043558.000000000000000;0
1298;-741964.000000000000000;-1044736.000000000000000;0
6767;-741223.949999999254942;-1044422.059999998658895;0
7275;-742794.339999999850988;-1044627.140000000596046;0
4218;-742263.436999998986721;-1043615.100999999791384;0
551;-742269.000000000000000;-1043755.000000000000000;0
7248;-742757.960000000894070;-1044826.929999999701977;0
8266;-742220.320000000298023;-1042706.760000001639128;0
