OID_;X;Y;TEMPERATURE
7077;-743564.359000001102686;-1045385.210000000894070;0
5995;-744441.440999999642372;-1042779.568999998271465;0
3679;-744571.809999998658895;-1042497.875999998301268;0
3527;-744805.695999998599291;-1042671.809000000357628;0
3538;-744616.304000001400709;-1042656.734000001102686;0
3585;-744920.065000001341105;-1042522.129999998956919;0
3460;-744993.289000000804663;-1042693.587000001221895;0
3466;-745113.802000001072884;-1042675.725000001490116;0
3612;-744996.545000001788139;-1042292.646000001579523;0
94;-744054.000000000000000;-1042934.000000000000000;0
5;-743466.000000000000000;-1042616.000000000000000;27
7259;-742935.280000001192093;-1044869.829999998211861;0
2696;-743477.489999998360872;-1042038.000000000000000;0
3214;-743628.813000001013279;-1042457.677000001072884;0
1586;-742372.000000000000000;-1044785.000000000000000;0
2361;-742323.000000000000000;-1045576.000000000000000;0
466;-741743.000000000000000;-1043331.000000000000000;0
6946;-742974.765000000596046;-1043929.388000000268221;0
6843;-741569.070000000298023;-1044975.261999998241663;0
9;-743512.000000000000000;-1042512.000000000000000;133
6875;-741808.350000001490116;-1045257.269999999552965;0
6805;-741109.710000000894070;-1044689.170000001788139;0
1532;-741805.000000000000000;-1043858.000000000000000;0
2093;-742915.000000000000000;-1044642.000000000000000;0
6606;-741654.631999999284744;-1043906.848000001162291;0
926;-741894.000000000000000;-1042999.000000000000000;0
1674;-741099.000000000000000;-1044736.000000000000000;0
1993;-743483.000000000000000;-1044984.000000000000000;0
403;-742307.000000000000000;-1043931.000000000000000;0
7514;-742304.866000000387430;-1044375.124000001698732;0
2481;-741255.609999999403954;-1044671.179999999701977;0
4146;-742666.940000001341105;-1043854.829999998211861;0
4078;-742842.960000000894070;-1043832.824999999254942;0
7011;-742831.309999998658895;-1044257.245000001043081;0
7216;-742500.129999998956919;-1044564.390000000596046;0
2214;-743162.000000000000000;-1045316.000000000000000;0
2166;-743016.000000000000000;-1045179.000000000000000;0
2506;-741267.000000000000000;-1044015.000000000000000;0
1487;-741117.000000000000000;-1044216.000000000000000;0
6997;-743109.160000000149012;-1044453.600000001490116;0
1103;-741306.000000000000000;-1044572.000000000000000;0
1701;-741378.000000000000000;-1044678.000000000000000;0
351;-742509.000000000000000;-1043739.000000000000000;0
1719;-741406.760000001639128;-1044866.039999999105930;0
6701;-742295.142000000923872;-1044533.372000001370907;0
734;-741935.000000000000000;-1043014.000000000000000;0
7935;-743156.000000000000000;-1045071.149999998509884;0
4342;-742506.473000001162291;-1043301.100000001490116;0
1092;-741549.000000000000000;-1044556.000000000000000;0
747;-741690.000000000000000;-1043000.000000000000000;0
1309;-741611.000000000000000;-1044813.000000000000000;0
7743;-741707.912999998778105;-1045072.826999999582767;0
4131;-742844.625000000000000;-1044059.980000000447035;0
2040;-743285.000000000000000;-1044809.000000000000000;0
4238;-742440.263000000268221;-1043528.236000001430511;0
563;-742155.000000000000000;-1043660.000000000000000;0
6854;-741522.427999999374151;-1045038.967999998480082;0
4174;-742738.230000000447035;-1043763.155000001192093;0
5306;-743103.326999999582767;-1043193.129000000655651;0
4237;-742425.385000001639128;-1043517.421000000089407;0
394;-742405.000000000000000;-1043863.000000000000000;0
2364;-742504.000000000000000;-1045563.000000000000000;0
4008;-743250.114999998360872;-1044043.905999999493361;0
281;-743045.000000000000000;-1043848.000000000000000;0
3352;-743954.622000001370907;-1043015.732999999076128;0
5767;-742424.269999999552965;-1042581.609000001102686;0
4327;-742333.449000000953674;-1043399.671000000089407;0
3181;-743898.234999999403954;-1042567.133000001311302;0
1604;-742552.000000000000000;-1044918.000000000000000;0
110;-744127.000000000000000;-1042724.000000000000000;3
2192;-743499.000000000000000;-1045199.000000000000000;0
7277;-742796.870000001043081;-1044653.429999999701977;0
1060;-741610.000000000000000;-1045115.000000000000000;0
1291;-742205.000000000000000;-1044568.000000000000000;0
941;-742098.000000000000000;-1043132.000000000000000;0
4166;-742448.504999998956919;-1044046.885000001639128;0
7160;-743028.010999999940395;-1044543.267999999225140;0
1615;-742367.000000000000000;-1044434.000000000000000;0
2211;-743248.000000000000000;-1045258.000000000000000;0
7014;-742650.170000001788139;-1044305.010000001639128;0
3091;-743924.489000000059605;-1042816.170000001788139;0
3919;-743904.947000000625849;-1043493.929999999701977;0
835;-741950.000000000000000;-1042513.000000000000000;0
2452;-742913.000000000000000;-1044127.000000000000000;0
344;-742557.000000000000000;-1043847.000000000000000;107
4150;-742581.789999999105930;-1044138.429999999701977;0
1518;-741994.000000000000000;-1044011.000000000000000;0
1822;-742986.199999999254942;-1044211.969999998807907;0
590;-741935.000000000000000;-1043331.000000000000000;0
6993;-743172.409000001847744;-1044501.339000001549721;0
7369;-743236.822000000625849;-1045458.699000000953674;0
1446;-741545.000000000000000;-1044774.000000000000000;0
710;-741829.000000000000000;-1042878.000000000000000;0
1239;-742138.000000000000000;-1044401.000000000000000;0
1677;-741109.160000000149012;-1044522.699999999254942;0
7025;-743199.914999999105930;-1044070.515000000596046;0
1328;-742037.000000000000000;-1045043.000000000000000;0
6786;-741269.960000000894070;-1044469.460000000894070;0
505;-741917.000000000000000;-1043153.000000000000000;0
1430;-741993.000000000000000;-1044260.000000000000000;0
7142;-742872.445000000298023;-1044472.239999998360872;0
7778;-743070.728000000119209;-1045812.342000000178814;0
3992;-743365.899999998509884;-1043881.385000001639128;0
5943;-742064.651000000536442;-1043693.136999998241663;0
3782;-743285.429999999701977;-1042842.460000000894070;0
2892;-744005.317000001668930;-1043204.537000000476837;0
2098;-743134.000000000000000;-1044763.000000000000000;0
1753;-742096.000000000000000;-1045195.000000000000000;0
1346;-741769.000000000000000;-1044817.000000000000000;0
3108;-743768.699999999254942;-1042671.241999998688698;0
6134;-742309.011999998241663;-1043060.703000001609325;0
4931;-742449.300000000745058;-1042791.403000000864267;0
3844;-743184.170000001788139;-1042586.949999999254942;0
5326;-742969.850000001490116;-1043038.800000000745058;0
7146;-742819.425000000745058;-1044426.225000001490116;0
1531;-741782.000000000000000;-1043838.000000000000000;0
7042;-743396.980000000447035;-1044078.954999998211861;0
3849;-743061.690000001341105;-1042485.920000001788139;0
1375;-742151.000000000000000;-1044887.000000000000000;0
4706;-742728.070000000298023;-1042610.910000000149012;0
1940;-743286.000000000000000;-1044339.000000000000000;0
5444;-743183.024000000208616;-1043210.600000001490116;0
1516;-741928.000000000000000;-1044062.000000000000000;0
164;-743392.000000000000000;-1043230.000000000000000;0
1337;-741723.000000000000000;-1044886.000000000000000;0
909;-742183.000000000000000;-1042503.000000000000000;0
650;-742263.000000000000000;-1043381.000000000000000;0
1960;-743386.000000000000000;-1044623.000000000000000;0
7168;-742792.969999998807907;-1044547.879999998956919;0
1400;-741719.000000000000000;-1044132.000000000000000;0
1991;-743482.000000000000000;-1044929.000000000000000;0
1032;-741970.000000000000000;-1044813.000000000000000;0
4459;-742274.829999998211861;-1042644.269999999552965;0
1928;-743474.000000000000000;-1044409.000000000000000;0
557;-742213.000000000000000;-1043713.000000000000000;0
1143;-741415.000000000000000;-1044457.000000000000000;0
4248;-742157.039999999105930;-1043376.699999999254942;0
1362;-742017.000000000000000;-1044913.000000000000000;0
7959;-741699.170000001788139;-1044292.620000001043081;0
4498;-741866.120000001043081;-1042718.471000000834465;0
1921;-743387.000000000000000;-1044335.000000000000000;0
1373;-742143.000000000000000;-1044822.000000000000000;0
7170;-742667.579999998211861;-1044492.469999998807907;0
1330;-741817.000000000000000;-1044709.000000000000000;0
792;-741718.000000000000000;-1042599.000000000000000;0
3564;-744648.296999998390675;-1042605.850999999791384;0
1503;-741537.000000000000000;-1044272.000000000000000;0
917;-742121.000000000000000;-1043008.000000000000000;0
995;-741906.000000000000000;-1044434.000000000000000;0
502;-741901.000000000000000;-1043169.000000000000000;0
2209;-743309.000000000000000;-1045217.000000000000000;0
6943;-742902.013999998569489;-1043932.647999998182058;0
1006;-741930.000000000000000;-1044565.000000000000000;0
1554;-741348.000000000000000;-1044238.000000000000000;0
4214;-742229.274999998509884;-1043511.745000001043081;0
4844;-742977.256000000983477;-1042754.953000001609325;0
5146;-743064.554000001400709;-1043452.671999998390675;0
1425;-742080.000000000000000;-1044210.000000000000000;0
5113;-742946.795000001788139;-1043444.427999999374151;0
2340;-742764.000000000000000;-1045532.000000000000000;0
6751;-742426.350000001490116;-1044371.070000000298023;0
1598;-742351.000000000000000;-1045090.000000000000000;0
4987;-742641.745000001043081;-1043011.309999998658895;0
3128;-743948.160000000149012;-1042657.320000000298023;0
4974;-742489.458999998867512;-1043047.024999998509884;0
3261;-743581.445999998599291;-1042690.379999998956919;0
273;-743381.000000000000000;-1043820.000000000000000;0
1500;-741441.000000000000000;-1044299.000000000000000;0
2368;-742507.000000000000000;-1045456.000000000000000;0
6014;-742844.000000000000000;-1043239.482999999076128;0
5518;-743427.500999998301268;-1043621.975000001490116;0
2259;-743001.000000000000000;-1045599.000000000000000;0
2124;-743275.000000000000000;-1045023.000000000000000;0
1401;-741723.000000000000000;-1044408.000000000000000;0
581;-741991.000000000000000;-1043457.000000000000000;0
6195;-742314.956000000238419;-1043061.181000001728535;0
5437;-744084.208999998867512;-1043295.061999998986721;0
698;-742041.000000000000000;-1042903.000000000000000;0
1316;-741765.000000000000000;-1044903.000000000000000;0
4889;-742621.425000000745058;-1042831.109999999403954;0
3274;-743652.714999999850988;-1042812.727000001817942;0
4458;-742245.679999999701977;-1042633.960000000894070;0
1570;-742291.000000000000000;-1044183.000000000000000;0
1699;-741435.000000000000000;-1044671.000000000000000;0
1368;-741998.000000000000000;-1044779.000000000000000;0
516;-742160.000000000000000;-1043135.000000000000000;0
5511;-743426.401000000536442;-1043599.129999998956919;0
317;-742464.000000000000000;-1044207.000000000000000;0
5997;-742040.579999998211861;-1043282.651999998837709;0
1762;-741227.000000000000000;-1044108.000000000000000;0
575;-742053.000000000000000;-1043541.000000000000000;0
332;-742645.000000000000000;-1044014.000000000000000;0
205;-743173.000000000000000;-1043599.000000000000000;0
5177;-743336.440999999642372;-1043440.883999999612570;0
4771;-742890.828000001609325;-1042889.975000001490116;0
4060;-742896.530000001192093;-1043699.219999998807907;5
6613;-741749.640000000596046;-1044032.820000000298023;0
2050;-743460.000000000000000;-1045072.000000000000000;0
6364;-742003.519999999552965;-1042660.690000001341105;0
4877;-742845.760000001639128;-1042956.589999999850988;0
8278;-742119.929999999701977;-1042758.710000000894070;0
634;-742117.000000000000000;-1043309.000000000000000;0
6337;-742257.140000000596046;-1042864.820000000298023;0
2160;-742849.000000000000000;-1045147.000000000000000;0
2752;-743983.471000000834465;-1043454.780000001192093;0
4119;-742717.223999999463558;-1043999.837999999523163;0
5324;-743025.329999998211861;-1043045.789999999105930;0
6221;-742317.633000001311302;-1043061.541000001132488;0
4575;-742336.600000001490116;-1042692.170000001788139;0
1137;-741538.000000000000000;-1044442.000000000000000;76
1404;-741692.000000000000000;-1044355.000000000000000;0
3750;-743221.379999998956919;-1042925.429999999701977;0
2155;-742797.000000000000000;-1045124.000000000000000;0
6245;-742369.682000000029802;-1043057.377000000327826;0
2286;-742894.000000000000000;-1045440.000000000000000;0
2420;-742431.000000000000000;-1045120.000000000000000;0
271;-743417.000000000000000;-1043795.000000000000000;0
1304;-741810.000000000000000;-1044684.000000000000000;0
5066;-742827.379000000655651;-1043252.267999999225140;0
4738;-742733.910000000149012;-1042704.890000000596046;0
2344;-742691.000000000000000;-1045541.000000000000000;0
2138;-742958.000000000000000;-1045095.000000000000000;0
7090;-743353.289999999105930;-1044571.760000001639128;0
3752;-743213.949999999254942;-1042902.719999998807907;0
7185;-742600.515000000596046;-1044717.333999998867512;0
6822;-741283.870000001043081;-1044793.059999998658895;0
7657;-742317.228999998420477;-1045306.000999998301268;0
2516;-742500.000000000000000;-1044414.000000000000000;0
5643;-743428.701999999582767;-1043689.872999999672174;0
2220;-743075.000000000000000;-1045396.000000000000000;0
3101;-743922.754999998956919;-1042745.195000000298023;0
4892;-742663.079999998211861;-1042817.344999998807907;0
984;-741917.000000000000000;-1044411.000000000000000;0
1875;-743367.000000000000000;-1044261.000000000000000;0
615;-742129.000000000000000;-1043271.000000000000000;0
7944;-742086.969999998807907;-1044063.079999998211861;0
2227;-743029.000000000000000;-1045506.000000000000000;0
2891;-744029.914000000804663;-1043200.478000000119209;0
4961;-742309.460000000894070;-1043010.730000000447035;0
1759;-741128.000000000000000;-1044097.000000000000000;0
2512;-743070.000000000000000;-1044052.000000000000000;0
5168;-743228.796000000089407;-1043420.092000000178814;0
5272;-743000.013999998569489;-1043245.364000000059605;0
3290;-743573.385000001639128;-1042757.348999999463558;0
3791;-743144.839999999850988;-1042881.120000001043081;0
2317;-742792.000000000000000;-1045467.000000000000000;0
7732;-742611.719000000506639;-1044632.203999999910593;0
1492;-741096.000000000000000;-1044331.000000000000000;0
4088;-742812.114999998360872;-1043580.475000001490116;0
212;-743080.000000000000000;-1043557.000000000000000;0
4040;-743224.710000000894070;-1043766.050000000745058;0
3345;-743952.826999999582767;-1043061.079999998211861;0
527;-742186.000000000000000;-1043818.000000000000000;144
1555;-741196.000000000000000;-1044374.000000000000000;0
2466;-743460.000000000000000;-1044740.000000000000000;0
6156;-742314.791999999433756;-1043066.736000001430511;0
6126;-743428.385999999940395;-1043621.800000000745058;0
1095;-741452.000000000000000;-1044553.000000000000000;0
5133;-742976.300000000745058;-1043502.951999999582767;0
754;-741676.000000000000000;-1042727.000000000000000;0
2447;-742772.000000000000000;-1044159.000000000000000;0
7928;-743542.539999999105930;-1044784.769999999552965;0
7047;-743395.495000001043081;-1044210.765000000596046;0
6697;-742363.109999999403954;-1044816.120000001043081;0
2547;-741724.000000000000000;-1044282.000000000000000;0
4744;-742848.129999998956919;-1042759.629999998956919;0
7723;-741757.929000001400709;-1044043.175000000745058;0
669;-742510.000000000000000;-1043260.000000000000000;0
7801;-742459.168999999761581;-1044490.660000000149012;0
1970;-743380.000000000000000;-1044854.000000000000000;0
700;-742008.000000000000000;-1042895.000000000000000;0
1595;-742313.000000000000000;-1045010.000000000000000;0
4430;-742235.070000000298023;-1043092.839999999850988;0
207;-743142.000000000000000;-1043590.000000000000000;0
328;-742670.000000000000000;-1044072.000000000000000;0
1122;-741749.000000000000000;-1044455.000000000000000;0
6458;-743360.644999999552965;-1043919.311999998986721;0
1119;-741791.000000000000000;-1044446.000000000000000;0
7809;-741981.809999998658895;-1044560.280000001192093;0
5720;-743418.223000001162291;-1043629.960999999195337;0
1385;-742194.000000000000000;-1044974.000000000000000;0
3438;-743746.833000000566244;-1043057.962000001221895;0
1795;-742155.000000000000000;-1044231.000000000000000;0
1474;-741604.000000000000000;-1044172.000000000000000;0
4938;-742469.324999999254942;-1042658.263000000268221;0
2274;-742870.000000000000000;-1045732.000000000000000;0
4071;-742929.394999999552965;-1043807.585000000894070;0
4331;-742391.967999998480082;-1043310.539000000804663;0
4600;-742647.000000000000000;-1042709.000000000000000;0
5251;-743317.296000000089407;-1043180.037999998778105;0
596;-741867.000000000000000;-1043259.000000000000000;0
3819;-743120.250000000000000;-1042679.620000001043081;0
6720;-742286.954999998211861;-1044705.997999999672174;0
2305;-742412.000000000000000;-1045445.000000000000000;0
4966;-742377.289999999105930;-1043071.030000001192093;0
4629;-742630.986000001430511;-1042626.096000000834465;0
6960;-743030.260000001639128;-1044242.870000001043081;0
3829;-742992.250000000000000;-1042635.140000000596046;0
5001;-742560.092999998480082;-1042966.206999998539686;0
1941;-743267.000000000000000;-1044384.000000000000000;0
6930;-742046.030000001192093;-1045191.489999998360872;0
2504;-742757.000000000000000;-1045516.000000000000000;0
1020;-742293.000000000000000;-1044615.000000000000000;0
1415;-741623.000000000000000;-1044561.000000000000000;0
2282;-742923.000000000000000;-1045519.000000000000000;0
1034;-741964.000000000000000;-1044876.000000000000000;0
5507;-743426.703000001609325;-1043656.230999998748302;0
2146;-742845.000000000000000;-1044968.000000000000000;0
3365;-743840.598999999463558;-1043023.565000001341105;0
4721;-742883.219999998807907;-1042605.010000001639128;0
4689;-742688.114999998360872;-1042568.859999999403954;0
4578;-742381.817000001668930;-1042594.177999999374151;0
4055;-743119.070000000298023;-1043694.109999999403954;0
2016;-743230.000000000000000;-1044873.000000000000000;0
6858;-741492.363000001758337;-1044950.462999999523163;0
7291;-742809.960000000894070;-1044827.300000000745058;0
1911;-743449.000000000000000;-1044447.000000000000000;0
1587;-742372.000000000000000;-1044806.000000000000000;0
4901;-742520.120000001043081;-1042823.960000000894070;0
6391;-742109.269999999552965;-1042498.320000000298023;0
4921;-742444.739999998360872;-1042908.420000001788139;0
5294;-743056.328999999910593;-1043196.096999999135733;0
6252;-742378.052000001072884;-1043040.958000000566244;0
1965;-743413.000000000000000;-1044726.000000000000000;0
2386;-742139.000000000000000;-1045460.000000000000000;0
2234;-743425.000000000000000;-1045221.000000000000000;0
4999;-742534.149999998509884;-1042966.892999999225140;0
3295;-743595.543000001460314;-1042827.322000000625849;0
619;-742229.000000000000000;-1043277.000000000000000;0
7537;-742722.660000000149012;-1045361.410000000149012;0
4976;-742494.337000001221895;-1043009.743000000715256;0
4220;-742214.344999998807907;-1043580.359999999403954;0
4227;-742108.530000001192093;-1043326.289999999105930;0
7290;-742819.100000001490116;-1044794.800000000745058;0
4947;-742399.918000001460314;-1042993.458000000566244;0
1607;-742414.000000000000000;-1044379.000000000000000;0
1933;-743329.000000000000000;-1044407.000000000000000;0
883;-741802.000000000000000;-1042773.000000000000000;0
1360;-741983.000000000000000;-1044900.000000000000000;0
4699;-742676.469999998807907;-1042731.760000001639128;0
1215;-742091.000000000000000;-1044365.000000000000000;0
4589;-742408.243000000715256;-1042542.631999999284744;0
4828;-743048.579999998211861;-1042941.179999999701977;0
3994;-743394.864000000059605;-1043949.813999999314547;0
1949;-743248.000000000000000;-1044491.000000000000000;0
7704;-742256.021000001579523;-1044313.592999998480082;0
3788;-743134.440000001341105;-1042956.210000000894070;0
4830;-743043.449999999254942;-1042882.359999999403954;0
6861;-741491.429999999701977;-1045010.300000000745058;0
7315;-742603.960000000894070;-1045022.870000001043081;0
5512;-743426.556000001728535;-1043602.920000001788139;0
6261;-742373.956999998539686;-1043022.041999999433756;0
4791;-743022.245000001043081;-1042633.714000001549721;0
2263;-742989.000000000000000;-1045714.000000000000000;0
2049;-743499.000000000000000;-1045071.000000000000000;0
2399;-742121.000000000000000;-1045372.000000000000000;0
1014;-742097.000000000000000;-1044586.000000000000000;0
5677;-743405.545000001788139;-1043716.931000001728535;0
1343;-741714.000000000000000;-1044765.000000000000000;0
4639;-742567.399999998509884;-1042548.592999998480082;0
544;-742343.910000000149012;-1043796.500000000000000;0
3975;-743112.984999999403954;-1043716.375999998301268;0
4949;-742369.969999998807907;-1042973.199999999254942;0
6777;-741073.500000000000000;-1044491.879999998956919;0
3289;-743584.761999998241663;-1042769.188000001013279;0
3768;-743006.370000001043081;-1042978.829999998211861;0
622;-742271.000000000000000;-1043302.000000000000000;0
6923;-742061.469999998807907;-1045089.760000001639128;0
1181;-741920.000000000000000;-1044230.000000000000000;0
1340;-741695.000000000000000;-1044759.000000000000000;0
6449;-743140.379999998956919;-1043395.559999998658895;0
1471;-741711.000000000000000;-1044132.000000000000000;0
1369;-742029.000000000000000;-1044788.000000000000000;0
6273;-742321.806000001728535;-1043017.085000000894070;0
1517;-741964.000000000000000;-1044034.000000000000000;0
546;-742323.640000000596046;-1043781.429999999701977;0
5736;-743414.859999999403954;-1043691.462999999523163;0
2156;-742796.000000000000000;-1045184.000000000000000;0
4249;-742151.910000000149012;-1043354.719999998807907;0
614;-742111.000000000000000;-1043271.000000000000000;0
8069;-742226.440000001341105;-1045255.949999999254942;0
4776;-742909.276000000536442;-1042820.587000001221895;0
4995;-742476.986000001430511;-1042961.239000000059605;0
4822;-742945.579999998211861;-1042879.910000000149012;0
1590;-742377.000000000000000;-1044885.000000000000000;0
4958;-742349.620000001043081;-1043004.539999999105930;0
6231;-742316.769000001251698;-1043058.344000000506639;0
3966;-743363.859999999403954;-1043530.829999998211861;0
1016;-742147.000000000000000;-1044590.000000000000000;0
5242;-743357.030000001192093;-1043419.239999998360872;0
4026;-743178.984999999403954;-1043847.989999998360872;0
1244;-742127.000000000000000;-1044527.000000000000000;0
7646;-742318.263999998569489;-1045391.811000000685453;0
8085;-741919.059999998658895;-1045407.820000000298023;0
4898;-742571.280000001192093;-1042840.859999999403954;0
381;-742465.000000000000000;-1043700.000000000000000;0
224;-742904.000000000000000;-1043522.000000000000000;0
4936;-742454.684000000357628;-1042685.620999999344349;0
5668;-743416.179999999701977;-1043712.995000001043081;0
6260;-742377.692999999970198;-1043022.434000000357628;0
4819;-742941.910000000149012;-1042776.670000001788139;0
4625;-742594.258000001311302;-1042576.114000000059605;0
1628;-742449.000000000000000;-1044494.000000000000000;0
8059;-742265.730000000447035;-1045081.309999998658895;0
4841;-742989.993999999016523;-1042765.850999999791384;0
4168;-742423.695000000298023;-1043984.135000001639128;0
391;-742395.000000000000000;-1043802.000000000000000;0
4793;-743035.089999999850988;-1042650.028000000864267;0
7138;-742917.554999999701977;-1044421.774999998509884;0
4711;-742803.300000000745058;-1042601.140000000596046;0
617;-742179.000000000000000;-1043272.000000000000000;0
3312;-743789.184999998658895;-1042904.234000001102686;0
4657;-742806.021999999880791;-1042442.679999999701977;0
4527;-742728.050000000745058;-1042838.719999998807907;0
4834;-742972.708000000566244;-1042657.809000000357628;0
4891;-742595.048999998718500;-1042857.274999998509884;0
1704;-741289.000000000000000;-1044690.000000000000000;0
6213;-742316.227000001817942;-1043060.478999998420477;0
4562;-742471.000000000000000;-1042510.920000001788139;0
1025;-741989.000000000000000;-1044602.000000000000000;0
7233;-742606.750000000000000;-1044827.379999998956919;0
2244;-743264.000000000000000;-1045331.000000000000000;0
6141;-742311.243999999016523;-1043063.195999998599291;0
1359;-742000.000000000000000;-1044897.000000000000000;0
5454;-742806.100999999791384;-1043305.197999998927116;0
718;-741691.000000000000000;-1042844.000000000000000;0
5024;-742588.655000001192093;-1042886.519000001251698;0
3974;-743140.660000000149012;-1043725.350000001490116;0
3836;-743096.070000000298023;-1042561.879999998956919;0
4018;-743153.285000000149012;-1043925.850000001490116;0
4982;-742559.320999998599291;-1043012.914000000804663;0
4007;-743275.230999998748302;-1044049.184999998658895;0
5757;-743420.747999999672174;-1043633.940999999642372;0
8271;-742030.649999998509884;-1042720.129999998956919;0
6709;-742264.587999999523163;-1044776.254999998956919;0
4523;-742703.960000000894070;-1042805.670000001788139;0
2394;-742273.000000000000000;-1045360.000000000000000;0
6182;-742317.399000000208616;-1043067.136999998241663;0
7180;-742618.809000000357628;-1044646.109000001102686;0
3346;-743958.802000001072884;-1043049.741000000387430;0
5195;-743232.432999998331070;-1043297.890999998897314;0
7175;-742651.780000001192093;-1044558.149999998509884;0
5681;-743400.820000000298023;-1043718.682000000029802;0
7049;-743420.177000001072884;-1044168.629999998956919;0
5308;-743062.039999999105930;-1043186.831999998539686;0
844;-742138.000000000000000;-1042519.000000000000000;0
6198;-742312.659000001847744;-1043056.964999999850988;0
6487;-741745.798000000417233;-1044519.414999999105930;0
2301;-742533.000000000000000;-1045416.000000000000000;0
6258;-742382.381999999284744;-1043032.370999999344349;0
5220;-743247.339999999850988;-1043589.050000000745058;0
6979;-743081.460000000894070;-1044413.079999998211861;0
678;-742421.000000000000000;-1043181.000000000000000;0
329;-742675.000000000000000;-1044052.000000000000000;0
3160;-743959.590999998152256;-1042557.386999998241663;0
3846;-743149.390000000596046;-1042549.600000001490116;0
5777;-742926.357000000774860;-1043427.357999999076128;0
6283;-742308.969000000506639;-1043049.539999999105930;0
1861;-743457.000000000000000;-1044175.000000000000000;0
3095;-743923.068999998271465;-1042787.789000000804663;0
4047;-743210.230000000447035;-1043992.289999999105930;0
4425;-742208.820000000298023;-1043035.230000000447035;0
3887;-742347.760000001639128;-1042449.881000000983477;0
711;-741828.000000000000000;-1042860.000000000000000;0
7169;-742693.079999998211861;-1044394.177999999374151;0
674;-742463.000000000000000;-1043211.000000000000000;0
5418;-742434.890000000596046;-1042864.780000001192093;0
4627;-742601.138999998569489;-1042606.791000001132488;0
191;-743424.000000000000000;-1043599.000000000000000;0
3810;-743261.510000001639128;-1042802.960000000894070;0
7975;-741349.339999999850988;-1044397.800000000745058;0
1035;-741963.000000000000000;-1044896.000000000000000;0
5663;-743422.087999999523163;-1043710.807999998331070;0
6675;-742272.140000000596046;-1044167.469999998807907;0
8276;-742095.079999998211861;-1042752.519999999552965;0
1823;-742973.000000000000000;-1044174.000000000000000;0
6214;-742315.447999998927116;-1043059.026000000536442;0
4079;-742836.170000001788139;-1043800.960000000894070;0
6511;-741291.670000001788139;-1044319.690000001341105;0
5217;-743306.870999999344349;-1043323.228000000119209;0
5121;-742889.114000000059605;-1043362.250000000000000;0
1485;-741184.000000000000000;-1044223.000000000000000;0
620;-742253.000000000000000;-1043281.000000000000000;0
1957;-743402.000000000000000;-1044519.000000000000000;0
6250;-742374.638999998569489;-1043047.576999999582767;0
4803;-743043.410999998450279;-1042699.506000000983477;0
4221;-742209.576000001281500;-1043499.238000001758337;0
270;-743230.000000000000000;-1043721.000000000000000;0
204;-743208.000000000000000;-1043588.000000000000000;0
755;-741668.000000000000000;-1042700.000000000000000;0
8265;-742197.820000000298023;-1042704.260000001639128;0
4854;-742971.159000001847744;-1042912.429000001400709;0
1867;-743474.000000000000000;-1044257.000000000000000;0
1892;-743525.000000000000000;-1044425.000000000000000;0
988;-741820.000000000000000;-1044516.000000000000000;0
579;-742006.000000000000000;-1043477.000000000000000;0
5716;-743423.320999998599291;-1043631.197000000625849;0
5210;-743253.673999998718500;-1043370.440999999642372;0
5370;-742580.300999999046326;-1042977.140999998897314;0
1289;-742211.000000000000000;-1044521.000000000000000;0
