OID_;X;Y;TEMPERATURE
7077;-743564.359000001102686;-1045385.210000000894070;0
5995;-744441.440999999642372;-1042779.568999998271465;0
3679;-744571.809999998658895;-1042497.875999998301268;0
3527;-744805.695999998599291;-1042671.809000000357628;0
3538;-744616.304000001400709;-1042656.734000001102686;0
3585;-744920.065000001341105;-1042522.129999998956919;0
3460;-744993.289000000804663;-1042693.587000001221895;0
3466;-745113.802000001072884;-1042675.725000001490116;0
3612;-744996.545000001788139;-1042292.646000001579523;0
94;-744054.000000000000000;-1042934.000000000000000;0
5;-743466.000000000000000;-1042616.000000000000000;27
7259;-742935.280000001192093;-1044869.829999998211861;0
2696;-743477.489999998360872;-1042038.000000000000000;0
1586;-742372.000000000000000;-1044785.000000000000000;0
2361;-742323.000000000000000;-1045576.000000000000000;0
466;-741743.000000000000000;-1043331.000000000000000;0
6946;-742974.765000000596046;-1043929.388000000268221;0
9;-743512.000000000000000;-1042512.000000000000000;133
1532;-741805.000000000000000;-1043858.000000000000000;0
6606;-741654.631999999284744;-1043906.848000001162291;0
926;-741894.000000000000000;-1042999.000000000000000;0
1674;-741099.000000000000000;-1044736.000000000000000;0
1993;-743483.000000000000000;-1044984.000000000000000;0
7514;-742304.866000000387430;-1044375.124000001698732;0
4146;-742666.940000001341105;-1043854.829999998211861;0
4078;-742842.960000000894070;-1043832.824999999254942;0
7011;-742831.309999998658895;-1044257.245000001043081;0
2214;-743162.000000000000000;-1045316.000000000000000;0
2166;-743016.000000000000000;-1045179.000000000000000;0
2506;-741267.000000000000000;-1044015.000000000000000;0
1487;-741117.000000000000000;-1044216.000000000000000;0
6997;-743109.160000000149012;-1044453.600000001490116;0
1719;-741406.760000001639128;-1044866.039999999105930;0
734;-741935.000000000000000;-1043014.000000000000000;0
7935;-743156.000000000000000;-1045071.149999998509884;0
747;-741690.000000000000000;-1043000.000000000000000;0
4131;-742844.625000000000000;-1044059.980000000447035;0
4238;-742440.263000000268221;-1043528.236000001430511;0
563;-742155.000000000000000;-1043660.000000000000000;0
4174;-742738.230000000447035;-1043763.155000001192093;0
5306;-743103.326999999582767;-1043193.129000000655651;0
394;-742405.000000000000000;-1043863.000000000000000;0
281;-743045.000000000000000;-1043848.000000000000000;0
5767;-742424.269999999552965;-1042581.609000001102686;0
110;-744127.000000000000000;-1042724.000000000000000;0
2192;-743499.000000000000000;-1045199.000000000000000;0
1291;-742205.000000000000000;-1044568.000000000000000;0
941;-742098.000000000000000;-1043132.000000000000000;0
2211;-743248.000000000000000;-1045258.000000000000000;0
3919;-743904.947000000625849;-1043493.929999999701977;0
6993;-743172.409000001847744;-1044501.339000001549721;0
7369;-743236.822000000625849;-1045458.699000000953674;0
6786;-741269.960000000894070;-1044469.460000000894070;0
505;-741917.000000000000000;-1043153.000000000000000;0
1430;-741993.000000000000000;-1044260.000000000000000;0
7778;-743070.728000000119209;-1045812.342000000178814;0
2892;-744005.317000001668930;-1043204.537000000476837;0
1753;-742096.000000000000000;-1045195.000000000000000;0
3108;-743768.699999999254942;-1042671.241999998688698;0
7146;-742819.425000000745058;-1044426.225000001490116;0
1531;-741782.000000000000000;-1043838.000000000000000;0
1516;-741928.000000000000000;-1044062.000000000000000;0
909;-742183.000000000000000;-1042503.000000000000000;0
1991;-743482.000000000000000;-1044929.000000000000000;0
1928;-743474.000000000000000;-1044409.000000000000000;0
557;-742213.000000000000000;-1043713.000000000000000;0
4248;-742157.039999999105930;-1043376.699999999254942;0
1921;-743387.000000000000000;-1044335.000000000000000;0
792;-741718.000000000000000;-1042599.000000000000000;0
1503;-741537.000000000000000;-1044272.000000000000000;0
502;-741901.000000000000000;-1043169.000000000000000;0
1554;-741348.000000000000000;-1044238.000000000000000;0
5146;-743064.554000001400709;-1043452.671999998390675;0
1425;-742080.000000000000000;-1044210.000000000000000;0
5113;-742946.795000001788139;-1043444.427999999374151;0
6751;-742426.350000001490116;-1044371.070000000298023;0
2259;-743001.000000000000000;-1045599.000000000000000;0
5437;-744084.208999998867512;-1043295.061999998986721;0
1316;-741765.000000000000000;-1044903.000000000000000;0
1570;-742291.000000000000000;-1044183.000000000000000;0
1368;-741998.000000000000000;-1044779.000000000000000;0
317;-742464.000000000000000;-1044207.000000000000000;0
1762;-741227.000000000000000;-1044108.000000000000000;0
205;-743173.000000000000000;-1043599.000000000000000;0
5177;-743336.440999999642372;-1043440.883999999612570;0
4060;-742896.530000001192093;-1043699.219999998807907;5
2050;-743460.000000000000000;-1045072.000000000000000;0
4877;-742845.760000001639128;-1042956.589999999850988;0
6337;-742257.140000000596046;-1042864.820000000298023;0
2160;-742849.000000000000000;-1045147.000000000000000;0
2752;-743983.471000000834465;-1043454.780000001192093;0
4119;-742717.223999999463558;-1043999.837999999523163;0
5324;-743025.329999998211861;-1043045.789999999105930;0
4575;-742336.600000001490116;-1042692.170000001788139;0
1137;-741538.000000000000000;-1044442.000000000000000;0
3750;-743221.379999998956919;-1042925.429999999701977;0
1304;-741810.000000000000000;-1044684.000000000000000;0
2344;-742691.000000000000000;-1045541.000000000000000;0
3752;-743213.949999999254942;-1042902.719999998807907;0
6822;-741283.870000001043081;-1044793.059999998658895;0
2516;-742500.000000000000000;-1044414.000000000000000;0
2220;-743075.000000000000000;-1045396.000000000000000;0
984;-741917.000000000000000;-1044411.000000000000000;0
7944;-742086.969999998807907;-1044063.079999998211861;0
2891;-744029.914000000804663;-1043200.478000000119209;0
1759;-741128.000000000000000;-1044097.000000000000000;0
2512;-743070.000000000000000;-1044052.000000000000000;0
5272;-743000.013999998569489;-1043245.364000000059605;0
1492;-741096.000000000000000;-1044331.000000000000000;0
4088;-742812.114999998360872;-1043580.475000001490116;0
527;-742186.000000000000000;-1043818.000000000000000;144
7928;-743542.539999999105930;-1044784.769999999552965;0
2547;-741724.000000000000000;-1044282.000000000000000;0
669;-742510.000000000000000;-1043260.000000000000000;0
7801;-742459.168999999761581;-1044490.660000000149012;0
3438;-743746.833000000566244;-1043057.962000001221895;0
1795;-742155.000000000000000;-1044231.000000000000000;0
4938;-742469.324999999254942;-1042658.263000000268221;0
4071;-742929.394999999552965;-1043807.585000000894070;0
4600;-742647.000000000000000;-1042709.000000000000000;0
5251;-743317.296000000089407;-1043180.037999998778105;0
2504;-742757.000000000000000;-1045516.000000000000000;0
1020;-742293.000000000000000;-1044615.000000000000000;0
2146;-742845.000000000000000;-1044968.000000000000000;0
2016;-743230.000000000000000;-1044873.000000000000000;0
1587;-742372.000000000000000;-1044806.000000000000000;0
4901;-742520.120000001043081;-1042823.960000000894070;0
6391;-742109.269999999552965;-1042498.320000000298023;0
2386;-742139.000000000000000;-1045460.000000000000000;0
2234;-743425.000000000000000;-1045221.000000000000000;0
7537;-742722.660000000149012;-1045361.410000000149012;0
4220;-742214.344999998807907;-1043580.359999999403954;0
1933;-743329.000000000000000;-1044407.000000000000000;0
883;-741802.000000000000000;-1042773.000000000000000;0
7704;-742256.021000001579523;-1044313.592999998480082;0
3788;-743134.440000001341105;-1042956.210000000894070;0
7315;-742603.960000000894070;-1045022.870000001043081;0
544;-742343.910000000149012;-1043796.500000000000000;0
6777;-741073.500000000000000;-1044491.879999998956919;0
1181;-741920.000000000000000;-1044230.000000000000000;0
1517;-741964.000000000000000;-1044034.000000000000000;0
8069;-742226.440000001341105;-1045255.949999999254942;0
5242;-743357.030000001192093;-1043419.239999998360872;0
8085;-741919.059999998658895;-1045407.820000000298023;0
4562;-742471.000000000000000;-1042510.920000001788139;0
5454;-742806.100999999791384;-1043305.197999998927116;0
6709;-742264.587999999523163;-1044776.254999998956919;0
7049;-743420.177000001072884;-1044168.629999998956919;0
2301;-742533.000000000000000;-1045416.000000000000000;0
3095;-743923.068999998271465;-1042787.789000000804663;0
4047;-743210.230000000447035;-1043992.289999999105930;0
6675;-742272.140000000596046;-1044167.469999998807907;0
1823;-742973.000000000000000;-1044174.000000000000000;0
1485;-741184.000000000000000;-1044223.000000000000000;0
620;-742253.000000000000000;-1043281.000000000000000;0
755;-741668.000000000000000;-1042700.000000000000000;0
8265;-742197.820000000298023;-1042704.260000001639128;0
1867;-743474.000000000000000;-1044257.000000000000000;0
1892;-743525.000000000000000;-1044425.000000000000000;0
1039;-741914.000000000000000;-1044595.000000000000000;0
4831;-743041.170000001788139;-1042862.530000001192093;0
7807;-742647.802999999374151;-1044543.524000000208616;0
3810;-743261.510000001639128;-1042802.960000000894070;0
1722;-741672.000000000000000;-1045029.000000000000000;0
4838;-742981.304999999701977;-1042697.471000000834465;0
3950;-743426.829999998211861;-1043556.070000000298023;0
7661;-742294.495999999344349;-1045349.482000000774860;0
7143;-742850.414999999105930;-1044473.449999999254942;0
7091;-743361.839999999850988;-1044584.039999999105930;0
3820;-743111.699999999254942;-1042659.320000000298023;0
7152;-742867.331999998539686;-1044547.015999998897314;0
2060;-742659.000000000000000;-1044472.000000000000000;0
3845;-743172.920000001788139;-1042573.210000000894070;0
6686;-742381.967000000178814;-1044961.747000001370907;0
4640;-742588.572999998927116;-1042544.848999999463558;0
572;-742083.000000000000000;-1043561.000000000000000;0
1610;-742374.000000000000000;-1044447.000000000000000;0
3264;-743565.725000001490116;-1042729.024999998509884;0
4030;-743133.280000001192093;-1043791.552000001072884;0
5758;-743420.897999998182058;-1043635.921999998390675;0
3204;-743715.278999999165535;-1042506.118999999016523;0
1359;-742000.000000000000000;-1044897.000000000000000;0
1241;-742132.000000000000000;-1044436.000000000000000;0
4046;-743205.699999999254942;-1044009.719999998807907;0
1084;-741698.000000000000000;-1044537.000000000000000;0
1379;-742135.000000000000000;-1044975.000000000000000;0
4332;-742410.359000001102686;-1043282.916000001132488;0
6002;-742018.502000000327826;-1043294.918999999761581;0
1013;-742076.000000000000000;-1044595.000000000000000;0
7217;-742516.318999998271465;-1044582.890000000596046;0
6268;-742340.850000001490116;-1043018.881000000983477;0
1214;-742064.000000000000000;-1044358.000000000000000;0
890;-742007.000000000000000;-1042740.000000000000000;0
6281;-742307.629000000655651;-1043042.113000001758337;0
6876;-741825.559999998658895;-1045240.469999998807907;0
7156;-742944.515000000596046;-1044546.140000000596046;0
5459;-742368.519000001251698;-1043474.221999999135733;0
4531;-742746.070000000298023;-1042885.980000000447035;0
4699;-742676.469999998807907;-1042731.760000001639128;0
3996;-743394.274999998509884;-1044004.254999998956919;0
7038;-743316.394999999552965;-1044240.155000001192093;0
4923;-742431.019999999552965;-1042882.210000000894070;0
1321;-741825.000000000000000;-1044923.000000000000000;0
7649;-742319.399999998509884;-1045429.557000000029802;0
1695;-741550.000000000000000;-1044656.000000000000000;0
7520;-742808.589999999850988;-1045680.519999999552965;0
6916;-742011.701000001281500;-1045042.927000001072884;0
329;-742675.000000000000000;-1044052.000000000000000;0
4002;-743397.818999998271465;-1044054.317999999970198;0
4558;-742373.019999999552965;-1042506.949999999254942;0
600;-741840.000000000000000;-1043212.000000000000000;0
1843;-743041.600000001490116;-1044324.489999998360872;0
2073;-743069.000000000000000;-1044754.000000000000000;0
5064;-742811.537999998778105;-1043238.886999998241663;0
5206;-743189.870999999344349;-1043360.936000000685453;0
6180;-742311.429000001400709;-1043057.635999999940395;0
2240;-743343.000000000000000;-1045290.000000000000000;0
3439;-743751.594000000506639;-1043080.798999998718500;0
2291;-742850.000000000000000;-1045401.000000000000000;0
7018;-742577.747000001370907;-1044239.712999999523163;0
4309;-742042.329999998211861;-1043492.329999998211861;0
2029;-743393.000000000000000;-1045068.000000000000000;0
1333;-741781.000000000000000;-1044777.000000000000000;0
616;-742153.000000000000000;-1043272.000000000000000;0
3992;-743365.899999998509884;-1043881.385000001639128;0
2446;-742750.000000000000000;-1044164.000000000000000;0
5035;-742658.587999999523163;-1043006.899000000208616;0
3353;-743954.399999998509884;-1043021.017999999225140;0
7288;-742817.019999999552965;-1044773.399999998509884;0
4029;-743130.695999998599291;-1043815.427999999374151;0
227;-742846.000000000000000;-1043520.000000000000000;0
1120;-741778.000000000000000;-1044457.000000000000000;0
7325;-743032.969999998807907;-1045186.298999998718500;0
4035;-743274.690000001341105;-1043779.739999998360872;0
2558;-741286.000000000000000;-1044387.000000000000000;0
6132;-742310.590999998152256;-1043063.552999999374151;0
2482;-741262.739999998360872;-1044725.530000001192093;0
4749;-742884.420000001788139;-1042760.329999998211861;0
2257;-742956.000000000000000;-1045558.000000000000000;0
4812;-743027.170000001788139;-1042810.219999998807907;0
7236;-742619.090999998152256;-1044816.800999999046326;0
1272;-742237.000000000000000;-1044545.000000000000000;0
5580;-743409.831000000238419;-1043636.449000000953674;0
5173;-743291.175999999046326;-1043426.754999998956919;0
1651;-741374.000000000000000;-1044519.000000000000000;0
2357;-742388.000000000000000;-1045577.000000000000000;0
4688;-742676.179000001400709;-1042555.322999998927116;0
7095;-743370.940000001341105;-1044597.230000000447035;0
7036;-743316.204999998211861;-1044198.315000001341105;0
1253;-742084.000000000000000;-1044730.000000000000000;0
4592;-742448.190999999642372;-1042642.517999999225140;0
2096;-743154.000000000000000;-1044724.000000000000000;0
4175;-742721.254999998956919;-1043775.890000000596046;0
1730;-741428.000000000000000;-1045052.000000000000000;0
725;-741983.000000000000000;-1042939.000000000000000;0
1726;-741516.000000000000000;-1045120.000000000000000;0
6213;-742316.227000001817942;-1043060.478999998420477;0
6118;-743652.447000000625849;-1042857.607999999076128;0
8046;-742169.109999999403954;-1044835.660000000149012;0
2323;-742622.000000000000000;-1045487.000000000000000;0
3310;-743829.561999998986721;-1042854.063000001013279;0
6119;-743582.679999999701977;-1042696.969999998807907;0
1512;-741829.000000000000000;-1044135.000000000000000;0
1131;-741643.000000000000000;-1044433.000000000000000;0
7017;-742571.059999998658895;-1044267.640000000596046;0
303;-742895.000000000000000;-1044116.000000000000000;0
5994;-743358.609999999403954;-1043460.469999998807907;0
7151;-742842.649000000208616;-1044545.307000000029802;0
341;-742592.000000000000000;-1043889.000000000000000;0
4786;-742953.361000001430511;-1042655.886999998241663;0
5599;-743411.622999999672174;-1043680.499000001698732;0
6841;-741583.443999998271465;-1044946.208000000566244;0
4811;-743040.379999998956919;-1042799.609999999403954;0
4653;-742788.747999999672174;-1042524.557000000029802;0
1172;-741869.000000000000000;-1044348.000000000000000;0
7680;-742500.160000000149012;-1045137.399999998509884;0
180;-743414.000000000000000;-1043320.000000000000000;0
4803;-743043.410999998450279;-1042699.506000000983477;0
5517;-743427.287000000476837;-1043618.956999998539686;0
3339;-743968.859000001102686;-1043058.642000000923872;0
5642;-743428.609999999403954;-1043688.666999999433756;0
696;-742077.000000000000000;-1042913.000000000000000;0
5792;-743363.984999999403954;-1043442.513999998569489;0
5660;-743425.633999999612570;-1043709.497000001370907;0
1816;-743070.000000000000000;-1044444.000000000000000;0
3808;-742987.050000000745058;-1042925.350000001490116;0
1303;-741865.000000000000000;-1044692.000000000000000;0
4224;-742139.756000000983477;-1043462.488000001758337;0
905;-742312.000000000000000;-1042489.000000000000000;0
4697;-742675.329999998211861;-1042689.179999999701977;0
582;-741994.000000000000000;-1043417.000000000000000;0
5241;-743365.063000001013279;-1043245.954999998211861;0
5413;-742651.872000001370907;-1042662.627999998629093;0
6251;-742377.396999999880791;-1043042.284000001847744;0
1444;-741559.000000000000000;-1044786.000000000000000;0
2083;-742588.000000000000000;-1044663.000000000000000;0
3128;-743948.160000000149012;-1042657.320000000298023;0
6161;-742310.964999999850988;-1043059.710999999195337;0
4924;-742427.890999998897314;-1042890.581000000238419;0
6726;-742476.517999999225140;-1044410.600000001490116;0
4984;-742580.537999998778105;-1043025.210999999195337;0
4164;-742476.478000000119209;-1044110.528000000864267;0
4701;-742687.780000001192093;-1042761.660000000149012;0
4249;-742151.910000000149012;-1043354.719999998807907;0
7740;-742301.949999999254942;-1045061.239000000059605;0
5677;-743405.545000001788139;-1043716.931000001728535;0
8077;-742038.989999998360872;-1045265.309999998658895;0
1473;-741642.000000000000000;-1044158.000000000000000;0
1445;-741553.000000000000000;-1044757.000000000000000;0
2397;-742181.000000000000000;-1045368.000000000000000;0
5757;-743420.747999999672174;-1043633.940999999642372;0
4159;-742455.734999999403954;-1043898.035000000149012;0
1407;-741650.000000000000000;-1044242.000000000000000;0
378;-742514.000000000000000;-1043703.000000000000000;0
7279;-742799.399999998509884;-1044679.829999998211861;0
6168;-742313.092999998480082;-1043062.208999998867512;0
401;-742324.000000000000000;-1043907.000000000000000;0
6256;-742380.723000001162291;-1043035.640000000596046;0
2039;-743308.000000000000000;-1044808.000000000000000;0
5322;-743060.379999998956919;-1043029.589999999850988;0
4460;-742216.600000001490116;-1042598.850000001490116;0
625;-742247.000000000000000;-1043299.000000000000000;0
4805;-743001.147999998182058;-1042707.644999999552965;0
6223;-742316.076000001281500;-1043058.679000001400709;0
4041;-743227.600000001490116;-1043746.495000001043081;0
709;-741861.000000000000000;-1042862.000000000000000;0
3815;-743161.949999999254942;-1042769.750000000000000;0
344;-742557.000000000000000;-1043847.000000000000000;0
1000;-741828.000000000000000;-1044502.000000000000000;0
4731;-742802.002999998629093;-1042654.546000000089407;0
2447;-742772.000000000000000;-1044159.000000000000000;0
4341;-742488.855000000447035;-1043325.412999998778105;0
1152;-741257.000000000000000;-1044489.000000000000000;0
4709;-742775.800000000745058;-1042600.690000001341105;0
2018;-743244.000000000000000;-1044909.000000000000000;0
209;-743108.000000000000000;-1043583.000000000000000;0
5699;-743416.657000001519918;-1043631.932999998331070;0
3313;-743774.447000000625849;-1042903.081999998539686;0
7202;-742561.410000000149012;-1044949.640000000596046;0
1403;-741702.000000000000000;-1044386.000000000000000;0
519;-742239.000000000000000;-1043113.000000000000000;0
740;-741759.000000000000000;-1043031.000000000000000;0
6312;-743933.359999999403954;-1042580.719999998807907;0
352;-742386.000000000000000;-1043914.000000000000000;0
4769;-742881.932000000029802;-1042923.590999998152256;0
4746;-742867.769999999552965;-1042768.570000000298023;0
5220;-743247.339999999850988;-1043589.050000000745058;0
4794;-743065.828999999910593;-1042673.377000000327826;0
4702;-742669.300000000745058;-1042747.399999998509884;0
4628;-742619.598000001162291;-1042609.989999998360872;0
681;-742383.000000000000000;-1043170.000000000000000;0
2377;-742390.000000000000000;-1045527.000000000000000;0
4852;-742992.449999999254942;-1042849.890000000596046;0
1944;-743280.000000000000000;-1044400.000000000000000;0
7246;-742736.730000000447035;-1044825.399999998509884;0
7727;-743363.892999999225140;-1044617.146000001579523;0
5014;-742563.771999999880791;-1042993.241999998688698;0
6227;-742319.839999999850988;-1043063.936000000685453;0
1006;-741930.000000000000000;-1044565.000000000000000;0
212;-743080.000000000000000;-1043557.000000000000000;0
8277;-742111.260000001639128;-1042746.399999998509884;0
4950;-742354.289999999105930;-1042955.670000001788139;0
7700;-742371.105999998748302;-1044818.445000000298023;0
512;-742063.000000000000000;-1043136.000000000000000;0
6805;-741109.710000000894070;-1044689.170000001788139;0
7197;-742570.949000000953674;-1044895.548999998718500;0
1720;-741436.000000000000000;-1044862.000000000000000;0
3141;-744035.420000001788139;-1042680.460000000894070;0
3064;-744117.098999999463558;-1042868.348999999463558;0
6872;-741751.719999998807907;-1045296.679999999701977;0
159;-742965.000000000000000;-1042641.000000000000000;0
5701;-743417.076999999582767;-1043630.140000000596046;0
5421;-742337.905999999493361;-1042777.837999999523163;0
1143;-741415.000000000000000;-1044457.000000000000000;0
3371;-743840.392999999225140;-1043010.835000000894070;0
3978;-743342.695000000298023;-1043756.835000000894070;0
5162;-743180.460999999195337;-1043323.660000000149012;0
5583;-743410.274999998509884;-1043642.072000000625849;0
3283;-743632.767000000923872;-1042846.004000000655651;0
840;-742067.000000000000000;-1042522.000000000000000;0
3314;-743758.675999999046326;-1042905.688999999314547;0
7165;-742711.789999999105930;-1044504.984999999403954;0
6253;-742378.725000001490116;-1043039.690000001341105;0
5082;-742925.114000000059605;-1043348.883999999612570;0
5360;-742453.188999999314547;-1042938.521999999880791;0
1704;-741289.000000000000000;-1044690.000000000000000;0
4459;-742274.829999998211861;-1042644.269999999552965;0
2351;-742525.000000000000000;-1045576.000000000000000;0
1092;-741549.000000000000000;-1044556.000000000000000;0
6339;-742245.460000000894070;-1042835.780000001192093;0
1955;-743374.000000000000000;-1044515.000000000000000;0
3033;-744483.675000000745058;-1042733.627000000327826;0
1388;-742152.000000000000000;-1045026.000000000000000;0
4494;-741874.920000001788139;-1042616.660000000149012;0
538;-742113.000000000000000;-1043652.000000000000000;0
518;-742194.000000000000000;-1043131.000000000000000;0
3945;-743388.361000001430511;-1043434.486000001430511;0
4152;-742564.589999999850988;-1044089.934999998658895;0
6114;-742234.250000000000000;-1043361.324999999254942;0
4898;-742571.280000001192093;-1042840.859999999403954;0
4156;-742513.734999999403954;-1043978.035000000149012;0
4507;-742472.469999998807907;-1042720.199999999254942;0
7275;-742794.339999999850988;-1044627.140000000596046;0
5600;-743410.407000001519918;-1043680.594000000506639;0
558;-742200.000000000000000;-1043683.000000000000000;0
5507;-743426.703000001609325;-1043656.230999998748302;0
7282;-742809.410000000149012;-1044693.629999998956919;0
385;-742436.000000000000000;-1043742.000000000000000;0
7218;-742534.100000001490116;-1044603.559999998658895;0
5702;-743417.206000000238419;-1043631.844999998807907;0
1757;-742189.000000000000000;-1045219.000000000000000;0
6930;-742046.030000001192093;-1045191.489999998360872;0
6144;-742308.925000000745058;-1043059.002000000327826;0
1250;-742103.000000000000000;-1044672.000000000000000;0
6687;-742383.274000000208616;-1044983.381999999284744;0
1611;-742400.000000000000000;-1044442.000000000000000;0
3998;-743432.704999998211861;-1043914.274999998509884;0
4586;-742464.175000000745058;-1042636.333999998867512;0
7173;-742660.850000001490116;-1044535.730000000447035;0
1088;-741617.000000000000000;-1044547.000000000000000;0
4629;-742630.986000001430511;-1042626.096000000834465;0
1658;-741404.000000000000000;-1044751.000000000000000;0
1510;-741764.000000000000000;-1044180.000000000000000;0
4753;-742764.600000001490116;-1042761.899999998509884;0
2318;-742763.000000000000000;-1045470.000000000000000;0
4723;-742883.429999999701977;-1042644.829999998211861;0
1051;-741775.000000000000000;-1044980.000000000000000;0
1499;-741413.000000000000000;-1044304.000000000000000;0
8066;-742286.199999999254942;-1045237.250000000000000;0
5135;-742979.611000001430511;-1043468.912999998778105;0
6262;-742370.024999998509884;-1043021.666000001132488;0
6221;-742317.633000001311302;-1043061.541000001132488;0
695;-742207.000000000000000;-1043019.000000000000000;96
5705;-743417.603000000119209;-1043637.098000001162291;0
1694;-741582.000000000000000;-1044653.000000000000000;0
503;-741879.000000000000000;-1043158.000000000000000;0
6162;-742310.199999999254942;-1043058.306000001728535;0
7814;-741769.006999999284744;-1044058.535999998450279;0
4529;-742762.920000001788139;-1042885.809999998658895;0
2273;-742895.000000000000000;-1045745.000000000000000;0
8281;-742164.160000000149012;-1042778.140000000596046;0
5747;-743413.175999999046326;-1043698.811000000685453;0
6532;-741593.359999999403954;-1044141.059999998658895;0
4129;-742890.405000001192093;-1044048.370000001043081;0
2430;-742493.000000000000000;-1045120.000000000000000;0
4927;-742447.969999998807907;-1042874.710000000894070;0
4931;-742449.300000000745058;-1042791.403000000864267;0
1392;-742104.000000000000000;-1045067.000000000000000;0
6240;-742364.495999999344349;-1043067.289999999105930;0
4729;-742855.690000001341105;-1042695.640000000596046;0
6186;-742314.337999999523163;-1043061.517000000923872;0
2561;-741214.000000000000000;-1044393.000000000000000;0
678;-742421.000000000000000;-1043181.000000000000000;0
1089;-741567.949999999254942;-1044538.820000000298023;0
8054;-742230.239999998360872;-1044988.530000001192093;0
6245;-742369.682000000029802;-1043057.377000000327826;0
559;-742191.000000000000000;-1043693.000000000000000;0
6693;-742248.197000000625849;-1044816.127000000327826;0
8151;-743319.030000001192093;-1043194.940000001341105;0
6130;-742312.136999998241663;-1043066.344000000506639;0
5294;-743056.328999999910593;-1043196.096999999135733;0
4593;-742510.820000000298023;-1042652.203999999910593;0
889;-742000.000000000000000;-1042770.000000000000000;0
6275;-742314.603999998420477;-1043016.407999999821186;0
1109;-741204.100000001490116;-1044585.460000000894070;0
8051;-742213.199999999254942;-1044935.890000000596046;0
586;-741966.000000000000000;-1043374.000000000000000;0
8283;-742198.600000001490116;-1042801.980000000447035;0
2389;-742076.000000000000000;-1045396.000000000000000;0
7362;-743205.807000000029802;-1045156.089999999850988;0
5122;-742902.166999999433756;-1043373.543999999761581;0
2467;-743434.000000000000000;-1044742.000000000000000;0
6648;-741750.510000001639128;-1044080.329999998211861;0
633;-742100.000000000000000;-1043296.000000000000000;0
5420;-742442.920000001788139;-1042740.519999999552965;0
1117;-741066.000000000000000;-1044603.000000000000000;0
3942;-743420.800000000745058;-1043492.339999999850988;0
4997;-742492.638000000268221;-1042962.833999998867512;0
6338;-742247.910000000149012;-1042851.670000001788139;0
5653;-743429.589999999850988;-1043701.940999999642372;0
4036;-743246.920000001788139;-1043771.574999999254942;0
4023;-743246.635000001639128;-1043864.364999998360872;0
4310;-742031.800000000745058;-1043475.199999999254942;0
5703;-743417.385000001639128;-1043633.592000000178814;0
3973;-743161.204999998211861;-1043723.574999999254942;0
1458;-741506.000000000000000;-1044384.000000000000000;0
7034;-743299.725999999791384;-1044153.140000000596046;0
3949;-743420.780000001192093;-1043527.820000000298023;0
574;-742068.000000000000000;-1043538.000000000000000;0
380;-742501.000000000000000;-1043722.000000000000000;0
818;-741961.000000000000000;-1042598.000000000000000;0
1595;-742313.000000000000000;-1045010.000000000000000;0
787;-741714.000000000000000;-1042620.000000000000000;0
4242;-742214.469999998807907;-1043415.800000000745058;0
6208;-742320.098000001162291;-1043067.458999998867512;0
1372;-742118.000000000000000;-1044815.000000000000000;0
4810;-743058.420000001788139;-1042810.050000000745058;0
1592;-742378.000000000000000;-1044936.000000000000000;0
7104;-743423.739999998360872;-1044624.530000001192093;0
710;-741829.000000000000000;-1042878.000000000000000;0
