OID_;X;Y;TEMPERATURE
3919;-743904.947000000625849;-1043493.929999999701977;0
2755;-744003.879000000655651;-1043471.734000001102686;0
4237;-742425.385000001639128;-1043517.421000000089407;0
4070;-742925.285000000149012;-1043783.565000001341105;0
7652;-742275.046999998390675;-1045497.052000001072884;0
2397;-742181.000000000000000;-1045368.000000000000000;0
3314;-743758.675999999046326;-1042905.688999999314547;0
110;-744127.000000000000000;-1042724.000000000000000;3
509;-741991.000000000000000;-1043143.000000000000000;0
4309;-742042.329999998211861;-1043492.329999998211861;0
6833;-741571.423000000417233;-1044909.473999999463558;0
466;-741743.000000000000000;-1043331.000000000000000;0
1533;-741832.000000000000000;-1043879.000000000000000;0
6399;-742013.379999998956919;-1042502.739999998360872;0
2885;-744122.791999999433756;-1043190.208000000566244;0
5436;-744076.484000001102686;-1043296.519999999552965;0
3580;-744924.973999999463558;-1042593.699999999254942;0
7518;-742829.780000001192093;-1045693.210000000894070;0
513;-742083.000000000000000;-1043145.000000000000000;0
2576;-742487.000000000000000;-1045483.000000000000000;0
7780;-743046.243000000715256;-1045844.168999999761581;0
1285;-742198.000000000000000;-1044467.000000000000000;0
1703;-741320.000000000000000;-1044686.000000000000000;0
5118;-742835.168000001460314;-1043315.074000000953674;0
882;-741825.000000000000000;-1042788.000000000000000;0
1586;-742372.000000000000000;-1044785.000000000000000;0
3358;-743952.916999999433756;-1043047.306000001728535;0
2693;-743425.660000000149012;-1042065.250000000000000;0
1370;-742061.000000000000000;-1044797.000000000000000;0
4212;-742205.245000001043081;-1043548.410000000149012;0
7020;-743104.175000000745058;-1044078.344999998807907;0
2256;-743156.000000000000000;-1045353.000000000000000;0
4093;-742889.967999998480082;-1043954.530000001192093;0
6876;-741825.559999998658895;-1045240.469999998807907;0
1026;-741986.000000000000000;-1044631.000000000000000;0
603;-741810.000000000000000;-1043205.000000000000000;0
7397;-743021.859999999403954;-1045682.989999998360872;0
1723;-741611.000000000000000;-1045092.000000000000000;0
1238;-742150.000000000000000;-1044384.000000000000000;0
1984;-743476.000000000000000;-1044743.000000000000000;0
2516;-742500.000000000000000;-1044414.000000000000000;0
2209;-743309.000000000000000;-1045217.000000000000000;0
2331;-742895.000000000000000;-1045530.000000000000000;0
2226;-743057.000000000000000;-1045470.000000000000000;0
8068;-742254.309999998658895;-1045265.969999998807907;0
1610;-742374.000000000000000;-1044447.000000000000000;0
885;-741739.000000000000000;-1042777.000000000000000;0
4167;-742438.315000001341105;-1044021.960000000894070;0
6112;-742237.710000000894070;-1043370.434999998658895;0
8081;-741974.019999999552965;-1045331.530000001192093;0
2141;-742897.000000000000000;-1045094.000000000000000;0
7;-743479.000000000000000;-1042567.000000000000000;0
5116;-742947.859000001102686;-1043386.767000000923872;0
4073;-742939.109999999403954;-1043858.504999998956919;0
6982;-743055.109999999403954;-1044342.629999998956919;0
1324;-741943.000000000000000;-1044994.000000000000000;0
533;-742137.000000000000000;-1043750.000000000000000;0
7009;-742877.537000000476837;-1044242.370000001043081;166
2298;-742621.000000000000000;-1045406.000000000000000;0
4087;-742811.609999999403954;-1043604.190000001341105;0
351;-742509.000000000000000;-1043739.000000000000000;0
500;-741861.000000000000000;-1043174.000000000000000;0
1928;-743474.000000000000000;-1044409.000000000000000;0
3784;-743187.730000000447035;-1042922.429999999701977;0
3838;-743113.550000000745058;-1042543.399999998509884;0
4208;-742372.416999999433756;-1043503.423000000417233;0
1398;-741753.000000000000000;-1044201.000000000000000;0
4578;-742381.817000001668930;-1042594.177999999374151;0
6705;-742279.050999999046326;-1044655.923000000417233;0
827;-742218.000000000000000;-1042626.000000000000000;0
2404;-742179.000000000000000;-1045467.000000000000000;0
5086;-742856.307999998331070;-1043239.488000001758337;0
1661;-741426.000000000000000;-1044846.000000000000000;0
7257;-742901.879999998956919;-1044859.039999999105930;0
1572;-742265.000000000000000;-1044184.000000000000000;0
1628;-742449.000000000000000;-1044494.000000000000000;0
7222;-742428.280000001192093;-1044822.489999998360872;0
7147;-742827.925000000745058;-1044451.385000001639128;0
1761;-741194.000000000000000;-1044104.000000000000000;0
1665;-741012.000000000000000;-1044351.000000000000000;0
4590;-742387.043000001460314;-1042535.971000000834465;0
1486;-741150.000000000000000;-1044219.000000000000000;0
7649;-742319.399999998509884;-1045429.557000000029802;0
6724;-742590.385000001639128;-1044428.910000000149012;0
350;-742505.000000000000000;-1043757.000000000000000;0
888;-741994.000000000000000;-1042797.000000000000000;0
2319;-742734.000000000000000;-1045474.000000000000000;0
4081;-742828.035000000149012;-1043754.850000001490116;0
1509;-741741.000000000000000;-1044196.000000000000000;0
403;-742307.000000000000000;-1043931.000000000000000;0
6870;-741708.260000001639128;-1045321.590999998152256;0
1526;-741644.000000000000000;-1043787.000000000000000;0
223;-742920.000000000000000;-1043542.000000000000000;0
2479;-741247.800000000745058;-1044609.379999998956919;0
1445;-741553.000000000000000;-1044757.000000000000000;0
6607;-741674.456000000238419;-1043925.333999998867512;0
4085;-742812.431000001728535;-1043657.114000000059605;0
2104;-743176.000000000000000;-1044964.000000000000000;0
7705;-742283.471999999135733;-1044316.339999999850988;0
1466;-741838.000000000000000;-1044041.000000000000000;0
7950;-741950.460000000894070;-1044150.710000000894070;0
1971;-743385.000000000000000;-1044881.000000000000000;0
1517;-741964.000000000000000;-1044034.000000000000000;0
7411;-743529.510000001639128;-1045393.140000000596046;0
7808;-741986.629999998956919;-1044440.109999999403954;0
7349;-742516.719999998807907;-1045170.359999999403954;0
1775;-741246.000000000000000;-1044012.000000000000000;0
4128;-742915.039999999105930;-1044041.920000001788139;0
2009;-743221.000000000000000;-1044770.000000000000000;0
7140;-742921.300000000745058;-1044469.335000000894070;0
3871;-742356.649999998509884;-1042420.543999999761581;0
2155;-742797.000000000000000;-1045124.000000000000000;0
2050;-743460.000000000000000;-1045072.000000000000000;0
6111;-742241.054000001400709;-1043365.475999999791384;0
1986;-743480.000000000000000;-1044794.000000000000000;0
1728;-741473.000000000000000;-1045087.000000000000000;0
3044;-744378.258000001311302;-1042783.539999999105930;0
2189;-743472.000000000000000;-1045183.000000000000000;0
4140;-742831.635999999940395;-1044004.828999999910593;0
8276;-742095.079999998211861;-1042752.519999999552965;0
7120;-743351.160000000149012;-1044618.460000000894070;0
1247;-742104.000000000000000;-1044609.000000000000000;0
1211;-742034.000000000000000;-1044412.000000000000000;0
7299;-743117.530000001192093;-1045145.859999999403954;0
2083;-742588.000000000000000;-1044663.000000000000000;0
7980;-741198.179999999701977;-1044410.339999999850988;0
5324;-743025.329999998211861;-1043045.789999999105930;0
1042;-741883.000000000000000;-1044682.000000000000000;0
4054;-743269.304999999701977;-1043797.405000001192093;0
7041;-743381.004999998956919;-1044158.699999999254942;0
731;-741925.000000000000000;-1042997.000000000000000;0
204;-743208.000000000000000;-1043588.000000000000000;0
669;-742510.000000000000000;-1043260.000000000000000;0
3268;-743594.046999998390675;-1042721.412999998778105;20
3807;-743008.690000001341105;-1042928.690000001341105;0
6231;-742316.769000001251698;-1043058.344000000506639;0
3761;-743202.559999998658895;-1042981.710000000894070;0
2326;-742523.000000000000000;-1045498.000000000000000;0
1675;-741059.000000000000000;-1044754.000000000000000;0
4461;-742218.370000001043081;-1042583.800000000745058;0
1234;-742162.000000000000000;-1044314.000000000000000;0
6;-743464.000000000000000;-1042594.000000000000000;0
1266;-742052.000000000000000;-1044980.000000000000000;0
4328;-742347.322000000625849;-1043375.796999998390675;0
3326;-744036.002000000327826;-1042922.574999999254942;0
3276;-743673.931000001728535;-1042836.190999999642372;0
8285;-742232.780000001192093;-1042821.149999998509884;0
588;-741950.000000000000000;-1043352.000000000000000;135
4736;-742701.269999999552965;-1042690.000000000000000;0
572;-742083.000000000000000;-1043561.000000000000000;0
2029;-743393.000000000000000;-1045068.000000000000000;0
8150;-743304.219999998807907;-1043217.539999999105930;0
2491;-742059.000000000000000;-1044251.000000000000000;353
5139;-743032.489999998360872;-1043533.679999999701977;0
1849;-742732.000000000000000;-1044228.000000000000000;157
1686;-741143.910000000149012;-1044795.120000001043081;0
1319;-741788.000000000000000;-1044905.000000000000000;0
2097;-743143.000000000000000;-1044742.000000000000000;0
3211;-743651.409000001847744;-1042483.458999998867512;0
347;-742542.000000000000000;-1043795.000000000000000;0
4678;-742775.910000000149012;-1042839.929999999701977;0
571;-742082.000000000000000;-1043581.000000000000000;0
7945;-742063.179999999701977;-1044077.379999998956919;0
890;-742007.000000000000000;-1042740.000000000000000;0
5326;-742969.850000001490116;-1043038.800000000745058;0
527;-742186.000000000000000;-1043818.000000000000000;0
6766;-741193.449999999254942;-1044424.320000000298023;0
6711;-742266.486000001430511;-1044832.896000001579523;0
2354;-742452.000000000000000;-1045584.000000000000000;0
617;-742179.000000000000000;-1043272.000000000000000;0
4341;-742488.855000000447035;-1043325.412999998778105;0
7318;-742578.910000000149012;-1045033.530000001192093;0
6962;-743011.489999998360872;-1044196.070000000298023;0
3981;-743341.517000000923872;-1043837.353999998420477;0
3657;-744539.449999999254942;-1042640.177999999374151;0
6188;-742312.807999998331070;-1043058.706999998539686;0
1946;-743281.000000000000000;-1044437.000000000000000;0
1992;-743482.000000000000000;-1044954.000000000000000;0
8244;-742617.899999998509884;-1045206.480000000447035;0
1161;-741106.550000000745058;-1044497.769999999552965;0
707;-741897.000000000000000;-1042863.000000000000000;0
7515;-742273.021999999880791;-1044371.543999999761581;0
4162;-742497.193999998271465;-1044160.030000001192093;0
6197;-742313.425000000745058;-1043058.370999999344349;0
1330;-741817.000000000000000;-1044709.000000000000000;0
6701;-742295.142000000923872;-1044533.372000001370907;0
7003;-743074.140000000596046;-1044350.280000001192093;0
3973;-743161.204999998211861;-1043723.574999999254942;0
2473;-743469.000000000000000;-1044899.000000000000000;0
7218;-742534.100000001490116;-1044603.559999998658895;0
873;-741728.000000000000000;-1042672.000000000000000;0
6339;-742245.460000000894070;-1042835.780000001192093;0
4247;-742154.829999998211861;-1043394.660000000149012;0
4771;-742890.828000001609325;-1042889.975000001490116;0
1813;-743118.000000000000000;-1044528.000000000000000;0
4977;-742489.451000001281500;-1042992.394000001251698;0
1548;-742220.000000000000000;-1044216.000000000000000;0
4670;-742810.120000001043081;-1042644.289999999105930;0
4828;-743048.579999998211861;-1042941.179999999701977;0
543;-742361.000000000000000;-1043823.000000000000000;0
3989;-743307.815000001341105;-1044034.914999999105930;0
3090;-743913.418999999761581;-1042804.416999999433756;0
5412;-742582.037000000476837;-1042571.986000001430511;0
8257;-742149.809999998658895;-1045048.399999998509884;0
407;-742340.000000000000000;-1044177.000000000000000;0
3758;-743284.129999998956919;-1042964.100000001490116;0
5513;-743426.734999999403954;-1043606.184000000357628;0
5204;-743246.423999998718500;-1043308.298999998718500;0
7245;-742748.780000001192093;-1044837.699999999254942;0
6190;-742318.782999999821186;-1043068.206000000238419;0
8050;-742206.719999998807907;-1044915.530000001192093;0
3175;-743891.249000001698732;-1042620.519000001251698;0
1461;-741473.000000000000000;-1044266.000000000000000;0
7087;-743339.940000001341105;-1044536.690000001341105;0
1087;-741605.000000000000000;-1044533.000000000000000;0
698;-742041.000000000000000;-1042903.000000000000000;0
1033;-741968.000000000000000;-1044843.000000000000000;0
4709;-742775.800000000745058;-1042600.690000001341105;0
7019;-742585.024999998509884;-1044210.725000001490116;0
5227;-743318.199999999254942;-1043537.510000001639128;0
1874;-743379.000000000000000;-1044247.000000000000000;0
4921;-742444.739999998360872;-1042908.420000001788139;0
1604;-742552.000000000000000;-1044918.000000000000000;0
552;-742259.000000000000000;-1043732.000000000000000;0
2341;-742711.000000000000000;-1045552.000000000000000;0
3393;-743910.969999998807907;-1043143.960000000894070;0
4811;-743040.379999998956919;-1042799.609999999403954;0
4909;-742383.146000001579523;-1042799.159000001847744;0
5113;-742946.795000001788139;-1043444.427999999374151;0
335;-742635.000000000000000;-1043966.000000000000000;0
1922;-743390.000000000000000;-1044308.000000000000000;0
6308;-741823.129999998956919;-1042770.370000001043081;0
4766;-742803.037999998778105;-1042842.532999999821186;0
4326;-742319.855000000447035;-1043419.918999999761581;0
3819;-743120.250000000000000;-1042679.620000001043081;0
6821;-741256.649999998509884;-1044796.100000001490116;0
7736;-742342.260000001639128;-1045113.918000001460314;0
7958;-741664.710000000894070;-1044289.879999998956919;0
6652;-741678.190000001341105;-1044132.780000001192093;0
514;-742119.000000000000000;-1043141.000000000000000;0
909;-742183.000000000000000;-1042503.000000000000000;0
3413;-743776.791000001132488;-1043071.675000000745058;0
1929;-743440.000000000000000;-1044410.000000000000000;0
5014;-742563.771999999880791;-1042993.241999998688698;0
6706;-742275.234999999403954;-1044689.607999999076128;0
4731;-742802.002999998629093;-1042654.546000000089407;0
1455;-741517.000000000000000;-1044468.000000000000000;0
1790;-742152.000000000000000;-1044138.000000000000000;0
7025;-743199.914999999105930;-1044070.515000000596046;0
914;-741715.000000000000000;-1042583.000000000000000;0
6718;-742339.493000000715256;-1044956.921999998390675;0
3985;-743312.765000000596046;-1043928.164999999105930;0
1055;-741747.000000000000000;-1045038.000000000000000;0
6751;-742426.350000001490116;-1044371.070000000298023;0
3998;-743432.704999998211861;-1043914.274999998509884;0
1809;-743160.000000000000000;-1044541.000000000000000;0
6241;-742365.649999998509884;-1043065.059999998658895;0
1261;-742057.000000000000000;-1044894.000000000000000;0
4966;-742377.289999999105930;-1043071.030000001192093;0
5306;-743103.326999999582767;-1043193.129000000655651;0
7166;-742741.322000000625849;-1044519.208999998867512;0
7729;-742623.480999998748302;-1044601.217000000178814;0
2016;-743230.000000000000000;-1044873.000000000000000;0
5222;-743271.000000000000000;-1043543.149999998509884;0
921;-743338.000000000000000;-1043818.000000000000000;0
4847;-742981.100000001490116;-1042831.059999998658895;0
5270;-742989.153999999165535;-1043210.684999998658895;0
1135;-741572.000000000000000;-1044437.000000000000000;0
1167;-741836.000000000000000;-1044429.000000000000000;0
748;-741671.000000000000000;-1042971.000000000000000;0
5370;-742580.300999999046326;-1042977.140999998897314;0
264;-743367.000000000000000;-1043732.000000000000000;0
6662;-741466.800000000745058;-1044192.359999999403954;0
4517;-742638.449999999254942;-1042779.280000001192093;0
6945;-742955.907000001519918;-1043932.182999998331070;0
3530;-744756.230000000447035;-1042672.155999999493361;0
1180;-741935.000000000000000;-1044283.000000000000000;33
694;-742280.000000000000000;-1043043.000000000000000;0
5414;-742582.574999999254942;-1042677.478999998420477;0
1938;-743289.000000000000000;-1044306.000000000000000;0
6789;-741187.510000001639128;-1044470.660000000149012;0
6121;-742069.784000001847744;-1043299.828000001609325;0
1469;-741752.000000000000000;-1044100.000000000000000;0
3109;-743754.403999999165535;-1042652.872000001370907;0
5676;-743406.725999999791384;-1043716.493000000715256;0
810;-741934.000000000000000;-1042519.000000000000000;0
1588;-742390.000000000000000;-1044837.000000000000000;0
4029;-743130.695999998599291;-1043815.427999999374151;0
1654;-741387.000000000000000;-1044621.000000000000000;0
4726;-742863.519999999552965;-1042684.000000000000000;0
2143;-742859.000000000000000;-1045086.000000000000000;0
5434;-744042.467999998480082;-1043135.986999999731779;0
7161;-743056.383000001311302;-1044541.903999999165535;0
4119;-742717.223999999463558;-1043999.837999999523163;0
332;-742645.000000000000000;-1044014.000000000000000;0
4137;-742705.739999998360872;-1044094.100000001490116;0
7186;-742587.609999999403954;-1044726.000000000000000;0
4848;-742977.940000001341105;-1042862.019999999552965;0
7016;-742557.515000000596046;-1044334.074999999254942;0
4755;-742734.960000000894070;-1042778.019999999552965;0
4026;-743178.984999999403954;-1043847.989999998360872;0
737;-741849.000000000000000;-1043021.000000000000000;0
3322;-743927.326000001281500;-1042934.425999999046326;19
1554;-741348.000000000000000;-1044238.000000000000000;0
1402;-741699.000000000000000;-1044419.000000000000000;0
1049;-741795.000000000000000;-1044923.000000000000000;0
1837;-743015.000000000000000;-1044249.000000000000000;0
6116;-742963.905999999493361;-1042886.313000001013279;0
4681;-742756.870000001043081;-1042844.710000000894070;0
6508;-741728.552999999374151;-1044508.050999999046326;0
1343;-741714.000000000000000;-1044765.000000000000000;0
2090;-742923.000000000000000;-1044566.000000000000000;0
4144;-742704.414999999105930;-1043822.484999999403954;0
2093;-742915.000000000000000;-1044642.000000000000000;0
2055;-743425.000000000000000;-1045038.000000000000000;0
6211;-742317.785000000149012;-1043063.318999998271465;0
7961;-741602.260000001639128;-1044314.350000001490116;0
7279;-742799.399999998509884;-1044679.829999998211861;0
2543;-741788.000000000000000;-1044237.000000000000000;0
2582;-741030.372999999672174;-1044607.635000001639128;0
4934;-742433.807000000029802;-1042730.874000001698732;0
1442;-741753.000000000000000;-1044375.000000000000000;0
1954;-743372.000000000000000;-1044497.000000000000000;0
8273;-742057.820000000298023;-1042728.760000001639128;0
4662;-742819.471000000834465;-1042530.037000000476837;0
4120;-742715.179999999701977;-1043974.089999999850988;0
7679;-742498.250000000000000;-1045115.879999998956919;0
7977;-741271.370000001043081;-1044404.390000000596046;0
1372;-742118.000000000000000;-1044815.000000000000000;0
2072;-743043.000000000000000;-1044743.000000000000000;0
1471;-741711.000000000000000;-1044132.000000000000000;0
7992;-741480.739999998360872;-1045117.620000001043081;0
181;-743421.000000000000000;-1043350.000000000000000;0
833;-742050.000000000000000;-1042573.000000000000000;0
4127;-742837.324999999254942;-1044032.670000001788139;0
3305;-743801.410000000149012;-1042874.962999999523163;0
5459;-742368.519000001251698;-1043474.221999999135733;0
297;-742938.000000000000000;-1044069.000000000000000;0
4935;-742447.241999998688698;-1042699.399000000208616;0
236;-743459.000000000000000;-1043775.000000000000000;0
613;-742089.000000000000000;-1043271.000000000000000;0
5307;-743082.182000000029802;-1043190.162000000476837;0
6104;-742208.646999999880791;-1043103.999000001698732;0
7145;-742812.874000001698732;-1044402.199000000953674;0
6173;-742316.787000000476837;-1043067.471000000834465;0
4689;-742688.114999998360872;-1042568.859999999403954;0
670;-742502.000000000000000;-1043239.000000000000000;0
5156;-743160.188999999314547;-1043355.291999999433756;0
6845;-741527.188000001013279;-1044989.557000000029802;0
1753;-742096.000000000000000;-1045195.000000000000000;0
3134;-743932.910999998450279;-1042615.767999999225140;0
3703;-744551.563999999314547;-1042514.760999999940395;0
6151;-742311.114999998360872;-1043061.451000001281500;0
4739;-742751.690000001341105;-1042699.230000000447035;0
7703;-742462.714000001549721;-1044818.045000001788139;0
4083;-742820.771999999880791;-1043708.657000001519918;0
5680;-743402.000000000000000;-1043718.245000001043081;0
727;-742001.000000000000000;-1042962.000000000000000;0
2053;-743404.000000000000000;-1044986.000000000000000;0
4984;-742580.537999998778105;-1043025.210999999195337;0
2135;-743006.000000000000000;-1045119.000000000000000;0
1142;-741437.000000000000000;-1044466.000000000000000;0
7355;-743348.309999998658895;-1045148.329999998211861;0
1003;-741913.000000000000000;-1044580.000000000000000;0
5235;-743350.096000000834465;-1043388.881000000983477;0
3958;-743416.328000001609325;-1043572.265999998897314;0
6007;-743187.807000000029802;-1043302.019000001251698;0
1397;-741771.000000000000000;-1044236.000000000000000;0
1162;-741087.000000000000000;-1044511.000000000000000;0
4214;-742229.274999998509884;-1043511.745000001043081;0
6205;-742314.800000000745058;-1043059.416999999433756;0
5023;-742588.899000000208616;-1042870.296999998390675;0
5241;-743365.063000001013279;-1043245.954999998211861;0
630;-742179.000000000000000;-1043289.000000000000000;0
4424;-742225.300000000745058;-1043033.250000000000000;0
2483;-741266.219999998807907;-1044755.030000001192093;0
3759;-743267.609999999403954;-1042971.300000000745058;0
1937;-743273.000000000000000;-1044318.000000000000000;0
4991;-742675.414999999105930;-1043031.236000001430511;0
1693;-741613.000000000000000;-1044649.000000000000000;76
3810;-743261.510000001639128;-1042802.960000000894070;145
6946;-742974.765000000596046;-1043929.388000000268221;0
281;-743045.000000000000000;-1043848.000000000000000;0
3885;-742418.339999999850988;-1042442.059999998658895;0
4987;-742641.745000001043081;-1043011.309999998658895;0
5238;-743360.410000000149012;-1043296.723999999463558;0
6532;-741593.359999999403954;-1044141.059999998658895;0
3974;-743140.660000000149012;-1043725.350000001490116;0
7248;-742757.960000000894070;-1044826.929999999701977;0
6118;-743652.447000000625849;-1042857.607999999076128;0
1169;-741813.000000000000000;-1044376.000000000000000;0
6176;-742314.491000000387430;-1043063.256000000983477;0
4981;-742536.340999998152256;-1043014.929999999701977;0
1258;-742076.000000000000000;-1044837.000000000000000;0
2138;-742958.000000000000000;-1045095.000000000000000;0
6483;-741773.829999998211861;-1044640.969000000506639;0
2212;-743217.000000000000000;-1045279.000000000000000;0
339;-742606.000000000000000;-1043916.000000000000000;0
2216;-743108.000000000000000;-1045349.000000000000000;0
2049;-743499.000000000000000;-1045071.000000000000000;0
6649;-741731.100000001490116;-1044094.850000001490116;0
1441;-741744.000000000000000;-1044392.000000000000000;0
688;-742284.000000000000000;-1043125.000000000000000;0
6265;-742353.164999999105930;-1043020.054999999701977;0
3944;-743390.002000000327826;-1043413.532999999821186;0
5411;-742776.079999998211861;-1042905.300000000745058;0
4007;-743275.230999998748302;-1044049.184999998658895;0
1651;-741374.000000000000000;-1044519.000000000000000;0
5369;-742583.364999998360872;-1042976.820999998599291;0
4672;-742811.831999998539686;-1042675.907999999821186;0
5223;-743283.699999999254942;-1043535.940000001341105;0
5240;-743364.164000000804663;-1043254.934000000357628;0
6374;-741977.035000000149012;-1042674.153999999165535;0
4003;-743371.839999999850988;-1044053.258999999612570;0
5721;-743418.407999999821186;-1043631.800000000745058;0
1245;-742114.000000000000000;-1044548.000000000000000;0
5293;-743043.969999998807907;-1043208.554000001400709;0
6225;-742314.519999999552965;-1043055.927000001072884;0
5664;-743420.907000001519918;-1043711.245999999344349;0
4671;-742824.179999999701977;-1042687.210000000894070;0
1304;-741810.000000000000000;-1044684.000000000000000;0
6137;-742314.326999999582767;-1043068.837000001221895;0
4853;-742981.855000000447035;-1042884.537000000476837;0
1088;-741617.000000000000000;-1044547.000000000000000;0
2293;-742786.000000000000000;-1045387.000000000000000;0
305;-742837.000000000000000;-1044130.000000000000000;0
4786;-742953.361000001430511;-1042655.886999998241663;0
4717;-742914.300000000745058;-1042625.489999998360872;0
5220;-743247.339999999850988;-1043589.050000000745058;0
678;-742421.000000000000000;-1043181.000000000000000;0
3822;-743065.039999999105930;-1042594.239999998360872;0
1128;-741655.000000000000000;-1044448.000000000000000;0
3976;-743088.861000001430511;-1043707.728000000119209;0
3796;-743161.100000001490116;-1042834.149999998509884;0
5210;-743253.673999998718500;-1043370.440999999642372;0
6728;-742547.451000001281500;-1044392.396000001579523;0
5449;-743124.745000001043081;-1043406.449000000953674;0
5393;-744730.162000000476837;-1042669.394000001251698;0
7160;-743028.010999999940395;-1044543.267999999225140;0
212;-743080.000000000000000;-1043557.000000000000000;0
4322;-742266.414000000804663;-1043213.907999999821186;0
6326;-745069.776999998837709;-1042709.401000000536442;0
1375;-742151.000000000000000;-1044887.000000000000000;0
3183;-743909.289999999105930;-1042546.210000000894070;0
626;-742236.000000000000000;-1043317.000000000000000;0
5682;-743399.638000000268221;-1043719.120999999344349;0
7645;-742305.313000001013279;-1045383.625000000000000;0
1103;-741306.000000000000000;-1044572.000000000000000;0
4777;-742910.034000001847744;-1042759.350999999791384;0
836;-742006.000000000000000;-1042525.000000000000000;0
1196;-741677.000000000000000;-1043894.000000000000000;0
6687;-742383.274000000208616;-1044983.381999999284744;0
4601;-742631.969999998807907;-1042675.629999998956919;0
4638;-742553.631999999284744;-1042542.028000000864267;0
4827;-743046.359999999403954;-1042958.140000000596046;0
5694;-743417.339999999850988;-1043640.361000001430511;0
282;-743034.000000000000000;-1043819.000000000000000;0
4068;-742917.125000000000000;-1043734.535000000149012;0
674;-742463.000000000000000;-1043211.000000000000000;0
6178;-742312.960000000894070;-1043060.445999998599291;0
3159;-743996.506000000983477;-1042545.605000000447035;0
2278;-742791.000000000000000;-1045657.000000000000000;0
266;-743321.000000000000000;-1043735.000000000000000;0
6842;-741574.894000001251698;-1044962.013999998569489;0
5650;-743429.348999999463558;-1043698.318999998271465;0
5224;-743293.449999999254942;-1043542.160000000149012;0
4478;-741867.359999999403954;-1042693.289999999105930;0
6415;-743180.657999999821186;-1043208.993999999016523;0
3572;-744646.515000000596046;-1042584.320000000298023;0
5172;-743274.383999999612570;-1043432.322999998927116;0
1702;-741348.000000000000000;-1044682.000000000000000;0
918;-743437.000000000000000;-1043904.000000000000000;0
4980;-742521.857999999076128;-1043030.853000000119209;0
3179;-743902.603999998420477;-1042607.138999998569489;0
5059;-742853.796000000089407;-1043168.151999998837709;0
5960;-743141.460999999195337;-1043339.964999999850988;0
7086;-743333.149999998509884;-1044527.250000000000000;0
6131;-742311.329999998211861;-1043064.982999999076128;0
3987;-743311.475000001490116;-1043983.175000000745058;0
3832;-743029.390000000596046;-1042595.910000000149012;0
2073;-743069.000000000000000;-1044754.000000000000000;0
622;-742271.000000000000000;-1043302.000000000000000;0
3207;-743687.458999998867512;-1042502.859000001102686;0
3433;-743896.050000000745058;-1042546.662000000476837;0
699;-742067.000000000000000;-1042896.000000000000000;0
283;-743026.000000000000000;-1043788.000000000000000;0
550;-742276.000000000000000;-1043746.000000000000000;0
1472;-741677.000000000000000;-1044145.000000000000000;0
6656;-741590.160000000149012;-1044150.480000000447035;0
5217;-743306.870999999344349;-1043323.228000000119209;0
4834;-742972.708000000566244;-1042657.809000000357628;0
1036;-741961.000000000000000;-1044922.000000000000000;0
4998;-742514.109000001102686;-1042978.602000001817942;0
4774;-742900.078999999910593;-1042854.859000001102686;0
5512;-743426.556000001728535;-1043602.920000001788139;0
2223;-743053.000000000000000;-1045437.000000000000000;0
4787;-742962.412000000476837;-1042621.662000000476837;0
6768;-741255.769999999552965;-1044419.920000001788139;0
4765;-742822.897999998182058;-1042850.499000001698732;0
3585;-744920.065000001341105;-1042522.129999998956919;0
