OID_;X;Y;TEMPERATURE
3614;-744984.548999998718500;-1042283.640999998897314;0
3019;-744463.447999998927116;-1042784.646000001579523;0
3568;-744718.817999999970198;-1042588.614999998360872;0
3692;-744525.876499999314547;-1042540.534000001847744;0
3580;-744924.973999999463558;-1042593.699999999254942;0
2605;-745393.842999998480082;-1042860.796000000089407;0
5975;-745052.346999999135733;-1042674.673000000417233;0
118;-745135.000000000000000;-1042687.000000000000000;0
3542;-744575.274000000208616;-1042656.160000000149012;0
2696;-743477.489999998360872;-1042038.000000000000000;0
2520;-741847.000000000000000;-1045324.000000000000000;0
3066;-744075.627000000327826;-1042883.837000001221895;0
6;-743464.000000000000000;-1042594.000000000000000;0
3216;-743615.890999998897314;-1042451.129999998956919;0
2226;-743057.000000000000000;-1045470.000000000000000;0
3211;-743651.409000001847744;-1042483.458999998867512;0
7716;-743023.190999999642372;-1045843.241999998688698;0
6872;-741751.719999998807907;-1045296.679999999701977;0
7397;-743021.859999999403954;-1045682.989999998360872;0
2760;-743863.331000000238419;-1043483.304000001400709;0
2755;-744003.879000000655651;-1043471.734000001102686;0
1584;-742368.000000000000000;-1044717.000000000000000;0
2404;-742179.000000000000000;-1045467.000000000000000;0
3919;-743904.947000000625849;-1043493.929999999701977;0
3107;-743778.888000000268221;-1042682.131999999284744;0
2255;-743181.000000000000000;-1045372.000000000000000;0
2740;-744042.611999999731779;-1043335.940000001341105;0
2641;-743432.578999999910593;-1042583.418999999761581;0
3268;-743594.046999998390675;-1042721.412999998778105;0
5408;-743696.881000000983477;-1042878.024999998509884;0
6705;-742279.050999999046326;-1044655.923000000417233;0
7217;-742516.318999998271465;-1044582.890000000596046;0
1629;-742450.000000000000000;-1044518.000000000000000;0
1767;-741261.000000000000000;-1044168.000000000000000;0
1760;-741162.000000000000000;-1044101.000000000000000;0
2085;-742426.000000000000000;-1044797.000000000000000;0
2166;-743016.000000000000000;-1045179.000000000000000;0
3233;-744152.962999999523163;-1042686.791999999433756;0
7185;-742600.515000000596046;-1044717.333999998867512;0
7829;-743509.649999998509884;-1045166.399999998509884;0
1267;-742040.000000000000000;-1044999.000000000000000;0
6833;-741571.423000000417233;-1044909.473999999463558;0
7325;-743032.969999998807907;-1045186.298999998718500;0
5405;-744043.826000001281500;-1042674.686000000685453;0
1486;-741150.000000000000000;-1044219.000000000000000;0
1445;-741553.000000000000000;-1044757.000000000000000;0
7174;-742639.019999999552965;-1044564.949999999254942;0
598;-741853.000000000000000;-1043233.000000000000000;0
1332;-741793.000000000000000;-1044755.000000000000000;0
6712;-742273.328000001609325;-1044860.912000000476837;0
8046;-742169.109999999403954;-1044835.660000000149012;0
1524;-741710.000000000000000;-1043844.000000000000000;0
1727;-741495.000000000000000;-1045103.000000000000000;0
1723;-741611.000000000000000;-1045092.000000000000000;0
1699;-741435.000000000000000;-1044671.000000000000000;0
3289;-743584.761999998241663;-1042769.188000001013279;0
1053;-741768.000000000000000;-1045023.000000000000000;0
2017;-743247.000000000000000;-1044884.000000000000000;0
1411;-741639.480000000447035;-1044683.019999999552965;0
1773;-741281.000000000000000;-1043977.000000000000000;0
7183;-742606.379999998956919;-1044692.969999998807907;0
6828;-741465.309999998658895;-1044768.940000001341105;0
2409;-742363.000000000000000;-1045093.000000000000000;0
1562;-743199.000000000000000;-1045122.000000000000000;0
7411;-743529.510000001639128;-1045393.140000000596046;0
727;-742001.000000000000000;-1042962.000000000000000;0
8054;-742230.239999998360872;-1044988.530000001192093;0
6719;-742371.686999998986721;-1044952.227000001817942;0
7020;-743104.175000000745058;-1044078.344999998807907;0
3413;-743776.791000001132488;-1043071.675000000745058;0
6728;-742547.451000001281500;-1044392.396000001579523;0
7212;-742559.410000000149012;-1045073.070000000298023;0
1602;-742507.000000000000000;-1044924.000000000000000;0
1291;-742205.000000000000000;-1044568.000000000000000;0
6835;-741618.964000001549721;-1044934.515000000596046;0
1971;-743385.000000000000000;-1044881.000000000000000;0
2079;-742688.000000000000000;-1044428.000000000000000;0
1355;-741899.000000000000000;-1044858.000000000000000;0
2151;-742827.000000000000000;-1045047.000000000000000;0
8244;-742617.899999998509884;-1045206.480000000447035;0
1674;-741099.000000000000000;-1044736.000000000000000;0
1041;-741893.000000000000000;-1044653.000000000000000;0
6845;-741527.188000001013279;-1044989.557000000029802;0
8257;-742149.809999998658895;-1045048.399999998509884;0
1718;-741366.219999998807907;-1044870.989999998360872;0
1316;-741765.000000000000000;-1044903.000000000000000;0
1324;-741943.000000000000000;-1044994.000000000000000;0
7704;-742256.021000001579523;-1044313.592999998480082;0
5434;-744042.467999998480082;-1043135.986999999731779;0
1315;-741715.000000000000000;-1044867.000000000000000;0
385;-742436.000000000000000;-1043742.000000000000000;0
7143;-742850.414999999105930;-1044473.449999999254942;0
345;-742559.000000000000000;-1043826.000000000000000;0
8079;-742021.839999999850988;-1045292.179999999701977;0
2070;-742993.000000000000000;-1044723.000000000000000;0
2097;-743143.000000000000000;-1044742.000000000000000;0
4156;-742513.734999999403954;-1043978.035000000149012;0
3988;-743309.704999998211861;-1044008.570000000298023;0
1092;-741549.000000000000000;-1044556.000000000000000;0
1250;-742103.000000000000000;-1044672.000000000000000;0
2417;-742421.000000000000000;-1045135.000000000000000;0
7263;-743009.559999998658895;-1044894.379999998956919;0
1303;-741865.000000000000000;-1044692.000000000000000;0
352;-742386.000000000000000;-1043914.000000000000000;0
383;-742450.000000000000000;-1043722.000000000000000;0
4238;-742440.263000000268221;-1043528.236000001430511;0
3096;-743906.309999998658895;-1042750.539999999105930;0
4794;-743065.828999999910593;-1042673.377000000327826;0
465;-741728.000000000000000;-1043309.000000000000000;0
7654;-742242.081000000238419;-1045273.263999998569489;0
6995;-743129.710000000894070;-1044496.579999998211861;0
984;-741917.000000000000000;-1044411.000000000000000;0
2893;-743977.276000000536442;-1043208.923999998718500;0
502;-741901.000000000000000;-1043169.000000000000000;0
7008;-742899.559999998658895;-1044224.074999999254942;0
1521;-741808.000000000000000;-1043917.000000000000000;0
1984;-743476.000000000000000;-1044743.000000000000000;0
2394;-742273.000000000000000;-1045360.000000000000000;0
4500;-742315.239999998360872;-1042719.460000000894070;0
2329;-742432.000000000000000;-1045508.000000000000000;0
335;-742635.000000000000000;-1043966.000000000000000;0
226;-742879.000000000000000;-1043516.000000000000000;0
2050;-743460.000000000000000;-1045072.000000000000000;0
4236;-742406.842999998480082;-1043504.015000000596046;0
4087;-742811.609999999403954;-1043604.190000001341105;0
7153;-742889.646999999880791;-1044547.438000001013279;0
2160;-742849.000000000000000;-1045147.000000000000000;0
2161;-742876.000000000000000;-1045153.000000000000000;0
4174;-742738.230000000447035;-1043763.155000001192093;0
4003;-743371.839999999850988;-1044053.258999999612570;0
7324;-742833.980000000447035;-1044949.109999999403954;0
307;-742781.000000000000000;-1044143.000000000000000;0
884;-741771.000000000000000;-1042776.000000000000000;0
3822;-743065.039999999105930;-1042594.239999998360872;0
8073;-742120.640000000596046;-1045259.500000000000000;0
3847;-743122.146999999880791;-1042525.489999998360872;0
7515;-742273.021999999880791;-1044371.543999999761581;0
3848;-743094.383999999612570;-1042505.245000001043081;0
6726;-742476.517999999225140;-1044410.600000001490116;0
5066;-742827.379000000655651;-1043252.267999999225140;0
5065;-742796.800999999046326;-1043254.010000001639128;0
512;-742063.000000000000000;-1043136.000000000000000;0
3782;-743285.429999999701977;-1042842.460000000894070;0
3163;-743993.758999999612570;-1042530.366000000387430;0
347;-742542.000000000000000;-1043795.000000000000000;0
7652;-742275.046999998390675;-1045497.052000001072884;0
1015;-742126.000000000000000;-1044599.000000000000000;0
1287;-742217.000000000000000;-1044486.000000000000000;0
2378;-742372.000000000000000;-1045503.000000000000000;0
5220;-743247.339999999850988;-1043589.050000000745058;0
734;-741935.000000000000000;-1043014.000000000000000;0
586;-741966.000000000000000;-1043374.000000000000000;0
563;-742155.000000000000000;-1043660.000000000000000;0
208;-743146.000000000000000;-1043573.000000000000000;0
6311;-743930.489999998360872;-1042569.390000000596046;0
6487;-741745.798000000417233;-1044519.414999999105930;0
699;-742067.000000000000000;-1042896.000000000000000;0
6675;-742272.140000000596046;-1044167.469999998807907;0
1932;-743359.000000000000000;-1044408.000000000000000;0
4055;-743119.070000000298023;-1043694.109999999403954;0
1189;-741786.000000000000000;-1044043.000000000000000;0
4826;-743043.850000001490116;-1042979.600000001490116;0
709;-741861.000000000000000;-1042862.000000000000000;0
1376;-742165.000000000000000;-1044873.000000000000000;0
1034;-741964.000000000000000;-1044876.000000000000000;0
1945;-743270.000000000000000;-1044454.000000000000000;0
1256;-742084.000000000000000;-1044787.000000000000000;0
2488;-742083.000000000000000;-1044303.000000000000000;0
7141;-742895.629999998956919;-1044470.910000000149012;0
8263;-742151.089999999850988;-1042702.239999998360872;0
1929;-743440.000000000000000;-1044410.000000000000000;0
1027;-741984.000000000000000;-1044660.000000000000000;0
5206;-743189.870999999344349;-1043360.936000000685453;0
7007;-742923.890000000596046;-1044218.879999998956919;0
6121;-742069.784000001847744;-1043299.828000001609325;0
3812;-743231.179999999701977;-1042815.199999999254942;0
738;-741818.000000000000000;-1043024.000000000000000;0
2211;-743248.000000000000000;-1045258.000000000000000;0
1542;-742043.000000000000000;-1044057.000000000000000;0
4081;-742828.035000000149012;-1043754.850000001490116;0
3756;-743319.230000000447035;-1042949.019999999552965;0
3794;-743091.015000000596046;-1042800.471999999135733;0
1993;-743483.000000000000000;-1044984.000000000000000;0
6003;-742038.201000001281500;-1043299.010999999940395;0
3761;-743202.559999998658895;-1042981.710000000894070;0
1938;-743289.000000000000000;-1044306.000000000000000;0
1101;-741339.000000000000000;-1044568.000000000000000;0
3787;-743130.989999998360872;-1042979.320000000298023;0
2483;-741266.219999998807907;-1044755.030000001192093;0
4896;-742589.649999998509884;-1042838.989999998360872;0
510;-742048.000000000000000;-1043150.000000000000000;0
4341;-742488.855000000447035;-1043325.412999998778105;0
1620;-742439.000000000000000;-1044323.000000000000000;0
2237;-743368.000000000000000;-1045238.000000000000000;0
4426;-742197.589999999850988;-1043031.679999999701977;0
4122;-742732.074999999254942;-1043923.995000001043081;0
2501;-742746.000000000000000;-1045430.000000000000000;0
4128;-742915.039999999105930;-1044041.920000001788139;0
4075;-742947.934999998658895;-1043903.649999998509884;0
5042;-742731.719000000506639;-1042890.517000000923872;0
1239;-742138.000000000000000;-1044401.000000000000000;0
3799;-743117.550000000745058;-1042868.160000000149012;0
1180;-741935.000000000000000;-1044283.000000000000000;0
4996;-742488.458999998867512;-1042974.723999999463558;0
1454;-741521.000000000000000;-1044499.000000000000000;0
4203;-742299.442000001668930;-1043608.692000001668930;0
7966;-741489.800000000745058;-1044356.219999998807907;0
1117;-741066.000000000000000;-1044603.000000000000000;0
1878;-743324.000000000000000;-1044249.000000000000000;0
317;-742464.000000000000000;-1044207.000000000000000;0
6676;-742250.239999998360872;-1044174.719999998807907;0
2035;-743435.000000000000000;-1044802.000000000000000;0
2504;-742757.000000000000000;-1045516.000000000000000;0
395;-742369.000000000000000;-1043840.000000000000000;0
6657;-741565.760000001639128;-1044156.980000000447035;0
1408;-741647.000000000000000;-1044201.000000000000000;0
4079;-742836.170000001788139;-1043800.960000000894070;0
6663;-741457.949999999254942;-1044194.329999998211861;0
2052;-743403.000000000000000;-1045075.000000000000000;0
4047;-743210.230000000447035;-1043992.289999999105930;0
6300;-741836.949999999254942;-1042698.329999998211861;0
1491;-741057.000000000000000;-1044333.000000000000000;0
4770;-742872.535000000149012;-1042899.679000001400709;0
1872;-743422.000000000000000;-1044246.000000000000000;0
2344;-742691.000000000000000;-1045541.000000000000000;0
2558;-741286.000000000000000;-1044387.000000000000000;0
4506;-742419.730000000447035;-1042717.019999999552965;0
4558;-742373.019999999552965;-1042506.949999999254942;0
7120;-743351.160000000149012;-1044618.460000000894070;0
3915;-744021.765999998897314;-1043098.603999998420477;0
6366;-741957.399999998509884;-1042652.609999999403954;0
2285;-742897.000000000000000;-1045467.000000000000000;0
7243;-742724.339999999850988;-1044835.870000001043081;0
5128;-743040.467000000178814;-1043389.765999998897314;0
7027;-743237.269999999552965;-1044095.524999998509884;0
1824;-742963.809999998658895;-1044143.929999999701977;0
8152;-743293.600000001490116;-1043190.510000001639128;0
4223;-742161.556000001728535;-1043473.138999998569489;0
5326;-742969.850000001490116;-1043038.800000000745058;0
2497;-741932.000000000000000;-1044075.000000000000000;0
4074;-742943.350000001490116;-1043880.304999999701977;0
1957;-743402.000000000000000;-1044519.000000000000000;0
8271;-742030.649999998509884;-1042720.129999998956919;0
671;-742489.000000000000000;-1043245.000000000000000;0
5296;-743058.934999998658895;-1043177.035000000149012;0
4641;-742591.151999998837709;-1042559.721000000834465;0
4764;-742839.835999999195337;-1042859.412999998778105;0
4990;-742657.837999999523163;-1043024.199999999254942;0
3369;-743878.633000001311302;-1043011.739000000059605;0
5292;-743055.866000000387430;-1043215.710999999195337;0
6784;-741318.109999999403954;-1044460.920000001788139;0
282;-743034.000000000000000;-1043819.000000000000000;0
4067;-742913.594999998807907;-1043714.640000000596046;0
7282;-742809.410000000149012;-1044693.629999998956919;0
4824;-742918.673000000417233;-1042871.875000000000000;0
5158;-743148.138999998569489;-1043320.254999998956919;0
527;-742186.000000000000000;-1043818.000000000000000;0
6105;-742213.883000001311302;-1043111.734000001102686;0
6219;-742319.168999999761581;-1043064.293999999761581;0
4635;-742575.561999998986721;-1042702.701000001281500;0
554;-742238.000000000000000;-1043717.000000000000000;0
2299;-742592.000000000000000;-1045409.000000000000000;0
621;-742285.000000000000000;-1043282.000000000000000;0
4327;-742333.449000000953674;-1043399.671000000089407;0
2276;-742865.000000000000000;-1045649.000000000000000;0
4129;-742890.405000001192093;-1044048.370000001043081;0
6212;-742317.006000000983477;-1043061.888000000268221;0
6700;-742298.611000001430511;-1044507.315999999642372;0
6152;-742310.348999999463558;-1043060.046999998390675;0
2325;-742559.000000000000000;-1045494.000000000000000;0
835;-741950.000000000000000;-1042513.000000000000000;0
1510;-741764.000000000000000;-1044180.000000000000000;0
4574;-742339.980000000447035;-1042661.570000000298023;0
1425;-742080.000000000000000;-1044210.000000000000000;0
536;-742085.000000000000000;-1043673.000000000000000;0
5026;-742631.168999999761581;-1042903.938999999314547;0
2258;-742974.000000000000000;-1045574.000000000000000;0
2021;-743281.000000000000000;-1044948.000000000000000;0
4741;-742787.859999999403954;-1042715.800000000745058;0
6241;-742365.649999998509884;-1043065.059999998658895;0
6226;-742320.660999998450279;-1043065.366999998688698;0
3951;-743433.379999998956919;-1043586.600000001490116;0
1795;-742155.000000000000000;-1044231.000000000000000;0
7985;-741091.269999999552965;-1044419.039999999105930;0
1458;-741506.000000000000000;-1044384.000000000000000;0
4838;-742981.304999999701977;-1042697.471000000834465;0
4051;-743236.329999998211861;-1043889.710000000894070;0
1906;-743459.000000000000000;-1044325.000000000000000;0
4790;-743036.497999999672174;-1042635.973999999463558;0
7151;-742842.649000000208616;-1044545.307000000029802;0
6103;-742213.102000001817942;-1043103.528999999165535;0
5110;-742876.271999999880791;-1043449.013000000268221;0
1573;-742358.000000000000000;-1044452.000000000000000;0
650;-742263.000000000000000;-1043381.000000000000000;0
1814;-743095.000000000000000;-1044510.000000000000000;0
4951;-742335.579999998211861;-1042934.429999999701977;0
181;-743421.000000000000000;-1043350.000000000000000;0
954;-742231.000000000000000;-1043024.000000000000000;0
6185;-742315.103999998420477;-1043062.923000000417233;0
331;-742664.000000000000000;-1044024.000000000000000;0
216;-743023.000000000000000;-1043539.000000000000000;0
4693;-742691.399999998509884;-1042612.399999998509884;0
4756;-742712.579999998211861;-1042776.829999998211861;0
5686;-743394.912000000476837;-1043720.872000001370907;0
7019;-742585.024999998509884;-1044210.725000001490116;0
6682;-742329.804000001400709;-1044319.611999999731779;0
905;-742312.000000000000000;-1042489.000000000000000;0
6276;-742310.815999999642372;-1043016.000999998301268;0
6278;-742305.421999998390675;-1043028.918000001460314;0
3985;-743312.765000000596046;-1043928.164999999105930;0
265;-743344.000000000000000;-1043735.000000000000000;0
6981;-743063.800000000745058;-1044366.239999998360872;0
694;-742280.000000000000000;-1043043.000000000000000;0
6234;-742324.105000000447035;-1043076.613000001758337;0
6184;-742315.868999999016523;-1043064.326999999582767;0
8283;-742198.600000001490116;-1042801.980000000447035;0
4030;-743133.280000001192093;-1043791.552000001072884;0
7161;-743056.383000001311302;-1044541.903999999165535;0
3098;-743918.111000001430511;-1042753.629000000655651;0
1497;-741332.000000000000000;-1044317.000000000000000;0
1171;-741882.000000000000000;-1044375.000000000000000;0
7088;-743335.559999998658895;-1044546.359999999403954;0
5714;-743423.756000000983477;-1043635.103999998420477;0
276;-743382.000000000000000;-1043905.000000000000000;0
5234;-743348.486000001430511;-1043412.741999998688698;0
4606;-742512.769000001251698;-1042608.333000000566244;0
4998;-742514.109000001102686;-1042978.602000001817942;0
4654;-742797.372999999672174;-1042533.888999998569489;0
705;-741929.000000000000000;-1042865.000000000000000;0
680;-742402.109999999403954;-1043166.679999999701977;0
6146;-742314.942000001668930;-1043068.475999999791384;0
747;-741690.000000000000000;-1043000.000000000000000;0
1293;-742037.000000000000000;-1044462.000000000000000;0
1854;-742675.000000000000000;-1044271.000000000000000;0
5652;-743429.532999999821186;-1043700.732000000774860;0
4677;-742787.309999998658895;-1042797.899999998509884;0
6268;-742340.850000001490116;-1043018.881000000983477;0
5775;-743915.925000000745058;-1042818.550999999046326;0
5654;-743429.644000001251698;-1043703.151000000536442;0
6194;-742315.721000000834465;-1043062.585999999195337;0
4137;-742705.739999998360872;-1044094.100000001490116;0
5239;-743361.096000000834465;-1043279.333999998867512;0
6264;-742357.280000001192093;-1043020.445999998599291;0
4698;-742673.530000001192093;-1042715.780000001192093;0
2546;-741750.000000000000000;-1044271.000000000000000;0
4636;-742576.870999999344349;-1042687.116999998688698;0
3984;-743314.570000000298023;-1043905.594999998807907;0
6217;-742320.725999999791384;-1043067.133999999612570;0
927;-742021.000000000000000;-1043498.000000000000000;0
7041;-743381.004999998956919;-1044158.699999999254942;0
525;-742233.000000000000000;-1043884.000000000000000;0
1702;-741348.000000000000000;-1044682.000000000000000;0
2478;-741241.859999999403954;-1044562.089999999850988;0
266;-743321.000000000000000;-1043735.000000000000000;0
6090;-742012.260000001639128;-1043497.300000000745058;0
1840;-742984.379999998956919;-1044155.149999998509884;0
4178;-742382.640000000596046;-1044160.138000000268221;0
3950;-743426.829999998211861;-1043556.070000000298023;0
7171;-742671.969999998807907;-1044508.219999998807907;0
1405;-741681.000000000000000;-1044325.000000000000000;0
5177;-743336.440999999642372;-1043440.883999999612570;0
635;-742143.000000000000000;-1043317.000000000000000;0
6139;-742312.807000000029802;-1043066.006000000983477;0
583;-741975.000000000000000;-1043434.000000000000000;0
1026;-741986.000000000000000;-1044631.000000000000000;0
1966;-743413.000000000000000;-1044746.000000000000000;0
4131;-742844.625000000000000;-1044059.980000000447035;0
6134;-742309.011999998241663;-1043060.703000001609325;0
5221;-743263.820000000298023;-1043556.920000001788139;0
4766;-742803.037999998778105;-1042842.532999999821186;0
4807;-743122.570000000298023;-1042767.850000001490116;0
5664;-743420.907000001519918;-1043711.245999999344349;0
1088;-741617.000000000000000;-1044547.000000000000000;0
5416;-742963.127999998629093;-1042713.598000001162291;0
1522;-741841.000000000000000;-1043893.000000000000000;0
6225;-742314.519999999552965;-1043055.927000001072884;0
5653;-743429.589999999850988;-1043701.940999999642372;0
625;-742247.000000000000000;-1043299.000000000000000;0
1305;-741826.000000000000000;-1044678.000000000000000;0
2271;-742945.000000000000000;-1045771.000000000000000;0
842;-742101.000000000000000;-1042521.000000000000000;0
4460;-742216.600000001490116;-1042598.850000001490116;0
1865;-743458.000000000000000;-1044233.000000000000000;0
873;-741728.000000000000000;-1042672.000000000000000;0
4212;-742205.245000001043081;-1043548.410000000149012;0
248;-743439.000000000000000;-1043748.000000000000000;0
6208;-742320.098000001162291;-1043067.458999998867512;0
6179;-742312.195000000298023;-1043059.041000001132488;0
2547;-741724.000000000000000;-1044282.000000000000000;0
8019;-741972.039999999105930;-1044557.089999999850988;0
6361;-742016.024999998509884;-1042677.243999999016523;0
4607;-742508.469999998807907;-1042623.089000001549721;0
5212;-743283.975000001490116;-1043373.589999999850988;0
5767;-742424.269999999552965;-1042581.609000001102686;0
2215;-743135.000000000000000;-1045335.000000000000000;0
4482;-741768.079999998211861;-1042606.449999999254942;0
2498;-741906.000000000000000;-1044040.000000000000000;0
4925;-742455.502000000327826;-1042923.307000000029802;0
1131;-741643.000000000000000;-1044433.000000000000000;0
6214;-742315.447999998927116;-1043059.026000000536442;0
4463;-742198.989999998360872;-1042569.030000001192093;0
5265;-743188.572999998927116;-1043226.513999998569489;0
6199;-742319.442000001668930;-1043067.822999998927116;0
692;-742292.000000000000000;-1043084.000000000000000;0
4511;-742539.859999999403954;-1042744.070000000298023;0
4086;-742813.079999998211861;-1043631.730000000447035;0
2537;-741975.000000000000000;-1044131.000000000000000;0
5230;-743335.399999998509884;-1043517.670000001788139;0
3308;-743813.059999998658895;-1042830.515000000596046;0
1402;-741699.000000000000000;-1044419.000000000000000;0
5195;-743232.432999998331070;-1043297.890999998897314;0
4958;-742349.620000001043081;-1043004.539999999105930;0
783;-741695.000000000000000;-1042663.000000000000000;0
270;-743230.000000000000000;-1043721.000000000000000;0
2301;-742533.000000000000000;-1045416.000000000000000;0
5112;-742942.920000001788139;-1043441.850000001490116;0
5462;-742498.728999998420477;-1042986.947000000625849;0
3325;-743911.068999998271465;-1042947.052000001072884;0
4904;-742460.050000000745058;-1042796.739999998360872;0
3364;-743855.184999998658895;-1043024.940000001341105;0
5144;-743052.642000000923872;-1043488.940000001341105;0
5409;-743745.201000001281500;-1042902.750000000000000;0
4479;-741782.780000001192093;-1042660.359999999403954;0
6209;-742319.320000000298023;-1043066.114999998360872;0
6267;-742344.767999999225140;-1043019.272999998182058;0
628;-742217.370000001043081;-1043308.559999998658895;0
7000;-743096.190000001341105;-1044426.870000001043081;0
7004;-743069.289999999105930;-1044326.469999998807907;0
1985;-743478.000000000000000;-1044769.000000000000000;0
2543;-741788.000000000000000;-1044237.000000000000000;0
1538;-741948.000000000000000;-1043973.000000000000000;0
4926;-742452.660000000149012;-1042896.190000001341105;0
221;-742951.000000000000000;-1043544.000000000000000;0
6294;-742653.550000000745058;-1042686.140000000596046;0
4716;-742893.160000000149012;-1042622.780000001192093;0
743;-741682.000000000000000;-1043020.000000000000000;0
1185;-741822.000000000000000;-1044095.000000000000000;0
4798;-743028.991999998688698;-1042693.375000000000000;0
618;-742203.000000000000000;-1043272.000000000000000;0
4729;-742855.690000001341105;-1042695.640000000596046;0
7035;-743299.831999998539686;-1044176.241999998688698;0
5729;-743420.103000000119209;-1043638.901000000536442;0
4599;-742625.879999998956919;-1042698.820000000298023;0
1704;-741289.000000000000000;-1044690.000000000000000;0
5503;-743427.870000001043081;-1043698.647999998182058;0
4639;-742567.399999998509884;-1042548.592999998480082;0
4965;-742383.620000001043081;-1043057.500000000000000;0
5236;-743352.302000001072884;-1043362.752000000327826;0
682;-742380.000000000000000;-1043151.000000000000000;0
908;-742211.000000000000000;-1042501.000000000000000;0
875;-741783.000000000000000;-1042677.000000000000000;0
5121;-742889.114000000059605;-1043362.250000000000000;0
3832;-743029.390000000596046;-1042595.910000000149012;0
3887;-742347.760000001639128;-1042449.881000000983477;0
5685;-743396.092999998480082;-1043720.434000000357628;0
7170;-742667.579999998211861;-1044492.469999998807907;0
3948;-743409.451999999582767;-1043515.662000000476837;0
2563;-741065.000000000000000;-1044421.000000000000000;0
2505;-742762.000000000000000;-1045562.000000000000000;0
4778;-742918.024999998509884;-1042786.565000001341105;0
1118;-741807.000000000000000;-1044459.000000000000000;0
6233;-742319.057000000029802;-1043072.162999998778105;0
5459;-742368.519000001251698;-1043474.221999999135733;0
1494;-741173.000000000000000;-1044326.000000000000000;0
1327;-742001.000000000000000;-1045024.000000000000000;0
3979;-743340.934999998658895;-1043779.414999999105930;0
1496;-741253.000000000000000;-1044321.000000000000000;0
833;-742050.000000000000000;-1042573.000000000000000;0
5683;-743398.456000000238419;-1043719.557999998331070;0
1499;-741413.000000000000000;-1044304.000000000000000;0
6123;-743427.453000001609325;-1043603.083000000566244;0
6186;-742314.337999999523163;-1043061.517000000923872;0
6164;-742316.155999999493361;-1043067.784000001847744;0
4827;-743046.359999999403954;-1042958.140000000596046;0
1706;-741225.800000000745058;-1044698.800000000745058;0
6126;-743428.385999999940395;-1043621.800000000745058;0
4617;-742561.250999998301268;-1042668.140000000596046;0
7982;-741163.039999999105930;-1044413.210000000894070;0
5663;-743422.087999999523163;-1043710.807999998331070;0
5657;-743429.199999999254942;-1043706.837999999523163;0
2223;-743053.000000000000000;-1045437.000000000000000;0
5955;-742960.732999999076128;-1043520.888999998569489;0
6223;-742316.076000001281500;-1043058.679000001400709;0
5687;-743415.142000000923872;-1043630.285999998450279;0
548;-742297.000000000000000;-1043762.000000000000000;0
6242;-742366.677999999374151;-1043062.949000000953674;0
6213;-742316.227000001817942;-1043060.478999998420477;0
4742;-742822.300000000745058;-1042747.920000001788139;0
4774;-742900.078999999910593;-1042854.859000001102686;0
4714;-742856.359999999403954;-1042618.210000000894070;0
6127;-742314.456000000238419;-1043070.548999998718500;0
4251;-742136.420000001788139;-1043379.969999998807907;0
4953;-742431.500999998301268;-1043027.399999998509884;0
6171;-742310.780999999493361;-1043057.971000000834465;0
693;-742284.000000000000000;-1043062.000000000000000;0
7967;-741508.109999999403954;-1044369.239999998360872;0
4762;-742854.192000001668930;-1042825.931000001728535;0
1426;-742056.000000000000000;-1044228.000000000000000;0
6450;-743166.964999999850988;-1043776.383999999612570;0
5516;-743427.133000001311302;-1043615.250999998301268;0
