OID_;X;Y;TEMPERATURE
3614;-744984.548999998718500;-1042283.640999998897314;0
110;-744127.000000000000000;-1042724.000000000000000;3
3019;-744463.447999998927116;-1042784.646000001579523;0
3568;-744718.817999999970198;-1042588.614999998360872;0
3692;-744525.876499999314547;-1042540.534000001847744;0
3580;-744924.973999999463558;-1042593.699999999254942;0
2605;-745393.842999998480082;-1042860.796000000089407;0
5975;-745052.346999999135733;-1042674.673000000417233;0
118;-745135.000000000000000;-1042687.000000000000000;0
7911;-743564.839999999850988;-1045408.649999998509884;0
3542;-744575.274000000208616;-1042656.160000000149012;0
2696;-743477.489999998360872;-1042038.000000000000000;0
3919;-743904.947000000625849;-1043493.929999999701977;0
2520;-741847.000000000000000;-1045324.000000000000000;0
7011;-742831.309999998658895;-1044257.245000001043081;0
1760;-741162.000000000000000;-1044101.000000000000000;0
7780;-743046.243000000715256;-1045844.168999999761581;0
4070;-742925.285000000149012;-1043783.565000001341105;0
1728;-741473.000000000000000;-1045087.000000000000000;0
2386;-742139.000000000000000;-1045460.000000000000000;0
6946;-742974.765000000596046;-1043929.388000000268221;0
2262;-742999.000000000000000;-1045686.000000000000000;0
2319;-742734.000000000000000;-1045474.000000000000000;0
3795;-743173.190000001341105;-1042842.170000001788139;0
8079;-742021.839999999850988;-1045292.179999999701977;0
2277;-742826.000000000000000;-1045653.000000000000000;0
3206;-743702.239000000059605;-1042499.019000001251698;0
7514;-742304.866000000387430;-1044375.124000001698732;0
2315;-742854.000000000000000;-1045460.000000000000000;0
2524;-742108.000000000000000;-1044191.000000000000000;0
6589;-741303.679999999701977;-1043901.390000000596046;0
1970;-743380.000000000000000;-1044854.000000000000000;0
1486;-741150.000000000000000;-1044219.000000000000000;0
6874;-741789.789999999105930;-1045272.100000001490116;0
3783;-743211.559999998658895;-1042920.120000001043081;0
2322;-742651.000000000000000;-1045483.000000000000000;0
1320;-741870.000000000000000;-1044957.000000000000000;0
4089;-742812.844999998807907;-1043560.114999998360872;0
7829;-743509.649999998509884;-1045166.399999998509884;0
7026;-743217.644999999552965;-1044082.329999998211861;0
1584;-742368.000000000000000;-1044717.000000000000000;0
467;-741757.000000000000000;-1043352.000000000000000;0
2186;-743184.000000000000000;-1045146.000000000000000;0
2309;-742322.000000000000000;-1045519.000000000000000;0
2150;-742812.000000000000000;-1045054.000000000000000;0
7279;-742799.399999998509884;-1044679.829999998211861;0
2156;-742796.000000000000000;-1045184.000000000000000;0
1334;-741769.000000000000000;-1044799.000000000000000;0
2050;-743460.000000000000000;-1045072.000000000000000;0
7157;-742964.840999998152256;-1044545.681000001728535;0
6573;-741294.089999999850988;-1044091.679999999701977;0
1020;-742293.000000000000000;-1044615.000000000000000;0
1698;-741464.000000000000000;-1044668.000000000000000;0
1171;-741882.000000000000000;-1044375.000000000000000;0
7019;-742585.024999998509884;-1044210.725000001490116;0
651;-742490.000000000000000;-1043564.000000000000000;0
6722;-742357.717000000178814;-1044705.708000000566244;0
4055;-743119.070000000298023;-1043694.109999999403954;0
1790;-742152.000000000000000;-1044138.000000000000000;0
6726;-742476.517999999225140;-1044410.600000001490116;0
1250;-742103.000000000000000;-1044672.000000000000000;0
4163;-742487.695000000298023;-1044138.535000000149012;0
696;-742077.000000000000000;-1042913.000000000000000;0
7215;-742484.320000000298023;-1044546.620000001043081;0
1987;-743480.000000000000000;-1044820.000000000000000;0
1309;-741611.000000000000000;-1044813.000000000000000;0
7181;-742612.239999998360872;-1044670.160000000149012;0
502;-741901.000000000000000;-1043169.000000000000000;0
2060;-742659.000000000000000;-1044472.000000000000000;0
384;-742471.000000000000000;-1043766.000000000000000;0
7146;-742819.425000000745058;-1044426.225000001490116;0
7136;-742914.329999998211861;-1044374.469999998807907;0
7654;-742242.081000000238419;-1045273.263999998569489;0
7015;-742554.570000000298023;-1044360.725000001490116;0
2373;-742469.000000000000000;-1045517.000000000000000;0
7171;-742671.969999998807907;-1044508.219999998807907;0
1287;-742217.000000000000000;-1044486.000000000000000;0
1658;-741404.000000000000000;-1044751.000000000000000;0
1530;-741753.000000000000000;-1043814.000000000000000;0
7644;-742295.089000001549721;-1045373.164999999105930;0
6473;-741931.359999999403954;-1044555.109999999403954;0
2098;-743134.000000000000000;-1044763.000000000000000;0
516;-742160.000000000000000;-1043135.000000000000000;0
3109;-743754.403999999165535;-1042652.872000001370907;0
785;-741702.000000000000000;-1042622.000000000000000;0
6825;-741380.010000001639128;-1044780.089999999850988;0
6930;-742046.030000001192093;-1045191.489999998360872;0
728;-741997.000000000000000;-1042918.000000000000000;0
5011;-742644.307999998331070;-1042994.813999999314547;0
8152;-743293.600000001490116;-1043190.510000001639128;0
6794;-741124.372999999672174;-1044792.221000000834465;0
281;-743045.000000000000000;-1043848.000000000000000;0
1307;-741803.000000000000000;-1044663.000000000000000;178
2018;-743244.000000000000000;-1044909.000000000000000;0
5244;-743361.021000001579523;-1043374.999000001698732;0
8263;-742151.089999999850988;-1042702.239999998360872;0
1298;-741964.000000000000000;-1044736.000000000000000;0
6853;-741548.899000000208616;-1045052.295000001788139;0
1463;-741933.000000000000000;-1043968.000000000000000;0
1360;-741983.000000000000000;-1044900.000000000000000;0
4557;-742381.019999999552965;-1042528.550000000745058;0
4019;-743157.434999998658895;-1043897.410000000149012;0
7259;-742935.280000001192093;-1044869.829999998211861;0
2892;-744005.317000001668930;-1043204.537000000476837;0
730;-741948.000000000000000;-1042998.000000000000000;0
1496;-741253.000000000000000;-1044321.000000000000000;0
1912;-743461.000000000000000;-1044430.000000000000000;0
3281;-743629.340999998152256;-1042825.692000001668930;0
3372;-743823.475000001490116;-1043010.432999998331070;0
4227;-742108.530000001192093;-1043326.289999999105930;0
350;-742505.000000000000000;-1043757.000000000000000;0
7187;-742595.019999999552965;-1044739.962000001221895;0
739;-741789.000000000000000;-1043028.000000000000000;0
5434;-744042.467999998480082;-1043135.986999999731779;0
885;-741739.000000000000000;-1042777.000000000000000;0
510;-742048.000000000000000;-1043150.000000000000000;373
4332;-742410.359000001102686;-1043282.916000001132488;0
6838;-741701.057999998331070;-1044977.087000001221895;0
1823;-742973.000000000000000;-1044174.000000000000000;0
2535;-742042.000000000000000;-1044071.000000000000000;0
7151;-742842.649000000208616;-1044545.307000000029802;0
6842;-741574.894000001251698;-1044962.013999998569489;0
1961;-743397.000000000000000;-1044642.000000000000000;0
2073;-743069.000000000000000;-1044754.000000000000000;0
1920;-743384.000000000000000;-1044363.000000000000000;0
755;-741668.000000000000000;-1042700.000000000000000;0
1214;-742064.000000000000000;-1044358.000000000000000;0
3811;-743244.620000001043081;-1042809.420000001788139;0
3322;-743927.326000001281500;-1042934.425999999046326;0
5068;-742837.162999998778105;-1043263.965999998152256;0
3760;-743233.829999998211861;-1042978.739999998360872;0
5292;-743055.866000000387430;-1043215.710999999195337;0
1411;-741639.480000000447035;-1044683.019999999552965;0
1228;-742220.539999999105930;-1044250.829999998211861;0
4208;-742372.416999999433756;-1043503.423000000417233;0
5169;-743240.785000000149012;-1043411.081999998539686;0
6114;-742234.250000000000000;-1043361.324999999254942;0
3314;-743758.675999999046326;-1042905.688999999314547;0
4858;-742955.339999999850988;-1042963.960000000894070;0
1473;-741642.000000000000000;-1044158.000000000000000;0
4212;-742205.245000001043081;-1043548.410000000149012;0
7246;-742736.730000000447035;-1044825.399999998509884;0
2242;-743321.000000000000000;-1045313.000000000000000;0
5265;-743188.572999998927116;-1043226.513999998569489;0
3066;-744075.627000000327826;-1042883.837000001221895;0
5067;-742813.465999998152256;-1043267.335999999195337;0
542;-742367.629999998956919;-1043814.379999998956919;0
4144;-742704.414999999105930;-1043822.484999999403954;0
8284;-742219.410000000149012;-1042809.500000000000000;0
338;-742602.000000000000000;-1043933.000000000000000;0
1468;-741778.000000000000000;-1044082.000000000000000;0
888;-741994.000000000000000;-1042797.000000000000000;0
5156;-743160.188999999314547;-1043355.291999999433756;0
5112;-742942.920000001788139;-1043441.850000001490116;0
1628;-742449.000000000000000;-1044494.000000000000000;0
2488;-742083.000000000000000;-1044303.000000000000000;0
678;-742421.000000000000000;-1043181.000000000000000;0
4995;-742476.986000001430511;-1042961.239000000059605;0
2138;-742958.000000000000000;-1045095.000000000000000;0
1476;-741531.000000000000000;-1044196.000000000000000;0
7201;-742571.190000001341105;-1044939.320000000298023;0
1286;-742221.460000000894070;-1044465.969999998807907;0
204;-743208.000000000000000;-1043588.000000000000000;0
2131;-743073.000000000000000;-1045134.000000000000000;0
7958;-741664.710000000894070;-1044289.879999998956919;0
578;-742023.000000000000000;-1043464.000000000000000;0
7087;-743339.940000001341105;-1044536.690000001341105;0
1865;-743458.000000000000000;-1044233.000000000000000;0
8062;-742311.170000001788139;-1045127.960000000894070;0
2222;-743058.000000000000000;-1045420.000000000000000;0
8244;-742617.899999998509884;-1045206.480000000447035;0
7745;-742933.037000000476837;-1045523.714999999850988;0
8052;-742218.929999999701977;-1044953.719999998807907;0
1926;-743301.000000000000000;-1044321.000000000000000;0
2221;-743076.000000000000000;-1045412.000000000000000;0
3426;-743729.493999999016523;-1043061.420000001788139;0
7696;-742416.806000001728535;-1045134.280000001192093;0
1706;-741225.800000000745058;-1044698.800000000745058;0
2172;-742886.000000000000000;-1045182.000000000000000;0
7933;-743544.570000000298023;-1044950.370000001043081;0
6960;-743030.260000001639128;-1044242.870000001043081;0
1130;-741624.000000000000000;-1044446.000000000000000;0
4336;-742416.888999998569489;-1043431.418000001460314;0
592;-741913.000000000000000;-1043311.000000000000000;0
6607;-741674.456000000238419;-1043925.333999998867512;0
7967;-741508.109999999403954;-1044369.239999998360872;0
1666;-741017.000000000000000;-1044315.000000000000000;0
4653;-742788.747999999672174;-1042524.557000000029802;0
7022;-743155.660000000149012;-1044074.410000000149012;0
4822;-742945.579999998211861;-1042879.910000000149012;0
1552;-741351.000000000000000;-1044295.000000000000000;0
1293;-742037.000000000000000;-1044462.000000000000000;0
6719;-742371.686999998986721;-1044952.227000001817942;0
1255;-742077.000000000000000;-1044770.000000000000000;0
877;-741951.000000000000000;-1042610.000000000000000;0
6849;-741635.855999998748302;-1045019.947999998927116;0
672;-742484.000000000000000;-1043226.000000000000000;0
8047;-742167.649999998509884;-1044854.320000000298023;0
4996;-742488.458999998867512;-1042974.723999999463558;0
2748;-743933.984000001102686;-1043445.734000001102686;0
551;-742269.000000000000000;-1043755.000000000000000;0
1813;-743118.000000000000000;-1044528.000000000000000;0
4023;-743246.635000001639128;-1043864.364999998360872;0
1187;-741805.000000000000000;-1044071.000000000000000;0
81;-744074.000000000000000;-1043369.000000000000000;0
6363;-742027.344999998807907;-1042665.324000000953674;0
3839;-743112.140000000596046;-1042558.280000001192093;0
6240;-742364.495999999344349;-1043067.289999999105930;0
6365;-741979.230000000447035;-1042656.230000000447035;0
561;-742172.000000000000000;-1043675.000000000000000;0
625;-742247.000000000000000;-1043299.000000000000000;0
4169;-742414.420000001788139;-1043962.329999998211861;0
5724;-743422.230999998748302;-1043632.715999998152256;0
7369;-743236.822000000625849;-1045458.699000000953674;0
4646;-742694.853000000119209;-1042535.625999998301268;0
5993;-743947.829999998211861;-1042646.350000001490116;0
2433;-742514.000000000000000;-1045081.000000000000000;0
1951;-743289.000000000000000;-1044491.000000000000000;0
6001;-742006.079999998211861;-1043292.300000000745058;0
4899;-742534.420000001788139;-1042820.899999998509884;0
3168;-743928.910000000149012;-1042570.219999998807907;0
7033;-743303.864999998360872;-1044132.750000000000000;0
6243;-742367.739999998360872;-1043061.098000001162291;0
6979;-743081.460000000894070;-1044413.079999998211861;0
5775;-743915.925000000745058;-1042818.550999999046326;0
1107;-741239.260000001639128;-1044580.940000001341105;0
1617;-742384.000000000000000;-1044407.000000000000000;0
2456;-741013.000000000000000;-1044501.000000000000000;0
4114;-742764.195000000298023;-1044131.760000001639128;0
4118;-742725.980000000447035;-1044022.765000000596046;0
1652;-741379.000000000000000;-1044550.000000000000000;0
4079;-742836.170000001788139;-1043800.960000000894070;0
3958;-743416.328000001609325;-1043572.265999998897314;0
1094;-741513.000000000000000;-1044561.000000000000000;0
527;-742186.000000000000000;-1043818.000000000000000;0
713;-741800.000000000000000;-1042859.000000000000000;0
5136;-742992.278000000864267;-1043472.440000001341105;0
695;-742207.000000000000000;-1043019.000000000000000;0
4667;-742823.039999999105930;-1042631.620000001043081;0
1808;-743187.000000000000000;-1044539.000000000000000;0
1828;-743007.000000000000000;-1044088.000000000000000;0
3269;-743600.679000001400709;-1042731.660000000149012;0
3346;-743958.802000001072884;-1043049.741000000387430;0
1333;-741781.000000000000000;-1044777.000000000000000;0
4746;-742867.769999999552965;-1042768.570000000298023;0
4673;-742811.420000001788139;-1042756.050000000745058;0
1414;-741627.000000000000000;-1044593.000000000000000;0
5684;-743397.274000000208616;-1043719.995999999344349;0
4949;-742369.969999998807907;-1042973.199999999254942;0
5582;-743410.127000000327826;-1043640.197999998927116;0
4726;-742863.519999999552965;-1042684.000000000000000;0
4062;-742830.460000000894070;-1043654.920000001788139;0
1269;-742246.000000000000000;-1044462.000000000000000;0
6132;-742310.590999998152256;-1043063.552999999374151;0
7161;-743056.383000001311302;-1044541.903999999165535;0
2214;-743162.000000000000000;-1045316.000000000000000;0
4054;-743269.304999999701977;-1043797.405000001192093;0
6458;-743360.644999999552965;-1043919.311999998986721;0
1819;-743034.000000000000000;-1044350.000000000000000;0
825;-742171.000000000000000;-1042598.000000000000000;0
6197;-742313.425000000745058;-1043058.370999999344349;0
1524;-741710.000000000000000;-1043844.000000000000000;0
236;-743459.000000000000000;-1043775.000000000000000;0
3304;-743786.739000000059605;-1042873.728999998420477;0
7045;-743400.745000001043081;-1044160.004999998956919;0
6337;-742257.140000000596046;-1042864.820000000298023;0
4125;-742857.695000000298023;-1044110.460000000894070;0
5666;-743418.543999999761581;-1043712.120000001043081;0
2547;-741724.000000000000000;-1044282.000000000000000;0
4309;-742042.329999998211861;-1043492.329999998211861;0
4218;-742263.436999998986721;-1043615.100999999791384;0
1182;-741915.000000000000000;-1044252.000000000000000;0
598;-741853.000000000000000;-1043233.000000000000000;0
2028;-743371.000000000000000;-1045054.000000000000000;0
1148;-741324.000000000000000;-1044481.000000000000000;0
4499;-742338.899999998509884;-1042707.250000000000000;0
985;-741823.000000000000000;-1044444.000000000000000;0
7698;-742389.168000001460314;-1044818.684000000357628;0
4851;-742991.500000000000000;-1042818.243000000715256;0
3804;-743040.109999999403954;-1042895.410000000149012;0
4826;-743043.850000001490116;-1042979.600000001490116;0
4002;-743397.818999998271465;-1044054.317999999970198;0
1267;-742040.000000000000000;-1044999.000000000000000;0
4075;-742947.934999998658895;-1043903.649999998509884;0
7050;-743438.070999998599291;-1044185.932000000029802;0
5653;-743429.589999999850988;-1043701.940999999642372;0
2546;-741750.000000000000000;-1044271.000000000000000;0
522;-742261.000000000000000;-1043122.000000000000000;0
744;-741666.000000000000000;-1042994.000000000000000;0
1937;-743273.000000000000000;-1044318.000000000000000;0
4430;-742235.070000000298023;-1043092.839999999850988;0
1395;-741799.000000000000000;-1044291.000000000000000;0
6221;-742317.633000001311302;-1043061.541000001132488;0
4502;-742349.309999998658895;-1042718.199999999254942;0
1464;-741899.000000000000000;-1043994.000000000000000;0
2197;-743331.000000000000000;-1045189.000000000000000;0
306;-742809.000000000000000;-1044137.000000000000000;0
261;-743429.000000000000000;-1043723.000000000000000;0
4795;-743049.835000000894070;-1042669.013000000268221;0
4612;-742515.302000001072884;-1042595.046999998390675;0
1133;-741604.000000000000000;-1044433.000000000000000;0
680;-742402.109999999403954;-1043166.679999999701977;0
5223;-743283.699999999254942;-1043535.940000001341105;0
4896;-742589.649999998509884;-1042838.989999998360872;0
5203;-743386.346000000834465;-1043274.958000000566244;0
1984;-743476.000000000000000;-1044743.000000000000000;0
1533;-741832.000000000000000;-1043879.000000000000000;0
6154;-742316.324000000953674;-1043069.546000000089407;0
394;-742405.000000000000000;-1043863.000000000000000;0
6395;-742057.429999999701977;-1042500.809999998658895;0
4787;-742962.412000000476837;-1042621.662000000476837;0
3847;-743122.146999999880791;-1042525.489999998360872;0
5307;-743082.182000000029802;-1043190.162000000476837;0
381;-742465.000000000000000;-1043700.000000000000000;0
5322;-743060.379999998956919;-1043029.589999999850988;0
4928;-742444.890000000596046;-1042854.899999998509884;0
406;-742366.000000000000000;-1044171.000000000000000;0
219;-742979.000000000000000;-1043549.000000000000000;0
408;-742317.000000000000000;-1044182.000000000000000;0
4778;-742918.024999998509884;-1042786.565000001341105;0
4965;-742383.620000001043081;-1043057.500000000000000;0
845;-742126.000000000000000;-1042505.000000000000000;0
4838;-742981.304999999701977;-1042697.471000000834465;0
7014;-742650.170000001788139;-1044305.010000001639128;0
3990;-743339.489999998360872;-1043987.234999999403954;0
6693;-742248.197000000625849;-1044816.127000000327826;0
5737;-743412.636999998241663;-1043691.631000000983477;0
1394;-741822.000000000000000;-1044310.000000000000000;0
4615;-742527.811000000685453;-1042658.600999999791384;0
6203;-742316.357000000774860;-1043062.256000000983477;0
1129;-741672.000000000000000;-1044438.000000000000000;0
4222;-742187.096999999135733;-1043485.890000000596046;0
4140;-742831.635999999940395;-1044004.828999999910593;0
2575;-742484.000000000000000;-1045453.000000000000000;0
4674;-742806.475999999791384;-1042703.594999998807907;0
4703;-742697.859000001102686;-1042783.011999998241663;0
4963;-742396.510000001639128;-1043031.829999998211861;0
6152;-742310.348999999463558;-1043060.046999998390675;0
2576;-742487.000000000000000;-1045483.000000000000000;0
5597;-743414.056000001728535;-1043680.309000000357628;0
1012;-742060.000000000000000;-1044582.000000000000000;0
6233;-742319.057000000029802;-1043072.162999998778105;0
7983;-741127.800000000745058;-1044416.199999999254942;0
3801;-743091.350000001490116;-1042882.719999998807907;0
5682;-743399.638000000268221;-1043719.120999999344349;0
3262;-743572.423999998718500;-1042699.197000000625849;0
6351;-741874.269999999552965;-1042706.859999999403954;0
1169;-741813.000000000000000;-1044376.000000000000000;0
4774;-742900.078999999910593;-1042854.859000001102686;0
526;-742209.000000000000000;-1043849.000000000000000;0
1;-743520.000000000000000;-1042472.000000000000000;0
1299;-741943.000000000000000;-1044719.000000000000000;0
6216;-742313.892000000923872;-1043056.272999998182058;0
826;-742191.000000000000000;-1042616.000000000000000;0
1458;-741506.000000000000000;-1044384.000000000000000;0
1557;-741193.000000000000000;-1044306.000000000000000;0
3178;-743875.403999999165535;-1042614.289999999105930;0
4764;-742839.835999999195337;-1042859.412999998778105;0
1404;-741692.000000000000000;-1044355.000000000000000;0
4920;-742444.449999999254942;-1042928.980000000447035;0
5755;-743415.670000001788139;-1043702.254000000655651;0
6689;-742384.449999999254942;-1045033.609999999403954;0
5280;-743058.660000000149012;-1043362.201999999582767;0
7041;-743381.004999998956919;-1044158.699999999254942;0
6293;-742666.339999999850988;-1042695.188999999314547;0
2084;-742447.000000000000000;-1044797.000000000000000;0
6232;-742316.034000001847744;-1043057.000000000000000;0
1392;-742104.000000000000000;-1045067.000000000000000;0
3985;-743312.765000000596046;-1043928.164999999105930;0
4126;-742851.335000000894070;-1044085.449999999254942;0
3888;-742331.469999998807907;-1042455.429999999701977;0
3154;-743984.818999998271465;-1042573.844999998807907;0
4211;-742193.190000001341105;-1043565.660000000149012;0
732;-741860.000000000000000;-1043003.000000000000000;0
3946;-743397.693999998271465;-1043460.780999999493361;0
6198;-742312.659000001847744;-1043056.964999999850988;0
7355;-743348.309999998658895;-1045148.329999998211861;0
5745;-743415.129000000655651;-1043695.054000001400709;0
1558;-741192.000000000000000;-1044273.000000000000000;0
4040;-743224.710000000894070;-1043766.050000000745058;0
1413;-741631.000000000000000;-1044621.000000000000000;0
4584;-742417.721999999135733;-1042627.620999999344349;0
6254;-742379.344000000506639;-1043038.363000001758337;0
4600;-742647.000000000000000;-1042709.000000000000000;0
4639;-742567.399999998509884;-1042548.592999998480082;0
7;-743479.000000000000000;-1042567.000000000000000;0
6747;-742410.170000001788139;-1044287.228000000119209;0
1153;-741245.000000000000000;-1044480.000000000000000;0
5042;-742731.719000000506639;-1042890.517000000923872;0
4321;-742265.214999999850988;-1043235.418999999761581;0
4752;-742774.460000000894070;-1042743.280000001192093;0
6262;-742370.024999998509884;-1043021.666000001132488;0
952;-742274.000000000000000;-1043018.000000000000000;0
210;-743112.000000000000000;-1043566.000000000000000;0
7269;-743143.410000000149012;-1044948.879999998956919;0
1715;-741269.309999998658895;-1044883.449999999254942;0
4923;-742431.019999999552965;-1042882.210000000894070;0
5113;-742946.795000001788139;-1043444.427999999374151;0
6127;-742314.456000000238419;-1043070.548999998718500;0
6277;-742304.633999999612570;-1043024.256000000983477;0
633;-742100.000000000000000;-1043296.000000000000000;0
4844;-742977.256000000983477;-1042754.953000001609325;0
4794;-743065.828999999910593;-1042673.377000000327826;0
4737;-742718.399999998509884;-1042684.079999998211861;0
4087;-742811.609999999403954;-1043604.190000001341105;0
4939;-742448.866999998688698;-1043072.822999998927116;0
6361;-742016.024999998509884;-1042677.243999999016523;0
615;-742129.000000000000000;-1043271.000000000000000;0
6179;-742312.195000000298023;-1043059.041000001132488;0
563;-742155.000000000000000;-1043660.000000000000000;0
6163;-742316.921000000089407;-1043069.223000001162291;0
5958;-742962.513999998569489;-1043517.497999999672174;0
5591;-743421.353999998420477;-1043679.738000001758337;0
4131;-742844.625000000000000;-1044059.980000000447035;0
7705;-742283.471999999135733;-1044316.339999999850988;0
1488;-741088.000000000000000;-1044212.000000000000000;0
694;-742280.000000000000000;-1043043.000000000000000;0
4952;-742318.899999998509884;-1042915.589999999850988;0
6147;-742314.177000001072884;-1043067.070999998599291;0
2435;-742452.000000000000000;-1044222.000000000000000;0
2403;-742211.000000000000000;-1045436.000000000000000;0
6249;-742373.554999999701977;-1043049.822000000625849;0
1325;-741894.000000000000000;-1044959.000000000000000;0
3377;-743832.151999998837709;-1042925.721000000834465;0
3975;-743112.984999999403954;-1043716.375999998301268;0
7661;-742294.495999999344349;-1045349.482000000774860;0
1388;-742152.000000000000000;-1045026.000000000000000;0
4635;-742575.561999998986721;-1042702.701000001281500;0
796;-741771.000000000000000;-1042592.000000000000000;0
4531;-742746.070000000298023;-1042885.980000000447035;0
1141;-741454.000000000000000;-1044453.000000000000000;0
4477;-741858.039999999105930;-1042692.129999998956919;0
7034;-743299.725999999791384;-1044153.140000000596046;0
974;-741933.000000000000000;-1044544.000000000000000;0
5506;-743427.348000001162291;-1043665.644999999552965;0
7978;-741231.690000001341105;-1044407.519999999552965;0
2323;-742622.000000000000000;-1045487.000000000000000;0
988;-741820.000000000000000;-1044516.000000000000000;0
4956;-742383.579999998211861;-1043007.739999998360872;0
4560;-742427.079999998211861;-1042500.829999998211861;0
2359;-742348.000000000000000;-1045581.000000000000000;0
6267;-742344.767999999225140;-1043019.272999998182058;0
5595;-743416.488000001758337;-1043680.118999999016523;0
4730;-742831.050000000745058;-1042696.600000001490116;0
201;-743229.000000000000000;-1043614.000000000000000;0
5207;-743208.434999998658895;-1043365.236999999731779;0
4696;-742682.817000001668930;-1042658.543999999761581;0
5676;-743406.725999999791384;-1043716.493000000715256;0
6119;-743582.679999999701977;-1042696.969999998807907;0
4854;-742971.159000001847744;-1042912.429000001400709;0
4080;-742832.480000000447035;-1043782.030000001192093;0
4777;-742910.034000001847744;-1042759.350999999791384;0
1114;-741151.059999998658895;-1044607.410000000149012;0
2054;-743413.000000000000000;-1045010.000000000000000;0
5441;-743196.690000001341105;-1043289.765000000596046;0
6711;-742266.486000001430511;-1044832.896000001579523;0
5715;-743423.747000001370907;-1043633.157999999821186;0
1554;-741348.000000000000000;-1044238.000000000000000;0
5176;-743321.252999998629093;-1043447.495000001043081;0
4978;-742491.822999998927116;-1043028.688000001013279;0
4701;-742687.780000001192093;-1042761.660000000149012;0
4694;-742689.272999998182058;-1042626.495999999344349;0
6106;-742210.445999998599291;-1043112.203000001609325;0
4580;-742393.905000001192093;-1042551.807000000029802;0
1314;-741695.000000000000000;-1044866.000000000000000;0
4022;-743268.934999998658895;-1043870.500000000000000;0
843;-742085.000000000000000;-1042507.000000000000000;0
2537;-741975.000000000000000;-1044131.000000000000000;0
743;-741682.000000000000000;-1043020.000000000000000;0
4323;-742267.879999998956919;-1043190.035000000149012;0
5213;-743326.385999999940395;-1043368.675999999046326;0
3279;-743638.815999999642372;-1042804.333999998867512;0
569;-742096.000000000000000;-1043601.000000000000000;0
1957;-743402.000000000000000;-1044519.000000000000000;0
5230;-743335.399999998509884;-1043517.670000001788139;0
389;-742408.000000000000000;-1043783.000000000000000;0
3355;-743953.881000000983477;-1043031.379999998956919;0
1179;-741934.000000000000000;-1044251.000000000000000;0
4588;-742421.668999999761581;-1042556.124000001698732;0
1152;-741257.000000000000000;-1044489.000000000000000;0
1005;-741944.000000000000000;-1044583.000000000000000;0
7814;-741769.006999999284744;-1044058.535999998450279;0
4197;-742179.633999999612570;-1043776.899000000208616;0
4790;-743036.497999999672174;-1042635.973999999463558;0
5686;-743394.912000000476837;-1043720.872000001370907;0
4068;-742917.125000000000000;-1043734.535000000149012;0
4088;-742812.114999998360872;-1043580.475000001490116;0
581;-741991.000000000000000;-1043457.000000000000000;0
6166;-742314.649999998509884;-1043065.006999999284744;0
890;-742007.000000000000000;-1042740.000000000000000;0
4951;-742335.579999998211861;-1042934.429999999701977;0
7354;-743365.449000000953674;-1045150.535999998450279;0
4145;-742687.109999999403954;-1043837.125000000000000;0
6373;-741992.809999998658895;-1042677.000000000000000;0
328;-742670.000000000000000;-1044072.000000000000000;0
532;-742114.000000000000000;-1043737.000000000000000;0
2236;-743391.000000000000000;-1045242.000000000000000;0
4820;-742927.769999999552965;-1042786.710000000894070;0
3965;-743388.850000001490116;-1043528.160000000149012;0
982;-741992.000000000000000;-1044416.000000000000000;0
