OID_;X;Y;TEMPERATURE
3614;-744984.548999998718500;-1042283.640999998897314;0
3019;-744463.447999998927116;-1042784.646000001579523;0
3568;-744718.817999999970198;-1042588.614999998360872;0
3692;-744525.876499999314547;-1042540.534000001847744;0
3580;-744924.973999999463558;-1042593.699999999254942;0
2605;-745393.842999998480082;-1042860.796000000089407;0
5975;-745052.346999999135733;-1042674.673000000417233;0
118;-745135.000000000000000;-1042687.000000000000000;0
3542;-744575.274000000208616;-1042656.160000000149012;0
2696;-743477.489999998360872;-1042038.000000000000000;0
2520;-741847.000000000000000;-1045324.000000000000000;0
6872;-741751.719999998807907;-1045296.679999999701977;0
2760;-743863.331000000238419;-1043483.304000001400709;0
2755;-744003.879000000655651;-1043471.734000001102686;0
2404;-742179.000000000000000;-1045467.000000000000000;0
3919;-743904.947000000625849;-1043493.929999999701977;0
3107;-743778.888000000268221;-1042682.131999999284744;0
2740;-744042.611999999731779;-1043335.940000001341105;0
6705;-742279.050999999046326;-1044655.923000000417233;0
6833;-741571.423000000417233;-1044909.473999999463558;0
1486;-741150.000000000000000;-1044219.000000000000000;0
1445;-741553.000000000000000;-1044757.000000000000000;0
1727;-741495.000000000000000;-1045103.000000000000000;0
1411;-741639.480000000447035;-1044683.019999999552965;0
6828;-741465.309999998658895;-1044768.940000001341105;0
7411;-743529.510000001639128;-1045393.140000000596046;0
2079;-742688.000000000000000;-1044428.000000000000000;0
385;-742436.000000000000000;-1043742.000000000000000;0
8079;-742021.839999999850988;-1045292.179999999701977;0
2070;-742993.000000000000000;-1044723.000000000000000;0
2097;-743143.000000000000000;-1044742.000000000000000;0
4156;-742513.734999999403954;-1043978.035000000149012;0
7263;-743009.559999998658895;-1044894.379999998956919;0
383;-742450.000000000000000;-1043722.000000000000000;0
4238;-742440.263000000268221;-1043528.236000001430511;0
7654;-742242.081000000238419;-1045273.263999998569489;0
7008;-742899.559999998658895;-1044224.074999999254942;0
2394;-742273.000000000000000;-1045360.000000000000000;0
2329;-742432.000000000000000;-1045508.000000000000000;0
2160;-742849.000000000000000;-1045147.000000000000000;0
2161;-742876.000000000000000;-1045153.000000000000000;0
8073;-742120.640000000596046;-1045259.500000000000000;0
7652;-742275.046999998390675;-1045497.052000001072884;0
2378;-742372.000000000000000;-1045503.000000000000000;0
7141;-742895.629999998956919;-1044470.910000000149012;0
4075;-742947.934999998658895;-1043903.649999998509884;0
7243;-742724.339999999850988;-1044835.870000001043081;0
4074;-742943.350000001490116;-1043880.304999999701977;0
5409;-743745.201000001281500;-1042902.750000000000000;0
4029;-743130.695999998599291;-1043815.427999999374151;0
7947;-742030.969999998807907;-1044096.679999999701977;0
524;-742255.000000000000000;-1043913.000000000000000;96
2296;-742678.000000000000000;-1045399.000000000000000;0
2326;-742523.000000000000000;-1045498.000000000000000;0
2323;-742622.000000000000000;-1045487.000000000000000;0
1780;-741214.000000000000000;-1043934.000000000000000;0
738;-741818.000000000000000;-1043024.000000000000000;0
1983;-743474.000000000000000;-1044709.000000000000000;0
1519;-741754.000000000000000;-1043956.000000000000000;0
748;-741671.000000000000000;-1042971.000000000000000;0
110;-744127.000000000000000;-1042724.000000000000000;0
7721;-742941.157000001519918;-1044215.368000000715256;0
7022;-743155.660000000149012;-1044074.410000000149012;0
1764;-741163.000000000000000;-1044144.000000000000000;0
7015;-742554.570000000298023;-1044360.725000001490116;0
735;-741910.000000000000000;-1043014.000000000000000;0
4220;-742214.344999998807907;-1043580.359999999403954;0
1287;-742217.000000000000000;-1044486.000000000000000;0
6339;-742245.460000000894070;-1042835.780000001192093;0
3975;-743112.984999999403954;-1043716.375999998301268;0
3310;-743829.561999998986721;-1042854.063000001013279;0
4046;-743205.699999999254942;-1044009.719999998807907;0
514;-742119.000000000000000;-1043141.000000000000000;0
510;-742048.000000000000000;-1043150.000000000000000;0
343;-742575.000000000000000;-1043857.000000000000000;0
4067;-742913.594999998807907;-1043714.640000000596046;0
847;-742155.000000000000000;-1042504.000000000000000;0
824;-742142.000000000000000;-1042596.000000000000000;0
2050;-743460.000000000000000;-1045072.000000000000000;0
827;-742218.000000000000000;-1042626.000000000000000;0
834;-742049.000000000000000;-1042541.000000000000000;0
2008;-743242.000000000000000;-1044759.000000000000000;0
2018;-743244.000000000000000;-1044909.000000000000000;0
4170;-742407.245000001043081;-1043945.519999999552965;0
394;-742405.000000000000000;-1043863.000000000000000;0
7148;-742828.445000000298023;-1044472.094999998807907;0
6722;-742357.717000000178814;-1044705.708000000566244;0
2020;-743260.000000000000000;-1044941.000000000000000;0
1561;-743186.000000000000000;-1045098.000000000000000;0
547;-742316.910000000149012;-1043790.309999998658895;0
1251;-742091.000000000000000;-1044690.000000000000000;0
7;-743479.000000000000000;-1042567.000000000000000;0
4106;-742664.475000001490116;-1043755.761999998241663;0
17;-743587.000000000000000;-1042394.000000000000000;0
1855;-742642.000000000000000;-1044286.000000000000000;0
5303;-743164.818999998271465;-1043211.078000001609325;0
1492;-741096.000000000000000;-1044331.000000000000000;0
4332;-742410.359000001102686;-1043282.916000001132488;0
4124;-742751.265000000596046;-1043878.414999999105930;0
3204;-743715.278999999165535;-1042506.118999999016523;0
6;-743464.000000000000000;-1042594.000000000000000;0
1769;-741260.000000000000000;-1044112.000000000000000;0
2133;-743040.000000000000000;-1045127.000000000000000;0
2151;-742827.000000000000000;-1045047.000000000000000;0
2166;-743016.000000000000000;-1045179.000000000000000;0
7324;-742833.980000000447035;-1044949.109999999403954;0
224;-742904.000000000000000;-1043522.000000000000000;0
4162;-742497.193999998271465;-1044160.030000001192093;0
4002;-743397.818999998271465;-1044054.317999999970198;0
4173;-742756.320000000298023;-1043749.629999998956919;0
6746;-742405.083999998867512;-1044259.199999999254942;0
1766;-741257.000000000000000;-1044204.000000000000000;0
4333;-742428.420000001788139;-1043255.609999999403954;0
1470;-741728.000000000000000;-1044116.000000000000000;0
1192;-741801.000000000000000;-1044083.000000000000000;0
1515;-741913.000000000000000;-1044072.000000000000000;0
2447;-742772.000000000000000;-1044159.000000000000000;0
1718;-741366.219999998807907;-1044870.989999998360872;0
1701;-741378.000000000000000;-1044678.000000000000000;0
2546;-741750.000000000000000;-1044271.000000000000000;0
6700;-742298.611000001430511;-1044507.315999999642372;0
1371;-742089.000000000000000;-1044807.000000000000000;0
7031;-743301.824999999254942;-1044080.774999998509884;0
2235;-743401.000000000000000;-1045221.000000000000000;0
884;-741771.000000000000000;-1042776.000000000000000;0
1013;-742076.000000000000000;-1044595.000000000000000;0
2189;-743472.000000000000000;-1045183.000000000000000;0
4024;-743223.734999999403954;-1043859.954999998211861;0
4150;-742581.789999999105930;-1044138.429999999701977;0
727;-742001.000000000000000;-1042962.000000000000000;0
1091;-741531.480000000447035;-1044543.440000001341105;0
280;-743053.000000000000000;-1043875.000000000000000;0
308;-742754.000000000000000;-1044149.000000000000000;0
6311;-743930.489999998360872;-1042569.390000000596046;0
728;-741997.000000000000000;-1042918.000000000000000;0
3154;-743984.818999998271465;-1042573.844999998807907;0
1982;-743408.000000000000000;-1044646.000000000000000;0
1518;-741994.000000000000000;-1044011.000000000000000;0
4139;-742859.625999998301268;-1044000.574999999254942;0
3101;-743922.754999998956919;-1042745.195000000298023;0
3264;-743565.725000001490116;-1042729.024999998509884;0
696;-742077.000000000000000;-1042913.000000000000000;0
5128;-743040.467000000178814;-1043389.765999998897314;0
2212;-743217.000000000000000;-1045279.000000000000000;0
3326;-744036.002000000327826;-1042922.574999999254942;0
1455;-741517.000000000000000;-1044468.000000000000000;0
711;-741828.000000000000000;-1042860.000000000000000;0
2226;-743057.000000000000000;-1045470.000000000000000;0
1433;-741895.000000000000000;-1044328.000000000000000;0
301;-742613.000000000000000;-1043903.000000000000000;0
4538;-742291.464000001549721;-1042734.344000000506639;0
4651;-742756.375000000000000;-1042524.938000001013279;0
4342;-742506.473000001162291;-1043301.100000001490116;0
1475;-741565.000000000000000;-1044185.000000000000000;0
4119;-742717.223999999463558;-1043999.837999999523163;0
504;-741937.000000000000000;-1043164.000000000000000;0
6982;-743055.109999999403954;-1044342.629999998956919;0
1242;-742137.000000000000000;-1044481.000000000000000;0
2043;-743471.000000000000000;-1044959.000000000000000;0
1996;-743484.000000000000000;-1045063.000000000000000;0
596;-741867.000000000000000;-1043259.000000000000000;0
503;-741879.000000000000000;-1043158.000000000000000;0
7048;-743392.429999999701977;-1044236.170000001788139;0
1695;-741550.000000000000000;-1044656.000000000000000;0
7045;-743400.745000001043081;-1044160.004999998956919;0
3292;-743576.905000001192093;-1042781.315000001341105;0
1126;-741684.000000000000000;-1044450.000000000000000;0
1920;-743384.000000000000000;-1044363.000000000000000;0
3285;-743661.519999999552965;-1042862.697000000625849;0
3752;-743213.949999999254942;-1042902.719999998807907;0
7212;-742559.410000000149012;-1045073.070000000298023;0
5062;-742798.513999998569489;-1043227.370999999344349;0
2209;-743309.000000000000000;-1045217.000000000000000;0
1991;-743482.000000000000000;-1044929.000000000000000;0
1388;-742152.000000000000000;-1045026.000000000000000;0
4068;-742917.125000000000000;-1043734.535000000149012;0
1970;-743380.000000000000000;-1044854.000000000000000;0
1381;-742115.000000000000000;-1044999.000000000000000;0
1987;-743480.000000000000000;-1044820.000000000000000;0
2091;-742920.000000000000000;-1044593.000000000000000;0
2084;-742447.000000000000000;-1044797.000000000000000;0
3387;-743960.368000000715256;-1043194.717000000178814;0
1573;-742358.000000000000000;-1044452.000000000000000;0
4625;-742594.258000001311302;-1042576.114000000059605;0
2255;-743181.000000000000000;-1045372.000000000000000;0
5322;-743060.379999998956919;-1043029.589999999850988;0
7515;-742273.021999999880791;-1044371.543999999761581;0
1652;-741379.000000000000000;-1044550.000000000000000;0
6714;-742287.171000000089407;-1044923.995999999344349;0
2256;-743156.000000000000000;-1045353.000000000000000;0
629;-742200.000000000000000;-1043289.000000000000000;0
3233;-744152.962999999523163;-1042686.791999999433756;0
6695;-742306.234000001102686;-1044816.138999998569489;0
4506;-742419.730000000447035;-1042717.019999999552965;0
7776;-743089.784000001847744;-1045773.409000001847744;0
1373;-742143.000000000000000;-1044822.000000000000000;0
6952;-743044.730999998748302;-1044106.129999998956919;0
4184;-742311.379999998956919;-1044164.660000000149012;0
1355;-741899.000000000000000;-1044858.000000000000000;0
7279;-742799.399999998509884;-1044679.829999998211861;0
2289;-742915.000000000000000;-1045426.000000000000000;0
7957;-741692.839999999850988;-1044277.559999998658895;0
1263;-742048.000000000000000;-1044929.000000000000000;0
2560;-741251.000000000000000;-1044390.000000000000000;0
2550;-741576.000000000000000;-1044342.000000000000000;0
6610;-741694.364999998360872;-1043961.170000001788139;0
7985;-741091.269999999552965;-1044419.039999999105930;0
1523;-741679.000000000000000;-1043865.000000000000000;0
4232;-742315.057999998331070;-1043428.918999999761581;0
1531;-741782.000000000000000;-1043838.000000000000000;0
4208;-742372.416999999433756;-1043503.423000000417233;0
6686;-742381.967000000178814;-1044961.747000001370907;0
1915;-743468.000000000000000;-1044494.000000000000000;0
1839;-742994.469999998807907;-1044185.679999999701977;0
4243;-742194.050000000745058;-1043431.899999998509884;0
7168;-742792.969999998807907;-1044547.879999998956919;0
1603;-742525.000000000000000;-1044922.000000000000000;0
1029;-741978.000000000000000;-1044721.000000000000000;0
2451;-742884.000000000000000;-1044134.000000000000000;0
3887;-742347.760000001639128;-1042449.881000000983477;0
684;-742358.000000000000000;-1043136.000000000000000;0
5240;-743364.164000000804663;-1043254.934000000357628;0
4126;-742851.335000000894070;-1044085.449999999254942;0
3418;-743758.105000000447035;-1043107.024999998509884;0
4709;-742775.800000000745058;-1042600.690000001341105;0
5119;-742850.592999998480082;-1043328.484999999403954;0
4572;-742343.539999999105930;-1042598.289999999105930;0
4426;-742197.589999999850988;-1043031.679999999701977;0
8150;-743304.219999998807907;-1043217.539999999105930;0
3370;-743858.489999998360872;-1043011.370999999344349;0
4581;-742391.460000000894070;-1042586.396999999880791;0
2319;-742734.000000000000000;-1045474.000000000000000;0
1324;-741943.000000000000000;-1044994.000000000000000;0
4064;-742879.655000001192093;-1043647.420000001788139;0
2516;-742500.000000000000000;-1044414.000000000000000;0
1614;-742388.000000000000000;-1044432.000000000000000;0
6770;-741306.423999998718500;-1044414.120999999344349;0
7138;-742917.554999999701977;-1044421.774999998509884;0
1931;-743388.000000000000000;-1044409.000000000000000;0
6696;-742332.717000000178814;-1044815.649999998509884;0
1545;-742236.000000000000000;-1044234.000000000000000;0
5434;-744042.467999998480082;-1043135.986999999731779;0
7520;-742808.589999999850988;-1045680.519999999552965;0
1913;-743453.000000000000000;-1044482.000000000000000;0
1293;-742037.000000000000000;-1044462.000000000000000;0
5135;-742979.611000001430511;-1043468.912999998778105;0
4089;-742812.844999998807907;-1043560.114999998360872;0
1039;-741914.000000000000000;-1044595.000000000000000;0
7087;-743339.940000001341105;-1044536.690000001341105;0
2321;-742679.000000000000000;-1045480.000000000000000;0
7350;-742556.390000000596046;-1045185.980000000447035;0
587;-741944.000000000000000;-1043391.000000000000000;0
465;-741728.000000000000000;-1043309.000000000000000;0
7215;-742484.320000000298023;-1044546.620000001043081;0
757;-741673.000000000000000;-1042678.000000000000000;0
519;-742239.000000000000000;-1043113.000000000000000;0
4935;-742447.241999998688698;-1042699.399000000208616;0
4928;-742444.890000000596046;-1042854.899999998509884;0
2082;-742569.000000000000000;-1044642.000000000000000;0
467;-741757.000000000000000;-1043352.000000000000000;0
1115;-741105.000000000000000;-1044598.000000000000000;0
2417;-742421.000000000000000;-1045135.000000000000000;0
1317;-741748.000000000000000;-1044884.000000000000000;0
6300;-741836.949999999254942;-1042698.329999998211861;0
5111;-742892.337999999523163;-1043424.370999999344349;0
8060;-742295.719999998807907;-1045082.859999999403954;0
6473;-741931.359999999403954;-1044555.109999999403954;0
1596;-742323.000000000000000;-1045037.000000000000000;0
5222;-743271.000000000000000;-1043543.149999998509884;0
1945;-743270.000000000000000;-1044454.000000000000000;0
2334;-742872.000000000000000;-1045519.000000000000000;0
5142;-743039.870000001043081;-1043473.929999999701977;0
3796;-743161.100000001490116;-1042834.149999998509884;0
6682;-742329.804000001400709;-1044319.611999999731779;0
6726;-742476.517999999225140;-1044410.600000001490116;0
1469;-741752.000000000000000;-1044100.000000000000000;0
6776;-741098.559999998658895;-1044491.530000001192093;0
1058;-741667.000000000000000;-1045072.000000000000000;0
6791;-741047.329999998211861;-1044765.467999998480082;0
1123;-741734.000000000000000;-1044442.000000000000000;0
4430;-742235.070000000298023;-1043092.839999999850988;0
6862;-741438.085999999195337;-1045031.583999998867512;0
6847;-741591.993999999016523;-1044992.927999999374151;0
1476;-741531.000000000000000;-1044196.000000000000000;0
2479;-741247.800000000745058;-1044609.379999998956919;0
1707;-741196.219999998807907;-1044702.390000000596046;0
1044;-741861.000000000000000;-1044743.000000000000000;0
283;-743026.000000000000000;-1043788.000000000000000;0
4054;-743269.304999999701977;-1043797.405000001192093;0
571;-742082.000000000000000;-1043581.000000000000000;0
4597;-742620.600000001490116;-1042680.690000001341105;0
4310;-742031.800000000745058;-1043475.199999999254942;0
1794;-742151.000000000000000;-1044190.000000000000000;0
4989;-742648.756000000983477;-1043019.318999998271465;0
6673;-742244.289999999105930;-1044153.350000001490116;0
6821;-741256.649999998509884;-1044796.100000001490116;0
5208;-743237.954999998211861;-1043368.065999999642372;0
1219;-742137.000000000000000;-1044315.000000000000000;0
6264;-742357.280000001192093;-1043020.445999998599291;0
4827;-743046.359999999403954;-1042958.140000000596046;0
8274;-742065.089999999850988;-1042742.109999999403954;0
3758;-743284.129999998956919;-1042964.100000001490116;0
5206;-743189.870999999344349;-1043360.936000000685453;0
3846;-743149.390000000596046;-1042549.600000001490116;0
648;-742246.000000000000000;-1043363.000000000000000;0
1170;-741893.000000000000000;-1044403.000000000000000;0
5598;-743412.839999999850988;-1043680.403000000864267;0
1875;-743367.000000000000000;-1044261.000000000000000;0
3839;-743112.140000000596046;-1042558.280000001192093;0
6211;-742317.785000000149012;-1043063.318999998271465;0
2262;-742999.000000000000000;-1045686.000000000000000;0
4920;-742444.449999999254942;-1042928.980000000447035;0
5997;-742040.579999998211861;-1043282.651999998837709;0
1330;-741817.000000000000000;-1044709.000000000000000;0
4632;-742615.638999998569489;-1042624.039999999105930;0
1428;-742028.000000000000000;-1044235.000000000000000;0
5415;-742954.934000000357628;-1042714.414000000804663;0
2887;-744098.480000000447035;-1043192.508000001311302;0
5923;-742953.765000000596046;-1043015.067999999970198;0
6151;-742311.114999998360872;-1043061.451000001281500;0
6177;-742313.717999998480082;-1043061.859999999403954;0
5713;-743423.890999998897314;-1043636.899999998509884;0
252;-743438.000000000000000;-1043926.000000000000000;0
4889;-742621.425000000745058;-1042831.109999999403954;0
5686;-743394.912000000476837;-1043720.872000001370907;0
3954;-743409.050999999046326;-1043550.699999999254942;0
4059;-743142.649999998509884;-1043612.730000000447035;0
4564;-742452.267000000923872;-1042534.980999998748302;0
2344;-742691.000000000000000;-1045541.000000000000000;0
1938;-743289.000000000000000;-1044306.000000000000000;0
4981;-742536.340999998152256;-1043014.929999999701977;0
531;-742157.000000000000000;-1043778.000000000000000;0
6159;-742312.495999999344349;-1043062.521000001579523;0
1213;-742068.000000000000000;-1044387.000000000000000;0
6224;-742315.320000000298023;-1043057.335000000894070;0
4961;-742309.460000000894070;-1043010.730000000447035;0
8281;-742164.160000000149012;-1042778.140000000596046;0
6505;-741746.570000000298023;-1044600.429999999701977;0
191;-743424.000000000000000;-1043599.000000000000000;0
1267;-742040.000000000000000;-1044999.000000000000000;0
3841;-743159.929999999701977;-1042641.120000001043081;0
4828;-743048.579999998211861;-1042941.179999999701977;0
6273;-742321.806000001728535;-1043017.085000000894070;0
1436;-741869.000000000000000;-1044323.000000000000000;0
5704;-743417.484999999403954;-1043635.530999999493361;0
4516;-742588.570000000298023;-1042771.460000000894070;0
3357;-743953.732000000774860;-1043042.298999998718500;0
6259;-742383.170000001788139;-1043030.809000000357628;0
5696;-743417.096000000834465;-1043637.135999999940395;0
4877;-742845.760000001639128;-1042956.589999999850988;0
6280;-742306.918999999761581;-1043038.083000000566244;0
6165;-742315.407000001519918;-1043066.436000000685453;0
5234;-743348.486000001430511;-1043412.741999998688698;0
6269;-742337.300000000745058;-1043018.486000001430511;0
5994;-743358.609999999403954;-1043460.469999998807907;0
4922;-742443.129999998956919;-1042886.510000001639128;0
6173;-742316.787000000476837;-1043067.471000000834465;0
6185;-742315.103999998420477;-1043062.923000000417233;0
5639;-743428.337999999523163;-1043685.046999998390675;0
7807;-742647.802999999374151;-1044543.524000000208616;0
7189;-742588.486999999731779;-1044766.690999999642372;0
6171;-742310.780999999493361;-1043057.971000000834465;0
2258;-742974.000000000000000;-1045574.000000000000000;0
6182;-742317.399000000208616;-1043067.136999998241663;0
6500;-741697.967999998480082;-1044926.364999998360872;0
5643;-743428.701999999582767;-1043689.872999999672174;0
558;-742200.000000000000000;-1043683.000000000000000;0
5719;-743419.508999999612570;-1043629.817999999970198;0
4701;-742687.780000001192093;-1042761.660000000149012;0
5718;-743420.888999998569489;-1043629.666999999433756;0
786;-741706.000000000000000;-1042606.000000000000000;0
943;-742292.000000000000000;-1043017.000000000000000;0
5641;-743428.517000000923872;-1043687.460000000894070;0
4947;-742399.918000001460314;-1042993.458000000566244;0
876;-741953.000000000000000;-1042636.000000000000000;0
4874;-742795.429999999701977;-1042925.910000000149012;0
6132;-742310.590999998152256;-1043063.552999999374151;0
5638;-743428.245000001043081;-1043683.840999998152256;0
4668;-742810.210000000894070;-1042618.969999998807907;0
5596;-743415.271999999880791;-1043680.212999999523163;0
5663;-743422.087999999523163;-1043710.807999998331070;0
532;-742114.000000000000000;-1043737.000000000000000;0
3761;-743202.559999998658895;-1042981.710000000894070;0
691;-742293.000000000000000;-1043097.000000000000000;0
4810;-743058.420000001788139;-1042810.050000000745058;0
6158;-742313.261999998241663;-1043063.925999999046326;0
4815;-742992.210000000894070;-1042788.359999999403954;0
1926;-743301.000000000000000;-1044321.000000000000000;0
4761;-742810.285000000149012;-1042793.122000001370907;0
4794;-743065.828999999910593;-1042673.377000000327826;0
6450;-743166.964999999850988;-1043776.383999999612570;0
4056;-743125.315000001341105;-1043671.969999998807907;0
4818;-742949.140000000596046;-1042791.660000000149012;0
626;-742236.000000000000000;-1043317.000000000000000;0
6179;-742312.195000000298023;-1043059.041000001132488;0
6147;-742314.177000001072884;-1043067.070999998599291;0
5693;-743415.905000001192093;-1043640.377000000327826;0
3407;-743772.385999999940395;-1043008.706999998539686;0
1333;-741781.000000000000000;-1044777.000000000000000;0
6200;-742318.653999999165535;-1043066.462000001221895;0
5292;-743055.866000000387430;-1043215.710999999195337;0
611;-742037.000000000000000;-1043267.000000000000000;0
6250;-742374.638999998569489;-1043047.576999999582767;0
4957;-742366.010000001639128;-1043006.059999998658895;0
5679;-743403.182000000029802;-1043717.807000000029802;0
4675;-742805.809999998658895;-1042785.070000000298023;0
4787;-742962.412000000476837;-1042621.662000000476837;0
7175;-742651.780000001192093;-1044558.149999998509884;0
1587;-742372.000000000000000;-1044806.000000000000000;0
4224;-742139.756000000983477;-1043462.488000001758337;0
1149;-741311.000000000000000;-1044471.000000000000000;0
6359;-742018.440000001341105;-1042712.449999999254942;0
1499;-741413.000000000000000;-1044304.000000000000000;0
5666;-743418.543999999761581;-1043712.120000001043081;0
985;-741823.000000000000000;-1044444.000000000000000;0
559;-742191.000000000000000;-1043693.000000000000000;0
537;-742099.000000000000000;-1043663.000000000000000;0
7970;-741444.739999998360872;-1044384.980000000447035;0
4790;-743036.497999999672174;-1042635.973999999463558;0
6183;-742316.633999999612570;-1043065.732000000774860;0
4795;-743049.835000000894070;-1042669.013000000268221;0
7190;-742577.989999998360872;-1044771.690000001341105;0
6996;-743116.699999999254942;-1044476.469999998807907;0
6357;-741947.870000001043081;-1042701.129999998956919;0
7700;-742371.105999998748302;-1044818.445000000298023;0
633;-742100.000000000000000;-1043296.000000000000000;0
5002;-742561.190000001341105;-1042977.401999998837709;0
2490;-742063.000000000000000;-1044273.000000000000000;0
6232;-742316.034000001847744;-1043057.000000000000000;0
3961;-743419.609999999403954;-1043589.497000001370907;0
5757;-743420.747999999672174;-1043633.940999999642372;0
6161;-742310.964999999850988;-1043059.710999999195337;0
3781;-743273.059999998658895;-1042814.050000000745058;0
5599;-743411.622999999672174;-1043680.499000001698732;0
1129;-741672.000000000000000;-1044438.000000000000000;0
592;-741913.000000000000000;-1043311.000000000000000;0
5360;-742453.188999999314547;-1042938.521999999880791;0
4781;-742926.519000001251698;-1042695.502999998629093;0
3824;-743038.059999998658895;-1042573.800000000745058;0
2489;-742079.000000000000000;-1044278.000000000000000;0
4964;-742390.059999998658895;-1043044.839999999850988;0
2061;-742681.000000000000000;-1044491.000000000000000;0
4850;-742956.164000000804663;-1042923.403000000864267;0
3795;-743173.190000001341105;-1042842.170000001788139;0
794;-741746.000000000000000;-1042595.000000000000000;0
5710;-743421.574999999254942;-1043640.598000001162291;0
7001;-743085.660000000149012;-1044400.420000001788139;0
5702;-743417.206000000238419;-1043631.844999998807907;0
1425;-742080.000000000000000;-1044210.000000000000000;0
1057;-741686.000000000000000;-1045058.000000000000000;0
1678;-741113.109999999403954;-1044552.320000000298023;0
4523;-742703.960000000894070;-1042805.670000001788139;0
819;-741987.000000000000000;-1042599.000000000000000;0
5270;-742989.153999999165535;-1043210.684999998658895;0
6458;-743360.644999999552965;-1043919.311999998986721;0
6976;-743107.829999998211861;-1044483.399999998509884;0
330;-742659.000000000000000;-1044043.000000000000000;0
5224;-743293.449999999254942;-1043542.160000000149012;0
4650;-742749.989000000059605;-1042534.539999999105930;0
5513;-743426.734999999403954;-1043606.184000000357628;0
5578;-743409.534000001847744;-1043632.701000001281500;0
5231;-743342.107000000774860;-1043497.627000000327826;0
6231;-742316.769000001251698;-1043058.344000000506639;0
3348;-743960.361000001430511;-1043015.629999998956919;0
6820;-741224.105999998748302;-1044799.311999998986721;0
913;-741742.000000000000000;-1042579.000000000000000;0
6783;-741340.728000000119209;-1044457.412000000476837;0
4956;-742383.579999998211861;-1043007.739999998360872;0
6131;-742311.329999998211861;-1043064.982999999076128;0
4839;-742984.162000000476837;-1042715.425000000745058;0
4222;-742187.096999999135733;-1043485.890000000596046;0
6997;-743109.160000000149012;-1044453.600000001490116;0
5654;-743429.644000001251698;-1043703.151000000536442;0
3346;-743958.802000001072884;-1043049.741000000387430;0
2227;-743029.000000000000000;-1045506.000000000000000;0
4021;-743293.295000001788139;-1043876.995000001043081;0
4847;-742981.100000001490116;-1042831.059999998658895;0
6213;-742316.227000001817942;-1043060.478999998420477;0
5733;-743410.142999999225140;-1043688.210999999195337;0
6265;-742353.164999999105930;-1043020.054999999701977;0
5664;-743420.907000001519918;-1043711.245999999344349;0
6255;-742379.991999998688698;-1043037.068999998271465;0
2495;-741982.000000000000000;-1044140.000000000000000;0
6174;-742316.021999999880791;-1043066.065000001341105;0
5016;-742572.212000001221895;-1042955.526999998837709;0
624;-742241.000000000000000;-1043343.000000000000000;0
6116;-742963.905999999493361;-1042886.313000001013279;0
6212;-742317.006000000983477;-1043061.888000000268221;0
5271;-742995.381999999284744;-1043229.673000000417233;0
3763;-743140.420000001788139;-1042987.649999998509884;0
6191;-742318.017000000923872;-1043066.800999999046326;0
6130;-742312.136999998241663;-1043066.344000000506639;0
3837;-743093.699999999254942;-1042577.890000000596046;0
331;-742664.000000000000000;-1044024.000000000000000;0
4742;-742822.300000000745058;-1042747.920000001788139;0
4958;-742349.620000001043081;-1043004.539999999105930;0
6251;-742377.396999999880791;-1043042.284000001847744;0
4588;-742421.668999999761581;-1042556.124000001698732;0
1347;-741791.000000000000000;-1044816.000000000000000;0
839;-742021.000000000000000;-1042510.000000000000000;0
