OID_;X;Y;TEMPERATURE
7077;-743564.359000001102686;-1045385.210000000894070;0
5995;-744441.440999999642372;-1042779.568999998271465;0
3527;-744805.695999998599291;-1042671.809000000357628;0
3538;-744616.304000001400709;-1042656.734000001102686;0
3585;-744920.065000001341105;-1042522.129999998956919;0
3460;-744993.289000000804663;-1042693.587000001221895;0
3466;-745113.802000001072884;-1042675.725000001490116;0
3612;-744996.545000001788139;-1042292.646000001579523;0
2696;-743477.489999998360872;-1042038.000000000000000;0
1674;-741099.000000000000000;-1044736.000000000000000;0
747;-741690.000000000000000;-1043000.000000000000000;0
2192;-743499.000000000000000;-1045199.000000000000000;0
2892;-744005.317000001668930;-1043204.537000000476837;0
3752;-743213.949999999254942;-1042902.719999998807907;0
6726;-742476.517999999225140;-1044410.600000001490116;0
3706;-744567.589999999850988;-1042534.585000000894070;0
1523;-741679.000000000000000;-1043865.000000000000000;0
3537;-744632.945000000298023;-1042671.657000001519918;0
7;-743479.000000000000000;-1042567.000000000000000;155
1994;-743483.000000000000000;-1045010.000000000000000;0
514;-742119.000000000000000;-1043141.000000000000000;0
6099;-741947.280000001192093;-1043424.289999999105930;0
881;-741806.000000000000000;-1042815.000000000000000;0
2398;-742150.000000000000000;-1045370.000000000000000;0
3068;-744158.921000000089407;-1042812.230999998748302;0
513;-742083.000000000000000;-1043145.000000000000000;0
1584;-742368.000000000000000;-1044717.000000000000000;0
1449;-741533.000000000000000;-1044684.000000000000000;0
2520;-741847.000000000000000;-1045324.000000000000000;0
1163;-741072.820000000298023;-1044501.940000001341105;0
4221;-742209.576000001281500;-1043499.238000001758337;0
7276;-742801.670000001788139;-1044613.309999998658895;0
349;-742524.000000000000000;-1043764.000000000000000;0
2262;-742999.000000000000000;-1045686.000000000000000;0
1248;-742109.000000000000000;-1044631.000000000000000;0
4333;-742428.420000001788139;-1043255.609999999403954;0
3915;-744021.765999998897314;-1043098.603999998420477;0
1491;-741057.000000000000000;-1044333.000000000000000;0
2222;-743058.000000000000000;-1045420.000000000000000;0
4144;-742704.414999999105930;-1043822.484999999403954;0
1765;-741159.000000000000000;-1044178.000000000000000;0
1698;-741464.000000000000000;-1044668.000000000000000;0
2759;-743890.965999998152256;-1043486.399000000208616;0
4611;-742532.804999999701977;-1042593.420000001788139;0
2276;-742865.000000000000000;-1045649.000000000000000;0
5937;-744081.739000000059605;-1043323.396999999880791;0
8263;-742151.089999999850988;-1042702.239999998360872;0
466;-741743.000000000000000;-1043331.000000000000000;0
2484;-741269.109999999403954;-1044779.070000000298023;0
6703;-742288.903999999165535;-1044591.625999998301268;0
7776;-743089.784000001847744;-1045773.409000001847744;0
1214;-742064.000000000000000;-1044358.000000000000000;0
1650;-741371.000000000000000;-1044490.000000000000000;0
1433;-741895.000000000000000;-1044328.000000000000000;0
1030;-741975.000000000000000;-1044753.000000000000000;0
1780;-741214.000000000000000;-1043934.000000000000000;0
5265;-743188.572999998927116;-1043226.513999998569489;0
1939;-743269.000000000000000;-1044355.000000000000000;0
2210;-743280.000000000000000;-1045237.000000000000000;0
6487;-741745.798000000417233;-1044519.414999999105930;0
6274;-742318.392999999225140;-1043016.747000001370907;0
4070;-742925.285000000149012;-1043783.565000001341105;0
5109;-742850.925999999046326;-1043483.024999998509884;0
2392;-742057.000000000000000;-1045310.000000000000000;0
7181;-742612.239999998360872;-1044670.160000000149012;0
6826;-741405.300000000745058;-1044777.199999999254942;0
6943;-742902.013999998569489;-1043932.647999998182058;0
7285;-742806.960000000894070;-1044758.379999998956919;0
5296;-743058.934999998658895;-1043177.035000000149012;0
3206;-743702.239000000059605;-1042499.019000001251698;0
2560;-741251.000000000000000;-1044390.000000000000000;0
4220;-742214.344999998807907;-1043580.359999999403954;0
1369;-742029.000000000000000;-1044788.000000000000000;0
4082;-742825.565000001341105;-1043737.364999998360872;0
7004;-743069.289999999105930;-1044326.469999998807907;0
529;-742162.000000000000000;-1043803.000000000000000;0
2016;-743230.000000000000000;-1044873.000000000000000;0
2147;-742828.000000000000000;-1044984.000000000000000;0
3279;-743638.815999999642372;-1042804.333999998867512;0
3110;-743743.295000001788139;-1042640.627000000327826;0
651;-742490.000000000000000;-1043564.000000000000000;0
2009;-743221.000000000000000;-1044770.000000000000000;0
6119;-743582.679999999701977;-1042696.969999998807907;0
6337;-742257.140000000596046;-1042864.820000000298023;0
4328;-742347.322000000625849;-1043375.796999998390675;0
7011;-742831.309999998658895;-1044257.245000001043081;0
3996;-743394.274999998509884;-1044004.254999998956919;0
110;-744127.000000000000000;-1042724.000000000000000;0
7947;-742030.969999998807907;-1044096.679999999701977;0
6092;-742001.309999998658895;-1043482.089999999850988;0
2494;-741985.000000000000000;-1044165.000000000000000;0
3836;-743096.070000000298023;-1042561.879999998956919;0
8046;-742169.109999999403954;-1044835.660000000149012;0
1537;-741924.000000000000000;-1043954.000000000000000;0
1539;-741977.000000000000000;-1043997.000000000000000;0
7017;-742571.059999998658895;-1044267.640000000596046;0
318;-742434.000000000000000;-1044213.000000000000000;0
1335;-741752.000000000000000;-1044833.000000000000000;0
504;-741937.000000000000000;-1043164.000000000000000;0
4860;-742964.800999999046326;-1043016.107999999076128;0
8051;-742213.199999999254942;-1044935.890000000596046;0
3795;-743173.190000001341105;-1042842.170000001788139;0
2326;-742523.000000000000000;-1045498.000000000000000;0
3169;-743932.120000001043081;-1042582.179999999701977;0
1525;-741738.000000000000000;-1043823.000000000000000;0
7809;-741981.809999998658895;-1044560.280000001192093;0
5157;-743178.671999998390675;-1043354.681000001728535;0
6040;-742075.469999998807907;-1043676.809999998658895;0
7325;-743032.969999998807907;-1045186.298999998718500;0
6504;-741755.193999998271465;-1044619.083000000566244;0
2358;-742370.000000000000000;-1045593.000000000000000;0
6830;-741526.739999998360872;-1044761.309000000357628;0
4030;-743133.280000001192093;-1043791.552000001072884;0
6121;-742069.784000001847744;-1043299.828000001609325;0
7653;-742255.225000001490116;-1045513.048000000417233;0
3792;-743110.019999999552965;-1042846.530000001192093;0
340;-742588.000000000000000;-1043906.000000000000000;0
2048;-743528.000000000000000;-1045069.000000000000000;0
5284;-743041.022999998182058;-1043277.397999998182058;0
602;-741828.000000000000000;-1043190.000000000000000;0
873;-741728.000000000000000;-1042672.000000000000000;0
1120;-741778.000000000000000;-1044457.000000000000000;0
5161;-743160.846999999135733;-1043333.914999999105930;0
619;-742229.000000000000000;-1043277.000000000000000;0
1269;-742246.000000000000000;-1044462.000000000000000;0
1629;-742450.000000000000000;-1044518.000000000000000;0
400;-742356.000000000000000;-1043931.000000000000000;0
1465;-741870.000000000000000;-1044016.000000000000000;0
730;-741948.000000000000000;-1042998.000000000000000;0
4650;-742749.989000000059605;-1042534.539999999105930;0
2474;-743439.000000000000000;-1044900.000000000000000;0
2339;-742747.000000000000000;-1045548.000000000000000;0
6822;-741283.870000001043081;-1044793.059999998658895;0
5023;-742588.899000000208616;-1042870.296999998390675;0
6003;-742038.201000001281500;-1043299.010999999940395;0
7516;-742248.390000000596046;-1044368.907999999821186;0
4114;-742764.195000000298023;-1044131.760000001639128;0
525;-742233.000000000000000;-1043884.000000000000000;0
4982;-742559.320999998599291;-1043012.914000000804663;0
2046;-743382.000000000000000;-1044968.000000000000000;0
216;-743023.000000000000000;-1043539.000000000000000;0
7155;-742920.776999998837709;-1044546.934000000357628;0
1386;-742158.000000000000000;-1044976.000000000000000;0
738;-741818.000000000000000;-1043024.000000000000000;0
1380;-742156.000000000000000;-1044947.000000000000000;0
6363;-742027.344999998807907;-1042665.324000000953674;0
2073;-743069.000000000000000;-1044754.000000000000000;0
7022;-743155.660000000149012;-1044074.410000000149012;0
1983;-743474.000000000000000;-1044709.000000000000000;0
7646;-742318.263999998569489;-1045391.811000000685453;0
6357;-741947.870000001043081;-1042701.129999998956919;0
5065;-742796.800999999046326;-1043254.010000001639128;0
6652;-741678.190000001341105;-1044132.780000001192093;0
6993;-743172.409000001847744;-1044501.339000001549721;0
1543;-742235.000000000000000;-1044164.000000000000000;0
5644;-743428.793999999761581;-1043691.079999998211861;0
5118;-742835.168000001460314;-1043315.074000000953674;0
1128;-741655.000000000000000;-1044448.000000000000000;0
7651;-742295.381000000983477;-1045479.861999999731779;0
2758;-743919.949999999254942;-1043488.059999998658895;0
1590;-742377.000000000000000;-1044885.000000000000000;0
1511;-741795.000000000000000;-1044159.000000000000000;0
596;-741867.000000000000000;-1043259.000000000000000;0
6399;-742013.379999998956919;-1042502.739999998360872;0
7164;-742596.114999998360872;-1044447.173000000417233;0
4926;-742452.660000000149012;-1042896.190000001341105;0
4089;-742812.844999998807907;-1043560.114999998360872;0
2315;-742854.000000000000000;-1045460.000000000000000;0
4814;-743000.489999998360872;-1042803.920000001788139;0
6190;-742318.782999999821186;-1043068.206000000238419;0
7218;-742534.100000001490116;-1044603.559999998658895;0
1618;-742405.000000000000000;-1044404.000000000000000;0
3214;-743628.813000001013279;-1042457.677000001072884;0
4718;-742933.730000000447035;-1042628.039999999105930;0
3338;-743968.458999998867512;-1043042.706999998539686;0
8242;-742568.629999998956919;-1045197.829999998211861;0
1287;-742217.000000000000000;-1044486.000000000000000;0
5325;-742997.480000000447035;-1043042.289999999105930;0
3833;-743029.679999999701977;-1042612.300000000745058;0
1415;-741623.000000000000000;-1044561.000000000000000;0
3415;-743772.855999998748302;-1043081.368000000715256;0
1108;-741261.000000000000000;-1044593.000000000000000;0
3963;-743372.780000001192093;-1043538.789999999105930;0
6233;-742319.057000000029802;-1043072.162999998778105;0
381;-742465.000000000000000;-1043700.000000000000000;0
3287;-743711.173999998718500;-1042886.515999998897314;0
5421;-742337.905999999493361;-1042777.837999999523163;0
7740;-742301.949999999254942;-1045061.239000000059605;0
6854;-741522.427999999374151;-1045038.967999998480082;0
5984;-743985.258000001311302;-1042842.061999998986721;0
2245;-743239.000000000000000;-1045356.000000000000000;0
4989;-742648.756000000983477;-1043019.318999998271465;0
1791;-742157.000000000000000;-1044163.000000000000000;0
4151;-742573.039999999105930;-1044109.035000000149012;0
5177;-743336.440999999642372;-1043440.883999999612570;0
4945;-742422.162999998778105;-1043009.861000001430511;0
207;-743142.000000000000000;-1043590.000000000000000;0
1090;-741581.000000000000000;-1044552.000000000000000;0
7048;-743392.429999999701977;-1044236.170000001788139;0
1961;-743397.000000000000000;-1044642.000000000000000;0
2366;-742513.000000000000000;-1045512.000000000000000;0
8067;-742257.760000001639128;-1045240.980000000447035;0
4891;-742595.048999998718500;-1042857.274999998509884;0
7005;-742998.190000001341105;-1043944.824999999254942;0
1265;-742047.000000000000000;-1044960.000000000000000;0
6198;-742312.659000001847744;-1043056.964999999850988;0
1919;-743381.000000000000000;-1044393.000000000000000;0
6225;-742314.519999999552965;-1043055.927000001072884;0
7142;-742872.445000000298023;-1044472.239999998360872;0
4780;-742928.596000000834465;-1042747.480000000447035;0
4649;-742732.228999998420477;-1042525.100000001490116;0
1485;-741184.000000000000000;-1044223.000000000000000;0
3348;-743960.361000001430511;-1043015.629999998956919;0
4427;-742190.519999999552965;-1043099.440000001341105;0
5682;-743399.638000000268221;-1043719.120999999344349;0
1555;-741196.000000000000000;-1044374.000000000000000;0
1913;-743453.000000000000000;-1044482.000000000000000;0
4745;-742840.800000000745058;-1042742.120000001043081;0
2294;-742754.000000000000000;-1045391.000000000000000;0
4928;-742444.890000000596046;-1042854.899999998509884;0
408;-742317.000000000000000;-1044182.000000000000000;0
7262;-742990.940000001341105;-1044886.989999998360872;0
5662;-743423.271000001579523;-1043710.372000001370907;0
248;-743439.000000000000000;-1043748.000000000000000;0
6694;-742280.806000001728535;-1044814.875999998301268;0
2545;-741723.000000000000000;-1044265.000000000000000;0
2526;-741087.000000000000000;-1044616.000000000000000;0
1732;-741840.000000000000000;-1045226.000000000000000;0
7317;-742579.670000001788139;-1045022.239999998360872;0
6977;-743098.949999999254942;-1044459.879999998956919;0
2108;-743147.000000000000000;-1045086.000000000000000;0
4512;-742515.339999999850988;-1042750.230000000447035;0
8258;-742053.760000001639128;-1042683.769999999552965;0
4002;-743397.818999998271465;-1044054.317999999970198;0
4339;-742459.269000001251698;-1043367.923000000417233;0
2512;-743070.000000000000000;-1044052.000000000000000;0
6194;-742315.721000000834465;-1043062.585999999195337;0
1240;-742145.000000000000000;-1044418.000000000000000;0
1216;-742093.000000000000000;-1044333.000000000000000;0
3094;-743906.500000000000000;-1042759.554999999701977;0
4936;-742454.684000000357628;-1042685.620999999344349;0
2161;-742876.000000000000000;-1045153.000000000000000;0
3786;-743150.480000000447035;-1042925.960000000894070;0
392;-742418.000000000000000;-1043843.000000000000000;0
4466;-742177.620000001043081;-1042567.899999998509884;0
909;-742183.000000000000000;-1042503.000000000000000;0
5135;-742979.611000001430511;-1043468.912999998778105;0
5459;-742368.519000001251698;-1043474.221999999135733;0
4829;-743051.579999998211861;-1042916.609999999403954;0
6316;-743949.877999998629093;-1042656.561999998986721;0
1040;-741904.000000000000000;-1044623.000000000000000;0
4555;-742337.140000000596046;-1042512.379999998956919;0
1675;-741059.000000000000000;-1044754.000000000000000;0
170;-743440.000000000000000;-1043364.000000000000000;0
2424;-742476.000000000000000;-1045132.000000000000000;0
5233;-743347.210000000894070;-1043435.807000000029802;0
4738;-742733.910000000149012;-1042704.890000000596046;0
4072;-742934.225000001490116;-1043833.899999998509884;0
7186;-742587.609999999403954;-1044726.000000000000000;0
1099;-741376.000000000000000;-1044563.000000000000000;0
6154;-742316.324000000953674;-1043069.546000000089407;0
545;-742337.000000000000000;-1043805.000000000000000;0
4424;-742225.300000000745058;-1043033.250000000000000;0
6916;-742011.701000001281500;-1045042.927000001072884;0
1832;-743024.000000000000000;-1044100.000000000000000;0
4895;-742596.936999998986721;-1042829.168000001460314;0
5710;-743421.574999999254942;-1043640.598000001162291;0
6458;-743360.644999999552965;-1043919.311999998986721;0
841;-742056.000000000000000;-1042508.000000000000000;0
3999;-743412.539999999105930;-1043918.725000001490116;0
628;-742217.370000001043081;-1043308.559999998658895;0
6151;-742311.114999998360872;-1043061.451000001281500;0
677;-742425.000000000000000;-1043200.000000000000000;0
5245;-743368.859999999403954;-1043290.789999999105930;0
2323;-742622.000000000000000;-1045487.000000000000000;0
1155;-741208.000000000000000;-1044484.000000000000000;0
823;-742110.000000000000000;-1042596.000000000000000;0
4786;-742953.361000001430511;-1042655.886999998241663;0
1762;-741227.000000000000000;-1044108.000000000000000;0
5213;-743326.385999999940395;-1043368.675999999046326;0
6722;-742357.717000000178814;-1044705.708000000566244;0
4757;-742873.984000001102686;-1042820.212000001221895;0
6851;-741595.567000001668930;-1045078.456999998539686;0
5251;-743317.296000000089407;-1043180.037999998778105;69
1607;-742414.000000000000000;-1044379.000000000000000;0
3750;-743221.379999998956919;-1042925.429999999701977;0
1340;-741695.000000000000000;-1044759.000000000000000;0
2057;-742787.000000000000000;-1044365.000000000000000;0
4690;-742679.162999998778105;-1042583.138999998569489;0
8068;-742254.309999998658895;-1045265.969999998807907;0
1434;-741931.000000000000000;-1044293.000000000000000;0
4874;-742795.429999999701977;-1042925.910000000149012;0
8056;-742242.379999998956919;-1045023.460000000894070;0
5507;-743426.703000001609325;-1043656.230999998748302;0
7003;-743074.140000000596046;-1044350.280000001192093;0
6179;-742312.195000000298023;-1043059.041000001132488;0
4143;-742750.925000000745058;-1044017.960000000894070;0
3822;-743065.039999999105930;-1042594.239999998360872;0
6699;-742301.118999999016523;-1044484.282999999821186;0
7171;-742671.969999998807907;-1044508.219999998807907;0
6245;-742369.682000000029802;-1043057.377000000327826;0
4798;-743028.991999998688698;-1042693.375000000000000;0
7678;-742388.550999999046326;-1045109.184000000357628;0
5082;-742925.114000000059605;-1043348.883999999612570;0
1936;-743293.000000000000000;-1044272.000000000000000;0
7034;-743299.725999999791384;-1044153.140000000596046;0
4744;-742848.129999998956919;-1042759.629999998956919;0
6279;-742306.210000000894070;-1043033.421999998390675;0
4036;-743246.920000001788139;-1043771.574999999254942;0
3378;-743818.598999999463558;-1042922.491999998688698;0
1597;-742338.000000000000000;-1045064.000000000000000;0
2447;-742772.000000000000000;-1044159.000000000000000;0
7199;-742570.910000000149012;-1044916.410000000149012;0
4520;-742651.079999998211861;-1042798.449999999254942;0
7295;-743165.010000001639128;-1044947.170000001788139;0
3132;-743939.052000001072884;-1042650.916999999433756;0
4933;-742437.605000000447035;-1042750.853000000119209;0
6207;-742313.287000000476837;-1043056.642000000923872;0
1401;-741723.000000000000000;-1044408.000000000000000;0
4696;-742682.817000001668930;-1042658.543999999761581;0
3975;-743112.984999999403954;-1043716.375999998301268;0
262;-743408.000000000000000;-1043731.000000000000000;0
2451;-742884.000000000000000;-1044134.000000000000000;0
331;-742664.000000000000000;-1044024.000000000000000;0
1908;-743459.000000000000000;-1044358.000000000000000;0
7168;-742792.969999998807907;-1044547.879999998956919;0
1498;-741382.000000000000000;-1044310.000000000000000;0
1831;-742994.000000000000000;-1044105.000000000000000;0
7679;-742498.250000000000000;-1045115.879999998956919;0
6833;-741571.423000000417233;-1044909.473999999463558;0
2040;-743285.000000000000000;-1044809.000000000000000;0
5767;-742424.269999999552965;-1042581.609000001102686;0
2239;-743345.000000000000000;-1045263.000000000000000;0
5778;-742917.131000000983477;-1043419.723000001162291;0
6370;-741968.780000001192093;-1042685.250000000000000;0
4959;-742331.289999999105930;-1043002.690000001341105;0
707;-741897.000000000000000;-1042863.000000000000000;0
3824;-743038.059999998658895;-1042573.800000000745058;0
554;-742238.000000000000000;-1043717.000000000000000;0
5024;-742588.655000001192093;-1042886.519000001251698;0
6963;-743004.519999999552965;-1044166.870000001043081;0
7137;-742916.074999999254942;-1044400.230000000447035;0
1121;-741765.000000000000000;-1044444.000000000000000;0
1044;-741861.000000000000000;-1044743.000000000000000;96
1357;-741935.000000000000000;-1044871.000000000000000;0
7188;-742583.839999999850988;-1044742.870000001043081;0
4174;-742738.230000000447035;-1043763.155000001192093;0
5994;-743358.609999999403954;-1043460.469999998807907;0
4522;-742668.079999998211861;-1042813.780000001192093;0
4680;-742759.370000001043081;-1042864.140000000596046;0
3986;-743313.355000000447035;-1043956.986999999731779;0
1872;-743422.000000000000000;-1044246.000000000000000;0
4766;-742803.037999998778105;-1042842.532999999821186;0
2300;-742561.000000000000000;-1045413.000000000000000;0
5220;-743247.339999999850988;-1043589.050000000745058;0
3848;-743094.383999999612570;-1042505.245000001043081;0
543;-742361.000000000000000;-1043823.000000000000000;0
2533;-743542.000000000000000;-1044816.000000000000000;0
698;-742041.000000000000000;-1042903.000000000000000;0
1247;-742104.000000000000000;-1044609.000000000000000;0
4322;-742266.414000000804663;-1043213.907999999821186;0
6931;-742050.949999999254942;-1045191.190000001341105;0
569;-742096.000000000000000;-1043601.000000000000000;0
728;-741997.000000000000000;-1042918.000000000000000;0
1854;-742675.000000000000000;-1044271.000000000000000;0
4041;-743227.600000001490116;-1043746.495000001043081;0
2490;-742063.000000000000000;-1044273.000000000000000;0
917;-742121.000000000000000;-1043008.000000000000000;0
6150;-742311.879999998956919;-1043062.857000000774860;0
1475;-741565.000000000000000;-1044185.000000000000000;0
1477;-741482.750000000000000;-1044212.480000000447035;0
4799;-743008.011999998241663;-1042697.245999999344349;0
4428;-742206.750000000000000;-1043097.800000000745058;0
4946;-742411.739000000059605;-1043002.199999999254942;0
4801;-742998.943999998271465;-1042721.118000000715256;0
4574;-742339.980000000447035;-1042661.570000000298023;0
7040;-743356.140000000596046;-1044164.359999999403954;0
5226;-743310.730000000447035;-1043553.269999999552965;0
2197;-743331.000000000000000;-1045189.000000000000000;0
4804;-743020.045000001788139;-1042704.315999999642372;0
7175;-742651.780000001192093;-1044558.149999998509884;0
1458;-741506.000000000000000;-1044384.000000000000000;0
817;-741937.000000000000000;-1042586.000000000000000;0
5167;-743219.324999999254942;-1043405.249000001698732;0
2154;-742805.000000000000000;-1045147.000000000000000;0
7397;-743021.859999999403954;-1045682.989999998360872;0
1906;-743459.000000000000000;-1044325.000000000000000;0
6692;-742222.114999998360872;-1044818.673000000417233;0
3312;-743789.184999998658895;-1042904.234000001102686;0
5595;-743416.488000001758337;-1043680.118999999016523;0
5791;-743256.583000000566244;-1043571.184000000357628;0
3843;-743139.170000001788139;-1042650.050000000745058;0
1795;-742155.000000000000000;-1044231.000000000000000;0
4130;-742868.460000000894070;-1044055.510000001639128;0
4125;-742857.695000000298023;-1044110.460000000894070;0
7744;-742941.256999999284744;-1045533.171000000089407;0
7245;-742748.780000001192093;-1044837.699999999254942;0
6224;-742315.320000000298023;-1043057.335000000894070;0
6193;-742316.486000001430511;-1043063.991000000387430;0
5198;-743259.600999999791384;-1043302.061000000685453;0
5280;-743058.660000000149012;-1043362.201999999582767;0
3422;-743740.361000001430511;-1043095.657999999821186;0
7742;-741703.945999998599291;-1045067.738000001758337;0
4180;-742368.370000001043081;-1044115.471999999135733;0
3954;-743409.050999999046326;-1043550.699999999254942;0
7233;-742606.750000000000000;-1044827.379999998956919;0
7083;-743309.980000000447035;-1044509.500000000000000;0
4604;-742463.967999998480082;-1042613.381999999284744;0
7018;-742577.747000001370907;-1044239.712999999523163;0
4498;-741866.120000001043081;-1042718.471000000834465;0
5283;-743032.892000000923872;-1043284.399000000208616;0
6651;-741697.910000000149012;-1044123.329999998211861;0
4429;-742222.260000001639128;-1043102.250000000000000;0
5412;-742582.037000000476837;-1042571.986000001430511;0
8053;-742224.410000000149012;-1044970.879999998956919;0
4010;-743200.372999999672174;-1044041.177999999374151;0
3767;-743033.910000000149012;-1042982.390000000596046;0
6234;-742324.105000000447035;-1043076.613000001758337;0
5187;-743086.927000001072884;-1043435.230999998748302;0
3340;-743960.212999999523163;-1043080.166999999433756;0
4778;-742918.024999998509884;-1042786.565000001341105;0
1381;-742115.000000000000000;-1044999.000000000000000;0
6499;-741707.811000000685453;-1044907.068999998271465;0
4247;-742154.829999998211861;-1043394.660000000149012;0
7540;-742660.390000000596046;-1045368.829999998211861;0
3807;-743008.690000001341105;-1042928.690000001341105;0
7028;-743257.254999998956919;-1044104.574999999254942;0
5294;-743056.328999999910593;-1043196.096999999135733;0
1982;-743408.000000000000000;-1044646.000000000000000;0
517;-742207.000000000000000;-1043117.000000000000000;0
5197;-743222.513000000268221;-1043313.989999998360872;0
4750;-742784.420000001788139;-1042733.429999999701977;0
4901;-742520.120000001043081;-1042823.960000000894070;0
6338;-742247.910000000149012;-1042851.670000001788139;0
205;-743173.000000000000000;-1043599.000000000000000;0
7283;-742804.480000000447035;-1044732.769999999552965;0
1828;-743007.000000000000000;-1044088.000000000000000;0
2483;-741266.219999998807907;-1044755.030000001192093;0
2209;-743309.000000000000000;-1045217.000000000000000;0
4146;-742666.940000001341105;-1043854.829999998211861;0
1256;-742084.000000000000000;-1044787.000000000000000;0
1459;-741491.000000000000000;-1044340.000000000000000;0
6952;-743044.730999998748302;-1044106.129999998956919;0
1414;-741627.000000000000000;-1044593.000000000000000;0
984;-741917.000000000000000;-1044411.000000000000000;0
1818;-743046.000000000000000;-1044380.000000000000000;0
6242;-742366.677999999374151;-1043062.949000000953674;0
1457;-741510.000000000000000;-1044411.000000000000000;0
874;-741755.000000000000000;-1042675.000000000000000;0
4018;-743153.285000000149012;-1043925.850000001490116;0
277;-743398.000000000000000;-1043928.000000000000000;0
4320;-742264.149000000208616;-1043259.541999999433756;0
202;-743240.000000000000000;-1043597.000000000000000;0
6196;-742314.190000001341105;-1043059.774999998509884;0
1169;-741813.000000000000000;-1044376.000000000000000;0
4679;-742774.199999999254942;-1042819.160000000149012;0
6647;-741767.690000001341105;-1044068.160000000149012;0
5746;-743415.399000000208616;-1043698.644000001251698;0
792;-741718.000000000000000;-1042599.000000000000000;0
4593;-742510.820000000298023;-1042652.203999999910593;0
269;-743248.000000000000000;-1043725.000000000000000;0
1531;-741782.000000000000000;-1043838.000000000000000;0
3322;-743927.326000001281500;-1042934.425999999046326;0
4723;-742883.429999999701977;-1042644.829999998211861;0
1318;-741838.000000000000000;-1044940.000000000000000;0
2131;-743073.000000000000000;-1045134.000000000000000;0
2219;-743094.000000000000000;-1045386.000000000000000;0
6143;-742309.690999999642372;-1043060.385000001639128;0
4724;-742870.089999999850988;-1042658.210000000894070;0
5686;-743394.912000000476837;-1043720.872000001370907;0
4848;-742977.940000001341105;-1042862.019999999552965;0
819;-741987.000000000000000;-1042599.000000000000000;0
2135;-743006.000000000000000;-1045119.000000000000000;0
323;-742711.000000000000000;-1044140.000000000000000;0
1405;-741681.000000000000000;-1044325.000000000000000;0
1956;-743397.000000000000000;-1044501.000000000000000;0
7009;-742877.537000000476837;-1044242.370000001043081;0
6922;-742056.329999998211861;-1045086.679999999701977;0
4024;-743223.734999999403954;-1043859.954999998211861;0
2334;-742872.000000000000000;-1045519.000000000000000;0
4560;-742427.079999998211861;-1042500.829999998211861;0
2263;-742989.000000000000000;-1045714.000000000000000;0
5695;-743417.217999998480082;-1043638.749000001698732;0
6507;-741738.839999999850988;-1044541.820000000298023;0
1226;-742204.000000000000000;-1044247.000000000000000;0
4978;-742491.822999998927116;-1043028.688000001013279;0
4169;-742414.420000001788139;-1043962.329999998211861;0
4531;-742746.070000000298023;-1042885.980000000447035;0
1167;-741836.000000000000000;-1044429.000000000000000;0
576;-742054.000000000000000;-1043517.000000000000000;0
4241;-742225.929999999701977;-1043394.530000001192093;0
4759;-742842.945999998599291;-1042806.664000000804663;0
7246;-742736.730000000447035;-1044825.399999998509884;0
6136;-742315.081999998539686;-1043070.210000000894070;0
1129;-741672.000000000000000;-1044438.000000000000000;0
5577;-743409.385999999940395;-1043630.826999999582767;0
2098;-743134.000000000000000;-1044763.000000000000000;0
3952;-743407.521999999880791;-1043538.500999998301268;0
8043;-742180.050000000745058;-1044750.160000000149012;0
5698;-743416.785999998450279;-1043633.638000000268221;0
