OID_;X;Y;TEMPERATURE
3614;-744984.548999998718500;-1042283.640999998897314;0
3019;-744463.447999998927116;-1042784.646000001579523;0
3568;-744718.817999999970198;-1042588.614999998360872;0
3692;-744525.876499999314547;-1042540.534000001847744;0
3580;-744924.973999999463558;-1042593.699999999254942;0
2605;-745393.842999998480082;-1042860.796000000089407;0
5975;-745052.346999999135733;-1042674.673000000417233;0
118;-745135.000000000000000;-1042687.000000000000000;0
3542;-744575.274000000208616;-1042656.160000000149012;0
2696;-743477.489999998360872;-1042038.000000000000000;0
2520;-741847.000000000000000;-1045324.000000000000000;0
6872;-741751.719999998807907;-1045296.679999999701977;0
2760;-743863.331000000238419;-1043483.304000001400709;0
2755;-744003.879000000655651;-1043471.734000001102686;0
2404;-742179.000000000000000;-1045467.000000000000000;0
3919;-743904.947000000625849;-1043493.929999999701977;0
3107;-743778.888000000268221;-1042682.131999999284744;0
2740;-744042.611999999731779;-1043335.940000001341105;0
6705;-742279.050999999046326;-1044655.923000000417233;0
6833;-741571.423000000417233;-1044909.473999999463558;0
1486;-741150.000000000000000;-1044219.000000000000000;0
1445;-741553.000000000000000;-1044757.000000000000000;0
1727;-741495.000000000000000;-1045103.000000000000000;0
1411;-741639.480000000447035;-1044683.019999999552965;0
6828;-741465.309999998658895;-1044768.940000001341105;0
7411;-743529.510000001639128;-1045393.140000000596046;0
2079;-742688.000000000000000;-1044428.000000000000000;0
385;-742436.000000000000000;-1043742.000000000000000;0
8079;-742021.839999999850988;-1045292.179999999701977;0
2070;-742993.000000000000000;-1044723.000000000000000;0
2097;-743143.000000000000000;-1044742.000000000000000;0
4156;-742513.734999999403954;-1043978.035000000149012;0
7263;-743009.559999998658895;-1044894.379999998956919;0
383;-742450.000000000000000;-1043722.000000000000000;0
4238;-742440.263000000268221;-1043528.236000001430511;0
7654;-742242.081000000238419;-1045273.263999998569489;0
7008;-742899.559999998658895;-1044224.074999999254942;0
2394;-742273.000000000000000;-1045360.000000000000000;0
2329;-742432.000000000000000;-1045508.000000000000000;0
2160;-742849.000000000000000;-1045147.000000000000000;0
2161;-742876.000000000000000;-1045153.000000000000000;0
8073;-742120.640000000596046;-1045259.500000000000000;0
7652;-742275.046999998390675;-1045497.052000001072884;0
7141;-742895.629999998956919;-1044470.910000000149012;0
4075;-742947.934999998658895;-1043903.649999998509884;0
7243;-742724.339999999850988;-1044835.870000001043081;0
4029;-743130.695999998599291;-1043815.427999999374151;0
7947;-742030.969999998807907;-1044096.679999999701977;0
524;-742255.000000000000000;-1043913.000000000000000;96
2326;-742523.000000000000000;-1045498.000000000000000;0
1780;-741214.000000000000000;-1043934.000000000000000;0
738;-741818.000000000000000;-1043024.000000000000000;0
1983;-743474.000000000000000;-1044709.000000000000000;0
1519;-741754.000000000000000;-1043956.000000000000000;0
748;-741671.000000000000000;-1042971.000000000000000;0
110;-744127.000000000000000;-1042724.000000000000000;0
7721;-742941.157000001519918;-1044215.368000000715256;0
7022;-743155.660000000149012;-1044074.410000000149012;0
1764;-741163.000000000000000;-1044144.000000000000000;0
7015;-742554.570000000298023;-1044360.725000001490116;0
735;-741910.000000000000000;-1043014.000000000000000;0
1287;-742217.000000000000000;-1044486.000000000000000;0
6339;-742245.460000000894070;-1042835.780000001192093;0
3310;-743829.561999998986721;-1042854.063000001013279;0
4046;-743205.699999999254942;-1044009.719999998807907;0
514;-742119.000000000000000;-1043141.000000000000000;0
510;-742048.000000000000000;-1043150.000000000000000;0
343;-742575.000000000000000;-1043857.000000000000000;0
847;-742155.000000000000000;-1042504.000000000000000;0
2050;-743460.000000000000000;-1045072.000000000000000;0
2008;-743242.000000000000000;-1044759.000000000000000;0
2018;-743244.000000000000000;-1044909.000000000000000;0
4170;-742407.245000001043081;-1043945.519999999552965;0
394;-742405.000000000000000;-1043863.000000000000000;0
7148;-742828.445000000298023;-1044472.094999998807907;0
6722;-742357.717000000178814;-1044705.708000000566244;0
2020;-743260.000000000000000;-1044941.000000000000000;0
1561;-743186.000000000000000;-1045098.000000000000000;0
547;-742316.910000000149012;-1043790.309999998658895;0
1251;-742091.000000000000000;-1044690.000000000000000;0
7;-743479.000000000000000;-1042567.000000000000000;0
4106;-742664.475000001490116;-1043755.761999998241663;0
17;-743587.000000000000000;-1042394.000000000000000;0
1855;-742642.000000000000000;-1044286.000000000000000;0
5303;-743164.818999998271465;-1043211.078000001609325;0
1492;-741096.000000000000000;-1044331.000000000000000;0
4332;-742410.359000001102686;-1043282.916000001132488;0
4124;-742751.265000000596046;-1043878.414999999105930;0
3204;-743715.278999999165535;-1042506.118999999016523;0
6;-743464.000000000000000;-1042594.000000000000000;0
1769;-741260.000000000000000;-1044112.000000000000000;0
2133;-743040.000000000000000;-1045127.000000000000000;0
2151;-742827.000000000000000;-1045047.000000000000000;0
2166;-743016.000000000000000;-1045179.000000000000000;0
7324;-742833.980000000447035;-1044949.109999999403954;0
224;-742904.000000000000000;-1043522.000000000000000;0
4162;-742497.193999998271465;-1044160.030000001192093;0
4173;-742756.320000000298023;-1043749.629999998956919;0
6746;-742405.083999998867512;-1044259.199999999254942;0
1766;-741257.000000000000000;-1044204.000000000000000;0
4333;-742428.420000001788139;-1043255.609999999403954;0
1470;-741728.000000000000000;-1044116.000000000000000;0
1515;-741913.000000000000000;-1044072.000000000000000;0
2447;-742772.000000000000000;-1044159.000000000000000;0
1718;-741366.219999998807907;-1044870.989999998360872;0
1701;-741378.000000000000000;-1044678.000000000000000;0
6700;-742298.611000001430511;-1044507.315999999642372;0
1371;-742089.000000000000000;-1044807.000000000000000;0
7031;-743301.824999999254942;-1044080.774999998509884;0
2235;-743401.000000000000000;-1045221.000000000000000;0
884;-741771.000000000000000;-1042776.000000000000000;0
1013;-742076.000000000000000;-1044595.000000000000000;0
2189;-743472.000000000000000;-1045183.000000000000000;0
4150;-742581.789999999105930;-1044138.429999999701977;0
727;-742001.000000000000000;-1042962.000000000000000;0
1091;-741531.480000000447035;-1044543.440000001341105;0
308;-742754.000000000000000;-1044149.000000000000000;0
6311;-743930.489999998360872;-1042569.390000000596046;0
728;-741997.000000000000000;-1042918.000000000000000;0
3154;-743984.818999998271465;-1042573.844999998807907;0
1982;-743408.000000000000000;-1044646.000000000000000;0
1518;-741994.000000000000000;-1044011.000000000000000;0
3101;-743922.754999998956919;-1042745.195000000298023;0
3264;-743565.725000001490116;-1042729.024999998509884;0
696;-742077.000000000000000;-1042913.000000000000000;0
2212;-743217.000000000000000;-1045279.000000000000000;0
3326;-744036.002000000327826;-1042922.574999999254942;0
1455;-741517.000000000000000;-1044468.000000000000000;0
711;-741828.000000000000000;-1042860.000000000000000;0
2226;-743057.000000000000000;-1045470.000000000000000;0
301;-742613.000000000000000;-1043903.000000000000000;0
4342;-742506.473000001162291;-1043301.100000001490116;0
4119;-742717.223999999463558;-1043999.837999999523163;0
504;-741937.000000000000000;-1043164.000000000000000;0
6982;-743055.109999999403954;-1044342.629999998956919;0
1242;-742137.000000000000000;-1044481.000000000000000;0
2043;-743471.000000000000000;-1044959.000000000000000;0
1996;-743484.000000000000000;-1045063.000000000000000;0
7048;-743392.429999999701977;-1044236.170000001788139;0
1695;-741550.000000000000000;-1044656.000000000000000;0
3292;-743576.905000001192093;-1042781.315000001341105;0
1920;-743384.000000000000000;-1044363.000000000000000;0
3752;-743213.949999999254942;-1042902.719999998807907;0
7212;-742559.410000000149012;-1045073.070000000298023;0
5062;-742798.513999998569489;-1043227.370999999344349;0
2209;-743309.000000000000000;-1045217.000000000000000;0
1991;-743482.000000000000000;-1044929.000000000000000;0
1388;-742152.000000000000000;-1045026.000000000000000;0
1970;-743380.000000000000000;-1044854.000000000000000;0
1381;-742115.000000000000000;-1044999.000000000000000;0
1987;-743480.000000000000000;-1044820.000000000000000;0
2091;-742920.000000000000000;-1044593.000000000000000;0
2084;-742447.000000000000000;-1044797.000000000000000;0
3387;-743960.368000000715256;-1043194.717000000178814;0
2255;-743181.000000000000000;-1045372.000000000000000;0
5322;-743060.379999998956919;-1043029.589999999850988;0
7515;-742273.021999999880791;-1044371.543999999761581;0
1652;-741379.000000000000000;-1044550.000000000000000;0
6714;-742287.171000000089407;-1044923.995999999344349;0
2256;-743156.000000000000000;-1045353.000000000000000;0
3233;-744152.962999999523163;-1042686.791999999433756;0
6695;-742306.234000001102686;-1044816.138999998569489;0
4506;-742419.730000000447035;-1042717.019999999552965;0
7776;-743089.784000001847744;-1045773.409000001847744;0
1373;-742143.000000000000000;-1044822.000000000000000;0
6952;-743044.730999998748302;-1044106.129999998956919;0
4184;-742311.379999998956919;-1044164.660000000149012;0
1355;-741899.000000000000000;-1044858.000000000000000;0
7279;-742799.399999998509884;-1044679.829999998211861;0
2289;-742915.000000000000000;-1045426.000000000000000;0
7957;-741692.839999999850988;-1044277.559999998658895;0
6610;-741694.364999998360872;-1043961.170000001788139;0
1523;-741679.000000000000000;-1043865.000000000000000;0
4232;-742315.057999998331070;-1043428.918999999761581;0
1531;-741782.000000000000000;-1043838.000000000000000;0
4208;-742372.416999999433756;-1043503.423000000417233;0
6686;-742381.967000000178814;-1044961.747000001370907;0
1915;-743468.000000000000000;-1044494.000000000000000;0
1839;-742994.469999998807907;-1044185.679999999701977;0
7168;-742792.969999998807907;-1044547.879999998956919;0
1603;-742525.000000000000000;-1044922.000000000000000;0
1029;-741978.000000000000000;-1044721.000000000000000;0
2451;-742884.000000000000000;-1044134.000000000000000;0
5240;-743364.164000000804663;-1043254.934000000357628;0
4126;-742851.335000000894070;-1044085.449999999254942;0
5119;-742850.592999998480082;-1043328.484999999403954;0
4572;-742343.539999999105930;-1042598.289999999105930;0
4426;-742197.589999999850988;-1043031.679999999701977;0
8150;-743304.219999998807907;-1043217.539999999105930;0
1324;-741943.000000000000000;-1044994.000000000000000;0
2516;-742500.000000000000000;-1044414.000000000000000;0
1614;-742388.000000000000000;-1044432.000000000000000;0
6770;-741306.423999998718500;-1044414.120999999344349;0
1931;-743388.000000000000000;-1044409.000000000000000;0
6696;-742332.717000000178814;-1044815.649999998509884;0
1545;-742236.000000000000000;-1044234.000000000000000;0
5434;-744042.467999998480082;-1043135.986999999731779;0
7520;-742808.589999999850988;-1045680.519999999552965;0
1913;-743453.000000000000000;-1044482.000000000000000;0
1293;-742037.000000000000000;-1044462.000000000000000;0
5135;-742979.611000001430511;-1043468.912999998778105;0
4089;-742812.844999998807907;-1043560.114999998360872;0
1039;-741914.000000000000000;-1044595.000000000000000;0
7087;-743339.940000001341105;-1044536.690000001341105;0
7350;-742556.390000000596046;-1045185.980000000447035;0
587;-741944.000000000000000;-1043391.000000000000000;0
7215;-742484.320000000298023;-1044546.620000001043081;0
757;-741673.000000000000000;-1042678.000000000000000;0
4935;-742447.241999998688698;-1042699.399000000208616;0
2082;-742569.000000000000000;-1044642.000000000000000;0
2417;-742421.000000000000000;-1045135.000000000000000;0
5111;-742892.337999999523163;-1043424.370999999344349;0
8060;-742295.719999998807907;-1045082.859999999403954;0
6473;-741931.359999999403954;-1044555.109999999403954;0
1596;-742323.000000000000000;-1045037.000000000000000;0
1945;-743270.000000000000000;-1044454.000000000000000;0
5142;-743039.870000001043081;-1043473.929999999701977;0
6682;-742329.804000001400709;-1044319.611999999731779;0
6726;-742476.517999999225140;-1044410.600000001490116;0
1058;-741667.000000000000000;-1045072.000000000000000;0
6791;-741047.329999998211861;-1044765.467999998480082;0
6862;-741438.085999999195337;-1045031.583999998867512;0
2479;-741247.800000000745058;-1044609.379999998956919;0
571;-742082.000000000000000;-1043581.000000000000000;0
4310;-742031.800000000745058;-1043475.199999999254942;0
1794;-742151.000000000000000;-1044190.000000000000000;0
5208;-743237.954999998211861;-1043368.065999999642372;0
4827;-743046.359999999403954;-1042958.140000000596046;0
8274;-742065.089999999850988;-1042742.109999999403954;0
5206;-743189.870999999344349;-1043360.936000000685453;0
3846;-743149.390000000596046;-1042549.600000001490116;0
1170;-741893.000000000000000;-1044403.000000000000000;0
1875;-743367.000000000000000;-1044261.000000000000000;0
3839;-743112.140000000596046;-1042558.280000001192093;0
2262;-742999.000000000000000;-1045686.000000000000000;0
4632;-742615.638999998569489;-1042624.039999999105930;0
2887;-744098.480000000447035;-1043192.508000001311302;0
5923;-742953.765000000596046;-1043015.067999999970198;0
4889;-742621.425000000745058;-1042831.109999999403954;0
4059;-743142.649999998509884;-1043612.730000000447035;0
4564;-742452.267000000923872;-1042534.980999998748302;0
531;-742157.000000000000000;-1043778.000000000000000;0
6505;-741746.570000000298023;-1044600.429999999701977;0
1436;-741869.000000000000000;-1044323.000000000000000;0
4516;-742588.570000000298023;-1042771.460000000894070;0
4922;-742443.129999998956919;-1042886.510000001639128;0
2258;-742974.000000000000000;-1045574.000000000000000;0
786;-741706.000000000000000;-1042606.000000000000000;0
4874;-742795.429999999701977;-1042925.910000000149012;0
532;-742114.000000000000000;-1043737.000000000000000;0
1926;-743301.000000000000000;-1044321.000000000000000;0
1333;-741781.000000000000000;-1044777.000000000000000;0
5292;-743055.866000000387430;-1043215.710999999195337;0
3781;-743273.059999998658895;-1042814.050000000745058;0
1129;-741672.000000000000000;-1044438.000000000000000;0
1678;-741113.109999999403954;-1044552.320000000298023;0
819;-741987.000000000000000;-1042599.000000000000000;0
6976;-743107.829999998211861;-1044483.399999998509884;0
330;-742659.000000000000000;-1044043.000000000000000;0
2492;-742017.000000000000000;-1044210.000000000000000;0
1437;-741840.000000000000000;-1044336.000000000000000;0
7188;-742583.839999999850988;-1044742.870000001043081;0
599;-741837.000000000000000;-1043243.000000000000000;0
5272;-743000.013999998569489;-1043245.364000000059605;0
841;-742056.000000000000000;-1042508.000000000000000;0
7000;-743096.190000001341105;-1044426.870000001043081;0
4466;-742177.620000001043081;-1042567.899999998509884;0
7729;-742623.480999998748302;-1044601.217000000178814;0
3373;-743814.043000001460314;-1043018.168000001460314;0
4243;-742194.050000000745058;-1043431.899999998509884;0
6488;-741718.210000000894070;-1044532.489999998360872;0
4142;-742777.425000000745058;-1044013.440000001341105;0
8273;-742057.820000000298023;-1042728.760000001639128;0
5412;-742582.037000000476837;-1042571.986000001430511;0
5035;-742658.587999999523163;-1043006.899000000208616;0
6945;-742955.907000001519918;-1043932.182999998331070;0
6820;-741224.105999998748302;-1044799.311999998986721;0
6975;-743116.140000000596046;-1044506.469999998807907;0
2060;-742659.000000000000000;-1044472.000000000000000;0
1507;-741673.000000000000000;-1044223.000000000000000;0
5503;-743427.870000001043081;-1043698.647999998182058;0
1319;-741788.000000000000000;-1044905.000000000000000;0
6501;-741689.493000000715256;-1044942.905000001192093;0
2484;-741269.109999999403954;-1044779.070000000298023;0
5220;-743247.339999999850988;-1043589.050000000745058;0
4459;-742274.829999998211861;-1042644.269999999552965;0
1442;-741753.000000000000000;-1044375.000000000000000;0
6658;-741538.879999998956919;-1044165.440000001341105;0
6811;-741110.469999998807907;-1044663.493000000715256;0
4825;-742908.839999999850988;-1042860.670000001788139;0
5283;-743032.892000000923872;-1043284.399000000208616;0
8266;-742220.320000000298023;-1042706.760000001639128;0
3338;-743968.458999998867512;-1043042.706999998539686;0
4210;-742178.550000000745058;-1043586.035000000149012;0
4507;-742472.469999998807907;-1042720.199999999254942;0
4203;-742299.442000001668930;-1043608.692000001668930;0
1264;-742059.000000000000000;-1044942.000000000000000;0
3886;-742385.100000001490116;-1042445.500000000000000;0
2502;-742750.000000000000000;-1045457.000000000000000;0
4803;-743043.410999998450279;-1042699.506000000983477;0
877;-741951.000000000000000;-1042610.000000000000000;0
3350;-743955.140999998897314;-1043006.692000001668930;0
4767;-742786.899999998509884;-1042835.736000001430511;0
1423;-742167.000000000000000;-1044150.000000000000000;0
522;-742261.000000000000000;-1043122.000000000000000;0
5016;-742572.212000001221895;-1042955.526999998837709;0
1471;-741711.000000000000000;-1044132.000000000000000;0
5641;-743428.517000000923872;-1043687.460000000894070;0
6137;-742314.326999999582767;-1043068.837000001221895;0
2335;-742825.000000000000000;-1045539.000000000000000;0
1131;-741643.000000000000000;-1044433.000000000000000;0
4760;-742826.947000000625849;-1042799.914000000804663;0
3961;-743419.609999999403954;-1043589.497000001370907;0
4521;-742681.440000001341105;-1042792.960000000894070;0
6213;-742316.227000001817942;-1043060.478999998420477;0
6239;-742363.504999998956919;-1043069.298000000417233;0
555;-742230.000000000000000;-1043726.000000000000000;0
515;-742176.000000000000000;-1043121.000000000000000;0
2344;-742691.000000000000000;-1045541.000000000000000;0
6163;-742316.921000000089407;-1043069.223000001162291;0
6243;-742367.739999998360872;-1043061.098000001162291;0
4708;-742755.420000001788139;-1042611.309999998658895;0
1865;-743458.000000000000000;-1044233.000000000000000;0
1495;-741215.000000000000000;-1044324.000000000000000;0
4069;-742920.684999998658895;-1043755.420000001788139;0
3835;-743050.579999998211861;-1042590.109999999403954;0
694;-742280.000000000000000;-1043043.000000000000000;0
2296;-742678.000000000000000;-1045399.000000000000000;0
273;-743381.000000000000000;-1043820.000000000000000;0
4654;-742797.372999999672174;-1042533.888999998569489;0
5023;-742588.899000000208616;-1042870.296999998390675;0
2299;-742592.000000000000000;-1045409.000000000000000;0
5688;-743415.267000000923872;-1043631.945000000298023;0
4512;-742515.339999999850988;-1042750.230000000447035;0
5649;-743429.256000000983477;-1043697.111999999731779;0
5584;-743408.885000001639128;-1043643.532000001519918;0
6267;-742344.767999999225140;-1043019.272999998182058;0
6004;-742061.723000001162291;-1043300.859999999403954;0
639;-741958.000000000000000;-1043294.000000000000000;0
458;-741726.000000000000000;-1043324.000000000000000;0
5746;-743415.399000000208616;-1043698.644000001251698;0
4251;-742136.420000001788139;-1043379.969999998807907;0
6273;-742321.806000001728535;-1043017.085000000894070;0
4796;-743054.247999999672174;-1042682.918000001460314;0
4843;-742975.057000000029802;-1042729.682000000029802;0
3973;-743161.204999998211861;-1043723.574999999254942;0
4778;-742918.024999998509884;-1042786.565000001341105;0
5745;-743415.129000000655651;-1043695.054000001400709;0
6206;-742314.043000001460314;-1043058.028999999165535;0
7138;-742917.554999999701977;-1044421.774999998509884;0
3314;-743758.675999999046326;-1042905.688999999314547;0
7042;-743396.980000000447035;-1044078.954999998211861;0
4830;-743043.449999999254942;-1042882.359999999403954;0
4479;-741782.780000001192093;-1042660.359999999403954;0
4672;-742811.831999998539686;-1042675.907999999821186;0
6139;-742312.807000000029802;-1043066.006000000983477;0
6284;-742309.677999999374151;-1043054.043999999761581;0
1303;-741865.000000000000000;-1044692.000000000000000;0
5223;-743283.699999999254942;-1043535.940000001341105;0
4478;-741867.359999999403954;-1042693.289999999105930;0
5507;-743426.703000001609325;-1043656.230999998748302;0
5593;-743418.921000000089407;-1043679.927999999374151;0
5730;-743418.855999998748302;-1043638.949000000953674;0
1164;-741055.000000000000000;-1044515.000000000000000;0
2489;-742079.000000000000000;-1044278.000000000000000;0
1460;-741482.000000000000000;-1044302.000000000000000;0
3792;-743110.019999999552965;-1042846.530000001192093;0
4026;-743178.984999999403954;-1043847.989999998360872;0
6193;-742316.486000001430511;-1043063.991000000387430;0
5957;-742962.627000000327826;-1043510.905000001192093;0
5506;-743427.348000001162291;-1043665.644999999552965;0
4055;-743119.070000000298023;-1043694.109999999403954;0
6222;-742316.855000000447035;-1043060.109999999403954;0
8283;-742198.600000001490116;-1042801.980000000447035;0
6165;-742315.407000001519918;-1043066.436000000685453;0
682;-742380.000000000000000;-1043151.000000000000000;0
5728;-743421.517999999225140;-1043638.609000001102686;0
6178;-742312.960000000894070;-1043060.445999998599291;0
4947;-742399.918000001460314;-1042993.458000000566244;0
624;-742241.000000000000000;-1043343.000000000000000;0
4062;-742830.460000000894070;-1043654.920000001788139;0
3283;-743632.767000000923872;-1042846.004000000655651;0
6306;-741842.129999998956919;-1042752.739999998360872;0
6207;-742313.287000000476837;-1043056.642000000923872;0
5702;-743417.206000000238419;-1043631.844999998807907;0
4070;-742925.285000000149012;-1043783.565000001341105;0
4034;-743295.410000000149012;-1043786.070000000298023;0
4966;-742377.289999999105930;-1043071.030000001192093;0
4939;-742448.866999998688698;-1043072.822999998927116;0
4852;-742992.449999999254942;-1042849.890000000596046;0
6272;-742325.379000000655651;-1043017.383000001311302;0
636;-742160.000000000000000;-1043325.000000000000000;0
4979;-742507.703000001609325;-1043016.118000000715256;0
3423;-743731.600000001490116;-1043092.067999999970198;0
620;-742253.000000000000000;-1043281.000000000000000;0
6114;-742234.250000000000000;-1043361.324999999254942;0
7167;-742771.785999998450279;-1044535.168000001460314;0
272;-743396.000000000000000;-1043809.000000000000000;0
6136;-742315.081999998539686;-1043070.210000000894070;0
4729;-742855.690000001341105;-1042695.640000000596046;0
6227;-742319.839999999850988;-1043063.936000000685453;0
6152;-742310.348999999463558;-1043060.046999998390675;0
1479;-741407.000000000000000;-1044225.000000000000000;0
6154;-742316.324000000953674;-1043069.546000000089407;0
3789;-743137.469999998807907;-1042933.670000001788139;0
1153;-741245.000000000000000;-1044480.000000000000000;0
4021;-743293.295000001788139;-1043876.995000001043081;0
6142;-742310.477000001817942;-1043061.813000001013279;0
4837;-742979.105999998748302;-1042672.627999998629093;0
5653;-743429.589999999850988;-1043701.940999999642372;0
280;-743053.000000000000000;-1043875.000000000000000;0
3957;-743415.125000000000000;-1043567.214999999850988;0
6100;-741950.760000001639128;-1043408.109999999403954;0
6211;-742317.785000000149012;-1043063.318999998271465;0
5224;-743293.449999999254942;-1043542.160000000149012;0
7153;-742889.646999999880791;-1044547.438000001013279;0
4921;-742444.739999998360872;-1042908.420000001788139;0
3990;-743339.489999998360872;-1043987.234999999403954;0
622;-742271.000000000000000;-1043302.000000000000000;0
1214;-742064.000000000000000;-1044358.000000000000000;0
1367;-742137.000000000000000;-1044959.000000000000000;0
3944;-743390.002000000327826;-1043413.532999999821186;0
4662;-742819.471000000834465;-1042530.037000000476837;0
5651;-743429.440999999642372;-1043699.524999998509884;0
6282;-742308.337999999523163;-1043045.984000001102686;0
1352;-741840.000000000000000;-1044854.000000000000000;0
2491;-742059.000000000000000;-1044251.000000000000000;0
7220;-742418.820000000298023;-1044813.199999999254942;0
3297;-743706.958999998867512;-1042868.114999998360872;0
3424;-743725.243000000715256;-1043089.951999999582767;0
3750;-743221.379999998956919;-1042925.429999999701977;0
5735;-743414.589999999850988;-1043687.874000001698732;0
5233;-743347.210000000894070;-1043435.807000000029802;0
4957;-742366.010000001639128;-1043006.059999998658895;0
6151;-742311.114999998360872;-1043061.451000001281500;0
4477;-741858.039999999105930;-1042692.129999998956919;0
6209;-742319.320000000298023;-1043066.114999998360872;0
4799;-743008.011999998241663;-1042697.245999999344349;0
1613;-742408.000000000000000;-1044428.000000000000000;0
7968;-741473.980000000447035;-1044379.839999999850988;0
6946;-742974.765000000596046;-1043929.388000000268221;0
7538;-742701.420000001788139;-1045364.109999999403954;0
4834;-742972.708000000566244;-1042657.809000000357628;0
1187;-741805.000000000000000;-1044071.000000000000000;0
6256;-742380.723000001162291;-1043035.640000000596046;0
6281;-742307.629000000655651;-1043042.113000001758337;0
264;-743367.000000000000000;-1043732.000000000000000;0
462;-741707.000000000000000;-1043294.000000000000000;0
6248;-742372.506000000983477;-1043051.769999999552965;0
2376;-742411.000000000000000;-1045554.000000000000000;0
6308;-741823.129999998956919;-1042770.370000001043081;0
6229;-742318.326000001281500;-1043061.204999998211861;0
6201;-742317.888999998569489;-1043065.035000000149012;0
3798;-743131.500000000000000;-1042848.730000000447035;0
5596;-743415.271999999880791;-1043680.212999999523163;0
3758;-743284.129999998956919;-1042964.100000001490116;0
252;-743438.000000000000000;-1043926.000000000000000;0
6132;-742310.590999998152256;-1043063.552999999374151;0
4812;-743027.170000001788139;-1042810.219999998807907;0
7814;-741769.006999999284744;-1044058.535999998450279;0
6251;-742377.396999999880791;-1043042.284000001847744;0
5232;-743347.087000001221895;-1043476.425000000745058;0
2488;-742083.000000000000000;-1044303.000000000000000;0
1338;-741629.000000000000000;-1045045.000000000000000;0
5687;-743415.142000000923872;-1043630.285999998450279;0
4737;-742718.399999998509884;-1042684.079999998211861;0
1586;-742372.000000000000000;-1044785.000000000000000;0
5705;-743417.603000000119209;-1043637.098000001162291;0
2566;-741010.000000000000000;-1044427.000000000000000;0
7233;-742606.750000000000000;-1044827.379999998956919;0
4067;-742913.594999998807907;-1043714.640000000596046;0
4817;-742967.460000000894070;-1042782.559999998658895;0
6279;-742306.210000000894070;-1043033.421999998390675;0
3790;-743140.809999998658895;-1042908.210000000894070;0
554;-742238.000000000000000;-1043717.000000000000000;0
1304;-741810.000000000000000;-1044684.000000000000000;0
5707;-743417.815000001341105;-1043640.510999999940395;0
496;-741768.000000000000000;-1043197.000000000000000;0
4741;-742787.859999999403954;-1042715.800000000745058;0
7650;-742315.337000001221895;-1045462.039999999105930;0
3796;-743161.100000001490116;-1042834.149999998509884;0
4570;-742347.760000001639128;-1042540.809999998658895;0
250;-743428.000000000000000;-1043794.000000000000000;0
6129;-742312.925000000745058;-1043067.717000000178814;0
671;-742489.000000000000000;-1043245.000000000000000;0
4558;-742373.019999999552965;-1042506.949999999254942;0
4832;-743039.079999998211861;-1042840.850000001490116;0
6183;-742316.633999999612570;-1043065.732000000774860;0
5509;-743425.144999999552965;-1043637.853000000119209;0
5415;-742954.934000000357628;-1042714.414000000804663;0
7982;-741163.039999999105930;-1044413.210000000894070;0
1454;-741521.000000000000000;-1044499.000000000000000;0
597;-741855.000000000000000;-1043268.000000000000000;0
5579;-743409.682999998331070;-1043634.574999999254942;0
7985;-741091.269999999552965;-1044419.039999999105930;0
6218;-742319.947000000625849;-1043065.767999999225140;0
1297;-742120.000000000000000;-1044453.000000000000000;0
6214;-742315.447999998927116;-1043059.026000000536442;0
6854;-741522.427999999374151;-1045038.967999998480082;0
4051;-743236.329999998211861;-1043889.710000000894070;0
