OID_;X;Y;TEMPERATURE
3614;-744984.548999998718500;-1042283.640999998897314;0
3019;-744463.447999998927116;-1042784.646000001579523;0
3568;-744718.817999999970198;-1042588.614999998360872;0
3692;-744525.876499999314547;-1042540.534000001847744;0
3580;-744924.973999999463558;-1042593.699999999254942;0
2605;-745393.842999998480082;-1042860.796000000089407;0
5975;-745052.346999999135733;-1042674.673000000417233;0
118;-745135.000000000000000;-1042687.000000000000000;0
3542;-744575.274000000208616;-1042656.160000000149012;0
2696;-743477.489999998360872;-1042038.000000000000000;0
2520;-741847.000000000000000;-1045324.000000000000000;0
6872;-741751.719999998807907;-1045296.679999999701977;0
2760;-743863.331000000238419;-1043483.304000001400709;0
2755;-744003.879000000655651;-1043471.734000001102686;0
2404;-742179.000000000000000;-1045467.000000000000000;0
3919;-743904.947000000625849;-1043493.929999999701977;0
3107;-743778.888000000268221;-1042682.131999999284744;0
2740;-744042.611999999731779;-1043335.940000001341105;0
6705;-742279.050999999046326;-1044655.923000000417233;0
6833;-741571.423000000417233;-1044909.473999999463558;0
1486;-741150.000000000000000;-1044219.000000000000000;0
1445;-741553.000000000000000;-1044757.000000000000000;0
1524;-741710.000000000000000;-1043844.000000000000000;0
1727;-741495.000000000000000;-1045103.000000000000000;0
1723;-741611.000000000000000;-1045092.000000000000000;0
1053;-741768.000000000000000;-1045023.000000000000000;0
1411;-741639.480000000447035;-1044683.019999999552965;0
6828;-741465.309999998658895;-1044768.940000001341105;0
7411;-743529.510000001639128;-1045393.140000000596046;0
3413;-743776.791000001132488;-1043071.675000000745058;0
2079;-742688.000000000000000;-1044428.000000000000000;0
6845;-741527.188000001013279;-1044989.557000000029802;0
5434;-744042.467999998480082;-1043135.986999999731779;0
1315;-741715.000000000000000;-1044867.000000000000000;0
385;-742436.000000000000000;-1043742.000000000000000;0
7143;-742850.414999999105930;-1044473.449999999254942;0
8079;-742021.839999999850988;-1045292.179999999701977;0
2070;-742993.000000000000000;-1044723.000000000000000;0
2097;-743143.000000000000000;-1044742.000000000000000;0
4156;-742513.734999999403954;-1043978.035000000149012;0
7263;-743009.559999998658895;-1044894.379999998956919;0
383;-742450.000000000000000;-1043722.000000000000000;0
4238;-742440.263000000268221;-1043528.236000001430511;0
465;-741728.000000000000000;-1043309.000000000000000;0
7654;-742242.081000000238419;-1045273.263999998569489;0
2893;-743977.276000000536442;-1043208.923999998718500;0
502;-741901.000000000000000;-1043169.000000000000000;0
7008;-742899.559999998658895;-1044224.074999999254942;0
2394;-742273.000000000000000;-1045360.000000000000000;0
2329;-742432.000000000000000;-1045508.000000000000000;0
2160;-742849.000000000000000;-1045147.000000000000000;0
2161;-742876.000000000000000;-1045153.000000000000000;0
8073;-742120.640000000596046;-1045259.500000000000000;0
7652;-742275.046999998390675;-1045497.052000001072884;0
2378;-742372.000000000000000;-1045503.000000000000000;0
7141;-742895.629999998956919;-1044470.910000000149012;0
4075;-742947.934999998658895;-1043903.649999998509884;0
3915;-744021.765999998897314;-1043098.603999998420477;0
7243;-742724.339999999850988;-1044835.870000001043081;0
8152;-743293.600000001490116;-1043190.510000001639128;0
4074;-742943.350000001490116;-1043880.304999999701977;0
282;-743034.000000000000000;-1043819.000000000000000;0
7282;-742809.410000000149012;-1044693.629999998956919;0
1814;-743095.000000000000000;-1044510.000000000000000;0
5409;-743745.201000001281500;-1042902.750000000000000;0
1985;-743478.000000000000000;-1044769.000000000000000;0
4029;-743130.695999998599291;-1043815.427999999374151;0
7947;-742030.969999998807907;-1044096.679999999701977;0
524;-742255.000000000000000;-1043913.000000000000000;0
2296;-742678.000000000000000;-1045399.000000000000000;0
2326;-742523.000000000000000;-1045498.000000000000000;0
2323;-742622.000000000000000;-1045487.000000000000000;0
1780;-741214.000000000000000;-1043934.000000000000000;0
6848;-741619.096999999135733;-1045007.451999999582767;0
738;-741818.000000000000000;-1043024.000000000000000;0
6505;-741746.570000000298023;-1044600.429999999701977;0
1942;-743283.000000000000000;-1044370.000000000000000;0
1875;-743367.000000000000000;-1044261.000000000000000;0
1983;-743474.000000000000000;-1044709.000000000000000;0
1300;-741917.410000000149012;-1044719.769999999552965;0
1519;-741754.000000000000000;-1043956.000000000000000;0
7162;-743075.840999998152256;-1044541.596000000834465;0
748;-741671.000000000000000;-1042971.000000000000000;0
110;-744127.000000000000000;-1042724.000000000000000;0
7721;-742941.157000001519918;-1044215.368000000715256;0
1520;-741777.000000000000000;-1043939.000000000000000;0
7022;-743155.660000000149012;-1044074.410000000149012;0
7004;-743069.289999999105930;-1044326.469999998807907;0
7001;-743085.660000000149012;-1044400.420000001788139;0
1764;-741163.000000000000000;-1044144.000000000000000;0
7516;-742248.390000000596046;-1044368.907999999821186;0
7015;-742554.570000000298023;-1044360.725000001490116;0
2093;-742915.000000000000000;-1044642.000000000000000;0
735;-741910.000000000000000;-1043014.000000000000000;0
6004;-742061.723000001162291;-1043300.859999999403954;0
4220;-742214.344999998807907;-1043580.359999999403954;0
1287;-742217.000000000000000;-1044486.000000000000000;0
7153;-742889.646999999880791;-1044547.438000001013279;0
1345;-741741.000000000000000;-1044789.000000000000000;0
6339;-742245.460000000894070;-1042835.780000001192093;0
7397;-743021.859999999403954;-1045682.989999998360872;0
8275;-742087.910000000149012;-1042738.609999999403954;0
3975;-743112.984999999403954;-1043716.375999998301268;0
2319;-742734.000000000000000;-1045474.000000000000000;0
3310;-743829.561999998986721;-1042854.063000001013279;0
7173;-742660.850000001490116;-1044535.730000000447035;0
2036;-743404.000000000000000;-1044803.000000000000000;0
4046;-743205.699999999254942;-1044009.719999998807907;0
1047;-741816.000000000000000;-1044867.000000000000000;0
1356;-741916.000000000000000;-1044874.000000000000000;0
514;-742119.000000000000000;-1043141.000000000000000;0
510;-742048.000000000000000;-1043150.000000000000000;0
343;-742575.000000000000000;-1043857.000000000000000;0
6728;-742547.451000001281500;-1044392.396000001579523;0
4223;-742161.556000001728535;-1043473.138999998569489;0
4067;-742913.594999998807907;-1043714.640000000596046;0
7185;-742600.515000000596046;-1044717.333999998867512;0
600;-741840.000000000000000;-1043212.000000000000000;0
3993;-743345.100000001490116;-1043930.980000000447035;0
3750;-743221.379999998956919;-1042925.429999999701977;0
847;-742155.000000000000000;-1042504.000000000000000;0
824;-742142.000000000000000;-1042596.000000000000000;0
817;-741937.000000000000000;-1042586.000000000000000;0
2050;-743460.000000000000000;-1045072.000000000000000;0
827;-742218.000000000000000;-1042626.000000000000000;0
834;-742049.000000000000000;-1042541.000000000000000;0
2008;-743242.000000000000000;-1044759.000000000000000;0
2018;-743244.000000000000000;-1044909.000000000000000;0
4170;-742407.245000001043081;-1043945.519999999552965;0
394;-742405.000000000000000;-1043863.000000000000000;0
1675;-741059.000000000000000;-1044754.000000000000000;0
7148;-742828.445000000298023;-1044472.094999998807907;0
6722;-742357.717000000178814;-1044705.708000000566244;0
2020;-743260.000000000000000;-1044941.000000000000000;0
2515;-742517.000000000000000;-1044420.000000000000000;0
1561;-743186.000000000000000;-1045098.000000000000000;0
547;-742316.910000000149012;-1043790.309999998658895;0
1619;-742426.000000000000000;-1044401.000000000000000;0
7514;-742304.866000000387430;-1044375.124000001698732;0
1251;-742091.000000000000000;-1044690.000000000000000;0
973;-741908.000000000000000;-1044547.000000000000000;0
7;-743479.000000000000000;-1042567.000000000000000;0
6820;-741224.105999998748302;-1044799.311999998986721;0
4106;-742664.475000001490116;-1043755.761999998241663;0
3838;-743113.550000000745058;-1042543.399999998509884;0
533;-742137.000000000000000;-1043750.000000000000000;0
17;-743587.000000000000000;-1042394.000000000000000;0
1027;-741984.000000000000000;-1044660.000000000000000;0
618;-742203.000000000000000;-1043272.000000000000000;0
1855;-742642.000000000000000;-1044286.000000000000000;0
1302;-741842.000000000000000;-1044693.000000000000000;0
5303;-743164.818999998271465;-1043211.078000001609325;0
4229;-742146.929000001400709;-1043334.585000000894070;0
1492;-741096.000000000000000;-1044331.000000000000000;0
4332;-742410.359000001102686;-1043282.916000001132488;0
5369;-742583.364999998360872;-1042976.820999998599291;0
3886;-742385.100000001490116;-1042445.500000000000000;0
4124;-742751.265000000596046;-1043878.414999999105930;0
4069;-742920.684999998658895;-1043755.420000001788139;0
3204;-743715.278999999165535;-1042506.118999999016523;0
620;-742253.000000000000000;-1043281.000000000000000;0
6;-743464.000000000000000;-1042594.000000000000000;0
1769;-741260.000000000000000;-1044112.000000000000000;0
2133;-743040.000000000000000;-1045127.000000000000000;0
4235;-742390.041999999433756;-1043492.094999998807907;0
5294;-743056.328999999910593;-1043196.096999999135733;0
1929;-743440.000000000000000;-1044410.000000000000000;0
5270;-742989.153999999165535;-1043210.684999998658895;0
2151;-742827.000000000000000;-1045047.000000000000000;0
2166;-743016.000000000000000;-1045179.000000000000000;0
7324;-742833.980000000447035;-1044949.109999999403954;0
7781;-743030.026999998837709;-1045857.486000001430511;0
224;-742904.000000000000000;-1043522.000000000000000;0
4162;-742497.193999998271465;-1044160.030000001192093;0
4002;-743397.818999998271465;-1044054.317999999970198;0
4173;-742756.320000000298023;-1043749.629999998956919;0
5110;-742876.271999999880791;-1043449.013000000268221;0
4062;-742830.460000000894070;-1043654.920000001788139;0
1947;-743286.000000000000000;-1044465.000000000000000;0
4086;-742813.079999998211861;-1043631.730000000447035;0
1610;-742374.000000000000000;-1044447.000000000000000;0
6746;-742405.083999998867512;-1044259.199999999254942;0
4234;-742349.850000001490116;-1043459.410000000149012;0
1766;-741257.000000000000000;-1044204.000000000000000;0
7973;-741347.850000001490116;-1044381.850000001490116;0
2277;-742826.000000000000000;-1045653.000000000000000;0
333;-742651.000000000000000;-1043996.000000000000000;0
4333;-742428.420000001788139;-1043255.609999999403954;0
5136;-742992.278000000864267;-1043472.440000001341105;0
1470;-741728.000000000000000;-1044116.000000000000000;0
1192;-741801.000000000000000;-1044083.000000000000000;0
1515;-741913.000000000000000;-1044072.000000000000000;0
2447;-742772.000000000000000;-1044159.000000000000000;0
7086;-743333.149999998509884;-1044527.250000000000000;0
2431;-742498.000000000000000;-1045094.000000000000000;0
7216;-742500.129999998956919;-1044564.390000000596046;0
1718;-741366.219999998807907;-1044870.989999998360872;0
2081;-742551.000000000000000;-1044621.000000000000000;0
4531;-742746.070000000298023;-1042885.980000000447035;0
2481;-741255.609999999403954;-1044671.179999999701977;0
1701;-741378.000000000000000;-1044678.000000000000000;0
558;-742200.000000000000000;-1043683.000000000000000;0
2546;-741750.000000000000000;-1044271.000000000000000;0
4906;-742448.370000001043081;-1042815.789999999105930;0
6700;-742298.611000001430511;-1044507.315999999642372;0
1038;-741956.000000000000000;-1044977.000000000000000;0
1449;-741533.000000000000000;-1044684.000000000000000;0
1371;-742089.000000000000000;-1044807.000000000000000;0
7031;-743301.824999999254942;-1044080.774999998509884;0
526;-742209.000000000000000;-1043849.000000000000000;0
4511;-742539.859999999403954;-1042744.070000000298023;0
210;-743112.000000000000000;-1043566.000000000000000;0
759;-741659.000000000000000;-1042650.000000000000000;0
2235;-743401.000000000000000;-1045221.000000000000000;0
2458;-741019.000000000000000;-1044567.000000000000000;0
1243;-742122.000000000000000;-1044502.000000000000000;0
203;-743204.000000000000000;-1043607.000000000000000;0
1099;-741376.000000000000000;-1044563.000000000000000;0
884;-741771.000000000000000;-1042776.000000000000000;0
1116;-741125.980000000447035;-1044610.410000000149012;0
4427;-742190.519999999552965;-1043099.440000001341105;0
220;-742969.000000000000000;-1043530.000000000000000;0
1013;-742076.000000000000000;-1044595.000000000000000;0
1432;-741958.000000000000000;-1044285.000000000000000;0
7983;-741127.800000000745058;-1044416.199999999254942;0
1090;-741581.000000000000000;-1044552.000000000000000;0
6014;-742844.000000000000000;-1043239.482999999076128;0
4525;-742716.719999998807907;-1042823.219999998807907;0
2189;-743472.000000000000000;-1045183.000000000000000;0
4024;-743223.734999999403954;-1043859.954999998211861;0
4150;-742581.789999999105930;-1044138.429999999701977;0
2238;-743372.000000000000000;-1045261.000000000000000;0
3795;-743173.190000001341105;-1042842.170000001788139;0
5968;-742288.989000000059605;-1044168.456999998539686;0
2247;-743199.000000000000000;-1045400.000000000000000;0
4248;-742157.039999999105930;-1043376.699999999254942;0
4668;-742810.210000000894070;-1042618.969999998807907;0
727;-742001.000000000000000;-1042962.000000000000000;0
3781;-743273.059999998658895;-1042814.050000000745058;0
3820;-743111.699999999254942;-1042659.320000000298023;0
7982;-741163.039999999105930;-1044413.210000000894070;0
1388;-742152.000000000000000;-1045026.000000000000000;0
1091;-741531.480000000447035;-1044543.440000001341105;0
4036;-743246.920000001788139;-1043771.574999999254942;0
5210;-743253.673999998718500;-1043370.440999999642372;0
5214;-743307.671999998390675;-1043376.414000000804663;0
3982;-743325.135000001639128;-1043857.684999998658895;0
5015;-742575.741000000387430;-1043008.607999999076128;0
6140;-742311.999000001698732;-1043064.638999998569489;0
4573;-742341.550000000745058;-1042629.699999999254942;0
1148;-741324.000000000000000;-1044481.000000000000000;0
280;-743053.000000000000000;-1043875.000000000000000;0
1911;-743449.000000000000000;-1044447.000000000000000;0
3366;-743913.831000000238419;-1043002.796999998390675;0
585;-741960.000000000000000;-1043413.000000000000000;0
7206;-742559.920000001788139;-1045003.190000001341105;0
6696;-742332.717000000178814;-1044815.649999998509884;0
4900;-742508.089999999850988;-1042815.289999999105930;0
183;-743438.000000000000000;-1043422.000000000000000;0
308;-742754.000000000000000;-1044149.000000000000000;0
2556;-741376.000000000000000;-1044379.000000000000000;0
1586;-742372.000000000000000;-1044785.000000000000000;0
1792;-742165.000000000000000;-1044209.000000000000000;0
6311;-743930.489999998360872;-1042569.390000000596046;0
728;-741997.000000000000000;-1042918.000000000000000;0
5227;-743318.199999999254942;-1043537.510000001639128;0
4134;-742772.309999998658895;-1044078.870000001043081;0
4827;-743046.359999999403954;-1042958.140000000596046;0
6653;-741657.920000001788139;-1044136.789999999105930;0
3141;-744035.420000001788139;-1042680.460000000894070;0
3154;-743984.818999998271465;-1042573.844999998807907;0
2318;-742763.000000000000000;-1045470.000000000000000;0
1982;-743408.000000000000000;-1044646.000000000000000;0
1832;-743024.000000000000000;-1044100.000000000000000;0
4894;-742610.888999998569489;-1042819.686999998986721;0
2453;-742941.000000000000000;-1044121.000000000000000;0
1518;-741994.000000000000000;-1044011.000000000000000;0
4621;-742536.945999998599291;-1042552.296000000089407;0
3956;-743414.039999999105930;-1043561.081999998539686;0
683;-742362.000000000000000;-1043155.000000000000000;0
671;-742489.000000000000000;-1043245.000000000000000;0
1872;-743422.000000000000000;-1044246.000000000000000;0
4139;-742859.625999998301268;-1044000.574999999254942;0
1234;-742162.000000000000000;-1044314.000000000000000;0
2492;-742017.000000000000000;-1044210.000000000000000;0
7041;-743381.004999998956919;-1044158.699999999254942;0
1879;-743302.000000000000000;-1044264.000000000000000;0
2215;-743135.000000000000000;-1045335.000000000000000;0
1477;-741482.750000000000000;-1044212.480000000447035;0
6231;-742316.769000001251698;-1043058.344000000506639;0
3101;-743922.754999998956919;-1042745.195000000298023;0
3264;-743565.725000001490116;-1042729.024999998509884;0
1993;-743483.000000000000000;-1044984.000000000000000;0
522;-742261.000000000000000;-1043122.000000000000000;0
696;-742077.000000000000000;-1042913.000000000000000;0
2054;-743413.000000000000000;-1045010.000000000000000;0
5652;-743429.532999999821186;-1043700.732000000774860;0
8047;-742167.649999998509884;-1044854.320000000298023;0
5128;-743040.467000000178814;-1043389.765999998897314;0
1264;-742059.000000000000000;-1044942.000000000000000;0
6225;-742314.519999999552965;-1043055.927000001072884;0
5228;-743334.289999999105930;-1043545.039999999105930;0
1424;-742134.000000000000000;-1044171.000000000000000;0
4576;-742354.388000000268221;-1042588.285999998450279;0
1171;-741882.000000000000000;-1044375.000000000000000;0
1293;-742037.000000000000000;-1044462.000000000000000;0
5317;-743063.690000001341105;-1043053.769999999552965;0
1214;-742064.000000000000000;-1044358.000000000000000;0
5447;-743129.958999998867512;-1043365.166000001132488;0
1458;-741506.000000000000000;-1044384.000000000000000;0
2212;-743217.000000000000000;-1045279.000000000000000;0
6105;-742213.883000001311302;-1043111.734000001102686;0
793;-741697.000000000000000;-1042588.000000000000000;0
6141;-742311.243999999016523;-1043063.195999998599291;0
6000;-741980.750000000000000;-1043285.629999998956919;0
4732;-742777.550000000745058;-1042653.539999999105930;0
3326;-744036.002000000327826;-1042922.574999999254942;0
6280;-742306.918999999761581;-1043038.083000000566244;0
7508;-742947.440000001341105;-1045540.690000001341105;0
6039;-742085.370000001043081;-1043669.620999999344349;0
1455;-741517.000000000000000;-1044468.000000000000000;0
954;-742231.000000000000000;-1043024.000000000000000;0
1990;-743482.000000000000000;-1044906.000000000000000;0
5686;-743394.912000000476837;-1043720.872000001370907;0
3360;-743950.688000001013279;-1042982.188000001013279;0
596;-741867.000000000000000;-1043259.000000000000000;0
4825;-742908.839999999850988;-1042860.670000001788139;0
3834;-743079.190000001341105;-1042579.899999998509884;0
1502;-741506.000000000000000;-1044283.000000000000000;0
1123;-741734.000000000000000;-1044442.000000000000000;0
4426;-742197.589999999850988;-1043031.679999999701977;0
3294;-743583.046999998390675;-1042805.258000001311302;0
4793;-743035.089999999850988;-1042650.028000000864267;0
4579;-742378.747999999672174;-1042626.699999999254942;0
2565;-741043.000000000000000;-1044424.000000000000000;0
5122;-742902.166999999433756;-1043373.543999999761581;0
4614;-742493.800000000745058;-1042636.896000001579523;0
892;-742946.000000000000000;-1042607.000000000000000;0
1229;-742244.000000000000000;-1044253.000000000000000;0
711;-741828.000000000000000;-1042860.000000000000000;0
4689;-742688.114999998360872;-1042568.859999999403954;0
1441;-741744.000000000000000;-1044392.000000000000000;0
2226;-743057.000000000000000;-1045470.000000000000000;0
1084;-741698.000000000000000;-1044537.000000000000000;0
688;-742284.000000000000000;-1043125.000000000000000;0
568;-742116.000000000000000;-1043604.000000000000000;0
3761;-743202.559999998658895;-1042981.710000000894070;0
5593;-743418.921000000089407;-1043679.927999999374151;0
6191;-742318.017000000923872;-1043066.800999999046326;0
1597;-742338.000000000000000;-1045064.000000000000000;0
8242;-742568.629999998956919;-1045197.829999998211861;0
702;-741961.000000000000000;-1042885.000000000000000;0
2494;-741985.000000000000000;-1044165.000000000000000;0
1387;-742155.000000000000000;-1044999.000000000000000;0
4955;-742383.649999998509884;-1043019.250000000000000;0
5518;-743427.500999998301268;-1043621.975000001490116;0
8048;-742190.519999999552965;-1044865.730000000447035;0
4826;-743043.850000001490116;-1042979.600000001490116;0
5067;-742813.465999998152256;-1043267.335999999195337;0
6277;-742304.633999999612570;-1043024.256000000983477;0
6487;-741745.798000000417233;-1044519.414999999105930;0
272;-743396.000000000000000;-1043809.000000000000000;0
6719;-742371.686999998986721;-1044952.227000001817942;0
5502;-743427.894999999552965;-1043706.885000001639128;0
8061;-742290.579999998211861;-1045109.600000001490116;0
1433;-741895.000000000000000;-1044328.000000000000000;0
1548;-742220.000000000000000;-1044216.000000000000000;0
3786;-743150.480000000447035;-1042925.960000000894070;0
4698;-742673.530000001192093;-1042715.780000001192093;0
6687;-742383.274000000208616;-1044983.381999999284744;0
682;-742380.000000000000000;-1043151.000000000000000;0
889;-742000.000000000000000;-1042770.000000000000000;0
4958;-742349.620000001043081;-1043004.539999999105930;0
498;-741801.000000000000000;-1043199.000000000000000;0
4966;-742377.289999999105930;-1043071.030000001192093;0
6508;-741728.552999999374151;-1044508.050999999046326;0
6221;-742317.633000001311302;-1043061.541000001132488;0
301;-742613.000000000000000;-1043903.000000000000000;0
1662;-741451.000000000000000;-1044403.000000000000000;0
6218;-742319.947000000625849;-1043065.767999999225140;0
6228;-742319.103999998420477;-1043062.592000000178814;0
6216;-742313.892000000923872;-1043056.272999998182058;0
4697;-742675.329999998211861;-1042689.179999999701977;0
800;-741822.000000000000000;-1042588.000000000000000;0
4538;-742291.464000001549721;-1042734.344000000506639;0
6784;-741318.109999999403954;-1044460.920000001788139;0
5708;-743418.927999999374151;-1043640.519000001251698;0
4768;-742862.888000000268221;-1042936.997999999672174;0
4954;-742405.539999999105930;-1043024.640000000596046;0
5589;-743423.785999998450279;-1043679.548000000417233;0
4651;-742756.375000000000000;-1042524.938000001013279;0
4823;-742936.660000000149012;-1042868.949999999254942;0
4944;-742430.605999998748302;-1043013.879000000655651;0
5706;-743417.688999999314547;-1043638.852000001817942;0
883;-741802.000000000000000;-1042773.000000000000000;0
1386;-742158.000000000000000;-1044976.000000000000000;0
2424;-742476.000000000000000;-1045132.000000000000000;0
4808;-743110.859999999403954;-1042784.829999998211861;0
1838;-743004.480000000447035;-1044216.030000001192093;0
5118;-742835.168000001460314;-1043315.074000000953674;0
6272;-742325.379000000655651;-1043017.383000001311302;0
1288;-742189.000000000000000;-1044543.000000000000000;0
5720;-743418.223000001162291;-1043629.960999999195337;0
4729;-742855.690000001341105;-1042695.640000000596046;0
6369;-741962.675000000745058;-1042665.013999998569489;0
5691;-743415.714000001549721;-1043637.241000000387430;0
6150;-742311.879999998956919;-1043062.857000000774860;0
598;-741853.000000000000000;-1043233.000000000000000;0
4775;-742898.375999998301268;-1042802.914000000804663;0
1949;-743248.000000000000000;-1044491.000000000000000;0
3809;-742980.300000000745058;-1042944.469999998807907;0
6374;-741977.035000000149012;-1042674.153999999165535;0
6136;-742315.081999998539686;-1043070.210000000894070;0
4805;-743001.147999998182058;-1042707.644999999552965;0
4818;-742949.140000000596046;-1042791.660000000149012;0
4800;-742990.043000001460314;-1042700.708000000566244;0
2499;-741884.000000000000000;-1044011.000000000000000;0
3946;-743397.693999998271465;-1043460.780999999493361;0
4742;-742822.300000000745058;-1042747.920000001788139;0
5594;-743417.704999998211861;-1043680.022999998182058;0
5646;-743428.978999998420477;-1043693.493000000715256;0
1390;-742129.000000000000000;-1045069.000000000000000;0
5246;-743373.739999998360872;-1043268.899999998509884;0
691;-742293.000000000000000;-1043097.000000000000000;0
5709;-743420.221999999135733;-1043640.467999998480082;0
3352;-743954.622000001370907;-1043015.732999999076128;0
5721;-743418.407999999821186;-1043631.800000000745058;0
6222;-742316.855000000447035;-1043060.109999999403954;0
7959;-741699.170000001788139;-1044292.620000001043081;0
5696;-743417.096000000834465;-1043637.135999999940395;0
4820;-742927.769999999552965;-1042786.710000000894070;0
6239;-742363.504999998956919;-1043069.298000000417233;0
4730;-742831.050000000745058;-1042696.600000001490116;0
6152;-742310.348999999463558;-1043060.046999998390675;0
1904;-743459.000000000000000;-1044297.000000000000000;0
249;-743433.000000000000000;-1043775.000000000000000;0
4837;-742979.105999998748302;-1042672.627999998629093;0
6148;-742313.410999998450279;-1043065.666999999433756;0
4821;-742966.550000000745058;-1042877.969999998807907;0
6128;-742313.668999999761581;-1043069.186000000685453;0
5737;-743412.636999998241663;-1043691.631000000983477;0
4474;-741831.079999998211861;-1042685.068999998271465;0
5516;-743427.133000001311302;-1043615.250999998301268;0
4956;-742383.579999998211861;-1043007.739999998360872;0
6103;-742213.102000001817942;-1043103.528999999165535;0
5666;-743418.543999999761581;-1043712.120000001043081;0
6200;-742318.653999999165535;-1043066.462000001221895;0
6258;-742382.381999999284744;-1043032.370999999344349;0
6147;-742314.177000001072884;-1043067.070999998599291;0
6145;-742315.708000000566244;-1043069.881999999284744;0
6131;-742311.329999998211861;-1043064.982999999076128;0
5669;-743414.997999999672174;-1043713.431000001728535;0
2222;-743058.000000000000000;-1045420.000000000000000;0
5512;-743426.556000001728535;-1043602.920000001788139;0
5714;-743423.756000000983477;-1043635.103999998420477;0
4665;-742824.410000000149012;-1042592.260000001639128;0
4832;-743039.079999998211861;-1042840.850000001490116;0
6265;-742353.164999999105930;-1043020.054999999701977;0
3274;-743652.714999999850988;-1042812.727000001817942;0
6263;-742365.719000000506639;-1043021.282999999821186;0
6439;-741765.070999998599291;-1042636.877999998629093;0
3358;-743952.916999999433756;-1043047.306000001728535;0
5226;-743310.730000000447035;-1043553.269999999552965;0
578;-742023.000000000000000;-1043464.000000000000000;0
6168;-742313.092999998480082;-1043062.208999998867512;0
5651;-743429.440999999642372;-1043699.524999998509884;0
7197;-742570.949000000953674;-1044895.548999998718500;0
4747;-742866.289999999105930;-1042753.390000000596046;0
4910;-742367.789000000804663;-1042795.280999999493361;0
6202;-742317.124000001698732;-1043063.651999998837709;0
178;-743389.000000000000000;-1043251.000000000000000;0
2480;-741251.739999998360872;-1044639.480000000447035;0
3797;-743147.989999998360872;-1042854.129999998956919;0
6782;-741303.329999998211861;-1044447.660000000149012;0
6189;-742312.041999999433756;-1043057.302000001072884;0
5667;-743417.361999999731779;-1043712.557000000029802;0
7962;-741640.190000001341105;-1044316.800000000745058;0
6257;-742381.556000001728535;-1043033.991000000387430;0
6271;-742329.282000001519918;-1043017.853999998420477;0
7165;-742711.789999999105930;-1044504.984999999403954;0
271;-743417.000000000000000;-1043795.000000000000000;0
3277;-743688.120999999344349;-1042851.743000000715256;0
7698;-742389.168000001460314;-1044818.684000000357628;0
6211;-742317.785000000149012;-1043063.318999998271465;0
4610;-742548.888000000268221;-1042601.879000000655651;0
6162;-742310.199999999254942;-1043058.306000001728535;0
5923;-742953.765000000596046;-1043015.067999999970198;0
581;-741991.000000000000000;-1043457.000000000000000;0
7745;-742933.037000000476837;-1045523.714999999850988;0
2042;-743505.000000000000000;-1044958.000000000000000;0
6125;-743428.124000001698732;-1043615.223999999463558;0
4784;-742945.712999999523163;-1042685.611999999731779;0
4756;-742712.579999998211861;-1042776.829999998211861;0
4734;-742762.920000001788139;-1042698.820000000298023;0
6282;-742308.337999999523163;-1043045.984000001102686;0
332;-742645.000000000000000;-1044014.000000000000000;0
2285;-742897.000000000000000;-1045467.000000000000000;0
2291;-742850.000000000000000;-1045401.000000000000000;0
7200;-742561.710999999195337;-1044911.469999998807907;0
6170;-742311.548000000417233;-1043059.381000000983477;0
