OID_;X;Y;TEMPERATURE
4067;-742913.594999998807907;-1043714.640000000596046;0
741;-741730.000000000000000;-1043035.000000000000000;0
1524;-741710.000000000000000;-1043844.000000000000000;0
462;-741707.000000000000000;-1043294.000000000000000;0
3783;-743211.559999998658895;-1042920.120000001043081;0
2520;-741847.000000000000000;-1045324.000000000000000;0
2695;-743455.570000000298023;-1042040.780000001192093;0
1774;-741285.000000000000000;-1043941.000000000000000;0
1446;-741545.000000000000000;-1044774.000000000000000;0
6721;-742321.052999999374151;-1044705.548000000417233;0
7776;-743089.784000001847744;-1045773.409000001847744;0
2222;-743058.000000000000000;-1045420.000000000000000;0
1533;-741832.000000000000000;-1043879.000000000000000;0
709;-741861.000000000000000;-1042862.000000000000000;0
2507;-742427.000000000000000;-1044437.000000000000000;0
1506;-741642.000000000000000;-1044236.000000000000000;0
2276;-742865.000000000000000;-1045649.000000000000000;0
4455;-741714.589000001549721;-1042663.557000000029802;0
510;-742048.000000000000000;-1043150.000000000000000;0
1769;-741260.000000000000000;-1044112.000000000000000;0
402;-742342.000000000000000;-1043952.000000000000000;0
7723;-741757.929000001400709;-1044043.175000000745058;0
6;-743464.000000000000000;-1042594.000000000000000;0
1693;-741613.000000000000000;-1044649.000000000000000;0
928;-744070.000000000000000;-1043299.000000000000000;0
4177;-742387.940999999642372;-1044182.254999998956919;0
1491;-741057.000000000000000;-1044333.000000000000000;0
3782;-743285.429999999701977;-1042842.460000000894070;0
1758;-741097.000000000000000;-1044094.000000000000000;0
3216;-743615.890999998897314;-1042451.129999998956919;0
6805;-741109.710000000894070;-1044689.170000001788139;0
3974;-743140.660000000149012;-1043725.350000001490116;0
3266;-743585.618999999016523;-1042739.508999999612570;0
993;-741977.000000000000000;-1044436.000000000000000;0
225;-742885.000000000000000;-1043535.000000000000000;0
1119;-741791.000000000000000;-1044446.000000000000000;0
265;-743344.000000000000000;-1043735.000000000000000;0
529;-742162.000000000000000;-1043803.000000000000000;0
4075;-742947.934999998658895;-1043903.649999998509884;0
1435;-741903.000000000000000;-1044306.000000000000000;0
5444;-743183.024000000208616;-1043210.600000001490116;0
2081;-742551.000000000000000;-1044621.000000000000000;0
7258;-742917.370000001043081;-1044865.420000001788139;0
1255;-742077.000000000000000;-1044770.000000000000000;0
2235;-743401.000000000000000;-1045221.000000000000000;0
3990;-743339.489999998360872;-1043987.234999999403954;0
579;-742006.000000000000000;-1043477.000000000000000;0
6111;-742241.054000001400709;-1043365.475999999791384;0
6855;-741501.394999999552965;-1045027.784000001847744;0
1162;-741087.000000000000000;-1044511.000000000000000;0
6306;-741842.129999998956919;-1042752.739999998360872;0
6383;-742199.620000001043081;-1042494.440000001341105;0
4072;-742934.225000001490116;-1043833.899999998509884;0
1130;-741624.000000000000000;-1044446.000000000000000;0
1477;-741482.750000000000000;-1044212.480000000447035;0
4649;-742732.228999998420477;-1042525.100000001490116;0
600;-741840.000000000000000;-1043212.000000000000000;0
3128;-743948.160000000149012;-1042657.320000000298023;0
1428;-742028.000000000000000;-1044235.000000000000000;0
7086;-743333.149999998509884;-1044527.250000000000000;0
8;-743496.000000000000000;-1042539.000000000000000;0
5141;-743039.598000001162291;-1043495.265000000596046;0
7218;-742534.100000001490116;-1044603.559999998658895;0
1924;-743359.000000000000000;-1044320.000000000000000;0
3537;-744632.945000000298023;-1042671.657000001519918;0
1044;-741861.000000000000000;-1044743.000000000000000;0
2213;-743188.000000000000000;-1045298.000000000000000;0
1017;-742167.000000000000000;-1044603.000000000000000;0
7034;-743299.725999999791384;-1044153.140000000596046;0
1151;-741279.000000000000000;-1044475.000000000000000;0
563;-742155.000000000000000;-1043660.000000000000000;0
281;-743045.000000000000000;-1043848.000000000000000;0
6723;-742592.894999999552965;-1044408.905000001192093;0
5116;-742947.859000001102686;-1043386.767000000923872;0
1502;-741506.000000000000000;-1044283.000000000000000;0
1655;-741391.000000000000000;-1044651.000000000000000;0
2430;-742493.000000000000000;-1045120.000000000000000;0
7652;-742275.046999998390675;-1045497.052000001072884;0
4173;-742756.320000000298023;-1043749.629999998956919;0
1571;-742239.000000000000000;-1044186.000000000000000;0
3235;-744146.118000000715256;-1042659.438999999314547;0
4890;-742605.287000000476837;-1042838.535000000149012;0
5589;-743423.785999998450279;-1043679.548000000417233;0
5434;-744042.467999998480082;-1043135.986999999731779;0
4010;-743200.372999999672174;-1044041.177999999374151;0
2757;-743949.300000000745058;-1043488.500000000000000;0
731;-741925.000000000000000;-1042997.000000000000000;0
4527;-742728.050000000745058;-1042838.719999998807907;0
1324;-741943.000000000000000;-1044994.000000000000000;0
3201;-743741.188999999314547;-1042531.719000000506639;0
695;-742207.000000000000000;-1043019.000000000000000;0
2480;-741251.739999998360872;-1044639.480000000447035;0
3820;-743111.699999999254942;-1042659.320000000298023;0
6692;-742222.114999998360872;-1044818.673000000417233;0
2398;-742150.000000000000000;-1045370.000000000000000;0
2894;-743960.129000000655651;-1043216.409000001847744;0
5003;-742589.811999998986721;-1042974.888999998569489;0
4428;-742206.750000000000000;-1043097.800000000745058;0
2098;-743134.000000000000000;-1044763.000000000000000;0
1407;-741650.000000000000000;-1044242.000000000000000;0
4846;-742981.635999999940395;-1042805.254000000655651;0
2049;-743499.000000000000000;-1045071.000000000000000;0
3767;-743033.910000000149012;-1042982.390000000596046;0
1815;-743083.000000000000000;-1044478.000000000000000;0
3017;-744468.008999999612570;-1042806.090999998152256;0
5211;-743299.236000001430511;-1043364.945000000298023;0
6216;-742313.892000000923872;-1043056.272999998182058;0
4063;-742855.079999998211861;-1043654.695000000298023;0
1722;-741672.000000000000000;-1045029.000000000000000;0
3524;-744816.782999999821186;-1042685.140999998897314;0
1136;-741520.000000000000000;-1044455.000000000000000;0
504;-741937.000000000000000;-1043164.000000000000000;0
220;-742969.000000000000000;-1043530.000000000000000;0
6483;-741773.829999998211861;-1044640.969000000506639;0
1486;-741150.000000000000000;-1044219.000000000000000;0
5246;-743373.739999998360872;-1043268.899999998509884;0
7168;-742792.969999998807907;-1044547.879999998956919;0
4850;-742956.164000000804663;-1042923.403000000864267;0
2035;-743435.000000000000000;-1044802.000000000000000;0
6364;-742003.519999999552965;-1042660.690000001341105;0
7155;-742920.776999998837709;-1044546.934000000357628;0
3915;-744021.765999998897314;-1043098.603999998420477;0
7104;-743423.739999998360872;-1044624.530000001192093;0
4240;-742471.613000001758337;-1043552.366000000387430;322
7137;-742916.074999999254942;-1044400.230000000447035;0
6133;-742309.820000000298023;-1043062.171999998390675;0
6148;-742313.410999998450279;-1043065.666999999433756;0
4920;-742444.449999999254942;-1042928.980000000447035;0
3068;-744158.921000000089407;-1042812.230999998748302;0
4834;-742972.708000000566244;-1042657.809000000357628;0
7705;-742283.471999999135733;-1044316.339999999850988;569
7031;-743301.824999999254942;-1044080.774999998509884;0
3798;-743131.500000000000000;-1042848.730000000447035;0
5599;-743411.622999999672174;-1043680.499000001698732;0
4024;-743223.734999999403954;-1043859.954999998211861;0
2536;-742003.000000000000000;-1044113.000000000000000;0
3761;-743202.559999998658895;-1042981.710000000894070;0
702;-741961.000000000000000;-1042885.000000000000000;0
8076;-742050.429999999701977;-1045256.199999999254942;0
3423;-743731.600000001490116;-1043092.067999999970198;0
4141;-742804.644999999552965;-1044008.964999999850988;0
6852;-741571.519999999552965;-1045065.932999998331070;0
2261;-743009.000000000000000;-1045657.000000000000000;0
6493;-742196.574000000953674;-1044452.076999999582767;0
4055;-743119.070000000298023;-1043694.109999999403954;0
6177;-742313.717999998480082;-1043061.859999999403954;0
2304;-742442.000000000000000;-1045429.000000000000000;0
4634;-742635.980000000447035;-1042656.144999999552965;0
8282;-742183.519999999552965;-1042790.890000000596046;0
1345;-741741.000000000000000;-1044789.000000000000000;0
1393;-742083.000000000000000;-1045067.000000000000000;0
2320;-742707.000000000000000;-1045477.000000000000000;0
307;-742781.000000000000000;-1044143.000000000000000;0
5270;-742989.153999999165535;-1043210.684999998658895;0
512;-742063.000000000000000;-1043136.000000000000000;0
684;-742358.000000000000000;-1043136.000000000000000;0
2374;-742473.000000000000000;-1045546.000000000000000;0
7171;-742671.969999998807907;-1044508.219999998807907;0
4724;-742870.089999999850988;-1042658.210000000894070;0
4980;-742521.857999999076128;-1043030.853000000119209;0
4331;-742391.967999998480082;-1043310.539000000804663;0
2760;-743863.331000000238419;-1043483.304000001400709;0
4229;-742146.929000001400709;-1043334.585000000894070;0
4675;-742805.809999998658895;-1042785.070000000298023;0
3100;-743941.234000001102686;-1042742.857999999076128;0
3795;-743173.190000001341105;-1042842.170000001788139;0
4459;-742274.829999998211861;-1042644.269999999552965;0
6258;-742382.381999999284744;-1043032.370999999344349;0
1222;-742157.000000000000000;-1044266.000000000000000;0
4860;-742964.800999999046326;-1043016.107999999076128;0
4607;-742508.469999998807907;-1042623.089000001549721;0
4335;-742398.230000000447035;-1043445.760000001639128;256
7182;-742597.789999999105930;-1044678.260000001639128;0
7187;-742595.019999999552965;-1044739.962000001221895;0
7661;-742294.495999999344349;-1045349.482000000774860;0
1452;-741519.000000000000000;-1044574.000000000000000;0
6822;-741283.870000001043081;-1044793.059999998658895;0
1526;-741644.000000000000000;-1043787.000000000000000;0
6243;-742367.739999998360872;-1043061.098000001162291;0
5420;-742442.920000001788139;-1042740.519999999552965;0
1237;-742144.000000000000000;-1044365.000000000000000;0
6496;-742290.655999999493361;-1044438.502999998629093;0
4560;-742427.079999998211861;-1042500.829999998211861;0
2026;-743351.000000000000000;-1045022.000000000000000;0
5036;-742666.855999998748302;-1042990.710000000894070;0
1007;-741976.000000000000000;-1044586.000000000000000;0
3311;-743816.037999998778105;-1042845.728999998420477;0
6510;-741721.960000000894070;-1044461.815000001341105;0
1943;-743264.000000000000000;-1044421.000000000000000;0
5067;-742813.465999998152256;-1043267.335999999195337;0
5026;-742631.168999999761581;-1042903.938999999314547;0
4309;-742042.329999998211861;-1043492.329999998211861;0
2197;-743331.000000000000000;-1045189.000000000000000;0
7169;-742693.079999998211861;-1044394.177999999374151;0
3582;-744914.405999999493361;-1042603.405999999493361;0
4036;-743246.920000001788139;-1043771.574999999254942;0
2466;-743460.000000000000000;-1044740.000000000000000;0
2315;-742854.000000000000000;-1045460.000000000000000;0
5302;-743090.423999998718500;-1043070.048999998718500;0
1756;-742165.000000000000000;-1045209.000000000000000;0
7007;-742923.890000000596046;-1044218.879999998956919;0
6174;-742316.021999999880791;-1043066.065000001341105;0
2160;-742849.000000000000000;-1045147.000000000000000;0
1516;-741928.000000000000000;-1044062.000000000000000;0
1714;-741239.129999998956919;-1044887.079999998211861;0
4212;-742205.245000001043081;-1043548.410000000149012;0
3848;-743094.383999999612570;-1042505.245000001043081;0
4768;-742862.888000000268221;-1042936.997999999672174;0
4512;-742515.339999999850988;-1042750.230000000447035;0
3680;-744554.980000000447035;-1042501.594999998807907;0
5016;-742572.212000001221895;-1042955.526999998837709;0
6746;-742405.083999998867512;-1044259.199999999254942;0
2094;-743203.000000000000000;-1044744.000000000000000;0
1610;-742374.000000000000000;-1044447.000000000000000;0
683;-742362.000000000000000;-1043155.000000000000000;0
8267;-742240.420000001788139;-1042709.160000000149012;0
1356;-741916.000000000000000;-1044874.000000000000000;0
5065;-742796.800999999046326;-1043254.010000001639128;0
5791;-743256.583000000566244;-1043571.184000000357628;0
7077;-743564.359000001102686;-1045385.210000000894070;0
4989;-742648.756000000983477;-1043019.318999998271465;0
7829;-743509.649999998509884;-1045166.399999998509884;0
1239;-742138.000000000000000;-1044401.000000000000000;0
249;-743433.000000000000000;-1043775.000000000000000;0
1910;-743460.000000000000000;-1044391.000000000000000;0
4737;-742718.399999998509884;-1042684.079999998211861;0
2318;-742763.000000000000000;-1045470.000000000000000;0
4145;-742687.109999999403954;-1043837.125000000000000;0
1402;-741699.000000000000000;-1044419.000000000000000;0
4676;-742792.579999998211861;-1042771.519999999552965;0
817;-741937.000000000000000;-1042586.000000000000000;0
2057;-742787.000000000000000;-1044365.000000000000000;0
1319;-741788.000000000000000;-1044905.000000000000000;0
2185;-743216.000000000000000;-1045130.000000000000000;0
1494;-741173.000000000000000;-1044326.000000000000000;0
6126;-743428.385999999940395;-1043621.800000000745058;0
4722;-742878.030000001192093;-1042626.550000000745058;0
7295;-743165.010000001639128;-1044947.170000001788139;0
1819;-743034.000000000000000;-1044350.000000000000000;0
6175;-742315.256999999284744;-1043064.660999998450279;0
1808;-743187.000000000000000;-1044539.000000000000000;0
5701;-743417.076999999582767;-1043630.140000000596046;0
4667;-742823.039999999105930;-1042631.620000001043081;0
1935;-743276.000000000000000;-1044289.000000000000000;0
350;-742505.000000000000000;-1043757.000000000000000;0
584;-741980.000000000000000;-1043396.000000000000000;0
1020;-742293.000000000000000;-1044615.000000000000000;0
3377;-743832.151999998837709;-1042925.721000000834465;0
1371;-742089.000000000000000;-1044807.000000000000000;0
4895;-742596.936999998986721;-1042829.168000001460314;0
4572;-742343.539999999105930;-1042598.289999999105930;0
7050;-743438.070999998599291;-1044185.932000000029802;76
4838;-742981.304999999701977;-1042697.471000000834465;0
171;-743448.000000000000000;-1043399.000000000000000;0
1143;-741415.000000000000000;-1044457.000000000000000;0
326;-742682.000000000000000;-1044102.000000000000000;0
3163;-743993.758999999612570;-1042530.366000000387430;0
4784;-742945.712999999523163;-1042685.611999999731779;0
4973;-742480.098000001162291;-1043031.443999998271465;0
6944;-742927.063000001013279;-1043928.673000000417233;0
7158;-742984.796999998390675;-1044545.407999999821186;0
7208;-742560.289999999105930;-1045023.789999999105930;0
40;-743597.000000000000000;-1042361.000000000000000;0
7721;-742941.157000001519918;-1044215.368000000715256;0
540;-742144.000000000000000;-1043804.000000000000000;0
7728;-743360.581999998539686;-1044610.631000000983477;0
314;-742585.000000000000000;-1044184.000000000000000;0
6327;-745070.166000001132488;-1042705.697000000625849;0
570;-742098.000000000000000;-1043582.000000000000000;0
758;-741658.000000000000000;-1042666.000000000000000;0
7946;-742007.769999999552965;-1044091.789999999105930;0
1303;-741865.000000000000000;-1044692.000000000000000;0
4563;-742461.379999998956919;-1042526.230000000447035;0
5997;-742040.579999998211861;-1043282.651999998837709;0
4952;-742318.899999998509884;-1042915.589999999850988;0
4464;-742182.309999998658895;-1042571.379999998956919;0
701;-742023.000000000000000;-1042885.000000000000000;0
1614;-742388.000000000000000;-1044432.000000000000000;0
7682;-742503.329999998211861;-1045169.949999999254942;0
7281;-742801.859999999403954;-1044705.300000000745058;0
621;-742285.000000000000000;-1043282.000000000000000;0
2337;-742783.000000000000000;-1045544.000000000000000;0
674;-742463.000000000000000;-1043211.000000000000000;0
1915;-743468.000000000000000;-1044494.000000000000000;0
1991;-743482.000000000000000;-1044929.000000000000000;0
1153;-741245.000000000000000;-1044480.000000000000000;0
719;-741705.000000000000000;-1042828.000000000000000;0
336;-742616.000000000000000;-1043959.000000000000000;0
1257;-742070.000000000000000;-1044815.000000000000000;0
4680;-742759.370000001043081;-1042864.140000000596046;0
4707;-742743.519999999552965;-1042600.359999999403954;0
389;-742408.000000000000000;-1043783.000000000000000;0
4661;-742816.708000000566244;-1042503.918999999761581;0
4566;-742473.846000000834465;-1042545.780000001192093;0
5241;-743365.063000001013279;-1043245.954999998211861;0
6676;-742250.239999998360872;-1044174.719999998807907;0
888;-741994.000000000000000;-1042797.000000000000000;0
4201;-742269.000000000000000;-1043651.563000001013279;0
3293;-743596.793000001460314;-1042814.440000001341105;0
5961;-742431.225000001490116;-1044003.574999999254942;0
6260;-742377.692999999970198;-1043022.434000000357628;0
556;-742222.000000000000000;-1043702.000000000000000;0
5158;-743148.138999998569489;-1043320.254999998956919;0
6230;-742317.590999998152256;-1043059.730999998748302;0
7189;-742588.486999999731779;-1044766.690999999642372;0
1482;-741289.000000000000000;-1044232.000000000000000;0
5995;-744441.440999999642372;-1042779.568999998271465;0
5148;-743071.477000001817942;-1043411.539999999105930;0
1827;-743033.000000000000000;-1044080.000000000000000;0
1590;-742377.000000000000000;-1044885.000000000000000;0
1167;-741836.000000000000000;-1044429.000000000000000;0
308;-742754.000000000000000;-1044149.000000000000000;0
1380;-742156.000000000000000;-1044947.000000000000000;0
5164;-743173.335000000894070;-1043404.677000001072884;0
3601;-744894.190999999642372;-1042626.861999999731779;0
4323;-742267.879999998956919;-1043190.035000000149012;0
2166;-743016.000000000000000;-1045179.000000000000000;0
1606;-742437.000000000000000;-1044706.000000000000000;211
1857;-742574.000000000000000;-1044318.000000000000000;0
3282;-743619.890999998897314;-1042841.907000001519918;0
6982;-743055.109999999403954;-1044342.629999998956919;0
7214;-742470.679999999701977;-1044531.269999999552965;0
6832;-741552.254000000655651;-1044899.227000001817942;0
1617;-742384.000000000000000;-1044407.000000000000000;0
4134;-742772.309999998658895;-1044078.870000001043081;0
7212;-742559.410000000149012;-1045073.070000000298023;0
6362;-742039.230999998748302;-1042680.660000000149012;0
3871;-742356.649999998509884;-1042420.543999999761581;0
7285;-742806.960000000894070;-1044758.379999998956919;0
3353;-743954.399999998509884;-1043021.017999999225140;0
5396;-744557.436000000685453;-1042656.633000001311302;0
633;-742100.000000000000000;-1043296.000000000000000;0
2331;-742895.000000000000000;-1045530.000000000000000;0
4051;-743236.329999998211861;-1043889.710000000894070;0
1385;-742194.000000000000000;-1044974.000000000000000;0
526;-742209.000000000000000;-1043849.000000000000000;0
6123;-743427.453000001609325;-1043603.083000000566244;0
7203;-742571.300000000745058;-1044963.219999998807907;0
2133;-743040.000000000000000;-1045127.000000000000000;0
7130;-743306.429999999701977;-1044539.519999999552965;0
6266;-742349.021000001579523;-1043019.662999998778105;0
2576;-742487.000000000000000;-1045483.000000000000000;0
6165;-742315.407000001519918;-1043066.436000000685453;0
4059;-743142.649999998509884;-1043612.730000000447035;0
2496;-741953.000000000000000;-1044102.000000000000000;0
4893;-742637.320000000298023;-1042818.600999999791384;0
4810;-743058.420000001788139;-1042810.050000000745058;0
7220;-742418.820000000298023;-1044813.199999999254942;0
8056;-742242.379999998956919;-1045023.460000000894070;0
915;-741884.000000000000000;-1043273.000000000000000;0
6150;-742311.879999998956919;-1043062.857000000774860;0
1850;-742751.000000000000000;-1044237.000000000000000;0
1375;-742151.000000000000000;-1044887.000000000000000;0
4505;-742434.910000000149012;-1042706.170000001788139;0
7740;-742301.949999999254942;-1045061.239000000059605;0
840;-742067.000000000000000;-1042522.000000000000000;0
4214;-742229.274999998509884;-1043511.745000001043081;0
5221;-743263.820000000298023;-1043556.920000001788139;0
8245;-742642.489999998360872;-1045210.670000001788139;0
4749;-742884.420000001788139;-1042760.329999998211861;0
2172;-742886.000000000000000;-1045182.000000000000000;0
4099;-742773.870000001043081;-1043846.135999999940395;0
2072;-743043.000000000000000;-1044743.000000000000000;0
1953;-743344.000000000000000;-1044500.000000000000000;0
6188;-742312.807999998331070;-1043058.706999998539686;0
1706;-741225.800000000745058;-1044698.800000000745058;0
4921;-742444.739999998360872;-1042908.420000001788139;0
90;-744040.000000000000000;-1043095.000000000000000;0
3993;-743345.100000001490116;-1043930.980000000447035;0
6135;-742308.289000000804663;-1043059.340999998152256;0
250;-743428.000000000000000;-1043794.000000000000000;0
7188;-742583.839999999850988;-1044742.870000001043081;0
6168;-742313.092999998480082;-1043062.208999998867512;0
5666;-743418.543999999761581;-1043712.120000001043081;0
725;-741983.000000000000000;-1042939.000000000000000;0
3981;-743341.517000000923872;-1043837.353999998420477;0
5705;-743417.603000000119209;-1043637.098000001162291;0
1912;-743461.000000000000000;-1044430.000000000000000;0
5015;-742575.741000000387430;-1043008.607999999076128;0
1908;-743459.000000000000000;-1044358.000000000000000;0
5243;-743357.622000001370907;-1043407.258999999612570;0
2296;-742678.000000000000000;-1045399.000000000000000;0
376;-742530.000000000000000;-1043680.000000000000000;0
5663;-743422.087999999523163;-1043710.807999998331070;0
5580;-743409.831000000238419;-1043636.449000000953674;0
4777;-742910.034000001847744;-1042759.350999999791384;0
6157;-742314.026999998837709;-1043065.331000000238419;0
190;-743443.000000000000000;-1043597.000000000000000;0
1509;-741741.000000000000000;-1044196.000000000000000;0
6823;-741313.910000000149012;-1044788.510000001639128;0
4806;-743138.429999999701977;-1042771.350000001490116;0
3870;-742381.989999998360872;-1042417.679999999701977;0
5294;-743056.328999999910593;-1043196.096999999135733;0
5111;-742892.337999999523163;-1043424.370999999344349;0
6184;-742315.868999999016523;-1043064.326999999582767;0
7148;-742828.445000000298023;-1044472.094999998807907;0
538;-742113.000000000000000;-1043652.000000000000000;0
892;-742946.000000000000000;-1042607.000000000000000;0
4712;-742830.309999998658895;-1042614.969999998807907;0
743;-741682.000000000000000;-1043020.000000000000000;0
3868;-742432.381000000983477;-1042412.094000000506639;0
4206;-742342.340999998152256;-1043547.063000001013279;0
2378;-742372.000000000000000;-1045503.000000000000000;0
6255;-742379.991999998688698;-1043037.068999998271465;0
7221;-742394.890000000596046;-1044813.550000000745058;0
3519;-744889.844999998807907;-1042681.971000000834465;0
1087;-741605.000000000000000;-1044533.000000000000000;0
5252;-743283.517000000923872;-1043176.197999998927116;0
3992;-743365.899999998509884;-1043881.385000001639128;0
5723;-743420.903000000864267;-1043631.703999999910593;0
6838;-741701.057999998331070;-1044977.087000001221895;0
5441;-743196.690000001341105;-1043289.765000000596046;0
1573;-742358.000000000000000;-1044452.000000000000000;0
628;-742217.370000001043081;-1043308.559999998658895;0
7021;-743129.019999999552965;-1044076.230000000447035;0
2508;-742961.000000000000000;-1044050.000000000000000;0
5214;-743307.671999998390675;-1043376.414000000804663;0
2143;-742859.000000000000000;-1045086.000000000000000;0
6351;-741874.269999999552965;-1042706.859999999403954;0
1696;-741529.000000000000000;-1044660.000000000000000;0
7204;-742561.000000000000000;-1044976.910000000149012;0
4029;-743130.695999998599291;-1043815.427999999374151;0
5412;-742582.037000000476837;-1042571.986000001430511;0
7210;-742559.789999999105930;-1045047.809999998658895;0
2371;-742463.000000000000000;-1045461.000000000000000;0
4983;-742587.776000000536442;-1043013.068999998271465;0
91;-744044.000000000000000;-1043053.000000000000000;0
2887;-744098.480000000447035;-1043192.508000001311302;0
1126;-741684.000000000000000;-1044450.000000000000000;0
264;-743367.000000000000000;-1043732.000000000000000;0
6253;-742378.725000001490116;-1043039.690000001341105;0
3887;-742347.760000001639128;-1042449.881000000983477;0
1111;-741167.030000001192093;-1044590.170000001788139;0
3292;-743576.905000001192093;-1042781.315000001341105;0
5600;-743410.407000001519918;-1043680.594000000506639;0
7729;-742623.480999998748302;-1044601.217000000178814;0
2246;-743218.000000000000000;-1045379.000000000000000;0
2268;-742911.000000000000000;-1045632.000000000000000;0
347;-742542.000000000000000;-1043795.000000000000000;0
634;-742117.000000000000000;-1043309.000000000000000;0
3839;-743112.140000000596046;-1042558.280000001192093;0
7678;-742388.550999999046326;-1045109.184000000357628;0
4711;-742803.300000000745058;-1042601.140000000596046;0
4154;-742544.524999998509884;-1044048.190000001341105;0
2161;-742876.000000000000000;-1045153.000000000000000;0
5960;-743141.460999999195337;-1043339.964999999850988;0
2223;-743053.000000000000000;-1045437.000000000000000;0
1955;-743374.000000000000000;-1044515.000000000000000;0
1760;-741162.000000000000000;-1044101.000000000000000;0
4954;-742405.539999999105930;-1043024.640000000596046;0
1035;-741963.000000000000000;-1044896.000000000000000;0
2193;-743531.000000000000000;-1045204.000000000000000;0
6205;-742314.800000000745058;-1043059.416999999433756;0
4639;-742567.399999998509884;-1042548.592999998480082;0
381;-742465.000000000000000;-1043700.000000000000000;0
1053;-741768.000000000000000;-1045023.000000000000000;0
1028;-741981.000000000000000;-1044692.000000000000000;0
1658;-741404.000000000000000;-1044751.000000000000000;0
6257;-742381.556000001728535;-1043033.991000000387430;0
1311;-741646.000000000000000;-1044831.000000000000000;0
2338;-742797.000000000000000;-1045528.000000000000000;0
399;-742339.000000000000000;-1043884.000000000000000;0
544;-742343.910000000149012;-1043796.500000000000000;0
7928;-743542.539999999105930;-1044784.769999999552965;0
4990;-742657.837999999523163;-1043024.199999999254942;0
7140;-742921.300000000745058;-1044469.335000000894070;0
1016;-742147.000000000000000;-1044590.000000000000000;0
6784;-741318.109999999403954;-1044460.920000001788139;0
4619;-742460.010000001639128;-1042480.890000000596046;0
618;-742203.000000000000000;-1043272.000000000000000;0
1155;-741208.000000000000000;-1044484.000000000000000;0
3101;-743922.754999998956919;-1042745.195000000298023;0
4987;-742641.745000001043081;-1043011.309999998658895;0
340;-742588.000000000000000;-1043906.000000000000000;0
6841;-741583.443999998271465;-1044946.208000000566244;0
7215;-742484.320000000298023;-1044546.620000001043081;0
1171;-741882.000000000000000;-1044375.000000000000000;0
6771;-741345.015999998897314;-1044413.647999998182058;0
7038;-743316.394999999552965;-1044240.155000001192093;0
4659;-742803.311000000685453;-1042470.754999998956919;0
699;-742067.000000000000000;-1042896.000000000000000;0
7241;-742701.429999999701977;-1044833.920000001788139;0
2524;-742108.000000000000000;-1044191.000000000000000;0
6169;-742312.320000000298023;-1043060.791999999433756;0
4060;-742896.530000001192093;-1043699.219999998807907;0
5316;-743075.980000000447035;-1043041.059999998658895;0
331;-742664.000000000000000;-1044024.000000000000000;0
4951;-742335.579999998211861;-1042934.429999999701977;0
5955;-742960.732999999076128;-1043520.888999998569489;0
4037;-743205.375000000000000;-1043771.175000000745058;0
6212;-742317.006000000983477;-1043061.888000000268221;0
2257;-742956.000000000000000;-1045558.000000000000000;0
4169;-742414.420000001788139;-1043962.329999998211861;0
4894;-742610.888999998569489;-1042819.686999998986721;0
4048;-743218.050000000745058;-1043961.320000000298023;0
1594;-742304.000000000000000;-1044977.000000000000000;0
4688;-742676.179000001400709;-1042555.322999998927116;0
3289;-743584.761999998241663;-1042769.188000001013279;0
1537;-741924.000000000000000;-1043954.000000000000000;0
5258;-743356.739999998360872;-1043230.039999999105930;0
