OID_;X;Y;TEMPERATURE
5306;-743103.326999999582767;-1043193.129000000655651;0
2641;-743432.578999999910593;-1042583.418999999761581;0
745;-741649.000000000000000;-1042968.000000000000000;0
2241;-743319.000000000000000;-1045289.000000000000000;0
2892;-744005.317000001668930;-1043204.537000000476837;0
461;-741713.000000000000000;-1043304.000000000000000;0
1020;-742293.000000000000000;-1044615.000000000000000;0
6872;-741751.719999998807907;-1045296.679999999701977;0
1682;-741129.769999999552965;-1044685.559999998658895;0
2698;-743513.489999998360872;-1042042.620000001043081;0
7153;-742889.646999999880791;-1044547.438000001013279;0
2758;-743919.949999999254942;-1043488.059999998658895;0
6766;-741193.449999999254942;-1044424.320000000298023;0
2108;-743147.000000000000000;-1045086.000000000000000;0
3098;-743918.111000001430511;-1042753.629000000655651;0
6;-743464.000000000000000;-1042594.000000000000000;0
3811;-743244.620000001043081;-1042809.420000001788139;0
2148;-742835.000000000000000;-1045008.000000000000000;0
4333;-742428.420000001788139;-1043255.609999999403954;0
1459;-741491.000000000000000;-1044340.000000000000000;0
5119;-742850.592999998480082;-1043328.484999999403954;0
6708;-742268.296999998390675;-1044748.438000001013279;287
1091;-741531.480000000447035;-1044543.440000001341105;0
1685;-741140.120000001043081;-1044765.980000000447035;0
2165;-742994.000000000000000;-1045179.000000000000000;0
1507;-741673.000000000000000;-1044223.000000000000000;0
2215;-743135.000000000000000;-1045335.000000000000000;0
706;-741897.000000000000000;-1042881.000000000000000;0
3310;-743829.561999998986721;-1042854.063000001013279;57
3838;-743113.550000000745058;-1042543.399999998509884;0
1587;-742372.000000000000000;-1044806.000000000000000;0
1357;-741935.000000000000000;-1044871.000000000000000;0
3802;-743068.190000001341105;-1042879.710000000894070;0
7279;-742799.399999998509884;-1044679.829999998211861;0
1773;-741281.000000000000000;-1043977.000000000000000;0
3127;-743955.348000001162291;-1042668.469000000506639;0
7539;-742682.600000001490116;-1045366.339999999850988;0
5943;-742064.651000000536442;-1043693.136999998241663;0
598;-741853.000000000000000;-1043233.000000000000000;0
5936;-743333.519000001251698;-1043956.541999999433756;0
6979;-743081.460000000894070;-1044413.079999998211861;0
6853;-741548.899000000208616;-1045052.295000001788139;0
6401;-741992.449999999254942;-1042503.609999999403954;0
930;-744068.000000000000000;-1043405.000000000000000;0
704;-741929.000000000000000;-1042879.000000000000000;0
2159;-742822.000000000000000;-1045141.000000000000000;0
4098;-742789.157000001519918;-1043861.918999999761581;0
1448;-741537.000000000000000;-1044716.000000000000000;0
845;-742126.000000000000000;-1042505.000000000000000;0
1937;-743273.000000000000000;-1044318.000000000000000;0
514;-742119.000000000000000;-1043141.000000000000000;0
7161;-743056.383000001311302;-1044541.903999999165535;0
2563;-741065.000000000000000;-1044421.000000000000000;0
3336;-743972.239999998360872;-1043004.743000000715256;0
5149;-743072.195999998599291;-1043377.370999999344349;0
6179;-742312.195000000298023;-1043059.041000001132488;0
5271;-742995.381999999284744;-1043229.673000000417233;0
7946;-742007.769999999552965;-1044091.789999999105930;0
3107;-743778.888000000268221;-1042682.131999999284744;0
611;-742037.000000000000000;-1043267.000000000000000;0
6727;-742522.868000000715256;-1044395.879999998956919;0
1657;-741399.000000000000000;-1044717.000000000000000;0
3410;-743766.532000001519918;-1043023.280999999493361;0
1529;-741727.000000000000000;-1043794.000000000000000;0
1718;-741366.219999998807907;-1044870.989999998360872;0
382;-742481.000000000000000;-1043751.000000000000000;0
1764;-741163.000000000000000;-1044144.000000000000000;0
4309;-742042.329999998211861;-1043492.329999998211861;0
3212;-743646.699000000953674;-1042469.458999998867512;0
2422;-742473.000000000000000;-1045096.000000000000000;0
4458;-742245.679999999701977;-1042633.960000000894070;0
4070;-742925.285000000149012;-1043783.565000001341105;0
512;-742063.000000000000000;-1043136.000000000000000;0
698;-742041.000000000000000;-1042903.000000000000000;0
1000;-741828.000000000000000;-1044502.000000000000000;0
7746;-742234.789999999105930;-1045549.890000000596046;0
4690;-742679.162999998778105;-1042583.138999998569489;0
4225;-742115.607999999076128;-1043452.125000000000000;0
3746;-743261.420000001788139;-1042982.839999999850988;0
4163;-742487.695000000298023;-1044138.535000000149012;0
1768;-741265.000000000000000;-1044133.000000000000000;0
1703;-741320.000000000000000;-1044686.000000000000000;0
1027;-741984.000000000000000;-1044660.000000000000000;0
2288;-742936.000000000000000;-1045436.000000000000000;0
6225;-742314.519999999552965;-1043055.927000001072884;0
2050;-743460.000000000000000;-1045072.000000000000000;0
3889;-742335.008999999612570;-1042489.949000000953674;0
1547;-742220.000000000000000;-1044181.000000000000000;0
3044;-744378.258000001311302;-1042783.539999999105930;0
6223;-742316.076000001281500;-1043058.679000001400709;0
6206;-742314.043000001460314;-1043058.028999999165535;0
4063;-742855.079999998211861;-1043654.695000000298023;0
628;-742217.370000001043081;-1043308.559999998658895;0
6688;-742383.146999999880791;-1045009.361000001430511;0
331;-742664.000000000000000;-1044024.000000000000000;0
1376;-742165.000000000000000;-1044873.000000000000000;0
5410;-742572.837000001221895;-1042981.173999998718500;0
4702;-742669.300000000745058;-1042747.399999998509884;0
4529;-742762.920000001788139;-1042885.809999998658895;0
1220;-742147.000000000000000;-1044283.000000000000000;0
7091;-743361.839999999850988;-1044584.039999999105930;0
183;-743438.000000000000000;-1043422.000000000000000;0
7010;-742857.964999999850988;-1044251.155000001192093;4
337;-742621.000000000000000;-1043941.000000000000000;0
6946;-742974.765000000596046;-1043929.388000000268221;0
1952;-743316.000000000000000;-1044495.000000000000000;0
3068;-744158.921000000089407;-1042812.230999998748302;0
210;-743112.000000000000000;-1043566.000000000000000;0
1932;-743359.000000000000000;-1044408.000000000000000;0
6155;-742315.557999998331070;-1043068.140999998897314;0
4236;-742406.842999998480082;-1043504.015000000596046;0
556;-742222.000000000000000;-1043702.000000000000000;0
1516;-741928.000000000000000;-1044062.000000000000000;0
3921;-743909.208999998867512;-1043541.574000000953674;0
2458;-741019.000000000000000;-1044567.000000000000000;0
6119;-743582.679999999701977;-1042696.969999998807907;0
2344;-742691.000000000000000;-1045541.000000000000000;0
926;-741894.000000000000000;-1042999.000000000000000;0
1342;-741721.000000000000000;-1044783.000000000000000;0
649;-742233.000000000000000;-1043382.000000000000000;0
2194;-743448.000000000000000;-1045193.000000000000000;0
1840;-742984.379999998956919;-1044155.149999998509884;0
4770;-742872.535000000149012;-1042899.679000001400709;0
1297;-742120.000000000000000;-1044453.000000000000000;0
7658;-742333.647999998182058;-1045313.331999998539686;0
6496;-742290.655999999493361;-1044438.502999998629093;0
6138;-742313.561999998986721;-1043067.399000000208616;0
5165;-743191.168000001460314;-1043398.304000001400709;0
4621;-742536.945999998599291;-1042552.296000000089407;0
4212;-742205.245000001043081;-1043548.410000000149012;0
1124;-741715.000000000000000;-1044452.000000000000000;0
5421;-742337.905999999493361;-1042777.837999999523163;0
616;-742153.000000000000000;-1043272.000000000000000;0
4852;-742992.449999999254942;-1042849.890000000596046;0
3412;-743772.947000000625849;-1043053.557999998331070;0
4517;-742638.449999999254942;-1042779.280000001192093;0
7165;-742711.789999999105930;-1044504.984999999403954;0
7968;-741473.980000000447035;-1044379.839999999850988;0
6838;-741701.057999998331070;-1044977.087000001221895;0
7132;-743262.120000001043081;-1044825.699999999254942;0
4713;-742844.640000000596046;-1042605.980000000447035;0
1695;-741550.000000000000000;-1044656.000000000000000;0
2035;-743435.000000000000000;-1044802.000000000000000;0
4426;-742197.589999999850988;-1043031.679999999701977;0
1434;-741931.000000000000000;-1044293.000000000000000;48
6363;-742027.344999998807907;-1042665.324000000953674;0
6275;-742314.603999998420477;-1043016.407999999821186;0
4127;-742837.324999999254942;-1044032.670000001788139;0
2260;-743019.000000000000000;-1045622.000000000000000;0
7216;-742500.129999998956919;-1044564.390000000596046;0
4031;-743135.774000000208616;-1043769.622000001370907;0
1545;-742236.000000000000000;-1044234.000000000000000;0
4335;-742398.230000000447035;-1043445.760000001639128;0
1195;-741696.000000000000000;-1043920.000000000000000;0
7387;-743066.739999998360872;-1045487.570000000298023;0
4938;-742469.324999999254942;-1042658.263000000268221;0
6263;-742365.719000000506639;-1043021.282999999821186;0
3598;-744894.750000000000000;-1042560.583999998867512;0
1552;-741351.000000000000000;-1044295.000000000000000;0
5791;-743256.583000000566244;-1043571.184000000357628;0
79;-744062.000000000000000;-1043257.000000000000000;0
219;-742979.000000000000000;-1043549.000000000000000;0
4160;-742443.074999999254942;-1043885.804999999701977;0
1597;-742338.000000000000000;-1045064.000000000000000;0
4921;-742444.739999998360872;-1042908.420000001788139;0
681;-742383.000000000000000;-1043170.000000000000000;0
1411;-741639.480000000447035;-1044683.019999999552965;0
5419;-742434.690000001341105;-1042846.280000001192093;0
3335;-743976.318999998271465;-1042991.258999999612570;0
4198;-742192.445000000298023;-1043760.521000001579523;0
1613;-742408.000000000000000;-1044428.000000000000000;0
6746;-742405.083999998867512;-1044259.199999999254942;0
8149;-743305.579999998211861;-1043204.070000000298023;0
788;-741637.000000000000000;-1042607.000000000000000;0
1254;-742090.000000000000000;-1044750.000000000000000;0
6859;-741483.522999998182058;-1044967.043999999761581;0
6307;-741835.620000001043081;-1042765.149999998509884;0
1454;-741521.000000000000000;-1044499.000000000000000;0
6975;-743116.140000000596046;-1044506.469999998807907;0
7143;-742850.414999999105930;-1044473.449999999254942;0
2386;-742139.000000000000000;-1045460.000000000000000;0
1384;-742180.000000000000000;-1044969.000000000000000;0
6767;-741223.949999999254942;-1044422.059999998658895;0
624;-742241.000000000000000;-1043343.000000000000000;0
6613;-741749.640000000596046;-1044032.820000000298023;0
2308;-742345.000000000000000;-1045499.000000000000000;0
3235;-744146.118000000715256;-1042659.438999999314547;0
4733;-742767.890000000596046;-1042671.010000001639128;0
4955;-742383.649999998509884;-1043019.250000000000000;0
7410;-743525.730000000447035;-1045377.420000001788139;0
6682;-742329.804000001400709;-1044319.611999999731779;0
2369;-742503.000000000000000;-1045427.000000000000000;0
882;-741825.000000000000000;-1042788.000000000000000;0
5241;-743365.063000001013279;-1043245.954999998211861;0
6658;-741538.879999998956919;-1044165.440000001341105;0
3833;-743029.679999999701977;-1042612.300000000745058;0
1749;-742065.000000000000000;-1045064.000000000000000;0
2212;-743217.000000000000000;-1045279.000000000000000;0
1867;-743474.000000000000000;-1044257.000000000000000;0
2394;-742273.000000000000000;-1045360.000000000000000;0
5002;-742561.190000001341105;-1042977.401999998837709;0
4945;-742422.162999998778105;-1043009.861000001430511;0
4067;-742913.594999998807907;-1043714.640000000596046;0
6714;-742287.171000000089407;-1044923.995999999344349;0
2007;-743231.000000000000000;-1044741.000000000000000;0
7014;-742650.170000001788139;-1044305.010000001639128;0
6125;-743428.124000001698732;-1043615.223999999463558;0
5162;-743180.460999999195337;-1043323.660000000149012;0
3816;-743149.379999998956919;-1042748.489999998360872;0
1820;-743006.000000000000000;-1044272.000000000000000;0
7142;-742872.445000000298023;-1044472.239999998360872;0
3160;-743959.590999998152256;-1042557.386999998241663;0
1323;-741859.000000000000000;-1044941.000000000000000;0
738;-741818.000000000000000;-1043024.000000000000000;0
1286;-742221.460000000894070;-1044465.969999998807907;0
8284;-742219.410000000149012;-1042809.500000000000000;0
994;-741946.000000000000000;-1044433.000000000000000;0
4040;-743224.710000000894070;-1043766.050000000745058;0
2123;-743299.000000000000000;-1045010.000000000000000;0
304;-742868.000000000000000;-1044122.000000000000000;0
4514;-742555.050000000745058;-1042761.809999998658895;0
4821;-742966.550000000745058;-1042877.969999998807907;0
5058;-742837.528999999165535;-1043170.686000000685453;0
5209;-743271.947999998927116;-1043361.392000000923872;0
2103;-743182.000000000000000;-1044931.000000000000000;0
3942;-743420.800000000745058;-1043492.339999999850988;0
1336;-741737.000000000000000;-1044860.000000000000000;0
3983;-743317.089999999850988;-1043883.160000000149012;0
1100;-741397.000000000000000;-1044576.000000000000000;0
5405;-744043.826000001281500;-1042674.686000000685453;0
3963;-743372.780000001192093;-1043538.789999999105930;0
1040;-741904.000000000000000;-1044623.000000000000000;0
4705;-742714.100000001490116;-1042599.829999998211861;0
285;-743021.000000000000000;-1043730.000000000000000;0
4577;-742376.686000000685453;-1042590.309999998658895;0
4699;-742676.469999998807907;-1042731.760000001639128;0
585;-741960.000000000000000;-1043413.000000000000000;0
6320;-741766.848000001162291;-1042614.989999998360872;0
3762;-743173.489999998360872;-1042984.559999998658895;0
1487;-741117.000000000000000;-1044216.000000000000000;0
5461;-742442.704999998211861;-1043234.515000000596046;0
391;-742395.000000000000000;-1043802.000000000000000;0
4732;-742777.550000000745058;-1042653.539999999105930;0
728;-741997.000000000000000;-1042918.000000000000000;0
7782;-743012.350000001490116;-1045871.938999999314547;0
2338;-742797.000000000000000;-1045528.000000000000000;0
2271;-742945.000000000000000;-1045771.000000000000000;0
2632;-743260.298999998718500;-1042362.980000000447035;0
4860;-742964.800999999046326;-1043016.107999999076128;0
4998;-742514.109000001102686;-1042978.602000001817942;0
1716;-741294.859999999403954;-1044879.870000001043081;0
2546;-741750.000000000000000;-1044271.000000000000000;0
5302;-743090.423999998718500;-1043070.048999998718500;0
4030;-743133.280000001192093;-1043791.552000001072884;0
6183;-742316.633999999612570;-1043065.732000000774860;0
3992;-743365.899999998509884;-1043881.385000001639128;0
7234;-742594.870000001043081;-1044815.140000000596046;0
1875;-743367.000000000000000;-1044261.000000000000000;0
4617;-742561.250999998301268;-1042668.140000000596046;0
1271;-742240.000000000000000;-1044521.000000000000000;0
6195;-742314.956000000238419;-1043061.181000001728535;0
1793;-742166.000000000000000;-1044246.000000000000000;0
2317;-742792.000000000000000;-1045467.000000000000000;0
1910;-743460.000000000000000;-1044391.000000000000000;0
2491;-742059.000000000000000;-1044251.000000000000000;0
588;-741950.000000000000000;-1043352.000000000000000;0
4203;-742299.442000001668930;-1043608.692000001668930;0
6103;-742213.102000001817942;-1043103.528999999165535;0
1340;-741695.000000000000000;-1044759.000000000000000;0
4150;-742581.789999999105930;-1044138.429999999701977;0
1248;-742109.000000000000000;-1044631.000000000000000;0
984;-741917.000000000000000;-1044411.000000000000000;0
2286;-742894.000000000000000;-1045440.000000000000000;0
5213;-743326.385999999940395;-1043368.675999999046326;0
7520;-742808.589999999850988;-1045680.519999999552965;0
5211;-743299.236000001430511;-1043364.945000000298023;0
6245;-742369.682000000029802;-1043057.377000000327826;0
1607;-742414.000000000000000;-1044379.000000000000000;0
6185;-742315.103999998420477;-1043062.923000000417233;0
4482;-741768.079999998211861;-1042606.449999999254942;0
8071;-742174.120000001043081;-1045257.530000001192093;0
4977;-742489.451000001281500;-1042992.394000001251698;0
2328;-742459.000000000000000;-1045505.000000000000000;0
1058;-741667.000000000000000;-1045072.000000000000000;0
1042;-741883.000000000000000;-1044682.000000000000000;0
323;-742711.000000000000000;-1044140.000000000000000;21
680;-742402.109999999403954;-1043166.679999999701977;0
7350;-742556.390000000596046;-1045185.980000000447035;0
7260;-742953.010000001639128;-1044873.530000001192093;0
4761;-742810.285000000149012;-1042793.122000001370907;0
693;-742284.000000000000000;-1043062.000000000000000;0
4700;-742659.859999999403954;-1042723.210000000894070;0
6131;-742311.329999998211861;-1043064.982999999076128;0
2095;-743178.000000000000000;-1044734.000000000000000;0
1378;-742161.000000000000000;-1044904.000000000000000;0
6650;-741714.296999998390675;-1044110.177000001072884;0
3679;-744571.809999998658895;-1042497.875999998301268;0
6843;-741569.070000000298023;-1044975.261999998241663;0
4004;-743345.877000000327826;-1044053.135999999940395;0
2473;-743469.000000000000000;-1044899.000000000000000;0
1827;-743033.000000000000000;-1044080.000000000000000;0
4763;-742847.094000000506639;-1042842.671000000089407;0
4928;-742444.890000000596046;-1042854.899999998509884;0
7005;-742998.190000001341105;-1043944.824999999254942;0
551;-742269.000000000000000;-1043755.000000000000000;0
4670;-742810.120000001043081;-1042644.289999999105930;0
4206;-742342.340999998152256;-1043547.063000001013279;0
4037;-743205.375000000000000;-1043771.175000000745058;0
1622;-742495.000000000000000;-1044321.000000000000000;0
3971;-743206.815000001341105;-1043721.065000001341105;0
917;-742121.000000000000000;-1043008.000000000000000;0
4738;-742733.910000000149012;-1042704.890000000596046;0
1243;-742122.000000000000000;-1044502.000000000000000;0
7224;-742399.359999999403954;-1044829.829999998211861;0
4666;-742808.710000000894070;-1042576.609999999403954;0
4989;-742648.756000000983477;-1043019.318999998271465;0
505;-741917.000000000000000;-1043153.000000000000000;0
5127;-743019.265000000596046;-1043389.644999999552965;0
7696;-742416.806000001728535;-1045134.280000001192093;0
4904;-742460.050000000745058;-1042796.739999998360872;0
3783;-743211.559999998658895;-1042920.120000001043081;0
4698;-742673.530000001192093;-1042715.780000001192093;0
6090;-742012.260000001639128;-1043497.300000000745058;0
6961;-743023.579999998211861;-1044221.129999998956919;0
4814;-743000.489999998360872;-1042803.920000001788139;0
1782;-741278.000000000000000;-1043912.000000000000000;0
7305;-742795.050000000745058;-1045069.809999998658895;0
1992;-743482.000000000000000;-1044954.000000000000000;0
4665;-742824.410000000149012;-1042592.260000001639128;0
4123;-742742.956000000238419;-1043901.826000001281500;0
7259;-742935.280000001192093;-1044869.829999998211861;0
3768;-743006.370000001043081;-1042978.829999998211861;0
694;-742280.000000000000000;-1043043.000000000000000;0
4180;-742368.370000001043081;-1044115.471999999135733;0
5117;-742816.081999998539686;-1043298.302999999374151;0
622;-742271.000000000000000;-1043302.000000000000000;0
6846;-741505.875000000000000;-1044995.949000000953674;0
5682;-743399.638000000268221;-1043719.120999999344349;0
4755;-742734.960000000894070;-1042778.019999999552965;0
4660;-742801.596999999135733;-1042487.965999998152256;0
8079;-742021.839999999850988;-1045292.179999999701977;0
1984;-743476.000000000000000;-1044743.000000000000000;0
2040;-743285.000000000000000;-1044809.000000000000000;0
5110;-742876.271999999880791;-1043449.013000000268221;0
4620;-742539.574000000953674;-1042537.307999998331070;0
4606;-742512.769000001251698;-1042608.333000000566244;0
4170;-742407.245000001043081;-1043945.519999999552965;0
1520;-741777.000000000000000;-1043939.000000000000000;0
1696;-741529.000000000000000;-1044660.000000000000000;0
1119;-741791.000000000000000;-1044446.000000000000000;0
1257;-742070.000000000000000;-1044815.000000000000000;0
7164;-742596.114999998360872;-1044447.173000000417233;0
339;-742606.000000000000000;-1043916.000000000000000;0
524;-742255.000000000000000;-1043913.000000000000000;96
754;-741676.000000000000000;-1042727.000000000000000;0
1518;-741994.000000000000000;-1044011.000000000000000;0
7033;-743303.864999998360872;-1044132.750000000000000;0
4009;-743231.157999999821186;-1044047.155000001192093;0
4018;-743153.285000000149012;-1043925.850000001490116;0
7170;-742667.579999998211861;-1044492.469999998807907;0
650;-742263.000000000000000;-1043381.000000000000000;0
3787;-743130.989999998360872;-1042979.320000000298023;0
1602;-742507.000000000000000;-1044924.000000000000000;0
5148;-743071.477000001817942;-1043411.539999999105930;0
4525;-742716.719999998807907;-1042823.219999998807907;0
224;-742904.000000000000000;-1043522.000000000000000;0
7723;-741757.929000001400709;-1044043.175000000745058;0
3790;-743140.809999998658895;-1042908.210000000894070;0
7000;-743096.190000001341105;-1044426.870000001043081;0
4845;-742978.655999999493361;-1042776.048000000417233;0
6104;-742208.646999999880791;-1043103.999000001698732;0
2557;-741318.000000000000000;-1044384.000000000000000;0
5746;-743415.399000000208616;-1043698.644000001251698;0
1512;-741829.000000000000000;-1044135.000000000000000;0
384;-742471.000000000000000;-1043766.000000000000000;0
1130;-741624.000000000000000;-1044446.000000000000000;0
596;-741867.000000000000000;-1043259.000000000000000;0
7958;-741664.710000000894070;-1044289.879999998956919;0
1388;-742152.000000000000000;-1045026.000000000000000;0
3275;-743665.002000000327826;-1042826.396999999880791;0
7179;-742625.429000001400709;-1044622.710000000894070;0
5701;-743417.076999999582767;-1043630.140000000596046;0
3567;-744730.736999999731779;-1042588.842999998480082;0
1573;-742358.000000000000000;-1044452.000000000000000;0
1605;-742404.000000000000000;-1044706.000000000000000;0
3657;-744539.449999999254942;-1042640.177999999374151;0
648;-742246.000000000000000;-1043363.000000000000000;0
5654;-743429.644000001251698;-1043703.151000000536442;0
4175;-742721.254999998956919;-1043775.890000000596046;0
3421;-743743.348000001162291;-1043104.984999999403954;0
7028;-743257.254999998956919;-1044104.574999999254942;0
5653;-743429.589999999850988;-1043701.940999999642372;0
1814;-743095.000000000000000;-1044510.000000000000000;0
5140;-743035.789999999105930;-1043514.489999998360872;0
1466;-741838.000000000000000;-1044041.000000000000000;0
5590;-743422.570000000298023;-1043679.642000000923872;0
3558;-744735.368000000715256;-1042614.524000000208616;0
1211;-742034.000000000000000;-1044412.000000000000000;0
1108;-741261.000000000000000;-1044593.000000000000000;0
1038;-741956.000000000000000;-1044977.000000000000000;0
5961;-742431.225000001490116;-1044003.574999999254942;0
7290;-742819.100000001490116;-1044794.800000000745058;0
5660;-743425.633999999612570;-1043709.497000001370907;0
1316;-741765.000000000000000;-1044903.000000000000000;0
4895;-742596.936999998986721;-1042829.168000001460314;0
4625;-742594.258000001311302;-1042576.114000000059605;0
2259;-743001.000000000000000;-1045599.000000000000000;0
4764;-742839.835999999195337;-1042859.412999998778105;0
1213;-742068.000000000000000;-1044387.000000000000000;0
5418;-742434.890000000596046;-1042864.780000001192093;0
5066;-742827.379000000655651;-1043252.267999999225140;0
609;-741984.000000000000000;-1043272.000000000000000;0
7741;-742302.225999999791384;-1045079.842999998480082;0
1198;-741636.000000000000000;-1043836.000000000000000;0
4637;-742572.578000001609325;-1042742.510999999940395;0
6673;-742244.289999999105930;-1044153.350000001490116;0
6364;-742003.519999999552965;-1042660.690000001341105;0
5695;-743417.217999998480082;-1043638.749000001698732;0
4130;-742868.460000000894070;-1044055.510000001639128;0
1327;-742001.000000000000000;-1045024.000000000000000;0
2307;-742371.000000000000000;-1045477.000000000000000;0
1167;-741836.000000000000000;-1044429.000000000000000;0
5968;-742288.989000000059605;-1044168.456999998539686;0
7183;-742606.379999998956919;-1044692.969999998807907;0
5594;-743417.704999998211861;-1043680.022999998182058;0
3503;-745069.432999998331070;-1042713.429999999701977;0
3533;-744673.774000000208616;-1042675.940000001341105;0
2479;-741247.800000000745058;-1044609.379999998956919;0
6827;-741437.300000000745058;-1044772.629999998956919;0
5157;-743178.671999998390675;-1043354.681000001728535;0
3676;-744617.872999999672174;-1042489.806000001728535;0
7933;-743544.570000000298023;-1044950.370000001043081;0
276;-743382.000000000000000;-1043905.000000000000000;0
793;-741697.000000000000000;-1042588.000000000000000;0
6015;-742854.607999999076128;-1043226.870999999344349;0
2323;-742622.000000000000000;-1045487.000000000000000;0
4784;-742945.712999999523163;-1042685.611999999731779;0
1154;-741228.719999998807907;-1044493.440000001341105;0
6201;-742317.888999998569489;-1043065.035000000149012;0
3953;-743407.249000001698732;-1043543.537000000476837;0
6747;-742410.170000001788139;-1044287.228000000119209;0
7317;-742579.670000001788139;-1045022.239999998360872;0
2172;-742886.000000000000000;-1045182.000000000000000;0
3738;-745043.339999999850988;-1042389.901000000536442;0
8263;-742151.089999999850988;-1042702.239999998360872;0
4036;-743246.920000001788139;-1043771.574999999254942;0
1421;-741587.000000000000000;-1044356.000000000000000;0
4605;-742489.238000001758337;-1042616.754999998956919;0
1407;-741650.000000000000000;-1044242.000000000000000;0
568;-742116.000000000000000;-1043604.000000000000000;0
5736;-743414.859999999403954;-1043691.462999999523163;0
1570;-742291.000000000000000;-1044183.000000000000000;0
7173;-742660.850000001490116;-1044535.730000000447035;0
7186;-742587.609999999403954;-1044726.000000000000000;0
1125;-741728.000000000000000;-1044435.000000000000000;0
7801;-742459.168999999761581;-1044490.660000000149012;0
1619;-742426.000000000000000;-1044401.000000000000000;0
4778;-742918.024999998509884;-1042786.565000001341105;0
1;-743520.000000000000000;-1042472.000000000000000;0
670;-742502.000000000000000;-1043239.000000000000000;0
4987;-742641.745000001043081;-1043011.309999998658895;0
3825;-743056.390000000596046;-1042570.079999998211861;0
4900;-742508.089999999850988;-1042815.289999999105930;0
4465;-742180.250000000000000;-1042584.370000001043081;0
1215;-742091.000000000000000;-1044365.000000000000000;0
2449;-742825.000000000000000;-1044147.000000000000000;0
821;-742048.000000000000000;-1042601.000000000000000;0
4836;-742984.245999999344349;-1042653.127999998629093;0
6982;-743055.109999999403954;-1044342.629999998956919;0
5020;-742572.699999999254942;-1042891.372999999672174;0
1410;-741643.039999999105930;-1044709.940000001341105;0
1794;-742151.000000000000000;-1044190.000000000000000;0
6479;-741969.831000000238419;-1044454.850000001490116;0
6267;-742344.767999999225140;-1043019.272999998182058;0
4779;-742917.822999998927116;-1042727.385000001639128;0
5323;-743049.401000000536442;-1043038.131000000983477;0
8260;-742091.730000000447035;-1042690.769999999552965;0
918;-743437.000000000000000;-1043904.000000000000000;0
2321;-742679.000000000000000;-1045480.000000000000000;0
6366;-741957.399999998509884;-1042652.609999999403954;0
1305;-741826.000000000000000;-1044678.000000000000000;0
1917;-743374.000000000000000;-1044458.000000000000000;0
1060;-741610.000000000000000;-1045115.000000000000000;0
4951;-742335.579999998211861;-1042934.429999999701977;0
6923;-742061.469999998807907;-1045089.760000001639128;0
4526;-742696.690000001341105;-1042823.320000000298023;0
3945;-743388.361000001430511;-1043434.486000001430511;0
5766;-742429.719999998807907;-1042597.699999999254942;0
4737;-742718.399999998509884;-1042684.079999998211861;0
1101;-741339.000000000000000;-1044568.000000000000000;0
2236;-743391.000000000000000;-1045242.000000000000000;0
7282;-742809.410000000149012;-1044693.629999998956919;0
5138;-743030.936000000685453;-1043483.587999999523163;0
2331;-742895.000000000000000;-1045530.000000000000000;0
1013;-742076.000000000000000;-1044595.000000000000000;0
3510;-744982.017000000923872;-1042686.442999999970198;0
912;-741690.000000000000000;-1042686.000000000000000;0
1037;-741958.000000000000000;-1044950.000000000000000;0
1719;-741406.760000001639128;-1044866.039999999105930;0
4759;-742842.945999998599291;-1042806.664000000804663;0
