OID_;X;Y;TEMPERATURE
7;-743479.000000000000000;-1042567.000000000000000;0
2757;-743949.300000000745058;-1043488.500000000000000;0
5786;-743456.410000000149012;-1042105.250000000000000;0
7519;-742850.620000001043081;-1045673.670000001788139;0
4074;-742943.350000001490116;-1043880.304999999701977;0
3752;-743213.949999999254942;-1042902.719999998807907;0
7776;-743089.784000001847744;-1045773.409000001847744;0
3923;-743845.660000000149012;-1043512.260000001639128;0
7409;-743521.629999998956919;-1045356.570000000298023;0
6399;-742013.379999998956919;-1042502.739999998360872;0
2262;-742999.000000000000000;-1045686.000000000000000;0
3314;-743758.675999999046326;-1042905.688999999314547;0
3839;-743112.140000000596046;-1042558.280000001192093;0
8080;-741989.600000001490116;-1045310.420000001788139;0
6658;-741538.879999998956919;-1044165.440000001341105;0
281;-743045.000000000000000;-1043848.000000000000000;205
509;-741991.000000000000000;-1043143.000000000000000;0
1674;-741099.000000000000000;-1044736.000000000000000;0
7177;-742643.059999998658895;-1044579.679999999701977;0
6722;-742357.717000000178814;-1044705.708000000566244;0
7087;-743339.940000001341105;-1044536.690000001341105;0
3352;-743954.622000001370907;-1043015.732999999076128;0
7745;-742933.037000000476837;-1045523.714999999850988;0
2741;-744016.675000000745058;-1043336.642999999225140;0
2516;-742500.000000000000000;-1044414.000000000000000;0
741;-741730.000000000000000;-1043035.000000000000000;0
713;-741800.000000000000000;-1042859.000000000000000;0
3066;-744075.627000000327826;-1042883.837000001221895;0
1057;-741686.000000000000000;-1045058.000000000000000;0
7007;-742923.890000000596046;-1044218.879999998956919;0
1103;-741306.000000000000000;-1044572.000000000000000;0
1486;-741150.000000000000000;-1044219.000000000000000;0
110;-744127.000000000000000;-1042724.000000000000000;3
5434;-744042.467999998480082;-1043135.986999999731779;0
8069;-742226.440000001341105;-1045255.949999999254942;0
5295;-743047.995000001043081;-1043185.530000001192093;0
6723;-742592.894999999552965;-1044408.905000001192093;0
4046;-743205.699999999254942;-1044009.719999998807907;0
1944;-743280.000000000000000;-1044400.000000000000000;0
1310;-741623.000000000000000;-1044829.000000000000000;0
1850;-742751.000000000000000;-1044237.000000000000000;0
758;-741658.000000000000000;-1042666.000000000000000;0
7658;-742333.647999998182058;-1045313.331999998539686;0
1405;-741681.000000000000000;-1044325.000000000000000;0
2037;-743373.000000000000000;-1044805.000000000000000;0
3092;-743909.377999998629093;-1042780.322999998927116;0
5048;-742867.500000000000000;-1043381.899999998509884;0
2075;-743114.000000000000000;-1044772.000000000000000;0
376;-742530.000000000000000;-1043680.000000000000000;0
3747;-743250.879999998956919;-1042956.620000001043081;0
2247;-743199.000000000000000;-1045400.000000000000000;0
4827;-743046.359999999403954;-1042958.140000000596046;0
1330;-741817.000000000000000;-1044709.000000000000000;0
2128;-743170.000000000000000;-1045080.000000000000000;0
5957;-742962.627000000327826;-1043510.905000001192093;0
2149;-742819.000000000000000;-1045024.000000000000000;0
2237;-743368.000000000000000;-1045238.000000000000000;0
4559;-742400.530000001192093;-1042503.760000001639128;0
6297;-742506.859999999403954;-1042634.250000000000000;0
6339;-742245.460000000894070;-1042835.780000001192093;0
7021;-743129.019999999552965;-1044076.230000000447035;0
2378;-742372.000000000000000;-1045503.000000000000000;0
2322;-742651.000000000000000;-1045483.000000000000000;0
4082;-742825.565000001341105;-1043737.364999998360872;0
1151;-741279.000000000000000;-1044475.000000000000000;0
7154;-742908.467000000178814;-1044547.784000001847744;0
3353;-743954.399999998509884;-1043021.017999999225140;0
671;-742489.000000000000000;-1043245.000000000000000;0
5267;-743190.021999999880791;-1043149.807000000029802;0
2212;-743217.000000000000000;-1045279.000000000000000;0
2020;-743260.000000000000000;-1044941.000000000000000;0
2403;-742211.000000000000000;-1045436.000000000000000;0
7260;-742953.010000001639128;-1044873.530000001192093;0
4144;-742704.414999999105930;-1043822.484999999403954;0
8267;-742240.420000001788139;-1042709.160000000149012;0
1873;-743410.000000000000000;-1044260.000000000000000;0
569;-742096.000000000000000;-1043601.000000000000000;0
2224;-743051.000000000000000;-1045450.000000000000000;0
6996;-743116.699999999254942;-1044476.469999998807907;0
5204;-743246.423999998718500;-1043308.298999998718500;0
2537;-741975.000000000000000;-1044131.000000000000000;0
578;-742023.000000000000000;-1043464.000000000000000;0
1507;-741673.000000000000000;-1044223.000000000000000;0
7985;-741091.269999999552965;-1044419.039999999105930;0
4246;-742193.159000001847744;-1043412.537000000476837;0
384;-742471.000000000000000;-1043766.000000000000000;0
5136;-742992.278000000864267;-1043472.440000001341105;0
1531;-741782.000000000000000;-1043838.000000000000000;0
1296;-742100.000000000000000;-1044473.000000000000000;0
1425;-742080.000000000000000;-1044210.000000000000000;0
6573;-741294.089999999850988;-1044091.679999999701977;0
5173;-743291.175999999046326;-1043426.754999998956919;0
4460;-742216.600000001490116;-1042598.850000001490116;0
1252;-742096.000000000000000;-1044711.000000000000000;0
527;-742186.000000000000000;-1043818.000000000000000;0
394;-742405.000000000000000;-1043863.000000000000000;0
1515;-741913.000000000000000;-1044072.000000000000000;0
1905;-743446.000000000000000;-1044312.000000000000000;0
1243;-742122.000000000000000;-1044502.000000000000000;0
4727;-742869.390000000596046;-1042700.829999998211861;0
513;-742083.000000000000000;-1043145.000000000000000;0
1459;-741491.000000000000000;-1044340.000000000000000;0
1095;-741452.000000000000000;-1044553.000000000000000;0
737;-741849.000000000000000;-1043021.000000000000000;0
3990;-743339.489999998360872;-1043987.234999999403954;0
6611;-741711.614000000059605;-1043979.263999998569489;0
3204;-743715.278999999165535;-1042506.118999999016523;0
2193;-743531.000000000000000;-1045204.000000000000000;0
3019;-744463.447999998927116;-1042784.646000001579523;0
3803;-743066.289999999105930;-1042896.320000000298023;0
2318;-742763.000000000000000;-1045470.000000000000000;0
4238;-742440.263000000268221;-1043528.236000001430511;0
2484;-741269.109999999403954;-1044779.070000000298023;0
1481;-741335.000000000000000;-1044231.000000000000000;0
7147;-742827.925000000745058;-1044451.385000001639128;0
457;-741732.000000000000000;-1043333.000000000000000;0
4199;-742205.142999999225140;-1043745.868000000715256;0
4693;-742691.399999998509884;-1042612.399999998509884;0
1435;-741903.000000000000000;-1044306.000000000000000;0
5777;-742926.357000000774860;-1043427.357999999076128;0
5284;-743041.022999998182058;-1043277.397999998182058;0
3182;-743923.576000001281500;-1042554.350000001490116;0
1038;-741956.000000000000000;-1044977.000000000000000;0
844;-742138.000000000000000;-1042519.000000000000000;0
5228;-743334.289999999105930;-1043545.039999999105930;0
2558;-741286.000000000000000;-1044387.000000000000000;0
342;-742573.000000000000000;-1043878.000000000000000;0
1679;-741116.550000000745058;-1044578.600000001490116;0
2220;-743075.000000000000000;-1045396.000000000000000;0
1702;-741348.000000000000000;-1044682.000000000000000;0
4052;-743252.954999998211861;-1043843.585000000894070;0
3438;-743746.833000000566244;-1043057.962000001221895;0
1573;-742358.000000000000000;-1044452.000000000000000;0
4166;-742448.504999998956919;-1044046.885000001639128;0
8052;-742218.929999999701977;-1044953.719999998807907;0
618;-742203.000000000000000;-1043272.000000000000000;0
7043;-743398.899999998509884;-1044106.629999998956919;0
7215;-742484.320000000298023;-1044546.620000001043081;0
6607;-741674.456000000238419;-1043925.333999998867512;0
6270;-742333.412999998778105;-1043018.204999998211861;0
4909;-742383.146000001579523;-1042799.159000001847744;0
700;-742008.000000000000000;-1042895.000000000000000;0
1448;-741537.000000000000000;-1044716.000000000000000;0
636;-742160.000000000000000;-1043325.000000000000000;0
4961;-742309.460000000894070;-1043010.730000000447035;0
7153;-742889.646999999880791;-1044547.438000001013279;0
5246;-743373.739999998360872;-1043268.899999998509884;0
7967;-741508.109999999403954;-1044369.239999998360872;0
3997;-743395.094999998807907;-1044031.109999999403954;0
2364;-742504.000000000000000;-1045563.000000000000000;0
5236;-743352.302000001072884;-1043362.752000000327826;0
2893;-743977.276000000536442;-1043208.923999998718500;0
2400;-742087.000000000000000;-1045374.000000000000000;0
1912;-743461.000000000000000;-1044430.000000000000000;0
6371;-741972.725000001490116;-1042696.274000000208616;0
3536;-744636.616000000387430;-1042659.348999999463558;0
6096;-742098.760000001639128;-1043615.589999999850988;0
4213;-742218.094999998807907;-1043529.954999998211861;238
4561;-742458.059999998658895;-1042497.190000001341105;0
6719;-742371.686999998986721;-1044952.227000001817942;0
2165;-742994.000000000000000;-1045179.000000000000000;0
7212;-742559.410000000149012;-1045073.070000000298023;0
545;-742337.000000000000000;-1043805.000000000000000;0
1587;-742372.000000000000000;-1044806.000000000000000;0
995;-741906.000000000000000;-1044434.000000000000000;0
3347;-743959.280000001192093;-1043034.447000000625849;0
799;-741822.000000000000000;-1042573.000000000000000;0
1820;-743006.000000000000000;-1044272.000000000000000;0
1518;-741994.000000000000000;-1044011.000000000000000;0
5252;-743283.517000000923872;-1043176.197999998927116;0
3835;-743050.579999998211861;-1042590.109999999403954;0
4499;-742338.899999998509884;-1042707.250000000000000;0
7037;-743316.085000000894070;-1044222.170000001788139;0
2490;-742063.000000000000000;-1044273.000000000000000;0
4768;-742862.888000000268221;-1042936.997999999672174;0
1251;-742091.000000000000000;-1044690.000000000000000;0
6695;-742306.234000001102686;-1044816.138999998569489;0
4332;-742410.359000001102686;-1043282.916000001132488;0
3416;-743754.546000000089407;-1043086.953000001609325;0
1989;-743481.000000000000000;-1044876.000000000000000;0
2082;-742569.000000000000000;-1044642.000000000000000;0
4532;-742760.140000000596046;-1042899.600000001490116;0
5001;-742560.092999998480082;-1042966.206999998539686;0
6944;-742927.063000001013279;-1043928.673000000417233;0
4085;-742812.431000001728535;-1043657.114000000059605;0
4150;-742581.789999999105930;-1044138.429999999701977;0
5518;-743427.500999998301268;-1043621.975000001490116;0
5186;-743270.949999999254942;-1043526.039999999105930;0
217;-742998.000000000000000;-1043554.000000000000000;0
4120;-742715.179999999701977;-1043974.089999999850988;0
1760;-741162.000000000000000;-1044101.000000000000000;0
8273;-742057.820000000298023;-1042728.760000001639128;0
1982;-743408.000000000000000;-1044646.000000000000000;0
4516;-742588.570000000298023;-1042771.460000000894070;0
7282;-742809.410000000149012;-1044693.629999998956919;0
4614;-742493.800000000745058;-1042636.896000001579523;0
1782;-741278.000000000000000;-1043912.000000000000000;0
7808;-741986.629999998956919;-1044440.109999999403954;0
8280;-742150.949999999254942;-1042770.420000001788139;0
407;-742340.000000000000000;-1044177.000000000000000;0
7146;-742819.425000000745058;-1044426.225000001490116;0
2052;-743403.000000000000000;-1045075.000000000000000;0
500;-741861.000000000000000;-1043174.000000000000000;0
6751;-742426.350000001490116;-1044371.070000000298023;0
1505;-741606.000000000000000;-1044248.000000000000000;0
6931;-742050.949999999254942;-1045191.190000001341105;0
1020;-742293.000000000000000;-1044615.000000000000000;0
1084;-741698.000000000000000;-1044537.000000000000000;0
4494;-741874.920000001788139;-1042616.660000000149012;0
4116;-742740.429999999701977;-1044064.789999999105930;0
6240;-742364.495999999344349;-1043067.289999999105930;0
6189;-742312.041999999433756;-1043057.302000001072884;0
4736;-742701.269999999552965;-1042690.000000000000000;0
6873;-741769.339999999850988;-1045285.489999998360872;0
3815;-743161.949999999254942;-1042769.750000000000000;0
603;-741810.000000000000000;-1043205.000000000000000;0
2641;-743432.578999999910593;-1042583.418999999761581;0
2514;-742546.000000000000000;-1044431.000000000000000;0
3766;-743053.532999999821186;-1042996.631000000983477;0
5418;-742434.890000000596046;-1042864.780000001192093;0
1239;-742138.000000000000000;-1044401.000000000000000;0
683;-742362.000000000000000;-1043155.000000000000000;0
1933;-743329.000000000000000;-1044407.000000000000000;0
3782;-743285.429999999701977;-1042842.460000000894070;0
6855;-741501.394999999552965;-1045027.784000001847744;0
4067;-742913.594999998807907;-1043714.640000000596046;0
3846;-743149.390000000596046;-1042549.600000001490116;0
5738;-743410.412999998778105;-1043691.800000000745058;0
205;-743173.000000000000000;-1043599.000000000000000;0
6305;-741836.559999998658895;-1042745.190000001341105;0
1320;-741870.000000000000000;-1044957.000000000000000;0
1446;-741545.000000000000000;-1044774.000000000000000;0
6188;-742312.807999998331070;-1043058.706999998539686;0
4427;-742190.519999999552965;-1043099.440000001341105;0
3100;-743941.234000001102686;-1042742.857999999076128;0
3986;-743313.355000000447035;-1043956.986999999731779;0
329;-742675.000000000000000;-1044052.000000000000000;0
6496;-742290.655999999493361;-1044438.502999998629093;0
1471;-741711.000000000000000;-1044132.000000000000000;0
727;-742001.000000000000000;-1042962.000000000000000;0
7121;-743339.839999999850988;-1044620.059999998658895;0
4323;-742267.879999998956919;-1043190.035000000149012;0
1332;-741793.000000000000000;-1044755.000000000000000;0
1830;-742961.000000000000000;-1044087.000000000000000;0
615;-742129.000000000000000;-1043271.000000000000000;0
2051;-743434.000000000000000;-1045074.000000000000000;0
4498;-741866.120000001043081;-1042718.471000000834465;0
226;-742879.000000000000000;-1043516.000000000000000;0
5447;-743129.958999998867512;-1043365.166000001132488;0
6510;-741721.960000000894070;-1044461.815000001341105;0
6852;-741571.519999999552965;-1045065.932999998331070;0
1098;-741435.000000000000000;-1044571.000000000000000;0
4617;-742561.250999998301268;-1042668.140000000596046;0
1374;-742155.000000000000000;-1044854.000000000000000;0
1300;-741917.410000000149012;-1044719.769999999552965;0
540;-742144.000000000000000;-1043804.000000000000000;0
4132;-742818.859999999403954;-1044067.969999998807907;0
8242;-742568.629999998956919;-1045197.829999998211861;0
7252;-742775.109999999403954;-1044855.940000001341105;0
4616;-742545.416999999433756;-1042662.541999999433756;0
6197;-742313.425000000745058;-1043058.370999999344349;0
248;-743439.000000000000000;-1043748.000000000000000;0
308;-742754.000000000000000;-1044149.000000000000000;0
2157;-742789.000000000000000;-1045161.000000000000000;0
6993;-743172.409000001847744;-1044501.339000001549721;0
3975;-743112.984999999403954;-1043716.375999998301268;200
5665;-743419.725000001490116;-1043711.682000000029802;0
4996;-742488.458999998867512;-1042974.723999999463558;0
5067;-742813.465999998152256;-1043267.335999999195337;0
4663;-742820.800000000745058;-1042560.039999999105930;0
1029;-741978.000000000000000;-1044721.000000000000000;0
4208;-742372.416999999433756;-1043503.423000000417233;0
698;-742041.000000000000000;-1042903.000000000000000;0
2526;-741087.000000000000000;-1044616.000000000000000;0
5196;-743199.263000000268221;-1043326.401000000536442;0
6114;-742234.250000000000000;-1043361.324999999254942;0
1857;-742574.000000000000000;-1044318.000000000000000;0
1942;-743283.000000000000000;-1044370.000000000000000;0
4592;-742448.190999999642372;-1042642.517999999225140;0
1415;-741623.000000000000000;-1044561.000000000000000;0
1342;-741721.000000000000000;-1044783.000000000000000;0
1718;-741366.219999998807907;-1044870.989999998360872;0
5020;-742572.699999999254942;-1042891.372999999672174;0
2041;-743531.000000000000000;-1044957.000000000000000;0
2301;-742533.000000000000000;-1045416.000000000000000;0
4905;-742467.730000000447035;-1042815.620000001043081;0
1470;-741728.000000000000000;-1044116.000000000000000;0
1309;-741611.000000000000000;-1044813.000000000000000;0
4054;-743269.304999999701977;-1043797.405000001192093;0
2574;-742481.000000000000000;-1045423.000000000000000;0
6100;-741950.760000001639128;-1043408.109999999403954;0
1365;-742125.050000000745058;-1044945.710000000894070;0
6210;-742318.541000001132488;-1043064.662999998778105;0
1229;-742244.000000000000000;-1044253.000000000000000;0
613;-742089.000000000000000;-1043271.000000000000000;0
544;-742343.910000000149012;-1043796.500000000000000;0
1287;-742217.000000000000000;-1044486.000000000000000;0
1179;-741934.000000000000000;-1044251.000000000000000;0
5162;-743180.460999999195337;-1043323.660000000149012;0
4837;-742979.105999998748302;-1042672.627999998629093;0
4524;-742683.789999999105930;-1042823.579999998211861;0
4778;-742918.024999998509884;-1042786.565000001341105;0
6259;-742383.170000001788139;-1043030.809000000357628;0
6324;-745068.543000001460314;-1042720.445999998599291;0
2168;-743025.000000000000000;-1045134.000000000000000;0
7678;-742388.550999999046326;-1045109.184000000357628;0
633;-742100.000000000000000;-1043296.000000000000000;0
2060;-742659.000000000000000;-1044472.000000000000000;0
6922;-742056.329999998211861;-1045086.679999999701977;0
6140;-742311.999000001698732;-1043064.638999998569489;0
4858;-742955.339999999850988;-1042963.960000000894070;0
2546;-741750.000000000000000;-1044271.000000000000000;0
4812;-743027.170000001788139;-1042810.219999998807907;0
3681;-744535.921999998390675;-1042505.831999998539686;0
6157;-742314.026999998837709;-1043065.331000000238419;0
1890;-743522.000000000000000;-1044402.000000000000000;0
7925;-743541.780000001192093;-1044709.149999998509884;0
7150;-742820.427000001072884;-1044516.962000001221895;0
4928;-742444.890000000596046;-1042854.899999998509884;0
2331;-742895.000000000000000;-1045530.000000000000000;0
2394;-742273.000000000000000;-1045360.000000000000000;0
3984;-743314.570000000298023;-1043905.594999998807907;0
3266;-743585.618999999016523;-1042739.508999999612570;0
4679;-742774.199999999254942;-1042819.160000000149012;0
1008;-741962.000000000000000;-1044568.000000000000000;0
3096;-743906.309999998658895;-1042750.539999999105930;0
4594;-742555.890999998897314;-1042650.090999998152256;0
3544;-744891.706999998539686;-1042640.835999999195337;0
6254;-742379.344000000506639;-1043038.363000001758337;0
3999;-743412.539999999105930;-1043918.725000001490116;0
982;-741992.000000000000000;-1044416.000000000000000;0
4991;-742675.414999999105930;-1043031.236000001430511;0
5654;-743429.644000001251698;-1043703.151000000536442;0
682;-742380.000000000000000;-1043151.000000000000000;0
503;-741879.000000000000000;-1043158.000000000000000;0
2103;-743182.000000000000000;-1044931.000000000000000;0
4026;-743178.984999999403954;-1043847.989999998360872;0
4232;-742315.057999998331070;-1043428.918999999761581;0
5413;-742651.872000001370907;-1042662.627999998629093;0
1187;-741805.000000000000000;-1044071.000000000000000;0
2095;-743178.000000000000000;-1044734.000000000000000;0
1041;-741893.000000000000000;-1044653.000000000000000;0
3108;-743768.699999999254942;-1042671.241999998688698;0
8055;-742223.859999999403954;-1045007.899999998509884;0
5068;-742837.162999998778105;-1043263.965999998152256;0
1144;-741402.000000000000000;-1044470.000000000000000;0
4651;-742756.375000000000000;-1042524.938000001013279;0
4637;-742572.578000001609325;-1042742.510999999940395;0
1256;-742084.000000000000000;-1044787.000000000000000;0
3998;-743432.704999998211861;-1043914.274999998509884;0
3992;-743365.899999998509884;-1043881.385000001639128;0
1324;-741943.000000000000000;-1044994.000000000000000;0
3849;-743061.690000001341105;-1042485.920000001788139;0
7184;-742592.399999998509884;-1044704.010000001639128;0
6258;-742382.381999999284744;-1043032.370999999344349;0
4424;-742225.300000000745058;-1043033.250000000000000;0
7222;-742428.280000001192093;-1044822.489999998360872;0
395;-742369.000000000000000;-1043840.000000000000000;0
619;-742229.000000000000000;-1043277.000000000000000;0
4596;-742597.181000001728535;-1042670.653000000864267;0
171;-743448.000000000000000;-1043399.000000000000000;0
2500;-742743.000000000000000;-1045401.000000000000000;0
7011;-742831.309999998658895;-1044257.245000001043081;0
3598;-744894.750000000000000;-1042560.583999998867512;0
236;-743459.000000000000000;-1043775.000000000000000;0
1492;-741096.000000000000000;-1044331.000000000000000;0
4831;-743041.170000001788139;-1042862.530000001192093;0
4671;-742824.179999999701977;-1042687.210000000894070;0
1570;-742291.000000000000000;-1044183.000000000000000;0
4570;-742347.760000001639128;-1042540.809999998658895;0
586;-741966.000000000000000;-1043374.000000000000000;0
7202;-742561.410000000149012;-1044949.640000000596046;0
1756;-742165.000000000000000;-1045209.000000000000000;0
4740;-742757.410000000149012;-1042715.589999999850988;0
5175;-743313.734999999403954;-1043433.749000001698732;0
6282;-742308.337999999523163;-1043045.984000001102686;0
6284;-742309.677999999374151;-1043054.043999999761581;0
2007;-743231.000000000000000;-1044741.000000000000000;0
560;-742181.000000000000000;-1043665.000000000000000;0
1380;-742156.000000000000000;-1044947.000000000000000;0
1135;-741572.000000000000000;-1044437.000000000000000;0
7807;-742647.802999999374151;-1044543.524000000208616;0
5998;-742019.482000000774860;-1043283.164000000804663;0
1660;-741423.000000000000000;-1044818.000000000000000;0
4826;-743043.850000001490116;-1042979.600000001490116;0
738;-741818.000000000000000;-1043024.000000000000000;0
340;-742588.000000000000000;-1043906.000000000000000;0
1013;-742076.000000000000000;-1044595.000000000000000;0
4177;-742387.940999999642372;-1044182.254999998956919;0
6170;-742311.548000000417233;-1043059.381000000983477;0
3985;-743312.765000000596046;-1043928.164999999105930;0
6759;-741016.559999998658895;-1044436.829999998211861;0
3537;-744632.945000000298023;-1042671.657000001519918;0
6039;-742085.370000001043081;-1043669.620999999344349;0
5042;-742731.719000000506639;-1042890.517000000923872;0
4329;-742363.315000001341105;-1043352.173999998718500;0
6141;-742311.243999999016523;-1043063.195999998599291;0
880;-741793.000000000000000;-1042834.000000000000000;0
317;-742464.000000000000000;-1044207.000000000000000;0
4752;-742774.460000000894070;-1042743.280000001192093;0
530;-742139.000000000000000;-1043771.000000000000000;0
4123;-742742.956000000238419;-1043901.826000001281500;0
6478;-741931.429999999701977;-1044453.500000000000000;0
3870;-742381.989999998360872;-1042417.679999999701977;0
4902;-742480.460000000894070;-1042802.989999998360872;0
1360;-741983.000000000000000;-1044900.000000000000000;0
6168;-742313.092999998480082;-1043062.208999998867512;0
6183;-742316.633999999612570;-1043065.732000000774860;0
4071;-742929.394999999552965;-1043807.585000000894070;0
1386;-742158.000000000000000;-1044976.000000000000000;0
6836;-741643.532000001519918;-1044947.486999999731779;0
6766;-741193.449999999254942;-1044424.320000000298023;0
1914;-743464.000000000000000;-1044458.000000000000000;0
1797;-743098.000000000000000;-1044099.000000000000000;0
4696;-742682.817000001668930;-1042658.543999999761581;0
3831;-743005.140000000596046;-1042638.440000001341105;0
2048;-743528.000000000000000;-1045069.000000000000000;0
4537;-742303.159000001847744;-1042752.293000001460314;0
168;-743427.000000000000000;-1043311.000000000000000;0
2147;-742828.000000000000000;-1044984.000000000000000;0
4705;-742714.100000001490116;-1042599.829999998211861;0
4849;-742966.960000000894070;-1042893.583999998867512;0
1044;-741861.000000000000000;-1044743.000000000000000;0
235;-743467.000000000000000;-1043745.000000000000000;0
4579;-742378.747999999672174;-1042626.699999999254942;0
1157;-741172.000000000000000;-1044489.000000000000000;0
4744;-742848.129999998956919;-1042759.629999998956919;0
3291;-743588.212999999523163;-1042790.916999999433756;0
1047;-741816.000000000000000;-1044867.000000000000000;0
5360;-742453.188999999314547;-1042938.521999999880791;0
6676;-742250.239999998360872;-1044174.719999998807907;0
1539;-741977.000000000000000;-1043997.000000000000000;0
7706;-742313.239999998360872;-1044319.611999999731779;30
3809;-742980.300000000745058;-1042944.469999998807907;0
1114;-741151.059999998658895;-1044607.410000000149012;0
5421;-742337.905999999493361;-1042777.837999999523163;0
2340;-742764.000000000000000;-1045532.000000000000000;0
1016;-742147.000000000000000;-1044590.000000000000000;0
5146;-743064.554000001400709;-1043452.671999998390675;0
4521;-742681.440000001341105;-1042792.960000000894070;0
4577;-742376.686000000685453;-1042590.309999998658895;0
6208;-742320.098000001162291;-1043067.458999998867512;0
7164;-742596.114999998360872;-1044447.173000000417233;0
4585;-742437.502000000327826;-1042630.243999999016523;0
4580;-742393.905000001192093;-1042551.807000000029802;0
1237;-742144.000000000000000;-1044365.000000000000000;0
7001;-743085.660000000149012;-1044400.420000001788139;0
6698;-742304.160999998450279;-1044462.195999998599291;0
6261;-742373.956999998539686;-1043022.041999999433756;0
4766;-742803.037999998778105;-1042842.532999999821186;0
4244;-742179.410000000149012;-1043422.000000000000000;0
1254;-742090.000000000000000;-1044750.000000000000000;0
6143;-742309.690999999642372;-1043060.385000001639128;0
1533;-741832.000000000000000;-1043879.000000000000000;0
1728;-741473.000000000000000;-1045087.000000000000000;0
2483;-741266.219999998807907;-1044755.030000001192093;0
2433;-742514.000000000000000;-1045081.000000000000000;0
4048;-743218.050000000745058;-1043961.320000000298023;0
5593;-743418.921000000089407;-1043679.927999999374151;0
1951;-743289.000000000000000;-1044491.000000000000000;0
7648;-742317.809000000357628;-1045414.322000000625849;0
3098;-743918.111000001430511;-1042753.629000000655651;0
3965;-743388.850000001490116;-1043528.160000000149012;0
1086;-741659.000000000000000;-1044542.000000000000000;0
40;-743597.000000000000000;-1042361.000000000000000;0
5735;-743414.589999999850988;-1043687.874000001698732;0
5699;-743416.657000001519918;-1043631.932999998331070;0
7218;-742534.100000001490116;-1044603.559999998658895;0
1215;-742091.000000000000000;-1044365.000000000000000;0
207;-743142.000000000000000;-1043590.000000000000000;0
1046;-741838.000000000000000;-1044805.000000000000000;0
2355;-742465.000000000000000;-1045568.000000000000000;0
1351;-741850.000000000000000;-1044830.000000000000000;0
7243;-742724.339999999850988;-1044835.870000001043081;0
7034;-743299.725999999791384;-1044153.140000000596046;0
3834;-743079.190000001341105;-1042579.899999998509884;0
8244;-742617.899999998509884;-1045206.480000000447035;0
6682;-742329.804000001400709;-1044319.611999999731779;0
1152;-741257.000000000000000;-1044489.000000000000000;0
630;-742179.000000000000000;-1043289.000000000000000;0
6693;-742248.197000000625849;-1044816.127000000327826;0
6128;-742313.668999999761581;-1043069.186000000685453;0
5582;-743410.127000000327826;-1043640.197999998927116;0
1388;-742152.000000000000000;-1045026.000000000000000;0
4023;-743246.635000001639128;-1043864.364999998360872;0
3793;-743101.820000000298023;-1042826.379999998956919;0
4999;-742534.149999998509884;-1042966.892999999225140;0
725;-741983.000000000000000;-1042939.000000000000000;0
262;-743408.000000000000000;-1043731.000000000000000;0
6166;-742314.649999998509884;-1043065.006999999284744;0
7351;-742529.339999999850988;-1045181.269999999552965;0
314;-742585.000000000000000;-1044184.000000000000000;0
4151;-742573.039999999105930;-1044109.035000000149012;0
3480;-745200.488000001758337;-1042779.028999999165535;0
6706;-742275.234999999403954;-1044689.607999999076128;0
670;-742502.000000000000000;-1043239.000000000000000;0
1601;-742452.000000000000000;-1044939.000000000000000;0
702;-741961.000000000000000;-1042885.000000000000000;0
2241;-743319.000000000000000;-1045289.000000000000000;0
4950;-742354.289999999105930;-1042955.670000001788139;0
