OID_;X;Y;TEMPERATURE
7077;-743564.359000001102686;-1045385.210000000894070;0
5995;-744441.440999999642372;-1042779.568999998271465;0
3527;-744805.695999998599291;-1042671.809000000357628;0
3538;-744616.304000001400709;-1042656.734000001102686;0
3585;-744920.065000001341105;-1042522.129999998956919;0
3460;-744993.289000000804663;-1042693.587000001221895;0
3466;-745113.802000001072884;-1042675.725000001490116;0
3612;-744996.545000001788139;-1042292.646000001579523;0
2696;-743477.489999998360872;-1042038.000000000000000;0
1674;-741099.000000000000000;-1044736.000000000000000;0
747;-741690.000000000000000;-1043000.000000000000000;0
2192;-743499.000000000000000;-1045199.000000000000000;0
2892;-744005.317000001668930;-1043204.537000000476837;0
3752;-743213.949999999254942;-1042902.719999998807907;0
527;-742186.000000000000000;-1043818.000000000000000;0
725;-741983.000000000000000;-1042939.000000000000000;0
6726;-742476.517999999225140;-1044410.600000001490116;0
6872;-741751.719999998807907;-1045296.679999999701977;0
397;-742355.000000000000000;-1043861.000000000000000;0
3706;-744567.589999999850988;-1042534.585000000894070;0
1523;-741679.000000000000000;-1043865.000000000000000;0
3537;-744632.945000000298023;-1042671.657000001519918;0
7;-743479.000000000000000;-1042567.000000000000000;0
1994;-743483.000000000000000;-1045010.000000000000000;0
514;-742119.000000000000000;-1043141.000000000000000;0
732;-741860.000000000000000;-1043003.000000000000000;0
6099;-741947.280000001192093;-1043424.289999999105930;0
6;-743464.000000000000000;-1042594.000000000000000;0
7136;-742914.329999998211861;-1044374.469999998807907;0
881;-741806.000000000000000;-1042815.000000000000000;0
6338;-742247.910000000149012;-1042851.670000001788139;0
8151;-743319.030000001192093;-1043194.940000001341105;0
350;-742505.000000000000000;-1043757.000000000000000;0
4335;-742398.230000000447035;-1043445.760000001639128;0
2398;-742150.000000000000000;-1045370.000000000000000;0
4305;-742520.295000001788139;-1043993.065000001341105;0
3068;-744158.921000000089407;-1042812.230999998748302;0
513;-742083.000000000000000;-1043145.000000000000000;0
1584;-742368.000000000000000;-1044717.000000000000000;0
1449;-741533.000000000000000;-1044684.000000000000000;0
3426;-743729.493999999016523;-1043061.420000001788139;0
7147;-742827.925000000745058;-1044451.385000001639128;0
2091;-742920.000000000000000;-1044593.000000000000000;0
6570;-741280.390000000596046;-1044118.620000001043081;0
2520;-741847.000000000000000;-1045324.000000000000000;0
3309;-743830.328000001609325;-1042834.535000000149012;0
6511;-741291.670000001788139;-1044319.690000001341105;0
7263;-743009.559999998658895;-1044894.379999998956919;0
1163;-741072.820000000298023;-1044501.940000001341105;0
1288;-742189.000000000000000;-1044543.000000000000000;0
4221;-742209.576000001281500;-1043499.238000001758337;0
2523;-742181.000000000000000;-1044140.000000000000000;0
542;-742367.629999998956919;-1043814.379999998956919;0
7276;-742801.670000001788139;-1044613.309999998658895;0
2467;-743434.000000000000000;-1044742.000000000000000;0
349;-742524.000000000000000;-1043764.000000000000000;0
1429;-741982.000000000000000;-1044280.000000000000000;0
2167;-743021.000000000000000;-1045154.000000000000000;0
885;-741739.000000000000000;-1042777.000000000000000;0
4120;-742715.179999999701977;-1043974.089999999850988;0
5454;-742806.100999999791384;-1043305.197999998927116;0
3349;-743960.629000000655651;-1042997.258999999612570;0
2262;-742999.000000000000000;-1045686.000000000000000;0
598;-741853.000000000000000;-1043233.000000000000000;0
1248;-742109.000000000000000;-1044631.000000000000000;0
4333;-742428.420000001788139;-1043255.609999999403954;0
3915;-744021.765999998897314;-1043098.603999998420477;0
3408;-743789.511999998241663;-1043022.425000000745058;0
1910;-743460.000000000000000;-1044391.000000000000000;0
3101;-743922.754999998956919;-1042745.195000000298023;0
1491;-741057.000000000000000;-1044333.000000000000000;0
3845;-743172.920000001788139;-1042573.210000000894070;0
2222;-743058.000000000000000;-1045420.000000000000000;0
2075;-743114.000000000000000;-1044772.000000000000000;0
4085;-742812.431000001728535;-1043657.114000000059605;0
4144;-742704.414999999105930;-1043822.484999999403954;0
1765;-741159.000000000000000;-1044178.000000000000000;0
1698;-741464.000000000000000;-1044668.000000000000000;0
1612;-742429.000000000000000;-1044425.000000000000000;0
2759;-743890.965999998152256;-1043486.399000000208616;0
4611;-742532.804999999701977;-1042593.420000001788139;0
2806;-743864.199999999254942;-1043546.870000001043081;0
2276;-742865.000000000000000;-1045649.000000000000000;0
5461;-742442.704999998211861;-1043234.515000000596046;0
5937;-744081.739000000059605;-1043323.396999999880791;0
982;-741992.000000000000000;-1044416.000000000000000;0
8263;-742151.089999999850988;-1042702.239999998360872;0
6358;-741993.554999999701977;-1042717.964000001549721;0
466;-741743.000000000000000;-1043331.000000000000000;0
2021;-743281.000000000000000;-1044948.000000000000000;0
1865;-743458.000000000000000;-1044233.000000000000000;0
2484;-741269.109999999403954;-1044779.070000000298023;0
4559;-742400.530000001192093;-1042503.760000001639128;0
2295;-742707.000000000000000;-1045396.000000000000000;0
6703;-742288.903999999165535;-1044591.625999998301268;0
7776;-743089.784000001847744;-1045773.409000001847744;0
1035;-741963.000000000000000;-1044896.000000000000000;0
1214;-742064.000000000000000;-1044358.000000000000000;0
1974;-743398.000000000000000;-1044958.000000000000000;0
6295;-742653.399999998509884;-1042696.070000000298023;0
5371;-742052.149999998509884;-1043011.940000001341105;0
1650;-741371.000000000000000;-1044490.000000000000000;0
281;-743045.000000000000000;-1043848.000000000000000;0
3314;-743758.675999999046326;-1042905.688999999314547;0
1433;-741895.000000000000000;-1044328.000000000000000;0
2314;-742884.000000000000000;-1045456.000000000000000;0
1503;-741537.000000000000000;-1044272.000000000000000;0
1366;-742109.000000000000000;-1044948.000000000000000;0
1723;-741611.000000000000000;-1045092.000000000000000;0
2162;-742917.000000000000000;-1045162.000000000000000;0
1044;-741861.000000000000000;-1044743.000000000000000;96
1030;-741975.000000000000000;-1044753.000000000000000;0
4166;-742448.504999998956919;-1044046.885000001639128;0
1780;-741214.000000000000000;-1043934.000000000000000;0
4031;-743135.774000000208616;-1043769.622000001370907;0
1454;-741521.000000000000000;-1044499.000000000000000;0
5265;-743188.572999998927116;-1043226.513999998569489;0
1939;-743269.000000000000000;-1044355.000000000000000;0
226;-742879.000000000000000;-1043516.000000000000000;0
5063;-742783.370000001043081;-1043241.048999998718500;0
6682;-742329.804000001400709;-1044319.611999999731779;0
4739;-742751.690000001341105;-1042699.230000000447035;0
1591;-742378.000000000000000;-1044910.000000000000000;0
2210;-743280.000000000000000;-1045237.000000000000000;0
5225;-743277.453999999910593;-1043558.087999999523163;0
7957;-741692.839999999850988;-1044277.559999998658895;0
6487;-741745.798000000417233;-1044519.414999999105930;0
560;-742181.000000000000000;-1043665.000000000000000;0
6274;-742318.392999999225140;-1043016.747000001370907;0
1111;-741167.030000001192093;-1044590.170000001788139;0
4070;-742925.285000000149012;-1043783.565000001341105;0
2327;-742491.000000000000000;-1045502.000000000000000;0
5109;-742850.925999999046326;-1043483.024999998509884;0
4838;-742981.304999999701977;-1042697.471000000834465;0
4876;-742826.449999999254942;-1042944.910000000149012;0
2392;-742057.000000000000000;-1045310.000000000000000;0
6139;-742312.807000000029802;-1043066.006000000983477;0
7703;-742462.714000001549721;-1044818.045000001788139;0
7181;-742612.239999998360872;-1044670.160000000149012;0
1070;-741665.000000000000000;-1044736.000000000000000;0
6655;-741614.039999999105930;-1044145.320000000298023;0
7153;-742889.646999999880791;-1044547.438000001013279;0
5240;-743364.164000000804663;-1043254.934000000357628;0
6826;-741405.300000000745058;-1044777.199999999254942;0
4025;-743202.881000000983477;-1043852.008000001311302;0
1730;-741428.000000000000000;-1045052.000000000000000;0
1083;-741667.000000000000000;-1044526.000000000000000;0
1229;-742244.000000000000000;-1044253.000000000000000;0
2268;-742911.000000000000000;-1045632.000000000000000;0
6943;-742902.013999998569489;-1043932.647999998182058;0
5129;-743046.677000001072884;-1043376.409000001847744;0
4461;-742218.370000001043081;-1042583.800000000745058;0
7285;-742806.960000000894070;-1044758.379999998956919;0
5296;-743058.934999998658895;-1043177.035000000149012;215
1595;-742313.000000000000000;-1045010.000000000000000;0
7208;-742560.289999999105930;-1045023.789999999105930;0
3206;-743702.239000000059605;-1042499.019000001251698;0
7008;-742899.559999998658895;-1044224.074999999254942;0
1852;-742739.000000000000000;-1044210.000000000000000;0
2560;-741251.000000000000000;-1044390.000000000000000;0
5133;-742976.300000000745058;-1043502.951999999582767;0
3784;-743187.730000000447035;-1042922.429999999701977;0
4220;-742214.344999998807907;-1043580.359999999403954;0
1369;-742029.000000000000000;-1044788.000000000000000;0
6746;-742405.083999998867512;-1044259.199999999254942;0
4893;-742637.320000000298023;-1042818.600999999791384;0
2158;-742781.000000000000000;-1045197.000000000000000;0
4082;-742825.565000001341105;-1043737.364999998360872;0
8069;-742226.440000001341105;-1045255.949999999254942;0
2148;-742835.000000000000000;-1045008.000000000000000;0
7004;-743069.289999999105930;-1044326.469999998807907;0
5711;-743422.837999999523163;-1043640.131000000983477;0
6181;-742318.164999999105930;-1043068.541999999433756;0
3802;-743068.190000001341105;-1042879.710000000894070;0
1262;-742066.000000000000000;-1044917.000000000000000;0
5168;-743228.796000000089407;-1043420.092000000178814;0
2247;-743199.000000000000000;-1045400.000000000000000;0
529;-742162.000000000000000;-1043803.000000000000000;0
2016;-743230.000000000000000;-1044873.000000000000000;0
4173;-742756.320000000298023;-1043749.629999998956919;0
4048;-743218.050000000745058;-1043961.320000000298023;0
7094;-743370.620000001043081;-1044578.289999999105930;0
297;-742938.000000000000000;-1044069.000000000000000;0
2147;-742828.000000000000000;-1044984.000000000000000;0
3279;-743638.815999999642372;-1042804.333999998867512;0
2234;-743425.000000000000000;-1045221.000000000000000;0
4827;-743046.359999999403954;-1042958.140000000596046;0
1272;-742237.000000000000000;-1044545.000000000000000;0
4743;-742812.449999999254942;-1042729.609999999403954;0
1461;-741473.000000000000000;-1044266.000000000000000;0
1716;-741294.859999999403954;-1044879.870000001043081;0
4142;-742777.425000000745058;-1044013.440000001341105;0
3110;-743743.295000001788139;-1042640.627000000327826;0
839;-742021.000000000000000;-1042510.000000000000000;0
4073;-742939.109999999403954;-1043858.504999998956919;0
7036;-743316.204999998211861;-1044198.315000001341105;0
651;-742490.000000000000000;-1043564.000000000000000;0
7163;-743099.541999999433756;-1044532.261999998241663;0
4983;-742587.776000000536442;-1043013.068999998271465;0
2344;-742691.000000000000000;-1045541.000000000000000;0
6708;-742268.296999998390675;-1044748.438000001013279;0
2185;-743216.000000000000000;-1045130.000000000000000;0
2009;-743221.000000000000000;-1044770.000000000000000;0
6119;-743582.679999999701977;-1042696.969999998807907;0
6930;-742046.030000001192093;-1045191.489999998360872;0
6337;-742257.140000000596046;-1042864.820000000298023;0
4328;-742347.322000000625849;-1043375.796999998390675;0
2080;-742685.000000000000000;-1044460.000000000000000;0
7680;-742500.160000000149012;-1045137.399999998509884;0
3944;-743390.002000000327826;-1043413.532999999821186;0
973;-741908.000000000000000;-1044547.000000000000000;0
7542;-742623.890000000596046;-1045372.899999998509884;0
271;-743417.000000000000000;-1043795.000000000000000;0
4502;-742349.309999998658895;-1042718.199999999254942;0
6747;-742410.170000001788139;-1044287.228000000119209;0
1469;-741752.000000000000000;-1044100.000000000000000;0
7011;-742831.309999998658895;-1044257.245000001043081;0
3996;-743394.274999998509884;-1044004.254999998956919;0
110;-744127.000000000000000;-1042724.000000000000000;0
6981;-743063.800000000745058;-1044366.239999998360872;0
5767;-742424.269999999552965;-1042581.609000001102686;0
1136;-741520.000000000000000;-1044455.000000000000000;0
6143;-742309.690999999642372;-1043060.385000001639128;0
277;-743398.000000000000000;-1043928.000000000000000;0
3285;-743661.519999999552965;-1042862.697000000625849;0
4117;-742733.614999998360872;-1044043.129999998956919;0
5215;-743342.890000000596046;-1043380.368000000715256;0
4557;-742381.019999999552965;-1042528.550000000745058;0
1168;-741825.000000000000000;-1044403.000000000000000;0
697;-742101.000000000000000;-1042908.000000000000000;0
7355;-743348.309999998658895;-1045148.329999998211861;0
7947;-742030.969999998807907;-1044096.679999999701977;0
2511;-743050.000000000000000;-1044050.000000000000000;0
1838;-743004.480000000447035;-1044216.030000001192093;0
5667;-743417.361999999731779;-1043712.557000000029802;0
6092;-742001.309999998658895;-1043482.089999999850988;0
2419;-742418.000000000000000;-1045101.000000000000000;0
7173;-742660.850000001490116;-1044535.730000000447035;0
1794;-742151.000000000000000;-1044190.000000000000000;0
1379;-742135.000000000000000;-1044975.000000000000000;0
4047;-743210.230000000447035;-1043992.289999999105930;0
4922;-742443.129999998956919;-1042886.510000001639128;0
2494;-741985.000000000000000;-1044165.000000000000000;0
3963;-743372.780000001192093;-1043538.789999999105930;0
1382;-742096.000000000000000;-1045023.000000000000000;0
3836;-743096.070000000298023;-1042561.879999998956919;0
1167;-741836.000000000000000;-1044429.000000000000000;0
8046;-742169.109999999403954;-1044835.660000000149012;0
5411;-742776.079999998211861;-1042905.300000000745058;0
1537;-741924.000000000000000;-1043954.000000000000000;0
1539;-741977.000000000000000;-1043997.000000000000000;0
208;-743146.000000000000000;-1043573.000000000000000;0
1314;-741695.000000000000000;-1044866.000000000000000;0
1601;-742452.000000000000000;-1044939.000000000000000;0
4613;-742506.557000000029802;-1042597.938000001013279;0
4783;-742933.866999998688698;-1042668.403000000864267;0
7348;-742537.370000001043081;-1045173.839999999850988;0
4107;-742652.458999998867512;-1043744.934000000357628;0
648;-742246.000000000000000;-1043363.000000000000000;0
1323;-741859.000000000000000;-1044941.000000000000000;0
7017;-742571.059999998658895;-1044267.640000000596046;0
6103;-742213.102000001817942;-1043103.528999999165535;0
6458;-743360.644999999552965;-1043919.311999998986721;0
5941;-742044.835000000894070;-1043561.903999999165535;0
318;-742434.000000000000000;-1044213.000000000000000;0
284;-743022.000000000000000;-1043758.000000000000000;0
4775;-742898.375999998301268;-1042802.914000000804663;0
1335;-741752.000000000000000;-1044833.000000000000000;0
222;-742939.000000000000000;-1043526.000000000000000;0
7233;-742606.750000000000000;-1044827.379999998956919;0
5226;-743310.730000000447035;-1043553.269999999552965;0
8019;-741972.039999999105930;-1044557.089999999850988;0
504;-741937.000000000000000;-1043164.000000000000000;0
4860;-742964.800999999046326;-1043016.107999999076128;0
7650;-742315.337000001221895;-1045462.039999999105930;0
7214;-742470.679999999701977;-1044531.269999999552965;0
7088;-743335.559999998658895;-1044546.359999999403954;0
6493;-742196.574000000953674;-1044452.076999999582767;0
4235;-742390.041999999433756;-1043492.094999998807907;0
8051;-742213.199999999254942;-1044935.890000000596046;0
1193;-741740.000000000000000;-1043981.000000000000000;0
1614;-742388.000000000000000;-1044432.000000000000000;0
1777;-741169.000000000000000;-1044003.000000000000000;0
3795;-743173.190000001341105;-1042842.170000001788139;0
757;-741673.000000000000000;-1042678.000000000000000;0
4601;-742631.969999998807907;-1042675.629999998956919;0
3355;-743953.881000000983477;-1043031.379999998956919;0
8257;-742149.809999998658895;-1045048.399999998509884;0
2326;-742523.000000000000000;-1045498.000000000000000;0
7647;-742319.918000001460314;-1045405.197999998927116;0
846;-742175.000000000000000;-1042517.000000000000000;0
3758;-743284.129999998956919;-1042964.100000001490116;0
6838;-741701.057999998331070;-1044977.087000001221895;0
2480;-741251.739999998360872;-1044639.480000000447035;0
1140;-741475.000000000000000;-1044461.000000000000000;0
5654;-743429.644000001251698;-1043703.151000000536442;0
1367;-742137.000000000000000;-1044959.000000000000000;0
7652;-742275.046999998390675;-1045497.052000001072884;0
6137;-742314.326999999582767;-1043068.837000001221895;0
7033;-743303.864999998360872;-1044132.750000000000000;0
5220;-743247.339999999850988;-1043589.050000000745058;0
4946;-742411.739000000059605;-1043002.199999999254942;0
5124;-742983.513000000268221;-1043417.271999999880791;0
4974;-742489.458999998867512;-1043047.024999998509884;0
6835;-741618.964000001549721;-1044934.515000000596046;0
236;-743459.000000000000000;-1043775.000000000000000;0
3169;-743932.120000001043081;-1042582.179999999701977;0
4677;-742787.309999998658895;-1042797.899999998509884;0
1525;-741738.000000000000000;-1043823.000000000000000;0
7809;-741981.809999998658895;-1044560.280000001192093;0
1850;-742751.000000000000000;-1044237.000000000000000;0
7166;-742741.322000000625849;-1044519.208999998867512;0
6283;-742308.969000000506639;-1043049.539999999105930;0
606;-741906.000000000000000;-1043273.000000000000000;0
1874;-743379.000000000000000;-1044247.000000000000000;0
1455;-741517.000000000000000;-1044468.000000000000000;0
4773;-742888.429000001400709;-1042839.530000001192093;0
5157;-743178.671999998390675;-1043354.681000001728535;0
6040;-742075.469999998807907;-1043676.809999998658895;0
6273;-742321.806000001728535;-1043017.085000000894070;0
5660;-743425.633999999612570;-1043709.497000001370907;0
4162;-742497.193999998271465;-1044160.030000001192093;0
7325;-743032.969999998807907;-1045186.298999998718500;0
6504;-741755.193999998271465;-1044619.083000000566244;0
7083;-743309.980000000447035;-1044509.500000000000000;0
6974;-743127.620000001043081;-1044518.800000000745058;0
5108;-742876.219999998807907;-1043431.129999998956919;0
4813;-743013.550000000745058;-1042793.390000000596046;0
5322;-743060.379999998956919;-1043029.589999999850988;0
1125;-741728.000000000000000;-1044435.000000000000000;0
3985;-743312.765000000596046;-1043928.164999999105930;0
2358;-742370.000000000000000;-1045593.000000000000000;0
910;-742219.000000000000000;-1042529.000000000000000;0
7184;-742592.399999998509884;-1044704.010000001639128;0
4679;-742774.199999999254942;-1042819.160000000149012;0
5691;-743415.714000001549721;-1043637.241000000387430;0
4251;-742136.420000001788139;-1043379.969999998807907;0
6830;-741526.739999998360872;-1044761.309000000357628;0
4030;-743133.280000001192093;-1043791.552000001072884;0
1926;-743301.000000000000000;-1044321.000000000000000;0
8267;-742240.420000001788139;-1042709.160000000149012;0
4979;-742507.703000001609325;-1043016.118000000715256;0
4781;-742926.519000001251698;-1042695.502999998629093;0
6121;-742069.784000001847744;-1043299.828000001609325;0
7653;-742255.225000001490116;-1045513.048000000417233;0
4649;-742732.228999998420477;-1042525.100000001490116;0
1252;-742096.000000000000000;-1044711.000000000000000;0
518;-742194.000000000000000;-1043131.000000000000000;0
4889;-742621.425000000745058;-1042831.109999999403954;0
4823;-742936.660000000149012;-1042868.949999999254942;0
3797;-743147.989999998360872;-1042854.129999998956919;0
4962;-742387.429999999701977;-1043028.129999998956919;0
3792;-743110.019999999552965;-1042846.530000001192093;0
1436;-741869.000000000000000;-1044323.000000000000000;0
4732;-742777.550000000745058;-1042653.539999999105930;0
4875;-742814.660000000149012;-1042937.800000000745058;0
615;-742129.000000000000000;-1043271.000000000000000;0
2149;-742819.000000000000000;-1045024.000000000000000;0
340;-742588.000000000000000;-1043906.000000000000000;0
2048;-743528.000000000000000;-1045069.000000000000000;0
6133;-742309.820000000298023;-1043062.171999998390675;0
4780;-742928.596000000834465;-1042747.480000000447035;0
3239;-744159.614000000059605;-1042651.675000000745058;0
2083;-742588.000000000000000;-1044663.000000000000000;0
4169;-742414.420000001788139;-1043962.329999998211861;0
5284;-743041.022999998182058;-1043277.397999998182058;0
1963;-743410.000000000000000;-1044689.000000000000000;0
602;-741828.000000000000000;-1043190.000000000000000;0
4581;-742391.460000000894070;-1042586.396999999880791;0
4931;-742449.300000000745058;-1042791.403000000864267;0
628;-742217.370000001043081;-1043308.559999998658895;0
6127;-742314.456000000238419;-1043070.548999998718500;0
1940;-743286.000000000000000;-1044339.000000000000000;0
4949;-742369.969999998807907;-1042973.199999999254942;0
5509;-743425.144999999552965;-1043637.853000000119209;0
4509;-742502.519999999552965;-1042732.079999998211861;0
4465;-742180.250000000000000;-1042584.370000001043081;0
873;-741728.000000000000000;-1042672.000000000000000;0
4634;-742635.980000000447035;-1042656.144999999552965;0
3203;-743724.272999998182058;-1042522.517000000923872;0
1120;-741778.000000000000000;-1044457.000000000000000;0
5715;-743423.747000001370907;-1043633.157999999821186;0
4980;-742521.857999999076128;-1043030.853000000119209;0
4586;-742464.175000000745058;-1042636.333999998867512;0
5596;-743415.271999999880791;-1043680.212999999523163;0
5161;-743160.846999999135733;-1043333.914999999105930;0
619;-742229.000000000000000;-1043277.000000000000000;0
1418;-741620.000000000000000;-1044458.000000000000000;0
718;-741691.000000000000000;-1042844.000000000000000;0
7198;-742561.769999999552965;-1044881.949999999254942;0
6197;-742313.425000000745058;-1043058.370999999344349;0
1269;-742246.000000000000000;-1044462.000000000000000;0
1629;-742450.000000000000000;-1044518.000000000000000;0
680;-742402.109999999403954;-1043166.679999999701977;0
400;-742356.000000000000000;-1043931.000000000000000;0
5413;-742651.872000001370907;-1042662.627999998629093;0
6842;-741574.894000001251698;-1044962.013999998569489;0
6847;-741591.993999999016523;-1044992.927999999374151;0
7681;-742501.629999998956919;-1045152.870000001043081;0
1917;-743374.000000000000000;-1044458.000000000000000;0
6157;-742314.026999998837709;-1043065.331000000238419;0
1931;-743388.000000000000000;-1044409.000000000000000;0
6366;-741957.399999998509884;-1042652.609999999403954;0
2221;-743076.000000000000000;-1045412.000000000000000;0
5598;-743412.839999999850988;-1043680.403000000864267;0
4150;-742581.789999999105930;-1044138.429999999701977;0
1465;-741870.000000000000000;-1044016.000000000000000;0
4769;-742881.932000000029802;-1042923.590999998152256;0
5645;-743428.886999998241663;-1043692.285999998450279;0
6252;-742378.052000001072884;-1043040.958000000566244;0
5582;-743410.127000000327826;-1043640.197999998927116;0
4518;-742623.960000000894070;-1042786.719999998807907;0
7977;-741271.370000001043081;-1044404.390000000596046;0
1829;-742968.539999999105930;-1044100.210000000894070;0
5224;-743293.449999999254942;-1043542.160000000149012;0
4944;-742430.605999998748302;-1043013.879000000655651;0
5026;-742631.168999999761581;-1042903.938999999314547;0
3975;-743112.984999999403954;-1043716.375999998301268;0
1988;-743481.000000000000000;-1044849.000000000000000;0
3387;-743960.368000000715256;-1043194.717000000178814;0
730;-741948.000000000000000;-1042998.000000000000000;0
4650;-742749.989000000059605;-1042534.539999999105930;0
5597;-743414.056000001728535;-1043680.309000000357628;0
2474;-743439.000000000000000;-1044900.000000000000000;0
5791;-743256.583000000566244;-1043571.184000000357628;0
1308;-741589.000000000000000;-1044811.000000000000000;0
5958;-742962.513999998569489;-1043517.497999999672174;0
3843;-743139.170000001788139;-1042650.050000000745058;0
5737;-743412.636999998241663;-1043691.631000000983477;0
6251;-742377.396999999880791;-1043042.284000001847744;0
5111;-742892.337999999523163;-1043424.370999999344349;0
2339;-742747.000000000000000;-1045548.000000000000000;0
6822;-741283.870000001043081;-1044793.059999998658895;0
1094;-741513.000000000000000;-1044561.000000000000000;0
2140;-742924.000000000000000;-1045088.000000000000000;0
7186;-742587.609999999403954;-1044726.000000000000000;0
5023;-742588.899000000208616;-1042870.296999998390675;0
5792;-743363.984999999403954;-1043442.513999998569489;0
6806;-741090.381000000983477;-1044706.675999999046326;0
918;-743437.000000000000000;-1043904.000000000000000;0
266;-743321.000000000000000;-1043735.000000000000000;0
5164;-743173.335000000894070;-1043404.677000001072884;0
5583;-743410.274999998509884;-1043642.072000000625849;0
4791;-743022.245000001043081;-1042633.714000001549721;0
6353;-741893.070000000298023;-1042697.059999998658895;0
921;-743338.000000000000000;-1043818.000000000000000;0
1551;-741353.000000000000000;-1044326.000000000000000;0
6291;-743672.399000000208616;-1042955.638000000268221;0
6003;-742038.201000001281500;-1043299.010999999940395;0
4888;-742649.925999999046326;-1042830.767000000923872;0
888;-741994.000000000000000;-1042797.000000000000000;0
1909;-743446.000000000000000;-1044375.000000000000000;0
1238;-742150.000000000000000;-1044384.000000000000000;0
624;-742241.000000000000000;-1043343.000000000000000;0
7516;-742248.390000000596046;-1044368.907999999821186;0
6653;-741657.920000001788139;-1044136.789999999105930;0
2393;-742054.000000000000000;-1045282.000000000000000;0
6132;-742310.590999998152256;-1043063.552999999374151;0
4114;-742764.195000000298023;-1044131.760000001639128;0
1471;-741711.000000000000000;-1044132.000000000000000;0
2288;-742936.000000000000000;-1045436.000000000000000;0
6264;-742357.280000001192093;-1043020.445999998599291;0
5203;-743386.346000000834465;-1043274.958000000566244;0
7027;-743237.269999999552965;-1044095.524999998509884;0
6196;-742314.190000001341105;-1043059.774999998509884;0
6846;-741505.875000000000000;-1044995.949000000953674;0
7120;-743351.160000000149012;-1044618.460000000894070;0
6269;-742337.300000000745058;-1043018.486000001430511;0
1181;-741920.000000000000000;-1044230.000000000000000;0
525;-742233.000000000000000;-1043884.000000000000000;0
3888;-742331.469999998807907;-1042455.429999999701977;0
1797;-743098.000000000000000;-1044099.000000000000000;0
706;-741897.000000000000000;-1042881.000000000000000;0
2388;-742096.000000000000000;-1045422.000000000000000;0
4527;-742728.050000000745058;-1042838.719999998807907;0
4519;-742665.160000000149012;-1042790.820000000298023;0
4753;-742764.600000001490116;-1042761.899999998509884;0
5699;-743416.657000001519918;-1043631.932999998331070;0
694;-742280.000000000000000;-1043043.000000000000000;0
2368;-742507.000000000000000;-1045456.000000000000000;0
5502;-743427.894999999552965;-1043706.885000001639128;0
4982;-742559.320999998599291;-1043012.914000000804663;0
4837;-742979.105999998748302;-1042672.627999998629093;0
1936;-743293.000000000000000;-1044272.000000000000000;0
4796;-743054.247999999672174;-1042682.918000001460314;0
3822;-743065.039999999105930;-1042594.239999998360872;0
5360;-742453.188999999314547;-1042938.521999999880791;0
191;-743424.000000000000000;-1043599.000000000000000;0
2046;-743382.000000000000000;-1044968.000000000000000;0
4729;-742855.690000001341105;-1042695.640000000596046;0
6008;-743902.607000000774860;-1042749.771000001579523;0
609;-741984.000000000000000;-1043272.000000000000000;0
5015;-742575.741000000387430;-1043008.607999999076128;0
688;-742284.000000000000000;-1043125.000000000000000;0
1588;-742390.000000000000000;-1044837.000000000000000;0
204;-743208.000000000000000;-1043588.000000000000000;0
216;-743023.000000000000000;-1043539.000000000000000;0
6013;-743372.780000001192093;-1043377.921999998390675;0
2550;-741576.000000000000000;-1044342.000000000000000;0
7155;-742920.776999998837709;-1044546.934000000357628;0
