OID_;X;Y;TEMPERATURE
2050;-743460.000000000000000;-1045072.000000000000000;0
1171;-741882.000000000000000;-1044375.000000000000000;0
6580;-741299.379000000655651;-1044005.879000000655651;0
6776;-741098.559999998658895;-1044491.530000001192093;0
2333;-742861.000000000000000;-1045534.000000000000000;0
1584;-742368.000000000000000;-1044717.000000000000000;0
7655;-742266.583000000566244;-1045284.133999999612570;0
1768;-741265.000000000000000;-1044133.000000000000000;0
2466;-743460.000000000000000;-1044740.000000000000000;0
2403;-742211.000000000000000;-1045436.000000000000000;0
2376;-742411.000000000000000;-1045554.000000000000000;0
6860;-741482.129999998956919;-1044991.089999999850988;0
7995;-741545.920000001788139;-1045160.100000001490116;0
872;-741698.000000000000000;-1042669.000000000000000;0
1040;-741904.000000000000000;-1044623.000000000000000;0
1614;-742388.000000000000000;-1044432.000000000000000;0
2263;-742989.000000000000000;-1045714.000000000000000;0
1127;-741700.000000000000000;-1044440.000000000000000;0
7;-743479.000000000000000;-1042567.000000000000000;0
1531;-741782.000000000000000;-1043838.000000000000000;0
2316;-742823.000000000000000;-1045463.000000000000000;0
1595;-742313.000000000000000;-1045010.000000000000000;0
1248;-742109.000000000000000;-1044631.000000000000000;170
1360;-741983.000000000000000;-1044900.000000000000000;0
503;-741879.000000000000000;-1043158.000000000000000;0
397;-742355.000000000000000;-1043861.000000000000000;0
1703;-741320.000000000000000;-1044686.000000000000000;0
1912;-743461.000000000000000;-1044430.000000000000000;0
1446;-741545.000000000000000;-1044774.000000000000000;0
458;-741726.000000000000000;-1043324.000000000000000;0
2090;-742923.000000000000000;-1044566.000000000000000;0
7263;-743009.559999998658895;-1044894.379999998956919;0
401;-742324.000000000000000;-1043907.000000000000000;0
1289;-742211.000000000000000;-1044521.000000000000000;0
1496;-741253.000000000000000;-1044321.000000000000000;0
1286;-742221.460000000894070;-1044465.969999998807907;0
6908;-741713.539999999105930;-1045085.160000000149012;0
1602;-742507.000000000000000;-1044924.000000000000000;0
1434;-741931.000000000000000;-1044293.000000000000000;0
1843;-743041.600000001490116;-1044324.489999998360872;0
2132;-743058.000000000000000;-1045118.000000000000000;0
383;-742450.000000000000000;-1043722.000000000000000;0
1791;-742157.000000000000000;-1044163.000000000000000;0
1718;-741366.219999998807907;-1044870.989999998360872;0
1311;-741646.000000000000000;-1044831.000000000000000;0
6004;-742061.723000001162291;-1043300.859999999403954;0
1396;-741798.000000000000000;-1044263.000000000000000;0
1115;-741105.000000000000000;-1044598.000000000000000;0
4463;-742198.989999998360872;-1042569.030000001192093;0
1031;-741973.000000000000000;-1044784.000000000000000;0
1758;-741097.000000000000000;-1044094.000000000000000;0
2446;-742750.000000000000000;-1044164.000000000000000;0
514;-742119.000000000000000;-1043141.000000000000000;0
1383;-742077.000000000000000;-1045046.000000000000000;0
2278;-742791.000000000000000;-1045657.000000000000000;0
7280;-742806.989999998360872;-1044667.600000001490116;0
843;-742085.000000000000000;-1042507.000000000000000;0
1491;-741057.000000000000000;-1044333.000000000000000;0
6003;-742038.201000001281500;-1043299.010999999940395;0
2520;-741847.000000000000000;-1045324.000000000000000;0
338;-742602.000000000000000;-1043933.000000000000000;0
5258;-743356.739999998360872;-1043230.039999999105930;0
2185;-743216.000000000000000;-1045130.000000000000000;0
1698;-741464.000000000000000;-1044668.000000000000000;0
1471;-741711.000000000000000;-1044132.000000000000000;0
147;-744724.000000000000000;-1042391.000000000000000;0
2098;-743134.000000000000000;-1044763.000000000000000;0
4322;-742266.414000000804663;-1043213.907999999821186;0
2393;-742054.000000000000000;-1045282.000000000000000;0
926;-741894.000000000000000;-1042999.000000000000000;0
2321;-742679.000000000000000;-1045480.000000000000000;0
6503;-741647.706000000238419;-1044996.008999999612570;0
3921;-743909.208999998867512;-1043541.574000000953674;0
4139;-742859.625999998301268;-1044000.574999999254942;0
6458;-743360.644999999552965;-1043919.311999998986721;0
6724;-742590.385000001639128;-1044428.910000000149012;0
1905;-743446.000000000000000;-1044312.000000000000000;0
2748;-743933.984000001102686;-1043445.734000001102686;0
1195;-741696.000000000000000;-1043920.000000000000000;0
3971;-743206.815000001341105;-1043721.065000001341105;0
2497;-741932.000000000000000;-1044075.000000000000000;0
430;-742185.000000000000000;-1043888.000000000000000;0
4089;-742812.844999998807907;-1043560.114999998360872;0
722;-742139.000000000000000;-1043009.000000000000000;48
3521;-744869.699000000953674;-1042677.925999999046326;0
7024;-743182.745000001043081;-1044052.815000001341105;0
1333;-741781.000000000000000;-1044777.000000000000000;0
7043;-743398.899999998509884;-1044106.629999998956919;0
1542;-742043.000000000000000;-1044057.000000000000000;103
2036;-743404.000000000000000;-1044803.000000000000000;0
7829;-743509.649999998509884;-1045166.399999998509884;0
3761;-743202.559999998658895;-1042981.710000000894070;0
1355;-741899.000000000000000;-1044858.000000000000000;0
4329;-742363.315000001341105;-1043352.173999998718500;0
1503;-741537.000000000000000;-1044272.000000000000000;0
1089;-741567.949999999254942;-1044538.820000000298023;0
3529;-744773.962999999523163;-1042673.491999998688698;0
1908;-743459.000000000000000;-1044358.000000000000000;0
7214;-742470.679999999701977;-1044531.269999999552965;51
817;-741937.000000000000000;-1042586.000000000000000;0
1933;-743329.000000000000000;-1044407.000000000000000;0
3700;-744597.480999998748302;-1042518.239999998360872;0
7186;-742587.609999999403954;-1044726.000000000000000;0
1228;-742220.539999999105930;-1044250.829999998211861;0
3273;-743642.442999999970198;-1042796.677999999374151;0
347;-742542.000000000000000;-1043795.000000000000000;0
1474;-741604.000000000000000;-1044172.000000000000000;0
1619;-742426.000000000000000;-1044401.000000000000000;0
7970;-741444.739999998360872;-1044384.980000000447035;0
3018;-744443.368000000715256;-1042805.962000001221895;0
3064;-744117.098999999463558;-1042868.348999999463558;0
4137;-742705.739999998360872;-1044094.100000001490116;0
208;-743146.000000000000000;-1043573.000000000000000;0
4075;-742947.934999998658895;-1043903.649999998509884;0
5067;-742813.465999998152256;-1043267.335999999195337;0
2209;-743309.000000000000000;-1045217.000000000000000;0
1488;-741088.000000000000000;-1044212.000000000000000;0
3517;-744882.524000000208616;-1042691.002000000327826;0
4507;-742472.469999998807907;-1042720.199999999254942;0
7148;-742828.445000000298023;-1044472.094999998807907;0
350;-742505.000000000000000;-1043757.000000000000000;0
6195;-742314.956000000238419;-1043061.181000001728535;0
7045;-743400.745000001043081;-1044160.004999998956919;0
1992;-743482.000000000000000;-1044954.000000000000000;0
745;-741649.000000000000000;-1042968.000000000000000;0
2302;-742507.000000000000000;-1045419.000000000000000;0
1317;-741748.000000000000000;-1044884.000000000000000;0
2228;-743044.000000000000000;-1045502.000000000000000;0
6710;-742260.203000001609325;-1044803.609999999403954;0
6701;-742295.142000000923872;-1044533.372000001370907;0
3569;-744704.920000001788139;-1042585.679999999701977;0
5510;-743424.346000000834465;-1043626.458999998867512;0
4190;-742301.250000000000000;-1044166.100000001490116;0
3766;-743053.532999999821186;-1042996.631000000983477;0
3836;-743096.070000000298023;-1042561.879999998956919;0
8262;-742129.620000001043081;-1042698.079999998211861;0
4235;-742390.041999999433756;-1043492.094999998807907;0
3107;-743778.888000000268221;-1042682.131999999284744;0
3233;-744152.962999999523163;-1042686.791999999433756;0
1713;-741207.339999999850988;-1044891.359999999403954;0
7031;-743301.824999999254942;-1044080.774999998509884;0
4247;-742154.829999998211861;-1043394.660000000149012;0
7174;-742639.019999999552965;-1044564.949999999254942;0
1947;-743286.000000000000000;-1044465.000000000000000;0
1545;-742236.000000000000000;-1044234.000000000000000;0
3458;-745043.431000001728535;-1042697.631000000983477;0
5136;-742992.278000000864267;-1043472.440000001341105;0
4794;-743065.828999999910593;-1042673.377000000327826;0
4594;-742555.890999998897314;-1042650.090999998152256;0
5667;-743417.361999999731779;-1043712.557000000029802;0
1005;-741944.000000000000000;-1044583.000000000000000;0
1809;-743160.000000000000000;-1044541.000000000000000;0
500;-741861.000000000000000;-1043174.000000000000000;0
3974;-743140.660000000149012;-1043725.350000001490116;0
4828;-743048.579999998211861;-1042941.179999999701977;0
8258;-742053.760000001639128;-1042683.769999999552965;0
7959;-741699.170000001788139;-1044292.620000001043081;0
2140;-742924.000000000000000;-1045088.000000000000000;0
4023;-743246.635000001639128;-1043864.364999998360872;0
2150;-742812.000000000000000;-1045054.000000000000000;0
1936;-743293.000000000000000;-1044272.000000000000000;0
1621;-742467.000000000000000;-1044322.000000000000000;0
4221;-742209.576000001281500;-1043499.238000001758337;0
5000;-742542.798000000417233;-1042978.486999999731779;0
5995;-744441.440999999642372;-1042779.568999998271465;0
5243;-743357.622000001370907;-1043407.258999999612570;0
6504;-741755.193999998271465;-1044619.083000000566244;0
6946;-742974.765000000596046;-1043929.388000000268221;0
1623;-742524.000000000000000;-1044319.000000000000000;0
3578;-744924.046000000089407;-1042547.359000001102686;0
8285;-742232.780000001192093;-1042821.149999998509884;0
3407;-743772.385999999940395;-1043008.706999998539686;0
5292;-743055.866000000387430;-1043215.710999999195337;0
7721;-742941.157000001519918;-1044215.368000000715256;0
3570;-744649.160000000149012;-1042588.129999998956919;0
4732;-742777.550000000745058;-1042653.539999999105930;0
4120;-742715.179999999701977;-1043974.089999999850988;0
118;-745135.000000000000000;-1042687.000000000000000;0
4724;-742870.089999999850988;-1042658.210000000894070;0
7679;-742498.250000000000000;-1045115.879999998956919;0
5393;-744730.162000000476837;-1042669.394000001251698;0
6785;-741294.269999999552965;-1044465.800000000745058;0
3783;-743211.559999998658895;-1042920.120000001043081;0
4060;-742896.530000001192093;-1043699.219999998807907;0
7182;-742597.789999999105930;-1044678.260000001639128;0
6297;-742506.859999999403954;-1042634.250000000000000;0
4781;-742926.519000001251698;-1042695.502999998629093;0
6138;-742313.561999998986721;-1043067.399000000208616;0
4974;-742489.458999998867512;-1043047.024999998509884;0
1368;-741998.000000000000000;-1044779.000000000000000;0
3702;-744567.984999999403954;-1042510.802000001072884;0
2033;-743500.000000000000000;-1044798.000000000000000;0
4055;-743119.070000000298023;-1043694.109999999403954;0
4619;-742460.010000001639128;-1042480.890000000596046;0
3961;-743419.609999999403954;-1043589.497000001370907;0
558;-742200.000000000000000;-1043683.000000000000000;0
3544;-744891.706999998539686;-1042640.835999999195337;0
3579;-744924.442999999970198;-1042569.135000001639128;0
2491;-742059.000000000000000;-1044251.000000000000000;0
2692;-743430.750000000000000;-1042085.649999998509884;0
3377;-743832.151999998837709;-1042925.721000000834465;0
4613;-742506.557000000029802;-1042597.938000001013279;0
677;-742425.000000000000000;-1043200.000000000000000;0
6096;-742098.760000001639128;-1043615.589999999850988;0
4099;-742773.870000001043081;-1043846.135999999940395;0
6092;-742001.309999998658895;-1043482.089999999850988;0
4590;-742387.043000001460314;-1042535.971000000834465;0
3203;-743724.272999998182058;-1042522.517000000923872;0
1854;-742675.000000000000000;-1044271.000000000000000;0
5306;-743103.326999999582767;-1043193.129000000655651;0
7980;-741198.179999999701977;-1044410.339999999850988;0
1386;-742158.000000000000000;-1044976.000000000000000;0
700;-742008.000000000000000;-1042895.000000000000000;0
3131;-743940.644999999552965;-1042662.771000001579523;0
3311;-743816.037999998778105;-1042845.728999998420477;0
111;-745351.000000000000000;-1042795.000000000000000;0
582;-741994.000000000000000;-1043417.000000000000000;0
6307;-741835.620000001043081;-1042765.149999998509884;0
6112;-742237.710000000894070;-1043370.434999998658895;0
250;-743428.000000000000000;-1043794.000000000000000;0
6152;-742310.348999999463558;-1043060.046999998390675;0
7741;-742302.225999999791384;-1045079.842999998480082;0
3752;-743213.949999999254942;-1042902.719999998807907;0
723;-741990.000000000000000;-1043024.000000000000000;0
1455;-741517.000000000000000;-1044468.000000000000000;0
3209;-743668.293999999761581;-1042492.478999998420477;0
5975;-745052.346999999135733;-1042674.673000000417233;0
4754;-742745.359999999403954;-1042759.160000000149012;0
33;-743464.000000000000000;-1042652.000000000000000;0
943;-742292.000000000000000;-1043017.000000000000000;0
80;-744067.000000000000000;-1043330.000000000000000;0
5392;-744709.620999999344349;-1042669.337000001221895;0
4033;-743319.719999998807907;-1043793.300000000745058;0
5036;-742666.855999998748302;-1042990.710000000894070;0
3792;-743110.019999999552965;-1042846.530000001192093;0
2480;-741251.739999998360872;-1044639.480000000447035;0
4999;-742534.149999998509884;-1042966.892999999225140;0
4476;-741849.620000001043081;-1042690.190000001341105;0
513;-742083.000000000000000;-1043145.000000000000000;0
164;-743392.000000000000000;-1043230.000000000000000;0
4592;-742448.190999999642372;-1042642.517999999225140;0
4162;-742497.193999998271465;-1044160.030000001192093;0
1829;-742968.539999999105930;-1044100.210000000894070;0
4528;-742714.350000001490116;-1042840.010000001639128;0
4775;-742898.375999998301268;-1042802.914000000804663;0
4737;-742718.399999998509884;-1042684.079999998211861;0
3503;-745069.432999998331070;-1042713.429999999701977;0
6697;-742363.109999999403954;-1044816.120000001043081;0
3019;-744463.447999998927116;-1042784.646000001579523;0
7650;-742315.337000001221895;-1045462.039999999105930;0
7287;-742809.579999998211861;-1044785.789999999105930;0
4207;-742354.105999998748302;-1043530.157999999821186;0
1939;-743269.000000000000000;-1044355.000000000000000;0
4499;-742338.899999998509884;-1042707.250000000000000;0
708;-741854.000000000000000;-1042881.000000000000000;0
220;-742969.000000000000000;-1043530.000000000000000;0
5062;-742798.513999998569489;-1043227.370999999344349;0
2422;-742473.000000000000000;-1045096.000000000000000;0
4063;-742855.079999998211861;-1043654.695000000298023;0
7745;-742933.037000000476837;-1045523.714999999850988;0
284;-743022.000000000000000;-1043758.000000000000000;0
7020;-743104.175000000745058;-1044078.344999998807907;0
4517;-742638.449999999254942;-1042779.280000001192093;0
6450;-743166.964999999850988;-1043776.383999999612570;0
6704;-742282.179999999701977;-1044623.793999999761581;0
7002;-743079.250000000000000;-1044377.170000001788139;0
4080;-742832.480000000447035;-1043782.030000001192093;0
6211;-742317.785000000149012;-1043063.318999998271465;0
2019;-743264.000000000000000;-1044921.000000000000000;0
3581;-744918.206999998539686;-1042631.410000000149012;0
4459;-742274.829999998211861;-1042644.269999999552965;0
2155;-742797.000000000000000;-1045124.000000000000000;0
5733;-743410.142999999225140;-1043688.210999999195337;0
5113;-742946.795000001788139;-1043444.427999999374151;0
4577;-742376.686000000685453;-1042590.309999998658895;0
4858;-742955.339999999850988;-1042963.960000000894070;0
3582;-744914.405999999493361;-1042603.405999999493361;0
4947;-742399.918000001460314;-1042993.458000000566244;0
3292;-743576.905000001192093;-1042781.315000001341105;0
4624;-742577.815000001341105;-1042600.907999999821186;0
7706;-742313.239999998360872;-1044319.611999999731779;0
3132;-743939.052000001072884;-1042650.916999999433756;0
3336;-743972.239999998360872;-1043004.743000000715256;0
4086;-742813.079999998211861;-1043631.730000000447035;0
631;-742153.000000000000000;-1043288.000000000000000;0
4691;-742693.760000001639128;-1042596.969999998807907;0
7728;-743360.581999998539686;-1044610.631000000983477;0
5225;-743277.453999999910593;-1043558.087999999523163;0
4651;-742756.375000000000000;-1042524.938000001013279;0
2296;-742678.000000000000000;-1045399.000000000000000;0
7159;-743013.767000000923872;-1044544.160999998450279;0
1467;-741808.000000000000000;-1044064.000000000000000;0
3408;-743789.511999998241663;-1043022.425000000745058;0
2123;-743299.000000000000000;-1045010.000000000000000;0
6183;-742316.633999999612570;-1043065.732000000774860;0
3347;-743959.280000001192093;-1043034.447000000625849;0
6299;-741803.309999998658895;-1042718.690000001341105;0
4660;-742801.596999999135733;-1042487.965999998152256;0
4138;-742883.587000001221895;-1043997.287999998778105;0
520;-742225.000000000000000;-1043127.000000000000000;0
3535;-744653.131999999284744;-1042674.822000000625849;0
3990;-743339.489999998360872;-1043987.234999999403954;0
7026;-743217.644999999552965;-1044082.329999998211861;0
2256;-743156.000000000000000;-1045353.000000000000000;0
1182;-741915.000000000000000;-1044252.000000000000000;0
1839;-742994.469999998807907;-1044185.679999999701977;0
1682;-741129.769999999552965;-1044685.559999998658895;0
602;-741828.000000000000000;-1043190.000000000000000;0
201;-743229.000000000000000;-1043614.000000000000000;0
5197;-743222.513000000268221;-1043313.989999998360872;0
5775;-743915.925000000745058;-1042818.550999999046326;0
5227;-743318.199999999254942;-1043537.510000001639128;0
4821;-742966.550000000745058;-1042877.969999998807907;0
6688;-742383.146999999880791;-1045009.361000001430511;0
5168;-743228.796000000089407;-1043420.092000000178814;0
5408;-743696.881000000983477;-1042878.024999998509884;0
671;-742489.000000000000000;-1043245.000000000000000;0
3412;-743772.947000000625849;-1043053.557999998331070;0
504;-741937.000000000000000;-1043164.000000000000000;0
4674;-742806.475999999791384;-1042703.594999998807907;0
5011;-742644.307999998331070;-1042994.813999999314547;0
4175;-742721.254999998956919;-1043775.890000000596046;0
4839;-742984.162000000476837;-1042715.425000000745058;0
3947;-743403.787999998778105;-1043488.118999999016523;0
7682;-742503.329999998211861;-1045169.949999999254942;0
5747;-743413.175999999046326;-1043698.811000000685453;0
3287;-743711.173999998718500;-1042886.515999998897314;0
728;-741997.000000000000000;-1042918.000000000000000;0
6374;-741977.035000000149012;-1042674.153999999165535;0
3379;-743806.728000000119209;-1042934.574999999254942;0
4599;-742625.879999998956919;-1042698.820000000298023;0
4057;-743132.184999998658895;-1043648.719999998807907;0
3276;-743673.931000001728535;-1042836.190999999642372;0
3032;-744506.962000001221895;-1042717.704999998211861;0
1410;-741643.039999999105930;-1044709.940000001341105;0
4834;-742972.708000000566244;-1042657.809000000357628;0
5245;-743368.859999999403954;-1043290.789999999105930;0
4240;-742471.613000001758337;-1043552.366000000387430;0
4892;-742663.079999998211861;-1042817.344999998807907;0
4661;-742816.708000000566244;-1042503.918999999761581;0
4965;-742383.620000001043081;-1043057.500000000000000;0
1144;-741402.000000000000000;-1044470.000000000000000;0
2039;-743308.000000000000000;-1044808.000000000000000;0
3534;-744667.721000000834465;-1042664.578000001609325;0
3033;-744483.675000000745058;-1042733.627000000327826;0
2095;-743178.000000000000000;-1044734.000000000000000;0
6214;-742315.447999998927116;-1043059.026000000536442;0
5309;-743033.405000001192093;-1043187.043999999761581;0
5410;-742572.837000001221895;-1042981.173999998718500;0
4692;-742681.477000001817942;-1042600.622000001370907;0
5016;-742572.212000001221895;-1042955.526999998837709;0
7508;-742947.440000001341105;-1045540.690000001341105;0
7409;-743521.629999998956919;-1045356.570000000298023;0
5177;-743336.440999999642372;-1043440.883999999612570;0
6276;-742310.815999999642372;-1043016.000999998301268;0
5758;-743420.897999998182058;-1043635.921999998390675;0
6013;-743372.780000001192093;-1043377.921999998390675;0
4991;-742675.414999999105930;-1043031.236000001430511;0
3614;-744984.548999998718500;-1042283.640999998897314;0
632;-742130.000000000000000;-1043287.000000000000000;0
7171;-742671.969999998807907;-1044508.219999998807907;0
4753;-742764.600000001490116;-1042761.899999998509884;0
3044;-744378.258000001311302;-1042783.539999999105930;0
2889;-744074.103999998420477;-1043194.559999998658895;0
532;-742114.000000000000000;-1043737.000000000000000;0
3323;-743934.361999999731779;-1042945.002999998629093;0
6978;-743090.239999998360872;-1044436.379999998956919;0
3571;-744668.519999999552965;-1042589.219999998807907;0
4925;-742455.502000000327826;-1042923.307000000029802;0
1974;-743398.000000000000000;-1044958.000000000000000;0
6190;-742318.782999999821186;-1043068.206000000238419;0
4001;-743418.500000000000000;-1044051.739000000059605;0
3426;-743729.493999999016523;-1043061.420000001788139;0
4639;-742567.399999998509884;-1042548.592999998480082;0
4770;-742872.535000000149012;-1042899.679000001400709;0
5146;-743064.554000001400709;-1043452.671999998390675;0
4969;-742465.059999998658895;-1043095.034000001847744;0
3396;-743905.006000000983477;-1043084.449999999254942;0
1938;-743289.000000000000000;-1044306.000000000000000;0
7516;-742248.390000000596046;-1044368.907999999821186;0
3738;-745043.339999999850988;-1042389.901000000536442;0
732;-741860.000000000000000;-1043003.000000000000000;0
6314;-743939.670000001788139;-1042606.239999998360872;0
586;-741966.000000000000000;-1043374.000000000000000;0
342;-742573.000000000000000;-1043878.000000000000000;0
548;-742297.000000000000000;-1043762.000000000000000;0
4859;-742966.710000000894070;-1042996.302999999374151;0
7515;-742273.021999999880791;-1044371.543999999761581;0
266;-743321.000000000000000;-1043735.000000000000000;0
5984;-743985.258000001311302;-1042842.061999998986721;0
3537;-744632.945000000298023;-1042671.657000001519918;0
5689;-743415.442000001668930;-1043633.646000001579523;0
6945;-742955.907000001519918;-1043932.182999998331070;0
169;-743433.000000000000000;-1043334.000000000000000;0
5390;-744691.164999999105930;-1042676.936000000685453;0
4501;-742368.980000000447035;-1042705.100000001490116;0
3101;-743922.754999998956919;-1042745.195000000298023;0
1532;-741805.000000000000000;-1043858.000000000000000;0
3269;-743600.679000001400709;-1042731.660000000149012;0
670;-742502.000000000000000;-1043239.000000000000000;0
6216;-742313.892000000923872;-1043056.272999998182058;0
5779;-742907.197999998927116;-1043414.096999999135733;0
394;-742405.000000000000000;-1043863.000000000000000;0
782;-741695.000000000000000;-1042522.000000000000000;0
6198;-742312.659000001847744;-1043056.964999999850988;0
6709;-742264.587999999523163;-1044776.254999998956919;0
4901;-742520.120000001043081;-1042823.960000000894070;0
6147;-742314.177000001072884;-1043067.070999998599291;0
1255;-742077.000000000000000;-1044770.000000000000000;0
3786;-743150.480000000447035;-1042925.960000000894070;0
1218;-742120.000000000000000;-1044309.000000000000000;0
3389;-743919.920000001788139;-1043153.510000001639128;0
6172;-742317.552999999374151;-1043068.875999998301268;0
5598;-743412.839999999850988;-1043680.403000000864267;0
1592;-742378.000000000000000;-1044936.000000000000000;0
2243;-743292.000000000000000;-1045310.000000000000000;0
1951;-743289.000000000000000;-1044491.000000000000000;0
1213;-742068.000000000000000;-1044387.000000000000000;0
3173;-743915.519000001251698;-1042609.598999999463558;0
6140;-742311.999000001698732;-1043064.638999998569489;0
6996;-743116.699999999254942;-1044476.469999998807907;0
3266;-743585.618999999016523;-1042739.508999999612570;0
4774;-742900.078999999910593;-1042854.859000001102686;0
4523;-742703.960000000894070;-1042805.670000001788139;0
3305;-743801.410000000149012;-1042874.962999999523163;0
396;-742388.000000000000000;-1043886.000000000000000;0
1587;-742372.000000000000000;-1044806.000000000000000;0
1400;-741719.000000000000000;-1044132.000000000000000;0
4815;-742992.210000000894070;-1042788.359999999403954;0
6113;-742229.061000000685453;-1043368.359000001102686;0
4708;-742755.420000001788139;-1042611.309999998658895;0
5678;-743404.363000001758337;-1043717.368999999016523;0
3380;-743794.508000001311302;-1042935.758999999612570;0
6168;-742313.092999998480082;-1043062.208999998867512;0
4730;-742831.050000000745058;-1042696.600000001490116;0
3525;-744827.657000001519918;-1042673.842999998480082;0
1466;-741838.000000000000000;-1044041.000000000000000;0
1395;-741799.000000000000000;-1044291.000000000000000;0
3368;-743901.462000001221895;-1043012.500999998301268;0
6485;-741795.653999999165535;-1044513.458000000566244;0
5391;-744691.945000000298023;-1042667.405000001192093;0
3730;-744714.653000000864267;-1042576.567999999970198;0
1128;-741655.000000000000000;-1044448.000000000000000;0
690;-742306.000000000000000;-1043081.000000000000000;0
5058;-742837.528999999165535;-1043170.686000000685453;0
5187;-743086.927000001072884;-1043435.230999998748302;0
5129;-743046.677000001072884;-1043376.409000001847744;0
3409;-743790.434999998658895;-1043040.907999999821186;0
1810;-743136.000000000000000;-1044544.000000000000000;0
6256;-742380.723000001162291;-1043035.640000000596046;0
3841;-743159.929999999701977;-1042641.120000001043081;0
4804;-743020.045000001788139;-1042704.315999999642372;0
5704;-743417.484999999403954;-1043635.530999999493361;0
5734;-743412.366999998688698;-1043688.041999999433756;0
2887;-744098.480000000447035;-1043192.508000001311302;0
5412;-742582.037000000476837;-1042571.986000001430511;0
729;-741986.000000000000000;-1042998.000000000000000;0
6223;-742316.076000001281500;-1043058.679000001400709;0
4584;-742417.721999999135733;-1042627.620999999344349;0
5209;-743271.947999998927116;-1043361.392000000923872;0
3241;-744178.436999998986721;-1042649.513999998569489;0
7008;-742899.559999998658895;-1044224.074999999254942;0
4205;-742325.267999999225140;-1043571.951000001281500;0
5943;-742064.651000000536442;-1043693.136999998241663;0
3128;-743948.160000000149012;-1042657.320000000298023;0
4890;-742605.287000000476837;-1042838.535000000149012;0
612;-742064.000000000000000;-1043270.000000000000000;0
3092;-743909.377999998629093;-1042780.322999998927116;0
5360;-742453.188999999314547;-1042938.521999999880791;0
3510;-744982.017000000923872;-1042686.442999999970198;0
3566;-744732.028000000864267;-1042600.848000001162291;0
4990;-742657.837999999523163;-1043024.199999999254942;0
3341;-743942.221999999135733;-1043078.236999999731779;0
3846;-743149.390000000596046;-1042549.600000001490116;0
3337;-743968.771999999880791;-1043021.756999999284744;0
1422;-742199.000000000000000;-1044127.000000000000000;0
5511;-743426.401000000536442;-1043599.129999998956919;0
3344;-743932.276000000536442;-1043064.493999999016523;0
5170;-743246.743000000715256;-1043425.304000001400709;0
3538;-744616.304000001400709;-1042656.734000001102686;0
5791;-743256.583000000566244;-1043571.184000000357628;0
1020;-742293.000000000000000;-1044615.000000000000000;0
4167;-742438.315000001341105;-1044021.960000000894070;0
4114;-742764.195000000298023;-1044131.760000001639128;0
3577;-744932.802000001072884;-1042529.300000000745058;0
5659;-743426.815000001341105;-1043709.059000000357628;0
3294;-743583.046999998390675;-1042805.258000001311302;0
7022;-743155.660000000149012;-1044074.410000000149012;0
4062;-742830.460000000894070;-1043654.920000001788139;0
4515;-742607.100000001490116;-1042765.780000001192093;0
1692;-741125.000000000000000;-1044816.000000000000000;0
1792;-742165.000000000000000;-1044209.000000000000000;0
4797;-743049.140999998897314;-1042689.576999999582767;0
5382;-744377.920000001788139;-1042814.201000001281500;0
6208;-742320.098000001162291;-1043067.458999998867512;0
2094;-743203.000000000000000;-1044744.000000000000000;0
1363;-742095.000000000000000;-1044934.000000000000000;0
8066;-742286.199999999254942;-1045237.250000000000000;0
3580;-744924.973999999463558;-1042593.699999999254942;0
982;-741992.000000000000000;-1044416.000000000000000;0
