OID_;X;Y;TEMPERATURE
7;-743479.000000000000000;-1042567.000000000000000;0
2757;-743949.300000000745058;-1043488.500000000000000;0
5786;-743456.410000000149012;-1042105.250000000000000;0
7258;-742917.370000001043081;-1044865.420000001788139;0
7519;-742850.620000001043081;-1045673.670000001788139;0
4074;-742943.350000001490116;-1043880.304999999701977;0
2210;-743280.000000000000000;-1045237.000000000000000;0
3752;-743213.949999999254942;-1042902.719999998807907;0
3269;-743600.679000001400709;-1042731.660000000149012;0
598;-741853.000000000000000;-1043233.000000000000000;0
383;-742450.000000000000000;-1043722.000000000000000;0
541;-742258.000000000000000;-1043678.000000000000000;0
7776;-743089.784000001847744;-1045773.409000001847744;0
7655;-742266.583000000566244;-1045284.133999999612570;0
3923;-743845.660000000149012;-1043512.260000001639128;0
394;-742405.000000000000000;-1043863.000000000000000;0
2466;-743460.000000000000000;-1044740.000000000000000;0
7409;-743521.629999998956919;-1045356.570000000298023;0
3388;-743940.289999999105930;-1043154.210000000894070;0
6399;-742013.379999998956919;-1042502.739999998360872;0
1629;-742450.000000000000000;-1044518.000000000000000;0
5265;-743188.572999998927116;-1043226.513999998569489;0
2262;-742999.000000000000000;-1045686.000000000000000;0
3314;-743758.675999999046326;-1042905.688999999314547;0
2488;-742083.000000000000000;-1044303.000000000000000;0
1433;-741895.000000000000000;-1044328.000000000000000;0
2050;-743460.000000000000000;-1045072.000000000000000;0
1197;-741657.000000000000000;-1043865.000000000000000;0
1532;-741805.000000000000000;-1043858.000000000000000;0
826;-742191.000000000000000;-1042616.000000000000000;0
3839;-743112.140000000596046;-1042558.280000001192093;0
3417;-743776.002999998629093;-1043098.853000000119209;0
2159;-742822.000000000000000;-1045141.000000000000000;0
4071;-742929.394999999552965;-1043807.585000000894070;0
1915;-743468.000000000000000;-1044494.000000000000000;0
3211;-743651.409000001847744;-1042483.458999998867512;0
2073;-743069.000000000000000;-1044754.000000000000000;0
3682;-744519.155999999493361;-1042509.840999998152256;0
7147;-742827.925000000745058;-1044451.385000001639128;0
6751;-742426.350000001490116;-1044371.070000000298023;0
3094;-743906.500000000000000;-1042759.554999999701977;0
1511;-741795.000000000000000;-1044159.000000000000000;30
2007;-743231.000000000000000;-1044741.000000000000000;0
2215;-743135.000000000000000;-1045335.000000000000000;0
3815;-743161.949999999254942;-1042769.750000000000000;0
883;-741802.000000000000000;-1042773.000000000000000;0
8080;-741989.600000001490116;-1045310.420000001788139;0
2151;-742827.000000000000000;-1045047.000000000000000;0
1323;-741859.000000000000000;-1044941.000000000000000;0
1429;-741982.000000000000000;-1044280.000000000000000;0
7277;-742796.870000001043081;-1044653.429999999701977;0
4068;-742917.125000000000000;-1043734.535000000149012;0
4500;-742315.239999998360872;-1042719.460000000894070;0
1794;-742151.000000000000000;-1044190.000000000000000;0
6658;-741538.879999998956919;-1044165.440000001341105;0
2019;-743264.000000000000000;-1044921.000000000000000;0
4144;-742704.414999999105930;-1043822.484999999403954;0
317;-742464.000000000000000;-1044207.000000000000000;0
2226;-743057.000000000000000;-1045470.000000000000000;0
281;-743045.000000000000000;-1043848.000000000000000;0
4056;-743125.315000001341105;-1043671.969999998807907;0
1465;-741870.000000000000000;-1044016.000000000000000;0
509;-741991.000000000000000;-1043143.000000000000000;0
3564;-744648.296999998390675;-1042605.850999999791384;0
4169;-742414.420000001788139;-1043962.329999998211861;0
4140;-742831.635999999940395;-1044004.828999999910593;0
5186;-743270.949999999254942;-1043526.039999999105930;0
6502;-741658.278999999165535;-1044979.149000000208616;0
1674;-741099.000000000000000;-1044736.000000000000000;0
2104;-743176.000000000000000;-1044964.000000000000000;0
5134;-742995.984000001102686;-1043497.364000000059605;0
3750;-743221.379999998956919;-1042925.429999999701977;0
4812;-743027.170000001788139;-1042810.219999998807907;0
2044;-743445.000000000000000;-1044960.000000000000000;0
3579;-744924.442999999970198;-1042569.135000001639128;0
7150;-742820.427000001072884;-1044516.962000001221895;0
5065;-742796.800999999046326;-1043254.010000001639128;0
7177;-742643.059999998658895;-1044579.679999999701977;0
3803;-743066.289999999105930;-1042896.320000000298023;28
1289;-742211.000000000000000;-1044521.000000000000000;0
7182;-742597.789999999105930;-1044678.260000001639128;0
1828;-743007.000000000000000;-1044088.000000000000000;0
7291;-742809.960000000894070;-1044827.300000000745058;0
2545;-741723.000000000000000;-1044265.000000000000000;0
6997;-743109.160000000149012;-1044453.600000001490116;0
982;-741992.000000000000000;-1044416.000000000000000;0
2233;-743461.000000000000000;-1045218.000000000000000;0
6722;-742357.717000000178814;-1044705.708000000566244;0
1246;-742120.000000000000000;-1044570.000000000000000;0
5675;-743407.907999999821186;-1043716.054999999701977;0
7360;-743228.008000001311302;-1045144.625999998301268;0
4839;-742984.162000000476837;-1042715.425000000745058;0
1131;-741643.000000000000000;-1044433.000000000000000;0
696;-742077.000000000000000;-1042913.000000000000000;0
1725;-741536.000000000000000;-1045136.000000000000000;0
7087;-743339.940000001341105;-1044536.690000001341105;0
1286;-742221.460000000894070;-1044465.969999998807907;0
4006;-743302.763000000268221;-1044052.298999998718500;0
4232;-742315.057999998331070;-1043428.918999999761581;0
3352;-743954.622000001370907;-1043015.732999999076128;0
2249;-743211.000000000000000;-1045443.000000000000000;0
4718;-742933.730000000447035;-1042628.039999999105930;0
1370;-742061.000000000000000;-1044797.000000000000000;0
2298;-742621.000000000000000;-1045406.000000000000000;0
6867;-741638.539999999105930;-1045354.059999998658895;0
5251;-743317.296000000089407;-1043180.037999998778105;0
202;-743240.000000000000000;-1043597.000000000000000;0
3990;-743339.489999998360872;-1043987.234999999403954;0
6198;-742312.659000001847744;-1043056.964999999850988;0
7745;-742933.037000000476837;-1045523.714999999850988;0
1904;-743459.000000000000000;-1044297.000000000000000;0
5446;-743190.850000001490116;-1043337.008999999612570;0
1592;-742378.000000000000000;-1044936.000000000000000;0
1473;-741642.000000000000000;-1044158.000000000000000;0
6828;-741465.309999998658895;-1044768.940000001341105;0
4137;-742705.739999998360872;-1044094.100000001490116;0
4207;-742354.105999998748302;-1043530.157999999821186;0
2741;-744016.675000000745058;-1043336.642999999225140;0
4175;-742721.254999998956919;-1043775.890000000596046;0
4602;-742441.269000001251698;-1042596.320000000298023;0
1687;-741142.120000001043081;-1044817.019999999552965;0
7699;-742381.114000000059605;-1044818.644000001251698;0
5648;-743429.164000000804663;-1043695.905999999493361;0
3170;-743935.190000001341105;-1042595.719999998807907;0
7043;-743398.899999998509884;-1044106.629999998956919;0
6359;-742018.440000001341105;-1042712.449999999254942;0
1089;-741567.949999999254942;-1044538.820000000298023;0
795;-741770.000000000000000;-1042577.000000000000000;0
1972;-743389.000000000000000;-1044907.000000000000000;0
6859;-741483.522999998182058;-1044967.043999999761581;0
403;-742307.000000000000000;-1043931.000000000000000;0
2336;-742837.000000000000000;-1045523.000000000000000;0
2238;-743372.000000000000000;-1045261.000000000000000;0
2516;-742500.000000000000000;-1044414.000000000000000;0
1875;-743367.000000000000000;-1044261.000000000000000;0
1060;-741610.000000000000000;-1045115.000000000000000;0
7286;-742814.550000000745058;-1044746.960000000894070;0
5272;-743000.013999998569489;-1043245.364000000059605;0
264;-743367.000000000000000;-1043732.000000000000000;0
6197;-742313.425000000745058;-1043058.370999999344349;0
6004;-742061.723000001162291;-1043300.859999999403954;0
331;-742664.000000000000000;-1044024.000000000000000;0
7814;-741769.006999999284744;-1044058.535999998450279;0
741;-741730.000000000000000;-1043035.000000000000000;0
6170;-742311.548000000417233;-1043059.381000000983477;0
1129;-741672.000000000000000;-1044438.000000000000000;0
537;-742099.000000000000000;-1043663.000000000000000;0
6260;-742377.692999999970198;-1043022.434000000357628;0
4332;-742410.359000001102686;-1043282.916000001132488;0
3022;-744385.094000000506639;-1042820.482999999076128;0
1705;-741257.219999998807907;-1044695.690000001341105;0
3950;-743426.829999998211861;-1043556.070000000298023;0
1027;-741984.000000000000000;-1044660.000000000000000;0
7200;-742561.710999999195337;-1044911.469999998807907;0
713;-741800.000000000000000;-1042859.000000000000000;0
3976;-743088.861000001430511;-1043707.728000000119209;0
727;-742001.000000000000000;-1042962.000000000000000;0
5968;-742288.989000000059605;-1044168.456999998539686;0
4566;-742473.846000000834465;-1042545.780000001192093;0
2040;-743285.000000000000000;-1044809.000000000000000;0
6705;-742279.050999999046326;-1044655.923000000417233;0
2133;-743040.000000000000000;-1045127.000000000000000;0
7121;-743339.839999999850988;-1044620.059999998658895;0
3295;-743595.543000001460314;-1042827.322000000625849;0
2170;-742897.000000000000000;-1045133.000000000000000;0
2575;-742484.000000000000000;-1045453.000000000000000;0
4803;-743043.410999998450279;-1042699.506000000983477;0
1017;-742167.000000000000000;-1044603.000000000000000;0
346;-742540.000000000000000;-1043816.000000000000000;0
2535;-742042.000000000000000;-1044071.000000000000000;0
6389;-742141.199999999254942;-1042497.030000001192093;0
7140;-742921.300000000745058;-1044469.335000000894070;0
5110;-742876.271999999880791;-1043449.013000000268221;0
2341;-742711.000000000000000;-1045552.000000000000000;0
4926;-742452.660000000149012;-1042896.190000001341105;0
4151;-742573.039999999105930;-1044109.035000000149012;0
4197;-742179.633999999612570;-1043776.899000000208616;0
5270;-742989.153999999165535;-1043210.684999998658895;0
2172;-742886.000000000000000;-1045182.000000000000000;0
3526;-744799.361999999731779;-1042683.306000001728535;0
3066;-744075.627000000327826;-1042883.837000001221895;0
4637;-742572.578000001609325;-1042742.510999999940395;0
6155;-742315.557999998331070;-1043068.140999998897314;0
7516;-742248.390000000596046;-1044368.907999999821186;0
1057;-741686.000000000000000;-1045058.000000000000000;0
5211;-743299.236000001430511;-1043364.945000000298023;0
4663;-742820.800000000745058;-1042560.039999999105930;0
1606;-742437.000000000000000;-1044706.000000000000000;0
1760;-741162.000000000000000;-1044101.000000000000000;0
4321;-742265.214999999850988;-1043235.418999999761581;0
628;-742217.370000001043081;-1043308.559999998658895;0
6825;-741380.010000001639128;-1044780.089999999850988;0
3457;-745069.765000000596046;-1042699.907000001519918;0
7007;-742923.890000000596046;-1044218.879999998956919;0
2582;-741030.372999999672174;-1044607.635000001639128;0
941;-742098.000000000000000;-1043132.000000000000000;509
4924;-742427.890999998897314;-1042890.581000000238419;0
1718;-741366.219999998807907;-1044870.989999998360872;0
706;-741897.000000000000000;-1042881.000000000000000;0
5176;-743321.252999998629093;-1043447.495000001043081;0
4228;-742132.969999998807907;-1043331.449999999254942;0
7679;-742498.250000000000000;-1045115.879999998956919;0
1181;-741920.000000000000000;-1044230.000000000000000;0
7159;-743013.767000000923872;-1044544.160999998450279;0
539;-742127.000000000000000;-1043824.000000000000000;0
988;-741820.000000000000000;-1044516.000000000000000;0
1103;-741306.000000000000000;-1044572.000000000000000;0
1573;-742358.000000000000000;-1044452.000000000000000;0
5205;-743251.475000001490116;-1043328.679000001400709;0
7168;-742792.969999998807907;-1044547.879999998956919;0
1808;-743187.000000000000000;-1044539.000000000000000;0
1970;-743380.000000000000000;-1044854.000000000000000;0
6183;-742316.633999999612570;-1043065.732000000774860;0
6294;-742653.550000000745058;-1042686.140000000596046;0
6;-743464.000000000000000;-1042594.000000000000000;0
4211;-742193.190000001341105;-1043565.660000000149012;0
6771;-741345.015999998897314;-1044413.647999998182058;0
6872;-741751.719999998807907;-1045296.679999999701977;0
1486;-741150.000000000000000;-1044219.000000000000000;0
3766;-743053.532999999821186;-1042996.631000000983477;0
5698;-743416.785999998450279;-1043633.638000000268221;0
4909;-742383.146000001579523;-1042799.159000001847744;0
6557;-741291.730000000447035;-1044031.710000000894070;0
905;-742312.000000000000000;-1042489.000000000000000;0
6139;-742312.807000000029802;-1043066.006000000983477;0
692;-742292.000000000000000;-1043084.000000000000000;0
4892;-742663.079999998211861;-1042817.344999998807907;0
5461;-742442.704999998211861;-1043234.515000000596046;0
7169;-742693.079999998211861;-1044394.177999999374151;0
6766;-741193.449999999254942;-1044424.320000000298023;0
1479;-741407.000000000000000;-1044225.000000000000000;0
1680;-741122.809999998658895;-1044628.710000000894070;0
110;-744127.000000000000000;-1042724.000000000000000;3
458;-741726.000000000000000;-1043324.000000000000000;0
1032;-741970.000000000000000;-1044813.000000000000000;0
4503;-742402.579999998211861;-1042702.839999999850988;0
5707;-743417.815000001341105;-1043640.510999999940395;0
6135;-742308.289000000804663;-1043059.340999998152256;0
1090;-741581.000000000000000;-1044552.000000000000000;0
4984;-742580.537999998778105;-1043025.210999999195337;0
8285;-742232.780000001192093;-1042821.149999998509884;0
5016;-742572.212000001221895;-1042955.526999998837709;0
6693;-742248.197000000625849;-1044816.127000000327826;0
4740;-742757.410000000149012;-1042715.589999999850988;0
7317;-742579.670000001788139;-1045022.239999998360872;0
4224;-742139.756000000983477;-1043462.488000001758337;0
577;-742038.000000000000000;-1043521.000000000000000;0
4765;-742822.897999998182058;-1042850.499000001698732;0
4875;-742814.660000000149012;-1042937.800000000745058;0
5434;-744042.467999998480082;-1043135.986999999731779;0
5302;-743090.423999998718500;-1043070.048999998718500;0
621;-742285.000000000000000;-1043282.000000000000000;0
4724;-742870.089999999850988;-1042658.210000000894070;0
6000;-741980.750000000000000;-1043285.629999998956919;0
1548;-742220.000000000000000;-1044216.000000000000000;0
5454;-742806.100999999791384;-1043305.197999998927116;0
7740;-742301.949999999254942;-1045061.239000000059605;0
8052;-742218.929999999701977;-1044953.719999998807907;0
4233;-742334.782000001519918;-1043445.793000001460314;0
4981;-742536.340999998152256;-1043014.929999999701977;0
1619;-742426.000000000000000;-1044401.000000000000000;0
3305;-743801.410000000149012;-1042874.962999999523163;0
4717;-742914.300000000745058;-1042625.489999998360872;0
7002;-743079.250000000000000;-1044377.170000001788139;0
8069;-742226.440000001341105;-1045255.949999999254942;0
4646;-742694.853000000119209;-1042535.625999998301268;0
5325;-742997.480000000447035;-1043042.289999999105930;0
497;-741780.000000000000000;-1043214.000000000000000;0
1020;-742293.000000000000000;-1044615.000000000000000;0
1562;-743199.000000000000000;-1045122.000000000000000;0
5295;-743047.995000001043081;-1043185.530000001192093;0
3408;-743789.511999998241663;-1043022.425000000745058;0
5645;-743428.886999998241663;-1043692.285999998450279;0
974;-741933.000000000000000;-1044544.000000000000000;0
4033;-743319.719999998807907;-1043793.300000000745058;0
397;-742355.000000000000000;-1043861.000000000000000;0
7652;-742275.046999998390675;-1045497.052000001072884;0
1307;-741803.000000000000000;-1044663.000000000000000;0
669;-742510.000000000000000;-1043260.000000000000000;0
4464;-742182.309999998658895;-1042571.379999998956919;0
4200;-742219.350000001490116;-1043727.980999998748302;0
4598;-742602.175000000745058;-1042688.015999998897314;0
583;-741975.000000000000000;-1043434.000000000000000;0
6188;-742312.807999998331070;-1043058.706999998539686;0
3349;-743960.629000000655651;-1042997.258999999612570;0
651;-742490.000000000000000;-1043564.000000000000000;0
4927;-742447.969999998807907;-1042874.710000000894070;0
6723;-742592.894999999552965;-1044408.905000001192093;0
5243;-743357.622000001370907;-1043407.258999999612570;0
1920;-743384.000000000000000;-1044363.000000000000000;0
2404;-742179.000000000000000;-1045467.000000000000000;0
5643;-743428.701999999582767;-1043689.872999999672174;0
6103;-742213.102000001817942;-1043103.528999999165535;0
3843;-743139.170000001788139;-1042650.050000000745058;0
5591;-743421.353999998420477;-1043679.738000001758337;0
8274;-742065.089999999850988;-1042742.109999999403954;0
2563;-741065.000000000000000;-1044421.000000000000000;0
7966;-741489.800000000745058;-1044356.219999998807907;0
4046;-743205.699999999254942;-1044009.719999998807907;0
6337;-742257.140000000596046;-1042864.820000000298023;0
1944;-743280.000000000000000;-1044400.000000000000000;0
1310;-741623.000000000000000;-1044829.000000000000000;0
2293;-742786.000000000000000;-1045387.000000000000000;0
1332;-741793.000000000000000;-1044755.000000000000000;0
6154;-742316.324000000953674;-1043069.546000000089407;0
4556;-742354.629999998956919;-1042526.789999999105930;0
5730;-743418.855999998748302;-1043638.949000000953674;0
6511;-741291.670000001788139;-1044319.690000001341105;0
6116;-742963.905999999493361;-1042886.313000001013279;0
304;-742868.000000000000000;-1044122.000000000000000;0
6179;-742312.195000000298023;-1043059.041000001132488;0
2103;-743182.000000000000000;-1044931.000000000000000;0
1414;-741627.000000000000000;-1044593.000000000000000;0
6112;-742237.710000000894070;-1043370.434999998658895;0
6163;-742316.921000000089407;-1043069.223000001162291;0
4606;-742512.769000001251698;-1042608.333000000566244;0
6259;-742383.170000001788139;-1043030.809000000357628;0
6296;-742543.019999999552965;-1042643.350000001490116;0
392;-742418.000000000000000;-1043843.000000000000000;0
6268;-742340.850000001490116;-1043018.881000000983477;0
4748;-742895.730000000447035;-1042781.289999999105930;0
4889;-742621.425000000745058;-1042831.109999999403954;0
6167;-742313.859999999403954;-1043063.607000000774860;0
2081;-742551.000000000000000;-1044621.000000000000000;0
5595;-743416.488000001758337;-1043680.118999999016523;0
6848;-741619.096999999135733;-1045007.451999999582767;0
5316;-743075.980000000447035;-1043041.059999998658895;0
6826;-741405.300000000745058;-1044777.199999999254942;0
1652;-741379.000000000000000;-1044550.000000000000000;0
1850;-742751.000000000000000;-1044237.000000000000000;0
5684;-743397.274000000208616;-1043719.995999999344349;0
2511;-743050.000000000000000;-1044050.000000000000000;0
2348;-742615.000000000000000;-1045550.000000000000000;0
7040;-743356.140000000596046;-1044164.359999999403954;0
5317;-743063.690000001341105;-1043053.769999999552965;0
683;-742362.000000000000000;-1043155.000000000000000;0
1614;-742388.000000000000000;-1044432.000000000000000;0
5000;-742542.798000000417233;-1042978.486999999731779;0
8079;-742021.839999999850988;-1045292.179999999701977;0
5138;-743030.936000000685453;-1043483.587999999523163;0
4089;-742812.844999998807907;-1043560.114999998360872;0
2422;-742473.000000000000000;-1045096.000000000000000;0
560;-742181.000000000000000;-1043665.000000000000000;0
6276;-742310.815999999642372;-1043016.000999998301268;0
5418;-742434.890000000596046;-1042864.780000001192093;0
8152;-743293.600000001490116;-1043190.510000001639128;0
5369;-742583.364999998360872;-1042976.820999998599291;0
758;-741658.000000000000000;-1042666.000000000000000;0
4987;-742641.745000001043081;-1043011.309999998658895;0
4820;-742927.769999999552965;-1042786.710000000894070;0
613;-742089.000000000000000;-1043271.000000000000000;0
1327;-742001.000000000000000;-1045024.000000000000000;0
695;-742207.000000000000000;-1043019.000000000000000;0
1776;-741200.000000000000000;-1044007.000000000000000;0
6374;-741977.035000000149012;-1042674.153999999165535;0
7946;-742007.769999999552965;-1044091.789999999105930;0
4430;-742235.070000000298023;-1043092.839999999850988;0
5456;-742761.041000001132488;-1043254.350999999791384;0
1262;-742066.000000000000000;-1044917.000000000000000;0
4053;-743260.039999999105930;-1043823.480000000447035;0
4975;-742477.829999998211861;-1043016.923000000417233;0
4670;-742810.120000001043081;-1042644.289999999105930;0
1348;-741801.000000000000000;-1044829.000000000000000;0
5324;-743025.329999998211861;-1043045.789999999105930;0
1247;-742104.000000000000000;-1044609.000000000000000;0
5508;-743426.105999998748302;-1043645.960999999195337;0
678;-742421.000000000000000;-1043181.000000000000000;0
1755;-742144.000000000000000;-1045199.000000000000000;0
2491;-742059.000000000000000;-1044251.000000000000000;0
2307;-742371.000000000000000;-1045477.000000000000000;0
6246;-742370.552999999374151;-1043055.625999998301268;0
6157;-742314.026999998837709;-1043065.331000000238419;0
7729;-742623.480999998748302;-1044601.217000000178814;0
735;-741910.000000000000000;-1043014.000000000000000;0
1124;-741715.000000000000000;-1044452.000000000000000;0
1098;-741435.000000000000000;-1044571.000000000000000;0
3128;-743948.160000000149012;-1042657.320000000298023;0
4990;-742657.837999999523163;-1043024.199999999254942;0
5590;-743422.570000000298023;-1043679.642000000923872;0
4620;-742539.574000000953674;-1042537.307999998331070;0
4126;-742851.335000000894070;-1044085.449999999254942;0
79;-744062.000000000000000;-1043257.000000000000000;0
1761;-741194.000000000000000;-1044104.000000000000000;0
209;-743108.000000000000000;-1043583.000000000000000;0
4032;-743136.934999998658895;-1043750.375000000000000;0
4597;-742620.600000001490116;-1042680.690000001341105;0
2355;-742465.000000000000000;-1045568.000000000000000;0
1831;-742994.000000000000000;-1044105.000000000000000;0
1455;-741517.000000000000000;-1044468.000000000000000;0
6194;-742315.721000000834465;-1043062.585999999195337;0
5413;-742651.872000001370907;-1042662.627999998629093;0
4475;-741839.219000000506639;-1042687.409000001847744;0
7658;-742333.647999998182058;-1045313.331999998539686;0
3978;-743342.695000000298023;-1043756.835000000894070;0
1946;-743281.000000000000000;-1044437.000000000000000;0
722;-742139.000000000000000;-1043009.000000000000000;0
620;-742253.000000000000000;-1043281.000000000000000;0
1293;-742037.000000000000000;-1044462.000000000000000;0
6229;-742318.326000001281500;-1043061.204999998211861;0
1839;-742994.469999998807907;-1044185.679999999701977;0
1437;-741840.000000000000000;-1044336.000000000000000;0
1300;-741917.410000000149012;-1044719.769999999552965;0
4603;-742442.480000000447035;-1042617.250000000000000;0
4662;-742819.471000000834465;-1042530.037000000476837;0
6164;-742316.155999999493361;-1043067.784000001847744;0
1405;-741681.000000000000000;-1044325.000000000000000;0
1386;-742158.000000000000000;-1044976.000000000000000;0
5689;-743415.442000001668930;-1043633.646000001579523;0
4874;-742795.429999999701977;-1042925.910000000149012;0
2105;-743158.000000000000000;-1044971.000000000000000;0
2037;-743373.000000000000000;-1044805.000000000000000;0
6278;-742305.421999998390675;-1043028.918000001460314;0
5001;-742560.092999998480082;-1042966.206999998539686;0
5036;-742666.855999998748302;-1042990.710000000894070;0
6212;-742317.006000000983477;-1043061.888000000268221;0
4123;-742742.956000000238419;-1043901.826000001281500;0
4063;-742855.079999998211861;-1043654.695000000298023;0
1070;-741665.000000000000000;-1044736.000000000000000;0
1388;-742152.000000000000000;-1045026.000000000000000;0
6206;-742314.043000001460314;-1043058.028999999165535;0
1306;-741783.000000000000000;-1044653.000000000000000;0
5510;-743424.346000000834465;-1043626.458999998867512;0
1464;-741899.000000000000000;-1043994.000000000000000;0
3092;-743909.377999998629093;-1042780.322999998927116;0
2399;-742121.000000000000000;-1045372.000000000000000;0
2300;-742561.000000000000000;-1045413.000000000000000;0
2557;-741318.000000000000000;-1044384.000000000000000;0
3999;-743412.539999999105930;-1043918.725000001490116;0
1179;-741934.000000000000000;-1044251.000000000000000;0
5647;-743429.070999998599291;-1043694.699000000953674;0
6485;-741795.653999999165535;-1044513.458000000566244;0
348;-742525.000000000000000;-1043787.000000000000000;0
4900;-742508.089999999850988;-1042815.289999999105930;0
6352;-741906.920000001788139;-1042710.609999999403954;0
546;-742323.640000000596046;-1043781.429999999701977;0
6171;-742310.780999999493361;-1043057.971000000834465;0
1224;-742174.000000000000000;-1044253.000000000000000;0
6258;-742382.381999999284744;-1043032.370999999344349;0
2440;-742596.000000000000000;-1044193.000000000000000;0
2367;-742510.000000000000000;-1045483.000000000000000;0
3130;-743942.151000000536442;-1042673.475999999791384;0
3824;-743038.059999998658895;-1042573.800000000745058;0
4148;-742631.269999999552965;-1043885.870000001043081;0
8272;-742042.399999998509884;-1042732.559999998658895;0
6415;-743180.657999999821186;-1043208.993999999016523;0
1908;-743459.000000000000000;-1044358.000000000000000;0
6090;-742012.260000001639128;-1043497.300000000745058;0
2093;-742915.000000000000000;-1044642.000000000000000;0
3309;-743830.328000001609325;-1042834.535000000149012;0
7694;-742486.548999998718500;-1045129.752000000327826;0
1450;-741527.000000000000000;-1044632.000000000000000;0
2480;-741251.739999998360872;-1044639.480000000447035;0
309;-742721.000000000000000;-1044157.000000000000000;0
5417;-742604.429000001400709;-1042550.491999998688698;0
545;-742337.000000000000000;-1043805.000000000000000;0
1303;-741865.000000000000000;-1044692.000000000000000;0
1554;-741348.000000000000000;-1044238.000000000000000;0
1490;-741023.000000000000000;-1044335.000000000000000;0
1214;-742064.000000000000000;-1044358.000000000000000;0
2318;-742763.000000000000000;-1045470.000000000000000;0
3530;-744756.230000000447035;-1042672.155999999493361;0
647;-742216.000000000000000;-1043375.000000000000000;0
333;-742651.000000000000000;-1043996.000000000000000;0
5187;-743086.927000001072884;-1043435.230999998748302;0
4750;-742784.420000001788139;-1042733.429999999701977;0
954;-742231.000000000000000;-1043024.000000000000000;0
4563;-742461.379999998956919;-1042526.230000000447035;0
5735;-743414.589999999850988;-1043687.874000001698732;0
522;-742261.000000000000000;-1043122.000000000000000;0
6704;-742282.179999999701977;-1044623.793999999761581;0
381;-742465.000000000000000;-1043700.000000000000000;0
6486;-741772.072999998927116;-1044516.256000000983477;0
1940;-743286.000000000000000;-1044339.000000000000000;0
270;-743230.000000000000000;-1043721.000000000000000;0
1498;-741382.000000000000000;-1044310.000000000000000;0
2362;-742301.000000000000000;-1045580.000000000000000;0
4633;-742625.931000001728535;-1042639.918999999761581;0
5048;-742867.500000000000000;-1043381.899999998509884;0
4253;-742109.368000000715256;-1043416.399999998509884;0
2152;-742814.000000000000000;-1045106.000000000000000;0
6713;-742278.905999999493361;-1044887.284000001847744;0
1439;-741772.000000000000000;-1044379.000000000000000;0
2075;-743114.000000000000000;-1044772.000000000000000;0
4799;-743008.011999998241663;-1042697.245999999344349;0
5589;-743423.785999998450279;-1043679.548000000417233;0
376;-742530.000000000000000;-1043680.000000000000000;0
5650;-743429.348999999463558;-1043698.318999998271465;0
1380;-742156.000000000000000;-1044947.000000000000000;0
1423;-742167.000000000000000;-1044150.000000000000000;0
5224;-743293.449999999254942;-1043542.160000000149012;0
6284;-742309.677999999374151;-1043054.043999999761581;0
4322;-742266.414000000804663;-1043213.907999999821186;0
5720;-743418.223000001162291;-1043629.960999999195337;0
4031;-743135.774000000208616;-1043769.622000001370907;0
3160;-743959.590999998152256;-1042557.386999998241663;0
782;-741695.000000000000000;-1042522.000000000000000;0
4705;-742714.100000001490116;-1042599.829999998211861;0
5976;-745060.993999999016523;-1042674.883000001311302;0
5999;-741991.910000000149012;-1043282.079999998211861;0
1347;-741791.000000000000000;-1044816.000000000000000;0
