OID_;X;Y;TEMPERATURE
3614;-744984.548999998718500;-1042283.640999998897314;0
3019;-744463.447999998927116;-1042784.646000001579523;0
3568;-744718.817999999970198;-1042588.614999998360872;0
3692;-744525.876499999314547;-1042540.534000001847744;0
3580;-744924.973999999463558;-1042593.699999999254942;0
2605;-745393.842999998480082;-1042860.796000000089407;0
5975;-745052.346999999135733;-1042674.673000000417233;0
118;-745135.000000000000000;-1042687.000000000000000;0
3542;-744575.274000000208616;-1042656.160000000149012;0
2696;-743477.489999998360872;-1042038.000000000000000;0
2520;-741847.000000000000000;-1045324.000000000000000;0
6872;-741751.719999998807907;-1045296.679999999701977;0
2760;-743863.331000000238419;-1043483.304000001400709;0
2755;-744003.879000000655651;-1043471.734000001102686;0
2404;-742179.000000000000000;-1045467.000000000000000;0
3919;-743904.947000000625849;-1043493.929999999701977;0
3107;-743778.888000000268221;-1042682.131999999284744;0
2740;-744042.611999999731779;-1043335.940000001341105;0
1486;-741150.000000000000000;-1044219.000000000000000;0
6828;-741465.309999998658895;-1044768.940000001341105;0
7411;-743529.510000001639128;-1045393.140000000596046;0
8079;-742021.839999999850988;-1045292.179999999701977;0
2070;-742993.000000000000000;-1044723.000000000000000;0
2097;-743143.000000000000000;-1044742.000000000000000;0
7263;-743009.559999998658895;-1044894.379999998956919;0
4238;-742440.263000000268221;-1043528.236000001430511;0
7654;-742242.081000000238419;-1045273.263999998569489;0
2394;-742273.000000000000000;-1045360.000000000000000;0
2160;-742849.000000000000000;-1045147.000000000000000;0
2161;-742876.000000000000000;-1045153.000000000000000;0
8073;-742120.640000000596046;-1045259.500000000000000;0
4075;-742947.934999998658895;-1043903.649999998509884;0
7947;-742030.969999998807907;-1044096.679999999701977;0
524;-742255.000000000000000;-1043913.000000000000000;0
1780;-741214.000000000000000;-1043934.000000000000000;0
738;-741818.000000000000000;-1043024.000000000000000;0
1983;-743474.000000000000000;-1044709.000000000000000;0
748;-741671.000000000000000;-1042971.000000000000000;0
110;-744127.000000000000000;-1042724.000000000000000;0
7022;-743155.660000000149012;-1044074.410000000149012;0
1764;-741163.000000000000000;-1044144.000000000000000;0
735;-741910.000000000000000;-1043014.000000000000000;0
514;-742119.000000000000000;-1043141.000000000000000;0
510;-742048.000000000000000;-1043150.000000000000000;0
2050;-743460.000000000000000;-1045072.000000000000000;0
2008;-743242.000000000000000;-1044759.000000000000000;0
6722;-742357.717000000178814;-1044705.708000000566244;0
1561;-743186.000000000000000;-1045098.000000000000000;0
1251;-742091.000000000000000;-1044690.000000000000000;0
7;-743479.000000000000000;-1042567.000000000000000;0
17;-743587.000000000000000;-1042394.000000000000000;0
5303;-743164.818999998271465;-1043211.078000001609325;0
1492;-741096.000000000000000;-1044331.000000000000000;0
4332;-742410.359000001102686;-1043282.916000001132488;0
3204;-743715.278999999165535;-1042506.118999999016523;0
6;-743464.000000000000000;-1042594.000000000000000;0
2133;-743040.000000000000000;-1045127.000000000000000;0
2151;-742827.000000000000000;-1045047.000000000000000;0
2166;-743016.000000000000000;-1045179.000000000000000;0
7324;-742833.980000000447035;-1044949.109999999403954;0
4162;-742497.193999998271465;-1044160.030000001192093;0
6746;-742405.083999998867512;-1044259.199999999254942;0
1515;-741913.000000000000000;-1044072.000000000000000;0
1371;-742089.000000000000000;-1044807.000000000000000;0
884;-741771.000000000000000;-1042776.000000000000000;0
1013;-742076.000000000000000;-1044595.000000000000000;0
2189;-743472.000000000000000;-1045183.000000000000000;0
727;-742001.000000000000000;-1042962.000000000000000;0
1091;-741531.480000000447035;-1044543.440000001341105;0
728;-741997.000000000000000;-1042918.000000000000000;0
696;-742077.000000000000000;-1042913.000000000000000;0
3326;-744036.002000000327826;-1042922.574999999254942;0
2226;-743057.000000000000000;-1045470.000000000000000;0
504;-741937.000000000000000;-1043164.000000000000000;0
5062;-742798.513999998569489;-1043227.370999999344349;0
1970;-743380.000000000000000;-1044854.000000000000000;0
1987;-743480.000000000000000;-1044820.000000000000000;0
3387;-743960.368000000715256;-1043194.717000000178814;0
2256;-743156.000000000000000;-1045353.000000000000000;0
3233;-744152.962999999523163;-1042686.791999999433756;0
7776;-743089.784000001847744;-1045773.409000001847744;0
4232;-742315.057999998331070;-1043428.918999999761581;0
1915;-743468.000000000000000;-1044494.000000000000000;0
5119;-742850.592999998480082;-1043328.484999999403954;0
7520;-742808.589999999850988;-1045680.519999999552965;0
7087;-743339.940000001341105;-1044536.690000001341105;0
7350;-742556.390000000596046;-1045185.980000000447035;0
5111;-742892.337999999523163;-1043424.370999999344349;0
1945;-743270.000000000000000;-1044454.000000000000000;0
1058;-741667.000000000000000;-1045072.000000000000000;0
6791;-741047.329999998211861;-1044765.467999998480082;0
1875;-743367.000000000000000;-1044261.000000000000000;0
2262;-742999.000000000000000;-1045686.000000000000000;0
1926;-743301.000000000000000;-1044321.000000000000000;0
5292;-743055.866000000387430;-1043215.710999999195337;0
7188;-742583.839999999850988;-1044742.870000001043081;0
599;-741837.000000000000000;-1043243.000000000000000;0
5272;-743000.013999998569489;-1043245.364000000059605;0
639;-741958.000000000000000;-1043294.000000000000000;0
4070;-742925.285000000149012;-1043783.565000001341105;0
496;-741768.000000000000000;-1043197.000000000000000;0
4342;-742506.473000001162291;-1043301.100000001490116;0
7651;-742295.381000000983477;-1045479.861999999731779;0
4212;-742205.245000001043081;-1043548.410000000149012;0
1238;-742150.000000000000000;-1044384.000000000000000;0
1243;-742122.000000000000000;-1044502.000000000000000;0
5223;-743283.699999999254942;-1043535.940000001341105;0
826;-742191.000000000000000;-1042616.000000000000000;0
2491;-742059.000000000000000;-1044251.000000000000000;0
7217;-742516.318999998271465;-1044582.890000000596046;0
467;-741757.000000000000000;-1043352.000000000000000;0
463;-741703.000000000000000;-1043287.000000000000000;0
1299;-741943.000000000000000;-1044719.000000000000000;0
1052;-741761.000000000000000;-1045002.000000000000000;0
910;-742219.000000000000000;-1042529.000000000000000;0
1171;-741882.000000000000000;-1044375.000000000000000;0
6943;-742902.013999998569489;-1043932.647999998182058;0
6825;-741380.010000001639128;-1044780.089999999850988;0
281;-743045.000000000000000;-1043848.000000000000000;0
226;-742879.000000000000000;-1043516.000000000000000;0
8018;-741974.039999999105930;-1044442.870000001043081;0
583;-741975.000000000000000;-1043434.000000000000000;0
4006;-743302.763000000268221;-1044052.298999998718500;0
1138;-741500.000000000000000;-1044458.000000000000000;0
4236;-742406.842999998480082;-1043504.015000000596046;0
2501;-742746.000000000000000;-1045430.000000000000000;0
6710;-742260.203000001609325;-1044803.609999999403954;0
7026;-743217.644999999552965;-1044082.329999998211861;0
6095;-742082.920000001788139;-1043614.710000000894070;0
7033;-743303.864999998360872;-1044132.750000000000000;0
7180;-742618.809000000357628;-1044646.109000001102686;0
1865;-743458.000000000000000;-1044233.000000000000000;0
3781;-743273.059999998658895;-1042814.050000000745058;0
3752;-743213.949999999254942;-1042902.719999998807907;0
7218;-742534.100000001490116;-1044603.559999998658895;0
1656;-741395.000000000000000;-1044688.000000000000000;0
1922;-743390.000000000000000;-1044308.000000000000000;0
1920;-743384.000000000000000;-1044363.000000000000000;0
1905;-743446.000000000000000;-1044312.000000000000000;0
2513;-742574.000000000000000;-1044441.000000000000000;0
7044;-743400.635000001639128;-1044135.579999998211861;0
2478;-741241.859999999403954;-1044562.089999999850988;0
7104;-743423.739999998360872;-1044624.530000001192093;0
6313;-743936.949999999254942;-1042594.780000001192093;0
3155;-743969.353000000119209;-1042568.828000001609325;0
576;-742054.000000000000000;-1043517.000000000000000;0
6092;-742001.309999998658895;-1043482.089999999850988;0
1707;-741196.219999998807907;-1044702.390000000596046;0
627;-742223.000000000000000;-1043335.000000000000000;0
4026;-743178.984999999403954;-1043847.989999998360872;0
786;-741706.000000000000000;-1042606.000000000000000;0
6821;-741256.649999998509884;-1044796.100000001490116;0
4145;-742687.109999999403954;-1043837.125000000000000;0
1101;-741339.000000000000000;-1044568.000000000000000;0
4023;-743246.635000001639128;-1043864.364999998360872;0
6000;-741980.750000000000000;-1043285.629999998956919;0
2300;-742561.000000000000000;-1045413.000000000000000;0
616;-742153.000000000000000;-1043272.000000000000000;0
613;-742089.000000000000000;-1043271.000000000000000;0
636;-742160.000000000000000;-1043325.000000000000000;0
1449;-741533.000000000000000;-1044684.000000000000000;0
1693;-741613.000000000000000;-1044649.000000000000000;0
713;-741800.000000000000000;-1042859.000000000000000;0
1325;-741894.000000000000000;-1044959.000000000000000;0
3976;-743088.861000001430511;-1043707.728000000119209;0
881;-741806.000000000000000;-1042815.000000000000000;0
1611;-742400.000000000000000;-1044442.000000000000000;0
6700;-742298.611000001430511;-1044507.315999999642372;0
6703;-742288.903999999165535;-1044591.625999998301268;0
6721;-742321.052999999374151;-1044705.548000000417233;0
7010;-742857.964999999850988;-1044251.155000001192093;4
4058;-743138.765000000596046;-1043625.405000001192093;0
4057;-743132.184999998658895;-1043648.719999998807907;0
1314;-741695.000000000000000;-1044866.000000000000000;0
1310;-741623.000000000000000;-1044829.000000000000000;0
7516;-742248.390000000596046;-1044368.907999999821186;0
6718;-742339.493000000715256;-1044956.921999998390675;0
1692;-741125.000000000000000;-1044816.000000000000000;0
6507;-741738.839999999850988;-1044541.820000000298023;0
6662;-741466.800000000745058;-1044192.359999999403954;0
4166;-742448.504999998956919;-1044046.885000001639128;0
2016;-743230.000000000000000;-1044873.000000000000000;0
1424;-742134.000000000000000;-1044171.000000000000000;0
5232;-743347.087000001221895;-1043476.425000000745058;0
2575;-742484.000000000000000;-1045453.000000000000000;0
1387;-742155.000000000000000;-1044999.000000000000000;0
1598;-742351.000000000000000;-1045090.000000000000000;0
1350;-741814.000000000000000;-1044844.000000000000000;0
2375;-742438.000000000000000;-1045570.000000000000000;0
2309;-742322.000000000000000;-1045519.000000000000000;0
1385;-742194.000000000000000;-1044974.000000000000000;0
4134;-742772.309999998658895;-1044078.870000001043081;0
2329;-742432.000000000000000;-1045508.000000000000000;0
6842;-741574.894000001251698;-1044962.013999998569489;0
1590;-742377.000000000000000;-1044885.000000000000000;0
2322;-742651.000000000000000;-1045483.000000000000000;0
4064;-742879.655000001192093;-1043647.420000001788139;0
1993;-743483.000000000000000;-1044984.000000000000000;0
8284;-742219.410000000149012;-1042809.500000000000000;0
2041;-743531.000000000000000;-1044957.000000000000000;0
8283;-742198.600000001490116;-1042801.980000000447035;0
2419;-742418.000000000000000;-1045101.000000000000000;0
1269;-742246.000000000000000;-1044462.000000000000000;0
6573;-741294.089999999850988;-1044091.679999999701977;0
7736;-742342.260000001639128;-1045113.918000001460314;0
4656;-742827.763000000268221;-1042494.379999998956919;0
4858;-742955.339999999850988;-1042963.960000000894070;0
6656;-741590.160000000149012;-1044150.480000000447035;0
4036;-743246.920000001788139;-1043771.574999999254942;0
623;-742254.000000000000000;-1043325.000000000000000;0
3766;-743053.532999999821186;-1042996.631000000983477;0
872;-741698.000000000000000;-1042669.000000000000000;0
4425;-742208.820000000298023;-1043035.230000000447035;0
2017;-743247.000000000000000;-1044884.000000000000000;0
6726;-742476.517999999225140;-1044410.600000001490116;0
2028;-743371.000000000000000;-1045054.000000000000000;0
7315;-742603.960000000894070;-1045022.870000001043081;0
2060;-742659.000000000000000;-1044472.000000000000000;0
7175;-742651.780000001192093;-1044558.149999998509884;0
4099;-742773.870000001043081;-1043846.135999999940395;0
6009;-743896.859000001102686;-1042750.497000001370907;0
3090;-743913.418999999761581;-1042804.416999999433756;0
1604;-742552.000000000000000;-1044918.000000000000000;0
5241;-743365.063000001013279;-1043245.954999998211861;0
7152;-742867.331999998539686;-1044547.015999998897314;0
5258;-743356.739999998360872;-1043230.039999999105930;0
7156;-742944.515000000596046;-1044546.140000000596046;0
6709;-742264.587999999523163;-1044776.254999998956919;0
7281;-742801.859999999403954;-1044705.300000000745058;0
7704;-742256.021000001579523;-1044313.592999998480082;0
1189;-741786.000000000000000;-1044043.000000000000000;0
5136;-742992.278000000864267;-1043472.440000001341105;0
1553;-741350.000000000000000;-1044268.000000000000000;0
4252;-742124.022999998182058;-1043390.519000001251698;0
1126;-741684.000000000000000;-1044450.000000000000000;0
3837;-743093.699999999254942;-1042577.890000000596046;0
918;-743437.000000000000000;-1043904.000000000000000;0
1459;-741491.000000000000000;-1044340.000000000000000;0
3847;-743122.146999999880791;-1042525.489999998360872;0
3995;-743393.225000001490116;-1043973.719999998807907;0
2247;-743199.000000000000000;-1045400.000000000000000;0
4220;-742214.344999998807907;-1043580.359999999403954;0
3287;-743711.173999998718500;-1042886.515999998897314;0
7141;-742895.629999998956919;-1044470.910000000149012;0
7143;-742850.414999999105930;-1044473.449999999254942;0
3987;-743311.475000001490116;-1043983.175000000745058;0
4590;-742387.043000001460314;-1042535.971000000834465;0
4190;-742301.250000000000000;-1044166.100000001490116;0
1518;-741994.000000000000000;-1044011.000000000000000;0
2286;-742894.000000000000000;-1045440.000000000000000;0
7206;-742559.920000001788139;-1045003.190000001341105;0
3943;-743413.429000001400709;-1043376.822000000625849;0
5135;-742979.611000001430511;-1043468.912999998778105;0
4427;-742190.519999999552965;-1043099.440000001341105;0
4668;-742810.210000000894070;-1042618.969999998807907;0
4323;-742267.879999998956919;-1043190.035000000149012;0
4990;-742657.837999999523163;-1043024.199999999254942;0
1619;-742426.000000000000000;-1044401.000000000000000;0
4062;-742830.460000000894070;-1043654.920000001788139;0
7017;-742571.059999998658895;-1044267.640000000596046;0
3413;-743776.791000001132488;-1043071.675000000745058;0
6855;-741501.394999999552965;-1045027.784000001847744;0
3747;-743250.879999998956919;-1042956.620000001043081;0
1423;-742167.000000000000000;-1044150.000000000000000;0
1570;-742291.000000000000000;-1044183.000000000000000;0
2238;-743372.000000000000000;-1045261.000000000000000;0
2232;-743488.000000000000000;-1045234.000000000000000;0
1259;-742064.000000000000000;-1044854.000000000000000;0
4794;-743065.828999999910593;-1042673.377000000327826;0
569;-742096.000000000000000;-1043601.000000000000000;0
391;-742395.000000000000000;-1043802.000000000000000;0
1849;-742732.000000000000000;-1044228.000000000000000;0
557;-742213.000000000000000;-1043713.000000000000000;0
4079;-742836.170000001788139;-1043800.960000000894070;0
1264;-742059.000000000000000;-1044942.000000000000000;0
842;-742101.000000000000000;-1042521.000000000000000;0
1843;-743041.600000001490116;-1044324.489999998360872;0
2320;-742707.000000000000000;-1045477.000000000000000;0
1061;-741586.000000000000000;-1045133.000000000000000;0
1357;-741935.000000000000000;-1044871.000000000000000;0
2891;-744029.914000000804663;-1043200.478000000119209;0
2888;-744082.749000001698732;-1043174.458999998867512;0
2338;-742797.000000000000000;-1045528.000000000000000;0
3349;-743960.629000000655651;-1042997.258999999612570;0
3266;-743585.618999999016523;-1042739.508999999612570;0
3289;-743584.761999998241663;-1042769.188000001013279;0
1121;-741765.000000000000000;-1044444.000000000000000;0
1341;-741687.000000000000000;-1044742.000000000000000;0
2213;-743188.000000000000000;-1045298.000000000000000;0
2241;-743319.000000000000000;-1045289.000000000000000;0
1821;-742995.000000000000000;-1044239.000000000000000;0
3789;-743137.469999998807907;-1042933.670000001788139;0
2526;-741087.000000000000000;-1044616.000000000000000;0
1523;-741679.000000000000000;-1043865.000000000000000;0
351;-742509.000000000000000;-1043739.000000000000000;0
7981;-741126.370000001043081;-1044401.239999998360872;0
1305;-741826.000000000000000;-1044678.000000000000000;0
1519;-741754.000000000000000;-1043956.000000000000000;0
4927;-742447.969999998807907;-1042874.710000000894070;0
7001;-743085.660000000149012;-1044400.420000001788139;0
1551;-741353.000000000000000;-1044326.000000000000000;0
1435;-741903.000000000000000;-1044306.000000000000000;0
382;-742481.000000000000000;-1043751.000000000000000;0
4898;-742571.280000001192093;-1042840.859999999403954;0
5208;-743237.954999998211861;-1043368.065999999642372;0
547;-742316.910000000149012;-1043790.309999998658895;0
4198;-742192.445000000298023;-1043760.521000001579523;0
6977;-743098.949999999254942;-1044459.879999998956919;0
4479;-741782.780000001192093;-1042660.359999999403954;0
4505;-742434.910000000149012;-1042706.170000001788139;0
835;-741950.000000000000000;-1042513.000000000000000;0
2084;-742447.000000000000000;-1044797.000000000000000;0
4959;-742331.289999999105930;-1043002.690000001341105;0
4791;-743022.245000001043081;-1042633.714000001549721;0
5961;-742431.225000001490116;-1044003.574999999254942;0
395;-742369.000000000000000;-1043840.000000000000000;0
5155;-743140.712999999523163;-1043357.901999998837709;0
4677;-742787.309999998658895;-1042797.899999998509884;0
399;-742339.000000000000000;-1043884.000000000000000;0
7146;-742819.425000000745058;-1044426.225000001490116;0
6784;-741318.109999999403954;-1044460.920000001788139;0
1469;-741752.000000000000000;-1044100.000000000000000;0
2487;-742101.000000000000000;-1044308.000000000000000;0
7252;-742775.109999999403954;-1044855.940000001341105;0
4500;-742315.239999998360872;-1042719.460000000894070;0
7958;-741664.710000000894070;-1044289.879999998956919;0
1127;-741700.000000000000000;-1044440.000000000000000;0
1455;-741517.000000000000000;-1044468.000000000000000;0
5461;-742442.704999998211861;-1043234.515000000596046;0
5194;-743205.761999998241663;-1043310.581999998539686;0
2449;-742825.000000000000000;-1044147.000000000000000;0
4966;-742377.289999999105930;-1043071.030000001192093;0
1164;-741055.000000000000000;-1044515.000000000000000;0
3889;-742335.008999999612570;-1042489.949000000953674;0
3411;-743769.885999999940395;-1043038.517000000923872;0
7508;-742947.440000001341105;-1045540.690000001341105;0
1588;-742390.000000000000000;-1044837.000000000000000;0
6152;-742310.348999999463558;-1043060.046999998390675;0
6172;-742317.552999999374151;-1043068.875999998301268;0
1195;-741696.000000000000000;-1043920.000000000000000;0
6261;-742373.956999998539686;-1043022.041999999433756;0
6247;-742371.447000000625849;-1043053.739000000059605;0
4777;-742910.034000001847744;-1042759.350999999791384;0
4688;-742676.179000001400709;-1042555.322999998927116;0
1830;-742961.000000000000000;-1044087.000000000000000;0
1003;-741913.000000000000000;-1044580.000000000000000;0
341;-742592.000000000000000;-1043889.000000000000000;0
1811;-743175.000000000000000;-1044525.000000000000000;0
4737;-742718.399999998509884;-1042684.079999998211861;0
5686;-743394.912000000476837;-1043720.872000001370907;0
5323;-743049.401000000536442;-1043038.131000000983477;0
303;-742895.000000000000000;-1044116.000000000000000;0
4937;-742461.982000000774860;-1042671.942000001668930;0
4598;-742602.175000000745058;-1042688.015999998897314;0
5649;-743429.256000000983477;-1043697.111999999731779;0
6179;-742312.195000000298023;-1043059.041000001132488;0
671;-742489.000000000000000;-1043245.000000000000000;0
4773;-742888.429000001400709;-1042839.530000001192093;0
250;-743428.000000000000000;-1043794.000000000000000;0
4585;-742437.502000000327826;-1042630.243999999016523;0
6227;-742319.839999999850988;-1043063.936000000685453;0
4948;-742386.929999999701977;-1042992.239999998360872;0
8276;-742095.079999998211861;-1042752.519999999552965;0
4876;-742826.449999999254942;-1042944.910000000149012;0
343;-742575.000000000000000;-1043857.000000000000000;0
1393;-742083.000000000000000;-1045067.000000000000000;0
6151;-742311.114999998360872;-1043061.451000001281500;0
4889;-742621.425000000745058;-1042831.109999999403954;0
5643;-743428.701999999582767;-1043689.872999999672174;0
7976;-741301.260000001639128;-1044401.750000000000000;0
5705;-743417.603000000119209;-1043637.098000001162291;0
1400;-741719.000000000000000;-1044132.000000000000000;0
4741;-742787.859999999403954;-1042715.800000000745058;0
6153;-742309.583999998867512;-1043058.640999998897314;0
4809;-743081.589999999850988;-1042799.800000000745058;0
5360;-742453.188999999314547;-1042938.521999999880791;0
2546;-741750.000000000000000;-1044271.000000000000000;0
4981;-742536.340999998152256;-1043014.929999999701977;0
5514;-743426.903000000864267;-1043609.252999998629093;0
4117;-742733.614999998360872;-1044043.129999998956919;0
6146;-742314.942000001668930;-1043068.475999999791384;0
1026;-741986.000000000000000;-1044631.000000000000000;0
3807;-743008.690000001341105;-1042928.690000001341105;0
5691;-743415.714000001549721;-1043637.241000000387430;0
4580;-742393.905000001192093;-1042551.807000000029802;0
672;-742484.000000000000000;-1043226.000000000000000;0
4693;-742691.399999998509884;-1042612.399999998509884;0
296;-742950.170000001788139;-1044097.429999999701977;0
1159;-741137.000000000000000;-1044493.000000000000000;0
2508;-742961.000000000000000;-1044050.000000000000000;0
4175;-742721.254999998956919;-1043775.890000000596046;0
4475;-741839.219000000506639;-1042687.409000001847744;0
1510;-741764.000000000000000;-1044180.000000000000000;0
820;-742019.000000000000000;-1042600.000000000000000;0
6268;-742340.850000001490116;-1043018.881000000983477;0
6279;-742306.210000000894070;-1043033.421999998390675;0
6142;-742310.477000001817942;-1043061.813000001013279;0
6996;-743116.699999999254942;-1044476.469999998807907;0
6124;-743427.861999999731779;-1043609.043000001460314;0
5597;-743414.056000001728535;-1043680.309000000357628;0
2331;-742895.000000000000000;-1045530.000000000000000;0
6156;-742314.791999999433756;-1043066.736000001430511;0
4783;-742933.866999998688698;-1042668.403000000864267;0
4906;-742448.370000001043081;-1042815.789999999105930;0
5697;-743416.916000001132488;-1043635.342000000178814;0
5664;-743420.907000001519918;-1043711.245999999344349;0
1388;-742152.000000000000000;-1045026.000000000000000;0
1004;-741898.000000000000000;-1044565.000000000000000;0
5145;-743058.063000001013279;-1043471.706999998539686;0
6183;-742316.633999999612570;-1043065.732000000774860;0
6256;-742380.723000001162291;-1043035.640000000596046;0
329;-742675.000000000000000;-1044052.000000000000000;0
3303;-743810.967999998480082;-1042865.596000000834465;0
692;-742292.000000000000000;-1043084.000000000000000;0
6276;-742310.815999999642372;-1043016.000999998301268;0
5717;-743422.208999998867512;-1043629.984000001102686;0
301;-742613.000000000000000;-1043903.000000000000000;0
5644;-743428.793999999761581;-1043691.079999998211861;0
5719;-743419.508999999612570;-1043629.817999999970198;0
5680;-743402.000000000000000;-1043718.245000001043081;0
6161;-742310.964999999850988;-1043059.710999999195337;0
6371;-741972.725000001490116;-1042696.274000000208616;0
6254;-742379.344000000506639;-1043038.363000001758337;0
5594;-743417.704999998211861;-1043680.022999998182058;0
6255;-742379.991999998688698;-1043037.068999998271465;0
4624;-742577.815000001341105;-1042600.907999999821186;0
4532;-742760.140000000596046;-1042899.600000001490116;0
4799;-743008.011999998241663;-1042697.245999999344349;0
322;-742701.000000000000000;-1044153.000000000000000;0
4849;-742966.960000000894070;-1042893.583999998867512;0
3794;-743091.015000000596046;-1042800.471999999135733;0
216;-743023.000000000000000;-1043539.000000000000000;0
6213;-742316.227000001817942;-1043060.478999998420477;0
5205;-743251.475000001490116;-1043328.679000001400709;0
7288;-742817.019999999552965;-1044773.399999998509884;0
6262;-742370.024999998509884;-1043021.666000001132488;0
1235;-742150.000000000000000;-1044330.000000000000000;0
4106;-742664.475000001490116;-1043755.761999998241663;0
5024;-742588.655000001192093;-1042886.519000001251698;0
5507;-743426.703000001609325;-1043656.230999998748302;0
3366;-743913.831000000238419;-1043002.796999998390675;0
4815;-742992.210000000894070;-1042788.359999999403954;0
5652;-743429.532999999821186;-1043700.732000000774860;0
3885;-742418.339999999850988;-1042442.059999998658895;0
5417;-742604.429000001400709;-1042550.491999998688698;0
6204;-742315.578999999910593;-1043060.826000001281500;0
4965;-742383.620000001043081;-1043057.500000000000000;0
1531;-741782.000000000000000;-1043838.000000000000000;0
3338;-743968.458999998867512;-1043042.706999998539686;0
5599;-743411.622999999672174;-1043680.499000001698732;0
5726;-743422.414000000804663;-1043635.760999999940395;0
5689;-743415.442000001668930;-1043633.646000001579523;0
4768;-742862.888000000268221;-1042936.997999999672174;0
3311;-743816.037999998778105;-1042845.728999998420477;0
691;-742293.000000000000000;-1043097.000000000000000;0
5657;-743429.199999999254942;-1043706.837999999523163;0
6782;-741303.329999998211861;-1044447.660000000149012;0
7145;-742812.874000001698732;-1044402.199000000953674;0
6176;-742314.491000000387430;-1043063.256000000983477;0
1194;-741721.000000000000000;-1043955.000000000000000;0
6243;-742367.739999998360872;-1043061.098000001162291;0
4755;-742734.960000000894070;-1042778.019999999552965;0
4717;-742914.300000000745058;-1042625.489999998360872;0
5640;-743428.425000000745058;-1043686.254000000655651;0
5217;-743306.870999999344349;-1043323.228000000119209;0
4740;-742757.410000000149012;-1042715.589999999850988;0
4707;-742743.519999999552965;-1042600.359999999403954;0
5716;-743423.320999998599291;-1043631.197000000625849;0
4526;-742696.690000001341105;-1042823.320000000298023;0
4476;-741849.620000001043081;-1042690.190000001341105;0
4822;-742945.579999998211861;-1042879.910000000149012;0
6126;-743428.385999999940395;-1043621.800000000745058;0
4613;-742506.557000000029802;-1042597.938000001013279;0
4775;-742898.375999998301268;-1042802.914000000804663;0
1302;-741842.000000000000000;-1044693.000000000000000;0
6129;-742312.925000000745058;-1043067.717000000178814;0
6211;-742317.785000000149012;-1043063.318999998271465;0
4465;-742180.250000000000000;-1042584.370000001043081;0
5704;-743417.484999999403954;-1043635.530999999493361;0
5756;-743426.113000001758337;-1043680.102000001817942;0
6504;-741755.193999998271465;-1044619.083000000566244;0
4628;-742619.598000001162291;-1042609.989999998360872;0
6155;-742315.557999998331070;-1043068.140999998897314;0
6274;-742318.392999999225140;-1043016.747000001370907;0
6832;-741552.254000000655651;-1044899.227000001817942;0
6134;-742309.011999998241663;-1043060.703000001609325;0
2545;-741723.000000000000000;-1044265.000000000000000;0
4610;-742548.888000000268221;-1042601.879000000655651;0
6154;-742316.324000000953674;-1043069.546000000089407;0
4893;-742637.320000000298023;-1042818.600999999791384;0
5591;-743421.353999998420477;-1043679.738000001758337;0
4201;-742269.000000000000000;-1043651.563000001013279;0
4958;-742349.620000001043081;-1043004.539999999105930;0
6356;-741962.699999999254942;-1042712.320000000298023;0
4810;-743058.420000001788139;-1042810.050000000745058;0
5695;-743417.217999998480082;-1043638.749000001698732;0
5002;-742561.190000001341105;-1042977.401999998837709;0
5015;-742575.741000000387430;-1043008.607999999076128;0
4730;-742831.050000000745058;-1042696.600000001490116;0
8259;-742072.089999999850988;-1042687.219999998807907;0
