OID_;X;Y;TEMPERATURE
3614;-744984.548999998718500;-1042283.640999998897314;0
110;-744127.000000000000000;-1042724.000000000000000;3
3019;-744463.447999998927116;-1042784.646000001579523;0
3568;-744718.817999999970198;-1042588.614999998360872;0
3692;-744525.876499999314547;-1042540.534000001847744;0
3580;-744924.973999999463558;-1042593.699999999254942;0
2605;-745393.842999998480082;-1042860.796000000089407;0
5975;-745052.346999999135733;-1042674.673000000417233;0
118;-745135.000000000000000;-1042687.000000000000000;0
3542;-744575.274000000208616;-1042656.160000000149012;0
2696;-743477.489999998360872;-1042038.000000000000000;0
2520;-741847.000000000000000;-1045324.000000000000000;0
7011;-742831.309999998658895;-1044257.245000001043081;0
1760;-741162.000000000000000;-1044101.000000000000000;0
7780;-743046.243000000715256;-1045844.168999999761581;0
4070;-742925.285000000149012;-1043783.565000001341105;0
6946;-742974.765000000596046;-1043929.388000000268221;0
8079;-742021.839999999850988;-1045292.179999999701977;0
6874;-741789.789999999105930;-1045272.100000001490116;0
1584;-742368.000000000000000;-1044717.000000000000000;0
7279;-742799.399999998509884;-1044679.829999998211861;0
6726;-742476.517999999225140;-1044410.600000001490116;0
4163;-742487.695000000298023;-1044138.535000000149012;0
696;-742077.000000000000000;-1042913.000000000000000;0
7215;-742484.320000000298023;-1044546.620000001043081;0
7171;-742671.969999998807907;-1044508.219999998807907;0
3109;-743754.403999999165535;-1042652.872000001370907;0
6930;-742046.030000001192093;-1045191.489999998360872;0
7259;-742935.280000001192093;-1044869.829999998211861;0
7187;-742595.019999999552965;-1044739.962000001221895;0
885;-741739.000000000000000;-1042777.000000000000000;0
7246;-742736.730000000447035;-1044825.399999998509884;0
2131;-743073.000000000000000;-1045134.000000000000000;0
2433;-742514.000000000000000;-1045081.000000000000000;0
1524;-741710.000000000000000;-1043844.000000000000000;0
744;-741666.000000000000000;-1042994.000000000000000;0
5307;-743082.182000000029802;-1043190.162000000476837;0
7;-743479.000000000000000;-1042567.000000000000000;0
7705;-742283.471999999135733;-1044316.339999999850988;0
1487;-741117.000000000000000;-1044216.000000000000000;0
2255;-743181.000000000000000;-1045372.000000000000000;0
4237;-742425.385000001639128;-1043517.421000000089407;0
3207;-743687.458999998867512;-1042502.859000001102686;0
2009;-743221.000000000000000;-1044770.000000000000000;0
5204;-743246.423999998718500;-1043308.298999998718500;0
1128;-741655.000000000000000;-1044448.000000000000000;0
2016;-743230.000000000000000;-1044873.000000000000000;0
7514;-742304.866000000387430;-1044375.124000001698732;0
2151;-742827.000000000000000;-1045047.000000000000000;0
7350;-742556.390000000596046;-1045185.980000000447035;0
2070;-742993.000000000000000;-1044723.000000000000000;0
2160;-742849.000000000000000;-1045147.000000000000000;0
2021;-743281.000000000000000;-1044948.000000000000000;0
7411;-743529.510000001639128;-1045393.140000000596046;0
3839;-743112.140000000596046;-1042558.280000001192093;0
2291;-742850.000000000000000;-1045401.000000000000000;0
351;-742509.000000000000000;-1043739.000000000000000;0
1772;-741277.000000000000000;-1044012.000000000000000;0
731;-741925.000000000000000;-1042997.000000000000000;0
4135;-742747.719999998807907;-1044085.660000000149012;0
1182;-741915.000000000000000;-1044252.000000000000000;0
2242;-743321.000000000000000;-1045313.000000000000000;0
2326;-742523.000000000000000;-1045498.000000000000000;0
8;-743496.000000000000000;-1042539.000000000000000;0
3869;-742407.539999999105930;-1042414.850000001490116;0
7721;-742941.157000001519918;-1044215.368000000715256;0
4455;-741714.589000001549721;-1042663.557000000029802;0
2081;-742551.000000000000000;-1044621.000000000000000;0
17;-743587.000000000000000;-1042394.000000000000000;0
1449;-741533.000000000000000;-1044684.000000000000000;0
284;-743022.000000000000000;-1043758.000000000000000;0
1854;-742675.000000000000000;-1044271.000000000000000;0
1521;-741808.000000000000000;-1043917.000000000000000;0
4145;-742687.109999999403954;-1043837.125000000000000;0
2467;-743434.000000000000000;-1044742.000000000000000;0
2189;-743472.000000000000000;-1045183.000000000000000;0
226;-742879.000000000000000;-1043516.000000000000000;0
1821;-742995.000000000000000;-1044239.000000000000000;0
6649;-741731.100000001490116;-1044094.850000001490116;0
1596;-742323.000000000000000;-1045037.000000000000000;0
7649;-742319.399999998509884;-1045429.557000000029802;0
7966;-741489.800000000745058;-1044356.219999998807907;0
4331;-742391.967999998480082;-1043310.539000000804663;0
2321;-742679.000000000000000;-1045480.000000000000000;0
2276;-742865.000000000000000;-1045649.000000000000000;0
1929;-743440.000000000000000;-1044410.000000000000000;0
2185;-743216.000000000000000;-1045130.000000000000000;0
4062;-742830.460000000894070;-1043654.920000001788139;0
2135;-743006.000000000000000;-1045119.000000000000000;0
1816;-743070.000000000000000;-1044444.000000000000000;0
1926;-743301.000000000000000;-1044321.000000000000000;0
3154;-743984.818999998271465;-1042573.844999998807907;0
2748;-743933.984000001102686;-1043445.734000001102686;0
4097;-742806.000000000000000;-1043874.793999999761581;0
2007;-743231.000000000000000;-1044741.000000000000000;0
3842;-743141.300000000745058;-1042637.030000001192093;0
7046;-743398.329999998211861;-1044186.289999999105930;0
6713;-742278.905999999493361;-1044887.284000001847744;37
1142;-741437.000000000000000;-1044466.000000000000000;0
465;-741728.000000000000000;-1043309.000000000000000;0
930;-744068.000000000000000;-1043405.000000000000000;0
1372;-742118.000000000000000;-1044815.000000000000000;0
1509;-741741.000000000000000;-1044196.000000000000000;0
538;-742113.000000000000000;-1043652.000000000000000;0
4136;-742726.225000001490116;-1044089.829999998211861;0
983;-741953.000000000000000;-1044414.000000000000000;0
7305;-742795.050000000745058;-1045069.809999998658895;0
514;-742119.000000000000000;-1043141.000000000000000;0
1610;-742374.000000000000000;-1044447.000000000000000;0
7151;-742842.649000000208616;-1044545.307000000029802;0
1251;-742091.000000000000000;-1044690.000000000000000;0
6728;-742547.451000001281500;-1044392.396000001579523;0
2373;-742469.000000000000000;-1045517.000000000000000;0
3097;-743920.339999999850988;-1042769.188999999314547;0
4463;-742198.989999998360872;-1042569.030000001192093;0
1761;-741194.000000000000000;-1044104.000000000000000;0
673;-742467.000000000000000;-1043230.000000000000000;0
1095;-741452.000000000000000;-1044553.000000000000000;0
6708;-742268.296999998390675;-1044748.438000001013279;0
7961;-741602.260000001639128;-1044314.350000001490116;0
2036;-743404.000000000000000;-1044803.000000000000000;0
1438;-741809.000000000000000;-1044350.000000000000000;0
7141;-742895.629999998956919;-1044470.910000000149012;0
7950;-741950.460000000894070;-1044150.710000000894070;0
1288;-742189.000000000000000;-1044543.000000000000000;0
2209;-743309.000000000000000;-1045217.000000000000000;0
973;-741908.000000000000000;-1044547.000000000000000;0
1491;-741057.000000000000000;-1044333.000000000000000;0
1014;-742097.000000000000000;-1044586.000000000000000;0
5436;-744076.484000001102686;-1043296.519999999552965;0
1287;-742217.000000000000000;-1044486.000000000000000;0
1386;-742158.000000000000000;-1044976.000000000000000;0
1219;-742137.000000000000000;-1044315.000000000000000;0
786;-741706.000000000000000;-1042606.000000000000000;0
3373;-743814.043000001460314;-1043018.168000001460314;0
7656;-742290.328000001609325;-1045294.499000001698732;0
4826;-743043.850000001490116;-1042979.600000001490116;0
1267;-742040.000000000000000;-1044999.000000000000000;0
1418;-741620.000000000000000;-1044458.000000000000000;0
8285;-742232.780000001192093;-1042821.149999998509884;0
3921;-743909.208999998867512;-1043541.574000000953674;0
1413;-741631.000000000000000;-1044621.000000000000000;0
4847;-742981.100000001490116;-1042831.059999998658895;0
6353;-741893.070000000298023;-1042697.059999998658895;0
2086;-742404.000000000000000;-1044796.000000000000000;0
4473;-741822.449999999254942;-1042676.699000000953674;0
4962;-742387.429999999701977;-1043028.129999998956919;0
722;-742139.000000000000000;-1043009.000000000000000;0
3066;-744075.627000000327826;-1042883.837000001221895;0
2502;-742750.000000000000000;-1045457.000000000000000;0
2486;-741289.250000000000000;-1044848.829999998211861;0
4504;-742387.329999998211861;-1042714.820000000298023;0
1271;-742240.000000000000000;-1044521.000000000000000;0
3752;-743213.949999999254942;-1042902.719999998807907;0
1032;-741970.000000000000000;-1044813.000000000000000;0
7169;-742693.079999998211861;-1044394.177999999374151;0
1620;-742439.000000000000000;-1044323.000000000000000;0
617;-742179.000000000000000;-1043272.000000000000000;0
2892;-744005.317000001668930;-1043204.537000000476837;0
1955;-743374.000000000000000;-1044515.000000000000000;0
3324;-743935.892000000923872;-1042963.829999998211861;0
624;-742241.000000000000000;-1043343.000000000000000;0
6722;-742357.717000000178814;-1044705.708000000566244;0
1871;-743440.000000000000000;-1044260.000000000000000;0
1189;-741786.000000000000000;-1044043.000000000000000;0
2334;-742872.000000000000000;-1045519.000000000000000;0
2397;-742181.000000000000000;-1045368.000000000000000;0
4177;-742387.940999999642372;-1044182.254999998956919;0
2544;-741753.000000000000000;-1044252.000000000000000;0
5086;-742856.307999998331070;-1043239.488000001758337;0
4334;-742384.170000001788139;-1043468.820000000298023;0
1924;-743359.000000000000000;-1044320.000000000000000;0
5144;-743052.642000000923872;-1043488.940000001341105;0
6486;-741772.072999998927116;-1044516.256000000983477;0
709;-741861.000000000000000;-1042862.000000000000000;0
8044;-742176.640000000596046;-1044778.420000001788139;0
1542;-742043.000000000000000;-1044057.000000000000000;0
6657;-741565.760000001639128;-1044156.980000000447035;0
7798;-743468.929999999701977;-1045091.809999998658895;0
5270;-742989.153999999165535;-1043210.684999998658895;0
1226;-742204.000000000000000;-1044247.000000000000000;0
2262;-742999.000000000000000;-1045686.000000000000000;0
4538;-742291.464000001549721;-1042734.344000000506639;0
6805;-741109.710000000894070;-1044689.170000001788139;0
611;-742037.000000000000000;-1043267.000000000000000;0
1041;-741893.000000000000000;-1044653.000000000000000;0
1462;-741464.000000000000000;-1044225.000000000000000;0
227;-742846.000000000000000;-1043520.000000000000000;0
6673;-742244.289999999105930;-1044153.350000001490116;0
4056;-743125.315000001341105;-1043671.969999998807907;0
941;-742098.000000000000000;-1043132.000000000000000;0
1181;-741920.000000000000000;-1044230.000000000000000;0
4035;-743274.690000001341105;-1043779.739999998360872;0
6395;-742057.429999999701977;-1042500.809999998658895;0
3309;-743830.328000001609325;-1042834.535000000149012;0
4876;-742826.449999999254942;-1042944.910000000149012;0
1705;-741257.219999998807907;-1044695.690000001341105;0
6148;-742313.410999998450279;-1043065.666999999433756;0
594;-741896.000000000000000;-1043296.000000000000000;0
6448;-744017.179999999701977;-1043123.899999998509884;0
5081;-742917.046000000089407;-1043356.515999998897314;0
5165;-743191.168000001460314;-1043398.304000001400709;0
5251;-743317.296000000089407;-1043180.037999998778105;0
4966;-742377.289999999105930;-1043071.030000001192093;0
7746;-742234.789999999105930;-1045549.890000000596046;0
8150;-743304.219999998807907;-1043217.539999999105930;0
2503;-742753.000000000000000;-1045484.000000000000000;0
1351;-741850.000000000000000;-1044830.000000000000000;0
170;-743440.000000000000000;-1043364.000000000000000;0
1162;-741087.000000000000000;-1044511.000000000000000;0
1994;-743483.000000000000000;-1045010.000000000000000;0
1538;-741948.000000000000000;-1043973.000000000000000;0
2490;-742063.000000000000000;-1044273.000000000000000;0
7004;-743069.289999999105930;-1044326.469999998807907;0
4211;-742193.190000001341105;-1043565.660000000149012;0
1720;-741436.000000000000000;-1044862.000000000000000;0
6251;-742377.396999999880791;-1043042.284000001847744;0
8271;-742030.649999998509884;-1042720.129999998956919;0
4764;-742839.835999999195337;-1042859.412999998778105;0
4120;-742715.179999999701977;-1043974.089999999850988;0
1359;-742000.000000000000000;-1044897.000000000000000;0
5243;-743357.622000001370907;-1043407.258999999612570;0
6313;-743936.949999999254942;-1042594.780000001192093;0
995;-741906.000000000000000;-1044434.000000000000000;0
6565;-741325.239999998360872;-1044209.190000001341105;0
1496;-741253.000000000000000;-1044321.000000000000000;0
1947;-743286.000000000000000;-1044465.000000000000000;0
2226;-743057.000000000000000;-1045470.000000000000000;0
6003;-742038.201000001281500;-1043299.010999999940395;0
1312;-741659.000000000000000;-1044848.000000000000000;0
4797;-743049.140999998897314;-1042689.576999999582767;0
4922;-742443.129999998956919;-1042886.510000001639128;0
4001;-743418.500000000000000;-1044051.739000000059605;0
559;-742191.000000000000000;-1043693.000000000000000;0
1017;-742167.000000000000000;-1044603.000000000000000;0
401;-742324.000000000000000;-1043907.000000000000000;0
6819;-741194.784000001847744;-1044802.818999998271465;0
5280;-743058.660000000149012;-1043362.201999999582767;0
6855;-741501.394999999552965;-1045027.784000001847744;0
6852;-741571.519999999552965;-1045065.932999998331070;0
4048;-743218.050000000745058;-1043961.320000000298023;0
3407;-743772.385999999940395;-1043008.706999998539686;0
4229;-742146.929000001400709;-1043334.585000000894070;0
1295;-742082.000000000000000;-1044456.000000000000000;0
1600;-742418.000000000000000;-1044944.000000000000000;0
4030;-743133.280000001192093;-1043791.552000001072884;0
1983;-743474.000000000000000;-1044709.000000000000000;0
7030;-743291.859999999403954;-1044128.440000001341105;0
4697;-742675.329999998211861;-1042689.179999999701977;0
1465;-741870.000000000000000;-1044016.000000000000000;0
4524;-742683.789999999105930;-1042823.579999998211861;0
4939;-742448.866999998688698;-1043072.822999998927116;0
7025;-743199.914999999105930;-1044070.515000000596046;0
1121;-741765.000000000000000;-1044444.000000000000000;0
2268;-742911.000000000000000;-1045632.000000000000000;0
496;-741768.000000000000000;-1043197.000000000000000;0
1322;-741906.000000000000000;-1044975.000000000000000;0
585;-741960.000000000000000;-1043413.000000000000000;0
4699;-742676.469999998807907;-1042731.760000001639128;0
270;-743230.000000000000000;-1043721.000000000000000;0
4125;-742857.695000000298023;-1044110.460000000894070;0
1433;-741895.000000000000000;-1044328.000000000000000;0
1264;-742059.000000000000000;-1044942.000000000000000;0
7729;-742623.480999998748302;-1044601.217000000178814;0
3998;-743432.704999998211861;-1043914.274999998509884;0
5955;-742960.732999999076128;-1043520.888999998569489;0
3964;-743352.359999999403954;-1043540.780000001192093;0
1827;-743033.000000000000000;-1044080.000000000000000;0
6181;-742318.164999999105930;-1043068.541999999433756;0
5026;-742631.168999999761581;-1042903.938999999314547;0
8274;-742065.089999999850988;-1042742.109999999403954;0
2224;-743051.000000000000000;-1045450.000000000000000;0
6458;-743360.644999999552965;-1043919.311999998986721;0
5778;-742917.131000000983477;-1043419.723000001162291;0
1808;-743187.000000000000000;-1044539.000000000000000;0
4596;-742597.181000001728535;-1042670.653000000864267;0
6114;-742234.250000000000000;-1043361.324999999254942;0
392;-742418.000000000000000;-1043843.000000000000000;0
690;-742306.000000000000000;-1043081.000000000000000;0
6145;-742315.708000000566244;-1043069.881999999284744;0
4159;-742455.734999999403954;-1043898.035000000149012;0
725;-741983.000000000000000;-1042939.000000000000000;0
1218;-742120.000000000000000;-1044309.000000000000000;0
3314;-743758.675999999046326;-1042905.688999999314547;0
4704;-742680.000000000000000;-1042776.750000000000000;0
6160;-742311.730999998748302;-1043061.116000000387430;0
1911;-743449.000000000000000;-1044447.000000000000000;0
220;-742969.000000000000000;-1043530.000000000000000;0
2330;-742403.000000000000000;-1045511.000000000000000;0
2045;-743418.000000000000000;-1044961.000000000000000;0
7159;-743013.767000000923872;-1044544.160999998450279;0
2476;-741234.809999998658895;-1044506.690000001341105;0
3811;-743244.620000001043081;-1042809.420000001788139;0
877;-741951.000000000000000;-1042610.000000000000000;0
6193;-742316.486000001430511;-1043063.991000000387430;0
7017;-742571.059999998658895;-1044267.640000000596046;0
3265;-743560.760000001639128;-1042741.429000001400709;0
845;-742126.000000000000000;-1042505.000000000000000;0
5957;-742962.627000000327826;-1043510.905000001192093;0
6908;-741713.539999999105930;-1045085.160000000149012;0
672;-742484.000000000000000;-1043226.000000000000000;0
3746;-743261.420000001788139;-1042982.839999999850988;0
1700;-741406.000000000000000;-1044677.000000000000000;0
889;-742000.000000000000000;-1042770.000000000000000;0
1349;-741824.000000000000000;-1044818.000000000000000;0
2574;-742481.000000000000000;-1045423.000000000000000;0
4721;-742883.219999998807907;-1042605.010000001639128;0
3950;-743426.829999998211861;-1043556.070000000298023;0
1675;-741059.000000000000000;-1044754.000000000000000;0
345;-742559.000000000000000;-1043826.000000000000000;0
4923;-742431.019999999552965;-1042882.210000000894070;0
4691;-742693.760000001639128;-1042596.969999998807907;0
6278;-742305.421999998390675;-1043028.918000001460314;0
4952;-742318.899999998509884;-1042915.589999999850988;0
4518;-742623.960000000894070;-1042786.719999998807907;0
539;-742127.000000000000000;-1043824.000000000000000;0
1651;-741374.000000000000000;-1044519.000000000000000;0
1160;-741114.859999999403954;-1044508.120000001043081;0
4138;-742883.587000001221895;-1043997.287999998778105;0
1961;-743397.000000000000000;-1044642.000000000000000;0
3949;-743420.780000001192093;-1043527.820000000298023;0
3792;-743110.019999999552965;-1042846.530000001192093;0
31;-743485.000000000000000;-1042645.000000000000000;0
4612;-742515.302000001072884;-1042595.046999998390675;0
1112;-741189.050000000745058;-1044602.469999998807907;0
4657;-742806.021999999880791;-1042442.679999999701977;0
6766;-741193.449999999254942;-1044424.320000000298023;0
5943;-742064.651000000536442;-1043693.136999998241663;0
5216;-743284.217999998480082;-1043325.638999998569489;0
553;-742251.000000000000000;-1043741.000000000000000;0
1424;-742134.000000000000000;-1044171.000000000000000;0
273;-743381.000000000000000;-1043820.000000000000000;0
3356;-743953.732000000774860;-1043037.083000000566244;0
1726;-741516.000000000000000;-1045120.000000000000000;0
1050;-741785.000000000000000;-1044952.000000000000000;0
4332;-742410.359000001102686;-1043282.916000001132488;0
4124;-742751.265000000596046;-1043878.414999999105930;0
1155;-741208.000000000000000;-1044484.000000000000000;0
4665;-742824.410000000149012;-1042592.260000001639128;0
507;-741953.000000000000000;-1043148.000000000000000;0
6226;-742320.660999998450279;-1043065.366999998688698;0
2347;-742597.000000000000000;-1045567.000000000000000;0
350;-742505.000000000000000;-1043757.000000000000000;0
5755;-743415.670000001788139;-1043702.254000000655651;0
3808;-742987.050000000745058;-1042925.350000001490116;0
4047;-743210.230000000447035;-1043992.289999999105930;0
4613;-742506.557000000029802;-1042597.938000001013279;0
4837;-742979.105999998748302;-1042672.627999998629093;0
6432;-742029.997999999672174;-1043511.272999998182058;0
1446;-741545.000000000000000;-1044774.000000000000000;0
5302;-743090.423999998718500;-1043070.048999998718500;0
892;-742946.000000000000000;-1042607.000000000000000;0
2034;-743468.000000000000000;-1044800.000000000000000;0
4507;-742472.469999998807907;-1042720.199999999254942;0
4717;-742914.300000000745058;-1042625.489999998360872;0
6370;-741968.780000001192093;-1042685.250000000000000;0
5646;-743428.978999998420477;-1043693.493000000715256;0
4973;-742480.098000001162291;-1043031.443999998271465;0
1330;-741817.000000000000000;-1044709.000000000000000;0
4716;-742893.160000000149012;-1042622.780000001192093;0
4895;-742596.936999998986721;-1042829.168000001460314;0
555;-742230.000000000000000;-1043726.000000000000000;0
7148;-742828.445000000298023;-1044472.094999998807907;0
2246;-743218.000000000000000;-1045379.000000000000000;0
3279;-743638.815999999642372;-1042804.333999998867512;0
1350;-741814.000000000000000;-1044844.000000000000000;0
3982;-743325.135000001639128;-1043857.684999998658895;0
6249;-742373.554999999701977;-1043049.822000000625849;0
4978;-742491.822999998927116;-1043028.688000001013279;0
4564;-742452.267000000923872;-1042534.980999998748302;0
4667;-742823.039999999105930;-1042631.620000001043081;0
7678;-742388.550999999046326;-1045109.184000000357628;0
4818;-742949.140000000596046;-1042791.660000000149012;0
6835;-741618.964000001549721;-1044934.515000000596046;0
5322;-743060.379999998956919;-1043029.589999999850988;0
5065;-742796.800999999046326;-1043254.010000001639128;0
572;-742083.000000000000000;-1043561.000000000000000;0
1026;-741986.000000000000000;-1044631.000000000000000;0
503;-741879.000000000000000;-1043158.000000000000000;0
1662;-741451.000000000000000;-1044403.000000000000000;0
7006;-742995.760000001639128;-1043976.245000001043081;0
1333;-741781.000000000000000;-1044777.000000000000000;0
4081;-742828.035000000149012;-1043754.850000001490116;0
4459;-742274.829999998211861;-1042644.269999999552965;0
4078;-742842.960000000894070;-1043832.824999999254942;0
202;-743240.000000000000000;-1043597.000000000000000;0
4427;-742190.519999999552965;-1043099.440000001341105;0
5669;-743414.997999999672174;-1043713.431000001728535;0
1263;-742048.000000000000000;-1044929.000000000000000;0
5578;-743409.534000001847744;-1043632.701000001281500;0
4252;-742124.022999998182058;-1043390.519000001251698;0
5746;-743415.399000000208616;-1043698.644000001251698;0
4429;-742222.260000001639128;-1043102.250000000000000;0
304;-742868.000000000000000;-1044122.000000000000000;0
5244;-743361.021000001579523;-1043374.999000001698732;0
6159;-742312.495999999344349;-1043062.521000001579523;0
4950;-742354.289999999105930;-1042955.670000001788139;0
4851;-742991.500000000000000;-1042818.243000000715256;0
1008;-741962.000000000000000;-1044568.000000000000000;0
5961;-742431.225000001490116;-1044003.574999999254942;0
1966;-743413.000000000000000;-1044746.000000000000000;0
5688;-743415.267000000923872;-1043631.945000000298023;0
3267;-743587.203000001609325;-1042710.840999998152256;0
3829;-742992.250000000000000;-1042635.140000000596046;0
5507;-743426.703000001609325;-1043656.230999998748302;0
5419;-742434.690000001341105;-1042846.280000001192093;0
4832;-743039.079999998211861;-1042840.850000001490116;0
3263;-743570.528999999165535;-1042712.653999999165535;0
5710;-743421.574999999254942;-1043640.598000001162291;0
6339;-742245.460000000894070;-1042835.780000001192093;0
4735;-742686.059999998658895;-1042669.260000001639128;0
6171;-742310.780999999493361;-1043057.971000000834465;0
528;-742187.000000000000000;-1043838.000000000000000;0
4222;-742187.096999999135733;-1043485.890000000596046;0
833;-742050.000000000000000;-1042573.000000000000000;0
6280;-742306.918999999761581;-1043038.083000000566244;0
2558;-741286.000000000000000;-1044387.000000000000000;0
2475;-743411.000000000000000;-1044901.000000000000000;0
6224;-742315.320000000298023;-1043057.335000000894070;0
3379;-743806.728000000119209;-1042934.574999999254942;0
7201;-742571.190000001341105;-1044939.320000000298023;0
3942;-743420.800000000745058;-1043492.339999999850988;0
5677;-743405.545000001788139;-1043716.931000001728535;0
7166;-742741.322000000625849;-1044519.208999998867512;0
301;-742613.000000000000000;-1043903.000000000000000;0
1942;-743283.000000000000000;-1044370.000000000000000;0
3988;-743309.704999998211861;-1044008.570000000298023;0
2157;-742789.000000000000000;-1045161.000000000000000;0
4633;-742625.931000001728535;-1042639.918999999761581;0
5582;-743410.127000000327826;-1043640.197999998927116;0
4775;-742898.375999998301268;-1042802.914000000804663;0
6358;-741993.554999999701977;-1042717.964000001549721;0
1303;-741865.000000000000000;-1044692.000000000000000;0
954;-742231.000000000000000;-1043024.000000000000000;0
3794;-743091.015000000596046;-1042800.471999999135733;0
4753;-742764.600000001490116;-1042761.899999998509884;0
4598;-742602.175000000745058;-1042688.015999998897314;0
6765;-741163.449999999254942;-1044427.199999999254942;0
5413;-742651.872000001370907;-1042662.627999998629093;0
7681;-742501.629999998956919;-1045152.870000001043081;0
5456;-742761.041000001132488;-1043254.350999999791384;0
1770;-741270.000000000000000;-1044086.000000000000000;0
1486;-741150.000000000000000;-1044219.000000000000000;0
6219;-742319.168999999761581;-1043064.293999999761581;0
4577;-742376.686000000685453;-1042590.309999998658895;0
6259;-742383.170000001788139;-1043030.809000000357628;0
6271;-742329.282000001519918;-1043017.853999998420477;0
5663;-743422.087999999523163;-1043710.807999998331070;0
5306;-743103.326999999582767;-1043193.129000000655651;0
732;-741860.000000000000000;-1043003.000000000000000;0
3948;-743409.451999999582767;-1043515.662000000476837;0
6832;-741552.254000000655651;-1044899.227000001817942;0
3834;-743079.190000001341105;-1042579.899999998509884;0
2057;-742787.000000000000000;-1044365.000000000000000;0
6134;-742309.011999998241663;-1043060.703000001609325;0
5360;-742453.188999999314547;-1042938.521999999880791;0
6676;-742250.239999998360872;-1044174.719999998807907;0
4956;-742383.579999998211861;-1043007.739999998360872;0
5036;-742666.855999998748302;-1042990.710000000894070;0
6403;-741971.879999998956919;-1042504.289999999105930;0
5002;-742561.190000001341105;-1042977.401999998837709;0
6274;-742318.392999999225140;-1043016.747000001370907;0
1328;-742037.000000000000000;-1045043.000000000000000;0
5724;-743422.230999998748302;-1043632.715999998152256;0
4203;-742299.442000001668930;-1043608.692000001668930;0
4779;-742917.822999998927116;-1042727.385000001639128;0
635;-742143.000000000000000;-1043317.000000000000000;0
3952;-743407.521999999880791;-1043538.500999998301268;0
743;-741682.000000000000000;-1043020.000000000000000;0
3802;-743068.190000001341105;-1042879.710000000894070;0
7085;-743327.129999998956919;-1044533.960000000894070;0
4755;-742734.960000000894070;-1042778.019999999552965;0
7351;-742529.339999999850988;-1045181.269999999552965;0
4936;-742454.684000000357628;-1042685.620999999344349;0
6997;-743109.160000000149012;-1044453.600000001490116;0
3414;-743757.269999999552965;-1043051.379999998956919;0
1127;-741700.000000000000000;-1044440.000000000000000;0
5674;-743409.089999999850988;-1043715.618000000715256;0
4225;-742115.607999999076128;-1043452.125000000000000;0
3971;-743206.815000001341105;-1043721.065000001341105;0
6132;-742310.590999998152256;-1043063.552999999374151;0
4114;-742764.195000000298023;-1044131.760000001639128;0
5022;-742578.440000001341105;-1042849.350000001490116;0
1396;-741798.000000000000000;-1044263.000000000000000;0
5941;-742044.835000000894070;-1043561.903999999165535;0
4926;-742452.660000000149012;-1042896.190000001341105;0
314;-742585.000000000000000;-1044184.000000000000000;0
4679;-742774.199999999254942;-1042819.160000000149012;0
4809;-743081.589999999850988;-1042799.800000000745058;0
4762;-742854.192000001668930;-1042825.931000001728535;0
4578;-742381.817000001668930;-1042594.177999999374151;0
4466;-742177.620000001043081;-1042567.899999998509884;0
4628;-742619.598000001162291;-1042609.989999998360872;0
5158;-743148.138999998569489;-1043320.254999998956919;0
8265;-742197.820000000298023;-1042704.260000001639128;0
4817;-742967.460000000894070;-1042782.559999998658895;0
7299;-743117.530000001192093;-1045145.859999999403954;0
1573;-742358.000000000000000;-1044452.000000000000000;0
1141;-741454.000000000000000;-1044453.000000000000000;0
6149;-742312.646000001579523;-1043064.261999998241663;0
