OID_;X;Y;TEMPERATURE
3919;-743904.947000000625849;-1043493.929999999701977;0
5785;-743436.010000001639128;-1042105.550000000745058;0
3032;-744506.962000001221895;-1042717.704999998211861;0
3111;-743727.034000001847744;-1042625.182999998331070;0
7409;-743521.629999998956919;-1045356.570000000298023;0
5267;-743190.021999999880791;-1043149.807000000029802;0
2265;-742972.000000000000000;-1045774.000000000000000;0
23;-743544.000000000000000;-1042505.000000000000000;0
2329;-742432.000000000000000;-1045508.000000000000000;0
5405;-744043.826000001281500;-1042674.686000000685453;0
3752;-743213.949999999254942;-1042902.719999998807907;0
6;-743464.000000000000000;-1042594.000000000000000;0
6822;-741283.870000001043081;-1044793.059999998658895;0
3812;-743231.179999999701977;-1042815.199999999254942;0
3239;-744159.614000000059605;-1042651.675000000745058;0
1739;-741831.780000001192093;-1045213.809999998658895;0
6825;-741380.010000001639128;-1044780.089999999850988;0
3378;-743818.598999999463558;-1042922.491999998688698;0
5389;-744380.177000001072884;-1042796.489000000059605;0
2516;-742500.000000000000000;-1044414.000000000000000;0
4335;-742398.230000000447035;-1043445.760000001639128;0
3093;-743925.421999998390675;-1042803.127000000327826;0
7143;-742850.414999999105930;-1044473.449999999254942;0
3287;-743711.173999998718500;-1042886.515999998897314;0
7004;-743069.289999999105930;-1044326.469999998807907;0
1527;-741676.000000000000000;-1043775.000000000000000;0
7261;-742970.839999999850988;-1044878.739999998360872;0
1286;-742221.460000000894070;-1044465.969999998807907;0
5295;-743047.995000001043081;-1043185.530000001192093;0
330;-742659.000000000000000;-1044043.000000000000000;0
5272;-743000.013999998569489;-1043245.364000000059605;0
6792;-741101.151999998837709;-1044754.271000001579523;0
1368;-741998.000000000000000;-1044779.000000000000000;0
8284;-742219.410000000149012;-1042809.500000000000000;0
557;-742213.000000000000000;-1043713.000000000000000;0
7704;-742256.021000001579523;-1044313.592999998480082;0
4002;-743397.818999998271465;-1044054.317999999970198;0
6843;-741569.070000000298023;-1044975.261999998241663;0
2894;-743960.129000000655651;-1043216.409000001847744;0
1765;-741159.000000000000000;-1044178.000000000000000;0
785;-741702.000000000000000;-1042622.000000000000000;0
5156;-743160.188999999314547;-1043355.291999999433756;0
884;-741771.000000000000000;-1042776.000000000000000;0
1436;-741869.000000000000000;-1044323.000000000000000;0
1428;-742028.000000000000000;-1044235.000000000000000;0
1940;-743286.000000000000000;-1044339.000000000000000;0
4235;-742390.041999999433756;-1043492.094999998807907;0
6610;-741694.364999998360872;-1043961.170000001788139;0
1701;-741378.000000000000000;-1044678.000000000000000;0
4457;-741664.109999999403954;-1042615.550000000745058;0
4224;-742139.756000000983477;-1043462.488000001758337;0
1461;-741473.000000000000000;-1044266.000000000000000;0
6008;-743902.607000000774860;-1042749.771000001579523;0
6499;-741707.811000000685453;-1044907.068999998271465;0
3407;-743772.385999999940395;-1043008.706999998539686;0
3171;-743937.730000000447035;-1042607.039999999105930;0
504;-741937.000000000000000;-1043164.000000000000000;0
5118;-742835.168000001460314;-1043315.074000000953674;0
2084;-742447.000000000000000;-1044797.000000000000000;0
7153;-742889.646999999880791;-1044547.438000001013279;0
2550;-741576.000000000000000;-1044342.000000000000000;0
2388;-742096.000000000000000;-1045422.000000000000000;0
7542;-742623.890000000596046;-1045372.899999998509884;0
2479;-741247.800000000745058;-1044609.379999998956919;0
2019;-743264.000000000000000;-1044921.000000000000000;0
514;-742119.000000000000000;-1043141.000000000000000;0
4047;-743210.230000000447035;-1043992.289999999105930;0
3268;-743594.046999998390675;-1042721.412999998778105;0
7009;-742877.537000000476837;-1044242.370000001043081;0
1867;-743474.000000000000000;-1044257.000000000000000;0
4075;-742947.934999998658895;-1043903.649999998509884;0
2140;-742924.000000000000000;-1045088.000000000000000;0
4333;-742428.420000001788139;-1043255.609999999403954;0
3365;-743840.598999999463558;-1043023.565000001341105;0
2232;-743488.000000000000000;-1045234.000000000000000;0
826;-742191.000000000000000;-1042616.000000000000000;0
1651;-741374.000000000000000;-1044519.000000000000000;0
4218;-742263.436999998986721;-1043615.100999999791384;0
3211;-743651.409000001847744;-1042483.458999998867512;0
1228;-742220.539999999105930;-1044250.829999998211861;0
202;-743240.000000000000000;-1043597.000000000000000;0
7000;-743096.190000001341105;-1044426.870000001043081;0
1533;-741832.000000000000000;-1043879.000000000000000;0
4083;-742820.771999999880791;-1043708.657000001519918;0
8078;-742024.710000000894070;-1045262.460000000894070;0
2079;-742688.000000000000000;-1044428.000000000000000;0
3790;-743140.809999998658895;-1042908.210000000894070;0
2061;-742681.000000000000000;-1044491.000000000000000;0
1615;-742367.000000000000000;-1044434.000000000000000;0
1318;-741838.000000000000000;-1044940.000000000000000;0
524;-742255.000000000000000;-1043913.000000000000000;0
6372;-741988.530000001192093;-1042699.339999999850988;0
2310;-742301.000000000000000;-1045537.000000000000000;0
1539;-741977.000000000000000;-1043997.000000000000000;0
1250;-742103.000000000000000;-1044672.000000000000000;0
2326;-742523.000000000000000;-1045498.000000000000000;0
3293;-743596.793000001460314;-1042814.440000001341105;0
3584;-744914.094999998807907;-1042552.403999999165535;0
2740;-744042.611999999731779;-1043335.940000001341105;0
3848;-743094.383999999612570;-1042505.245000001043081;0
987;-741814.000000000000000;-1044493.000000000000000;0
1510;-741764.000000000000000;-1044180.000000000000000;0
2488;-742083.000000000000000;-1044303.000000000000000;0
2051;-743434.000000000000000;-1045074.000000000000000;0
681;-742383.000000000000000;-1043170.000000000000000;0
542;-742367.629999998956919;-1043814.379999998956919;0
2474;-743439.000000000000000;-1044900.000000000000000;0
4069;-742920.684999998658895;-1043755.420000001788139;0
1333;-741781.000000000000000;-1044777.000000000000000;0
1983;-743474.000000000000000;-1044709.000000000000000;0
4515;-742607.100000001490116;-1042765.780000001192093;0
5792;-743363.984999999403954;-1043442.513999998569489;0
600;-741840.000000000000000;-1043212.000000000000000;0
380;-742501.000000000000000;-1043722.000000000000000;0
4340;-742473.662000000476837;-1043349.048999998718500;0
4023;-743246.635000001639128;-1043864.364999998360872;0
6127;-742314.456000000238419;-1043070.548999998718500;0
6511;-741291.670000001788139;-1044319.690000001341105;0
301;-742613.000000000000000;-1043903.000000000000000;0
4064;-742879.655000001192093;-1043647.420000001788139;0
1838;-743004.480000000447035;-1044216.030000001192093;0
6401;-741992.449999999254942;-1042503.609999999403954;0
2185;-743216.000000000000000;-1045130.000000000000000;0
2039;-743308.000000000000000;-1044808.000000000000000;0
2149;-742819.000000000000000;-1045024.000000000000000;0
223;-742920.000000000000000;-1043542.000000000000000;0
2294;-742754.000000000000000;-1045391.000000000000000;0
4139;-742859.625999998301268;-1044000.574999999254942;0
5003;-742589.811999998986721;-1042974.888999998569489;0
6720;-742286.954999998211861;-1044705.997999999672174;0
1136;-741520.000000000000000;-1044455.000000000000000;0
8060;-742295.719999998807907;-1045082.859999999403954;0
7723;-741757.929000001400709;-1044043.175000000745058;0
7048;-743392.429999999701977;-1044236.170000001788139;0
4122;-742732.074999999254942;-1043923.995000001043081;0
7218;-742534.100000001490116;-1044603.559999998658895;0
1243;-742122.000000000000000;-1044502.000000000000000;0
3767;-743033.910000000149012;-1042982.390000000596046;0
4999;-742534.149999998509884;-1042966.892999999225140;0
1517;-741964.000000000000000;-1044034.000000000000000;0
4257;-742056.467000000178814;-1043503.657999999821186;0
8047;-742167.649999998509884;-1044854.320000000298023;0
307;-742781.000000000000000;-1044143.000000000000000;0
7661;-742294.495999999344349;-1045349.482000000774860;0
710;-741829.000000000000000;-1042878.000000000000000;0
1474;-741604.000000000000000;-1044172.000000000000000;0
2075;-743114.000000000000000;-1044772.000000000000000;0
4070;-742925.285000000149012;-1043783.565000001341105;0
450;-741705.000000000000000;-1043312.000000000000000;0
7141;-742895.629999998956919;-1044470.910000000149012;0
2033;-743500.000000000000000;-1044798.000000000000000;0
4657;-742806.021999999880791;-1042442.679999999701977;0
4723;-742883.429999999701977;-1042644.829999998211861;0
2749;-743924.129999998956919;-1043464.359999999403954;0
2562;-741090.000000000000000;-1044404.000000000000000;0
6004;-742061.723000001162291;-1043300.859999999403954;0
2276;-742865.000000000000000;-1045649.000000000000000;0
735;-741910.000000000000000;-1043014.000000000000000;0
7006;-742995.760000001639128;-1043976.245000001043081;0
1982;-743408.000000000000000;-1044646.000000000000000;0
7281;-742801.859999999403954;-1044705.300000000745058;0
7247;-742774.480000000447035;-1044839.850000001490116;0
3989;-743307.815000001341105;-1044034.914999999105930;0
406;-742366.000000000000000;-1044171.000000000000000;0
4166;-742448.504999998956919;-1044046.885000001639128;0
4859;-742966.710000000894070;-1042996.302999999374151;0
90;-744040.000000000000000;-1043095.000000000000000;0
1151;-741279.000000000000000;-1044475.000000000000000;0
6696;-742332.717000000178814;-1044815.649999998509884;0
1829;-742968.539999999105930;-1044100.210000000894070;0
6688;-742383.146999999880791;-1045009.361000001430511;0
578;-742023.000000000000000;-1043464.000000000000000;0
6673;-742244.289999999105930;-1044153.350000001490116;0
1451;-741522.000000000000000;-1044602.000000000000000;0
4703;-742697.859000001102686;-1042783.011999998241663;0
4953;-742431.500999998301268;-1043027.399999998509884;0
1811;-743175.000000000000000;-1044525.000000000000000;0
744;-741666.000000000000000;-1042994.000000000000000;0
221;-742951.000000000000000;-1043544.000000000000000;0
398;-742372.000000000000000;-1043909.000000000000000;0
694;-742280.000000000000000;-1043043.000000000000000;0
1682;-741129.769999999552965;-1044685.559999998658895;0
4329;-742363.315000001341105;-1043352.173999998718500;0
5147;-743077.127000000327826;-1043433.221999999135733;0
3063;-744133.098999999463558;-1042851.478999998420477;0
7179;-742625.429000001400709;-1044622.710000000894070;0
1222;-742157.000000000000000;-1044266.000000000000000;0
4678;-742775.910000000149012;-1042839.929999999701977;0
530;-742139.000000000000000;-1043771.000000000000000;0
2421;-742464.000000000000000;-1045117.000000000000000;0
1766;-741257.000000000000000;-1044204.000000000000000;0
4499;-742338.899999998509884;-1042707.250000000000000;0
5068;-742837.162999998778105;-1043263.965999998152256;0
7015;-742554.570000000298023;-1044360.725000001490116;0
1185;-741822.000000000000000;-1044095.000000000000000;0
226;-742879.000000000000000;-1043516.000000000000000;0
1571;-742239.000000000000000;-1044186.000000000000000;0
7223;-742409.149999998509884;-1044822.649999998509884;0
4106;-742664.475000001490116;-1043755.761999998241663;0
699;-742067.000000000000000;-1042896.000000000000000;0
4877;-742845.760000001639128;-1042956.589999999850988;0
1995;-743484.000000000000000;-1045036.000000000000000;0
7315;-742603.960000000894070;-1045022.870000001043081;0
6503;-741647.706000000238419;-1044996.008999999612570;0
4058;-743138.765000000596046;-1043625.405000001192093;0
4239;-742454.206000000238419;-1043538.927999999374151;0
2546;-741750.000000000000000;-1044271.000000000000000;0
2198;-743302.000000000000000;-1045194.000000000000000;0
1125;-741728.000000000000000;-1044435.000000000000000;0
2215;-743135.000000000000000;-1045335.000000000000000;0
4080;-742832.480000000447035;-1043782.030000001192093;0
3679;-744571.809999998658895;-1042497.875999998301268;0
2131;-743073.000000000000000;-1045134.000000000000000;0
4636;-742576.870999999344349;-1042687.116999998688698;0
4809;-743081.589999999850988;-1042799.800000000745058;0
4465;-742180.250000000000000;-1042584.370000001043081;0
4938;-742469.324999999254942;-1042658.263000000268221;0
3355;-743953.881000000983477;-1043031.379999998956919;0
3843;-743139.170000001788139;-1042650.050000000745058;0
5681;-743400.820000000298023;-1043718.682000000029802;0
1055;-741747.000000000000000;-1045038.000000000000000;0
379;-742479.000000000000000;-1043679.000000000000000;0
4834;-742972.708000000566244;-1042657.809000000357628;0
8271;-742030.649999998509884;-1042720.129999998956919;0
4780;-742928.596000000834465;-1042747.480000000447035;0
2344;-742691.000000000000000;-1045541.000000000000000;0
1928;-743474.000000000000000;-1044409.000000000000000;0
2179;-742953.000000000000000;-1045258.000000000000000;0
6307;-741835.620000001043081;-1042765.149999998509884;0
4614;-742493.800000000745058;-1042636.896000001579523;0
2226;-743057.000000000000000;-1045470.000000000000000;0
6828;-741465.309999998658895;-1044768.940000001341105;0
4958;-742349.620000001043081;-1043004.539999999105930;0
1378;-742161.000000000000000;-1044904.000000000000000;0
1341;-741687.000000000000000;-1044742.000000000000000;0
3769;-742978.969999998807907;-1042975.300000000745058;0
6141;-742311.243999999016523;-1043063.195999998599291;0
7216;-742500.129999998956919;-1044564.390000000596046;0
606;-741906.000000000000000;-1043273.000000000000000;0
5082;-742925.114000000059605;-1043348.883999999612570;0
2307;-742371.000000000000000;-1045477.000000000000000;0
4511;-742539.859999999403954;-1042744.070000000298023;0
7091;-743361.839999999850988;-1044584.039999999105930;0
1214;-742064.000000000000000;-1044358.000000000000000;0
2158;-742781.000000000000000;-1045197.000000000000000;0
209;-743108.000000000000000;-1043583.000000000000000;0
1028;-741981.000000000000000;-1044692.000000000000000;0
203;-743204.000000000000000;-1043607.000000000000000;0
5675;-743407.907999999821186;-1043716.054999999701977;0
545;-742337.000000000000000;-1043805.000000000000000;0
4243;-742194.050000000745058;-1043431.899999998509884;0
3991;-743363.940000001341105;-1043857.699999999254942;0
7739;-742301.399000000208616;-1045040.431000001728535;0
840;-742067.000000000000000;-1042522.000000000000000;0
6751;-742426.350000001490116;-1044371.070000000298023;0
6854;-741522.427999999374151;-1045038.967999998480082;0
2007;-743231.000000000000000;-1044741.000000000000000;0
1062;-741560.000000000000000;-1045151.000000000000000;0
1088;-741617.000000000000000;-1044547.000000000000000;0
4794;-743065.828999999910593;-1042673.377000000327826;0
4764;-742839.835999999195337;-1042859.412999998778105;0
580;-742010.000000000000000;-1043443.000000000000000;0
6872;-741751.719999998807907;-1045296.679999999701977;0
1750;-742045.000000000000000;-1045215.000000000000000;0
7647;-742319.918000001460314;-1045405.197999998927116;0
310;-742696.000000000000000;-1044162.000000000000000;0
628;-742217.370000001043081;-1043308.559999998658895;0
1447;-741541.000000000000000;-1044744.000000000000000;0
5738;-743410.412999998778105;-1043691.800000000745058;0
4688;-742676.179000001400709;-1042555.322999998927116;0
6283;-742308.969000000506639;-1043049.539999999105930;0
1542;-742043.000000000000000;-1044057.000000000000000;0
2506;-741267.000000000000000;-1044015.000000000000000;0
7190;-742577.989999998360872;-1044771.690000001341105;0
4562;-742471.000000000000000;-1042510.920000001788139;0
7957;-741692.839999999850988;-1044277.559999998658895;0
336;-742616.000000000000000;-1043959.000000000000000;0
1003;-741913.000000000000000;-1044580.000000000000000;0
5767;-742424.269999999552965;-1042581.609000001102686;0
983;-741953.000000000000000;-1044414.000000000000000;0
2342;-742726.000000000000000;-1045537.000000000000000;0
4666;-742808.710000000894070;-1042576.609999999403954;0
4725;-742875.100000001490116;-1042678.230000000447035;0
6173;-742316.787000000476837;-1043067.471000000834465;0
4150;-742581.789999999105930;-1044138.429999999701977;0
3570;-744649.160000000149012;-1042588.129999998956919;0
2315;-742854.000000000000000;-1045460.000000000000000;0
4591;-742426.813000001013279;-1042640.035000000149012;0
1623;-742524.000000000000000;-1044319.000000000000000;0
314;-742585.000000000000000;-1044184.000000000000000;0
7201;-742571.190000001341105;-1044939.320000000298023;0
5234;-743348.486000001430511;-1043412.741999998688698;0
4830;-743043.449999999254942;-1042882.359999999403954;0
5677;-743405.545000001788139;-1043716.931000001728535;0
6128;-742313.668999999761581;-1043069.186000000685453;0
4519;-742665.160000000149012;-1042790.820000000298023;0
629;-742200.000000000000000;-1043289.000000000000000;0
6993;-743172.409000001847744;-1044501.339000001549721;0
1488;-741088.000000000000000;-1044212.000000000000000;0
4427;-742190.519999999552965;-1043099.440000001341105;0
7019;-742585.024999998509884;-1044210.725000001490116;0
4921;-742444.739999998360872;-1042908.420000001788139;0
275;-743361.000000000000000;-1043904.000000000000000;0
3973;-743161.204999998211861;-1043723.574999999254942;0
4690;-742679.162999998778105;-1042583.138999998569489;0
1418;-741620.000000000000000;-1044458.000000000000000;0
1086;-741659.000000000000000;-1044542.000000000000000;0
164;-743392.000000000000000;-1043230.000000000000000;0
6705;-742279.050999999046326;-1044655.923000000417233;0
2241;-743319.000000000000000;-1045289.000000000000000;0
4059;-743142.649999998509884;-1043612.730000000447035;0
5239;-743361.096000000834465;-1043279.333999998867512;0
4707;-742743.519999999552965;-1042600.359999999403954;0
7966;-741489.800000000745058;-1044356.219999998807907;0
4537;-742303.159000001847744;-1042752.293000001460314;0
4646;-742694.853000000119209;-1042535.625999998301268;0
2889;-744074.103999998420477;-1043194.559999998658895;0
4030;-743133.280000001192093;-1043791.552000001072884;0
227;-742846.000000000000000;-1043520.000000000000000;0
6753;-742485.511999998241663;-1044950.206999998539686;0
5705;-743417.603000000119209;-1043637.098000001162291;0
2217;-743112.000000000000000;-1045360.000000000000000;0
1491;-741057.000000000000000;-1044333.000000000000000;0
7158;-742984.796999998390675;-1044545.407999999821186;0
4708;-742755.420000001788139;-1042611.309999998658895;0
282;-743034.000000000000000;-1043819.000000000000000;0
5722;-743419.659000001847744;-1043631.798000000417233;0
4928;-742444.890000000596046;-1042854.899999998509884;0
5232;-743347.087000001221895;-1043476.425000000745058;0
1330;-741817.000000000000000;-1044709.000000000000000;0
1965;-743413.000000000000000;-1044726.000000000000000;0
4599;-742625.879999998956919;-1042698.820000000298023;0
2557;-741318.000000000000000;-1044384.000000000000000;0
2085;-742426.000000000000000;-1044797.000000000000000;0
4010;-743200.372999999672174;-1044041.177999999374151;0
5718;-743420.888999998569489;-1043629.666999999433756;0
538;-742113.000000000000000;-1043652.000000000000000;0
8066;-742286.199999999254942;-1045237.250000000000000;0
1269;-742246.000000000000000;-1044462.000000000000000;0
5113;-742946.795000001788139;-1043444.427999999374151;0
6146;-742314.942000001668930;-1043068.475999999791384;0
587;-741944.000000000000000;-1043391.000000000000000;0
1881;-743269.000000000000000;-1044266.000000000000000;0
4832;-743039.079999998211861;-1042840.850000001490116;0
678;-742421.000000000000000;-1043181.000000000000000;0
1190;-741821.000000000000000;-1044110.000000000000000;0
3802;-743068.190000001341105;-1042879.710000000894070;0
1790;-742152.000000000000000;-1044138.000000000000000;0
1249;-742097.000000000000000;-1044649.000000000000000;0
1483;-741252.000000000000000;-1044224.000000000000000;0
4674;-742806.475999999791384;-1042703.594999998807907;0
4560;-742427.079999998211861;-1042500.829999998211861;0
6178;-742312.960000000894070;-1043060.445999998599291;0
1316;-741765.000000000000000;-1044903.000000000000000;0
2270;-742954.000000000000000;-1045592.000000000000000;0
4768;-742862.888000000268221;-1042936.997999999672174;0
4926;-742452.660000000149012;-1042896.190000001341105;0
1677;-741109.160000000149012;-1044522.699999999254942;0
1362;-742017.000000000000000;-1044913.000000000000000;0
841;-742056.000000000000000;-1042508.000000000000000;0
6135;-742308.289000000804663;-1043059.340999998152256;0
4584;-742417.721999999135733;-1042627.620999999344349;0
5596;-743415.271999999880791;-1043680.212999999523163;0
2166;-743016.000000000000000;-1045179.000000000000000;0
6213;-742316.227000001817942;-1043060.478999998420477;0
8053;-742224.410000000149012;-1044970.879999998956919;0
702;-741961.000000000000000;-1042885.000000000000000;0
5647;-743429.070999998599291;-1043694.699000000953674;0
2380;-742308.000000000000000;-1045401.000000000000000;0
4777;-742910.034000001847744;-1042759.350999999791384;0
6776;-741098.559999998658895;-1044491.530000001192093;0
5515;-743426.960000000894070;-1043612.083999998867512;0
2146;-742845.000000000000000;-1044968.000000000000000;0
1924;-743359.000000000000000;-1044320.000000000000000;0
1873;-743410.000000000000000;-1044260.000000000000000;0
3974;-743140.660000000149012;-1043725.350000001490116;0
2273;-742895.000000000000000;-1045745.000000000000000;0
6244;-742368.587000001221895;-1043059.245999999344349;0
6824;-741347.350000001490116;-1044784.280000001192093;0
7270;-743152.309999998658895;-1044962.469999998807907;0
6830;-741526.739999998360872;-1044761.309000000357628;0
5158;-743148.138999998569489;-1043320.254999998956919;0
6252;-742378.052000001072884;-1043040.958000000566244;0
6930;-742046.030000001192093;-1045191.489999998360872;0
1326;-741927.000000000000000;-1044976.000000000000000;0
3835;-743050.579999998211861;-1042590.109999999403954;0
8059;-742265.730000000447035;-1045081.309999998658895;0
6337;-742257.140000000596046;-1042864.820000000298023;0
1528;-741698.000000000000000;-1043770.000000000000000;0
6202;-742317.124000001698732;-1043063.651999998837709;0
6145;-742315.708000000566244;-1043069.881999999284744;0
1445;-741553.000000000000000;-1044757.000000000000000;0
3830;-743013.879999998956919;-1042612.359999999403954;0
4819;-742941.910000000149012;-1042776.670000001788139;0
6387;-742159.980000000447035;-1042496.210000000894070;0
6240;-742364.495999999344349;-1043067.289999999105930;0
6496;-742290.655999999493361;-1044438.502999998629093;0
6485;-741795.653999999165535;-1044513.458000000566244;0
3379;-743806.728000000119209;-1042934.574999999254942;0
1433;-741895.000000000000000;-1044328.000000000000000;0
2223;-743053.000000000000000;-1045437.000000000000000;0
5148;-743071.477000001817942;-1043411.539999999105930;0
7203;-742571.300000000745058;-1044963.219999998807907;0
1932;-743359.000000000000000;-1044408.000000000000000;0
3757;-743300.960000000894070;-1042956.699999999254942;0
5978;-745078.285000000149012;-1042675.223999999463558;0
640;-741983.000000000000000;-1043299.000000000000000;0
5580;-743409.831000000238419;-1043636.449000000953674;0
4021;-743293.295000001788139;-1043876.995000001043081;0
8277;-742111.260000001639128;-1042746.399999998509884;0
7025;-743199.914999999105930;-1044070.515000000596046;0
5579;-743409.682999998331070;-1043634.574999999254942;0
5721;-743418.407999999821186;-1043631.800000000745058;0
6449;-743140.379999998956919;-1043395.559999998658895;0
8285;-742232.780000001192093;-1042821.149999998509884;0
5026;-742631.168999999761581;-1042903.938999999314547;0
4575;-742336.600000001490116;-1042692.170000001788139;0
349;-742524.000000000000000;-1043764.000000000000000;0
3956;-743414.039999999105930;-1043561.081999998539686;0
4895;-742596.936999998986721;-1042829.168000001460314;0
5016;-742572.212000001221895;-1042955.526999998837709;0
5238;-743360.410000000149012;-1043296.723999999463558;0
6154;-742316.324000000953674;-1043069.546000000089407;0
4906;-742448.370000001043081;-1042815.789999999105930;0
4935;-742447.241999998688698;-1042699.399000000208616;0
3959;-743417.421999998390675;-1043577.730000000447035;0
6282;-742308.337999999523163;-1043045.984000001102686;0
4641;-742591.151999998837709;-1042559.721000000834465;0
926;-741894.000000000000000;-1042999.000000000000000;0
1917;-743374.000000000000000;-1044458.000000000000000;0
701;-742023.000000000000000;-1042885.000000000000000;0
1934;-743294.000000000000000;-1044407.000000000000000;0
6207;-742313.287000000476837;-1043056.642000000923872;0
8261;-742108.039999999105930;-1042693.769999999552965;0
6856;-741514.510999999940395;-1044912.175999999046326;0
401;-742324.000000000000000;-1043907.000000000000000;0
3530;-744756.230000000447035;-1042672.155999999493361;0
5513;-743426.734999999403954;-1043606.184000000357628;0
6153;-742309.583999998867512;-1043058.640999998897314;0
4424;-742225.300000000745058;-1043033.250000000000000;0
1425;-742080.000000000000000;-1044210.000000000000000;0
4123;-742742.956000000238419;-1043901.826000001281500;0
6210;-742318.541000001132488;-1043064.662999998778105;0
461;-741713.000000000000000;-1043304.000000000000000;0
4659;-742803.311000000685453;-1042470.754999998956919;0
729;-741986.000000000000000;-1042998.000000000000000;0
4888;-742649.925999999046326;-1042830.767000000923872;0
1036;-741961.000000000000000;-1044922.000000000000000;0
6165;-742315.407000001519918;-1043066.436000000685453;0
1914;-743464.000000000000000;-1044458.000000000000000;0
6225;-742314.519999999552965;-1043055.927000001072884;0
8018;-741974.039999999105930;-1044442.870000001043081;0
6305;-741836.559999998658895;-1042745.190000001341105;0
4729;-742855.690000001341105;-1042695.640000000596046;0
2286;-742894.000000000000000;-1045440.000000000000000;0
8260;-742091.730000000447035;-1042690.769999999552965;0
6151;-742311.114999998360872;-1043061.451000001281500;0
4833;-743036.859999999403954;-1042820.050000000745058;0
3470;-745024.565000001341105;-1042295.905000001192093;0
1116;-741125.980000000447035;-1044610.410000000149012;0
576;-742054.000000000000000;-1043517.000000000000000;0
7829;-743509.649999998509884;-1045166.399999998509884;0
4320;-742264.149000000208616;-1043259.541999999433756;0
5172;-743274.383999999612570;-1043432.322999998927116;0
6142;-742310.477000001817942;-1043061.813000001013279;0
1247;-742104.000000000000000;-1044609.000000000000000;0
5652;-743429.532999999821186;-1043700.732000000774860;0
6218;-742319.947000000625849;-1043065.767999999225140;0
1391;-742117.000000000000000;-1045084.000000000000000;0
1171;-741882.000000000000000;-1044375.000000000000000;0
2330;-742403.000000000000000;-1045511.000000000000000;0
5776;-742933.609000001102686;-1043433.765999998897314;0
3018;-744443.368000000715256;-1042805.962000001221895;0
8056;-742242.379999998956919;-1045023.460000000894070;0
1;-743520.000000000000000;-1042472.000000000000000;0
2447;-742772.000000000000000;-1044159.000000000000000;0
1964;-743412.000000000000000;-1044708.000000000000000;0
4990;-742657.837999999523163;-1043024.199999999254942;0
1157;-741172.000000000000000;-1044489.000000000000000;0
3066;-744075.627000000327826;-1042883.837000001221895;0
4249;-742151.910000000149012;-1043354.719999998807907;0
1831;-742994.000000000000000;-1044105.000000000000000;0
5680;-743402.000000000000000;-1043718.245000001043081;0
5584;-743408.885000001639128;-1043643.532000001519918;0
4586;-742464.175000000745058;-1042636.333999998867512;0
4727;-742869.390000000596046;-1042700.829999998211861;0
1463;-741933.000000000000000;-1043968.000000000000000;0
1597;-742338.000000000000000;-1045064.000000000000000;0
2160;-742849.000000000000000;-1045147.000000000000000;0
4628;-742619.598000001162291;-1042609.989999998360872;0
6259;-742383.170000001788139;-1043030.809000000357628;0
3992;-743365.899999998509884;-1043881.385000001639128;0
4746;-742867.769999999552965;-1042768.570000000298023;0
8281;-742164.160000000149012;-1042778.140000000596046;0
7001;-743085.660000000149012;-1044400.420000001788139;0
2332;-742899.000000000000000;-1045516.000000000000000;0
4180;-742368.370000001043081;-1044115.471999999135733;0
1365;-742125.050000000745058;-1044945.710000000894070;0
7246;-742736.730000000447035;-1044825.399999998509884;0
2050;-743460.000000000000000;-1045072.000000000000000;0
