OID_;X;Y;TEMPERATURE
3919;-743904.947000000625849;-1043493.929999999701977;0
3679;-744571.809999998658895;-1042497.875999998301268;0
3781;-743273.059999998658895;-1042814.050000000745058;270
2755;-744003.879000000655651;-1043471.734000001102686;0
2098;-743134.000000000000000;-1044763.000000000000000;0
7324;-742833.980000000447035;-1044949.109999999403954;0
2167;-743021.000000000000000;-1045154.000000000000000;0
1584;-742368.000000000000000;-1044717.000000000000000;0
725;-741983.000000000000000;-1042939.000000000000000;0
1924;-743359.000000000000000;-1044320.000000000000000;0
2021;-743281.000000000000000;-1044948.000000000000000;0
1196;-741677.000000000000000;-1043894.000000000000000;0
401;-742324.000000000000000;-1043907.000000000000000;0
4331;-742391.967999998480082;-1043310.539000000804663;0
4237;-742425.385000001639128;-1043517.421000000089407;0
7263;-743009.559999998658895;-1044894.379999998956919;0
6794;-741124.372999999672174;-1044792.221000000834465;0
4070;-742925.285000000149012;-1043783.565000001341105;0
1362;-742017.000000000000000;-1044913.000000000000000;0
4144;-742704.414999999105930;-1043822.484999999403954;0
7146;-742819.425000000745058;-1044426.225000001490116;0
7244;-742713.559999998658895;-1044823.719999998807907;0
2232;-743488.000000000000000;-1045234.000000000000000;0
2160;-742849.000000000000000;-1045147.000000000000000;0
226;-742879.000000000000000;-1043516.000000000000000;0
4047;-743210.230000000447035;-1043992.289999999105930;0
7934;-743545.050000000745058;-1044980.559999998658895;0
2217;-743112.000000000000000;-1045360.000000000000000;0
2447;-742772.000000000000000;-1044159.000000000000000;0
7048;-743392.429999999701977;-1044236.170000001788139;0
345;-742559.000000000000000;-1043826.000000000000000;0
7992;-741480.739999998360872;-1045117.620000001043081;0
1929;-743440.000000000000000;-1044410.000000000000000;0
542;-742367.629999998956919;-1043814.379999998956919;0
7538;-742701.420000001788139;-1045364.109999999403954;0
7652;-742275.046999998390675;-1045497.052000001072884;0
3291;-743588.212999999523163;-1042790.916999999433756;0
3847;-743122.146999999880791;-1042525.489999998360872;0
2397;-742181.000000000000000;-1045368.000000000000000;0
7091;-743361.839999999850988;-1044584.039999999105930;0
7362;-743205.807000000029802;-1045156.089999999850988;0
701;-742023.000000000000000;-1042885.000000000000000;0
7928;-743542.539999999105930;-1044784.769999999552965;0
2328;-742459.000000000000000;-1045505.000000000000000;0
8076;-742050.429999999701977;-1045256.199999999254942;0
872;-741698.000000000000000;-1042669.000000000000000;0
7170;-742667.579999998211861;-1044492.469999998807907;0
3387;-743960.368000000715256;-1043194.717000000178814;0
6823;-741313.910000000149012;-1044788.510000001639128;0
884;-741771.000000000000000;-1042776.000000000000000;0
2562;-741090.000000000000000;-1044404.000000000000000;0
6853;-741548.899000000208616;-1045052.295000001788139;0
3750;-743221.379999998956919;-1042925.429999999701977;0
7216;-742500.129999998956919;-1044564.390000000596046;0
6486;-741772.072999998927116;-1044516.256000000983477;0
2104;-743176.000000000000000;-1044964.000000000000000;0
1088;-741617.000000000000000;-1044547.000000000000000;0
1297;-742120.000000000000000;-1044453.000000000000000;0
3314;-743758.675999999046326;-1042905.688999999314547;0
1143;-741415.000000000000000;-1044457.000000000000000;0
1739;-741831.780000001192093;-1045213.809999998658895;0
1597;-742338.000000000000000;-1045064.000000000000000;0
820;-742019.000000000000000;-1042600.000000000000000;0
7141;-742895.629999998956919;-1044470.910000000149012;0
9;-743512.000000000000000;-1042512.000000000000000;133
1971;-743385.000000000000000;-1044881.000000000000000;0
2050;-743460.000000000000000;-1045072.000000000000000;0
6727;-742522.868000000715256;-1044395.879999998956919;0
7705;-742283.471999999135733;-1044316.339999999850988;0
6313;-743936.949999999254942;-1042594.780000001192093;0
4902;-742480.460000000894070;-1042802.989999998360872;0
578;-742023.000000000000000;-1043464.000000000000000;0
7943;-742063.449999999254942;-1044055.260000001639128;0
333;-742651.000000000000000;-1043996.000000000000000;0
110;-744127.000000000000000;-1042724.000000000000000;0
2402;-742236.000000000000000;-1045408.000000000000000;0
7388;-743052.050000000745058;-1045513.859999999403954;0
1486;-741150.000000000000000;-1044219.000000000000000;0
7008;-742899.559999998658895;-1044224.074999999254942;0
5241;-743365.063000001013279;-1043245.954999998211861;0
2237;-743368.000000000000000;-1045238.000000000000000;0
1029;-741978.000000000000000;-1044721.000000000000000;0
509;-741991.000000000000000;-1043143.000000000000000;0
6502;-741658.278999999165535;-1044979.149000000208616;0
2243;-743292.000000000000000;-1045310.000000000000000;0
2249;-743211.000000000000000;-1045443.000000000000000;0
569;-742096.000000000000000;-1043601.000000000000000;0
4690;-742679.162999998778105;-1042583.138999998569489;0
2340;-742764.000000000000000;-1045532.000000000000000;0
1344;-741750.000000000000000;-1044808.000000000000000;0
2055;-743425.000000000000000;-1045038.000000000000000;0
1219;-742137.000000000000000;-1044315.000000000000000;0
2285;-742897.000000000000000;-1045467.000000000000000;0
1501;-741475.000000000000000;-1044292.000000000000000;0
7077;-743564.359000001102686;-1045385.210000000894070;0
281;-743045.000000000000000;-1043848.000000000000000;0
1611;-742400.000000000000000;-1044442.000000000000000;0
3885;-742418.339999999850988;-1042442.059999998658895;0
1054;-741734.000000000000000;-1045021.000000000000000;0
4938;-742469.324999999254942;-1042658.263000000268221;0
4166;-742448.504999998956919;-1044046.885000001639128;0
3212;-743646.699000000953674;-1042469.458999998867512;0
4214;-742229.274999998509884;-1043511.745000001043081;0
4309;-742042.329999998211861;-1043492.329999998211861;0
1758;-741097.000000000000000;-1044094.000000000000000;0
3022;-744385.094000000506639;-1042820.482999999076128;0
1854;-742675.000000000000000;-1044271.000000000000000;0
533;-742137.000000000000000;-1043750.000000000000000;0
1307;-741803.000000000000000;-1044663.000000000000000;0
1149;-741311.000000000000000;-1044471.000000000000000;0
6833;-741571.423000000417233;-1044909.473999999463558;0
466;-741743.000000000000000;-1043331.000000000000000;0
2134;-743028.000000000000000;-1045111.000000000000000;0
7200;-742561.710999999195337;-1044911.469999998807907;0
3542;-744575.274000000208616;-1042656.160000000149012;0
1422;-742199.000000000000000;-1044127.000000000000000;0
7173;-742660.850000001490116;-1044535.730000000447035;0
6114;-742234.250000000000000;-1043361.324999999254942;0
1533;-741832.000000000000000;-1043879.000000000000000;0
690;-742306.000000000000000;-1043081.000000000000000;0
4242;-742214.469999998807907;-1043415.800000000745058;0
6824;-741347.350000001490116;-1044784.280000001192093;0
602;-741828.000000000000000;-1043190.000000000000000;0
3369;-743878.633000001311302;-1043011.739000000059605;0
1832;-743024.000000000000000;-1044100.000000000000000;0
5444;-743183.024000000208616;-1043210.600000001490116;0
2040;-743285.000000000000000;-1044809.000000000000000;0
1013;-742076.000000000000000;-1044595.000000000000000;0
4459;-742274.829999998211861;-1042644.269999999552965;0
1323;-741859.000000000000000;-1044941.000000000000000;0
6399;-742013.379999998956919;-1042502.739999998360872;0
2515;-742517.000000000000000;-1044420.000000000000000;0
4827;-743046.359999999403954;-1042958.140000000596046;0
1415;-741623.000000000000000;-1044561.000000000000000;0
5968;-742288.989000000059605;-1044168.456999998539686;0
7514;-742304.866000000387430;-1044375.124000001698732;0
1551;-741353.000000000000000;-1044326.000000000000000;0
7002;-743079.250000000000000;-1044377.170000001788139;0
1289;-742211.000000000000000;-1044521.000000000000000;0
1004;-741898.000000000000000;-1044565.000000000000000;0
2885;-744122.791999999433756;-1043190.208000000566244;0
1180;-741935.000000000000000;-1044283.000000000000000;0
741;-741730.000000000000000;-1043035.000000000000000;0
7975;-741349.339999999850988;-1044397.800000000745058;0
504;-741937.000000000000000;-1043164.000000000000000;0
7158;-742984.796999998390675;-1044545.407999999821186;0
1812;-743149.000000000000000;-1044528.000000000000000;0
606;-741906.000000000000000;-1043273.000000000000000;0
875;-741783.000000000000000;-1042677.000000000000000;0
5436;-744076.484000001102686;-1043296.519999999552965;0
6810;-741106.350999999791384;-1044631.888999998569489;0
620;-742253.000000000000000;-1043281.000000000000000;0
1430;-741993.000000000000000;-1044260.000000000000000;0
1083;-741667.000000000000000;-1044526.000000000000000;0
4844;-742977.256000000983477;-1042754.953000001609325;12
6230;-742317.590999998152256;-1043059.730999998748302;0
3797;-743147.989999998360872;-1042854.129999998956919;0
1694;-741582.000000000000000;-1044653.000000000000000;0
4717;-742914.300000000745058;-1042625.489999998360872;0
1652;-741379.000000000000000;-1044550.000000000000000;0
4700;-742659.859999999403954;-1042723.210000000894070;0
202;-743240.000000000000000;-1043597.000000000000000;0
3580;-744924.973999999463558;-1042593.699999999254942;0
1293;-742037.000000000000000;-1044462.000000000000000;0
4040;-743224.710000000894070;-1043766.050000000745058;0
8045;-742173.070000000298023;-1044806.519999999552965;0
4688;-742676.179000001400709;-1042555.322999998927116;0
4083;-742820.771999999880791;-1043708.657000001519918;0
7276;-742801.670000001788139;-1044613.309999998658895;0
6337;-742257.140000000596046;-1042864.820000000298023;0
3561;-744699.155999999493361;-1042614.903999999165535;0
4058;-743138.765000000596046;-1043625.405000001192093;0
1439;-741772.000000000000000;-1044379.000000000000000;0
6227;-742319.839999999850988;-1043063.936000000685453;0
5516;-743427.133000001311302;-1043615.250999998301268;0
713;-741800.000000000000000;-1042859.000000000000000;0
7044;-743400.635000001639128;-1044135.579999998211861;0
4206;-742342.340999998152256;-1043547.063000001013279;0
1398;-741753.000000000000000;-1044201.000000000000000;0
1172;-741869.000000000000000;-1044348.000000000000000;0
4753;-742764.600000001490116;-1042761.899999998509884;0
1940;-743286.000000000000000;-1044339.000000000000000;0
4034;-743295.410000000149012;-1043786.070000000298023;0
5725;-743422.388000000268221;-1043634.186999998986721;0
7518;-742829.780000001192093;-1045693.210000000894070;0
1192;-741801.000000000000000;-1044083.000000000000000;0
6721;-742321.052999999374151;-1044705.548000000417233;0
4979;-742507.703000001609325;-1043016.118000000715256;0
6995;-743129.710000000894070;-1044496.579999998211861;0
1345;-741741.000000000000000;-1044789.000000000000000;0
5661;-743424.451999999582767;-1043709.932999998331070;0
5996;-742061.879000000655651;-1043284.276999998837709;0
2321;-742679.000000000000000;-1045480.000000000000000;0
5296;-743058.934999998658895;-1043177.035000000149012;0
513;-742083.000000000000000;-1043145.000000000000000;0
7399;-742999.699999999254942;-1045733.309999998658895;0
2144;-742844.000000000000000;-1045070.000000000000000;0
3564;-744648.296999998390675;-1042605.850999999791384;0
4199;-742205.142999999225140;-1043745.868000000715256;0
4973;-742480.098000001162291;-1043031.443999998271465;0
3349;-743960.629000000655651;-1042997.258999999612570;0
6245;-742369.682000000029802;-1043057.377000000327826;0
1701;-741378.000000000000000;-1044678.000000000000000;0
379;-742479.000000000000000;-1043679.000000000000000;0
1264;-742059.000000000000000;-1044942.000000000000000;0
4037;-743205.375000000000000;-1043771.175000000745058;0
6726;-742476.517999999225140;-1044410.600000001490116;0
6777;-741073.500000000000000;-1044491.879999998956919;0
1589;-742376.000000000000000;-1044861.000000000000000;0
1152;-741257.000000000000000;-1044489.000000000000000;0
7745;-742933.037000000476837;-1045523.714999999850988;0
1932;-743359.000000000000000;-1044408.000000000000000;0
1484;-741219.000000000000000;-1044224.000000000000000;0
5274;-743012.366000000387430;-1043280.149000000208616;0
4202;-742285.475999999791384;-1043627.734999999403954;0
5233;-743347.210000000894070;-1043435.807000000029802;0
5325;-742997.480000000447035;-1043042.289999999105930;0
3989;-743307.815000001341105;-1044034.914999999105930;0
4669;-742823.199999999254942;-1042658.309999998658895;0
6192;-742317.252000000327826;-1043065.394999999552965;0
1781;-741247.000000000000000;-1043923.000000000000000;0
8272;-742042.399999998509884;-1042732.559999998658895;0
917;-742121.000000000000000;-1043008.000000000000000;0
730;-741948.000000000000000;-1042998.000000000000000;0
6374;-741977.035000000149012;-1042674.153999999165535;0
5502;-743427.894999999552965;-1043706.885000001639128;0
5518;-743427.500999998301268;-1043621.975000001490116;0
5026;-742631.168999999761581;-1042903.938999999314547;0
6710;-742260.203000001609325;-1044803.609999999403954;0
5975;-745052.346999999135733;-1042674.673000000417233;0
2576;-742487.000000000000000;-1045483.000000000000000;0
4075;-742947.934999998658895;-1043903.649999998509884;0
7217;-742516.318999998271465;-1044582.890000000596046;0
1966;-743413.000000000000000;-1044746.000000000000000;0
7654;-742242.081000000238419;-1045273.263999998569489;0
1554;-741348.000000000000000;-1044238.000000000000000;0
1270;-742242.000000000000000;-1044491.000000000000000;0
4502;-742349.309999998658895;-1042718.199999999254942;0
5214;-743307.671999998390675;-1043376.414000000804663;0
5144;-743052.642000000923872;-1043488.940000001341105;0
2300;-742561.000000000000000;-1045413.000000000000000;0
673;-742467.000000000000000;-1043230.000000000000000;0
7118;-743468.750000000000000;-1044677.690000001341105;0
4225;-742115.607999999076128;-1043452.125000000000000;0
3094;-743906.500000000000000;-1042759.554999999701977;0
6159;-742312.495999999344349;-1043062.521000001579523;0
4893;-742637.320000000298023;-1042818.600999999791384;0
2245;-743239.000000000000000;-1045356.000000000000000;0
215;-743021.000000000000000;-1043558.000000000000000;0
3066;-744075.627000000327826;-1042883.837000001221895;0
683;-742362.000000000000000;-1043155.000000000000000;0
6771;-741345.015999998897314;-1044413.647999998182058;0
4725;-742875.100000001490116;-1042678.230000000447035;0
4062;-742830.460000000894070;-1043654.920000001788139;0
1471;-741711.000000000000000;-1044132.000000000000000;0
1043;-741872.000000000000000;-1044711.000000000000000;0
5168;-743228.796000000089407;-1043420.092000000178814;0
1595;-742313.000000000000000;-1045010.000000000000000;0
31;-743485.000000000000000;-1042645.000000000000000;0
2499;-741884.000000000000000;-1044011.000000000000000;0
4679;-742774.199999999254942;-1042819.160000000149012;0
4161;-742506.254999998956919;-1044181.925000000745058;0
6922;-742056.329999998211861;-1045086.679999999701977;0
5779;-742907.197999998927116;-1043414.096999999135733;0
1516;-741928.000000000000000;-1044062.000000000000000;0
6146;-742314.942000001668930;-1043068.475999999791384;0
3993;-743345.100000001490116;-1043930.980000000447035;0
4962;-742387.429999999701977;-1043028.129999998956919;0
5421;-742337.905999999493361;-1042777.837999999523163;0
3820;-743111.699999999254942;-1042659.320000000298023;0
6656;-741590.160000000149012;-1044150.480000000447035;0
1251;-742091.000000000000000;-1044690.000000000000000;0
7780;-743046.243000000715256;-1045844.168999999761581;0
909;-742183.000000000000000;-1042503.000000000000000;0
1407;-741650.000000000000000;-1044242.000000000000000;0
3806;-743010.089999999850988;-1042912.410000000149012;0
4084;-742817.504999998956919;-1043681.475000001490116;0
6118;-743652.447000000625849;-1042857.607999999076128;0
1951;-743289.000000000000000;-1044491.000000000000000;0
4662;-742819.471000000834465;-1042530.037000000476837;0
688;-742284.000000000000000;-1043125.000000000000000;0
7746;-742234.789999999105930;-1045549.890000000596046;0
526;-742209.000000000000000;-1043849.000000000000000;0
2536;-742003.000000000000000;-1044113.000000000000000;0
6997;-743109.160000000149012;-1044453.600000001490116;0
5512;-743426.556000001728535;-1043602.920000001788139;0
4718;-742933.730000000447035;-1042628.039999999105930;0
7037;-743316.085000000894070;-1044222.170000001788139;0
3426;-743729.493999999016523;-1043061.420000001788139;0
4241;-742225.929999999701977;-1043394.530000001192093;0
3788;-743134.440000001341105;-1042956.210000000894070;0
4120;-742715.179999999701977;-1043974.089999999850988;0
5724;-743422.230999998748302;-1043632.715999998152256;0
2452;-742913.000000000000000;-1044127.000000000000000;0
1762;-741227.000000000000000;-1044108.000000000000000;0
6166;-742314.649999998509884;-1043065.006999999284744;0
1446;-741545.000000000000000;-1044774.000000000000000;0
1519;-741754.000000000000000;-1043956.000000000000000;0
5517;-743427.287000000476837;-1043618.956999998539686;0
4328;-742347.322000000625849;-1043375.796999998390675;0
1955;-743374.000000000000000;-1044515.000000000000000;0
390;-742429.000000000000000;-1043827.000000000000000;0
91;-744044.000000000000000;-1043053.000000000000000;0
3974;-743140.660000000149012;-1043725.350000001490116;0
6293;-742666.339999999850988;-1042695.188999999314547;0
5239;-743361.096000000834465;-1043279.333999998867512;0
4079;-742836.170000001788139;-1043800.960000000894070;0
3143;-744031.217999998480082;-1042659.508999999612570;0
557;-742213.000000000000000;-1043713.000000000000000;0
6818;-741163.460000000894070;-1044806.616999998688698;0
4173;-742756.320000000298023;-1043749.629999998956919;0
4696;-742682.817000001668930;-1042658.543999999761581;0
2331;-742895.000000000000000;-1045530.000000000000000;0
4171;-742796.910000000149012;-1043722.629999998956919;0
6652;-741678.190000001341105;-1044132.780000001192093;0
4140;-742831.635999999940395;-1044004.828999999910593;0
5155;-743140.712999999523163;-1043357.901999998837709;0
6960;-743030.260000001639128;-1044242.870000001043081;0
755;-741668.000000000000000;-1042700.000000000000000;0
4849;-742966.960000000894070;-1042893.583999998867512;0
7151;-742842.649000000208616;-1044545.307000000029802;0
1150;-741290.000000000000000;-1044485.000000000000000;0
7542;-742623.890000000596046;-1045372.899999998509884;0
2401;-742253.000000000000000;-1045390.000000000000000;0
1213;-742068.000000000000000;-1044387.000000000000000;0
1455;-741517.000000000000000;-1044468.000000000000000;0
219;-742979.000000000000000;-1043549.000000000000000;0
6673;-742244.289999999105930;-1044153.350000001490116;0
1131;-741643.000000000000000;-1044433.000000000000000;0
6369;-741962.675000000745058;-1042665.013999998569489;0
1354;-741877.000000000000000;-1044859.000000000000000;0
4018;-743153.285000000149012;-1043925.850000001490116;0
4526;-742696.690000001341105;-1042823.320000000298023;0
4057;-743132.184999998658895;-1043648.719999998807907;0
4504;-742387.329999998211861;-1042714.820000000298023;0
6004;-742061.723000001162291;-1043300.859999999403954;0
6258;-742382.381999999284744;-1043032.370999999344349;0
1475;-741565.000000000000000;-1044185.000000000000000;0
3829;-742992.250000000000000;-1042635.140000000596046;0
170;-743440.000000000000000;-1043364.000000000000000;0
1931;-743388.000000000000000;-1044409.000000000000000;0
2060;-742659.000000000000000;-1044472.000000000000000;0
5224;-743293.449999999254942;-1043542.160000000149012;0
4021;-743293.295000001788139;-1043876.995000001043081;0
3759;-743267.609999999403954;-1042971.300000000745058;0
4059;-743142.649999998509884;-1043612.730000000447035;0
4628;-742619.598000001162291;-1042609.989999998360872;0
5197;-743222.513000000268221;-1043313.989999998360872;0
7186;-742587.609999999403954;-1044726.000000000000000;0
1680;-741122.809999998658895;-1044628.710000000894070;0
317;-742464.000000000000000;-1044207.000000000000000;0
7703;-742462.714000001549721;-1044818.045000001788139;0
1950;-743271.000000000000000;-1044490.000000000000000;0
204;-743208.000000000000000;-1043588.000000000000000;0
5766;-742429.719999998807907;-1042597.699999999254942;0
6871;-741730.899000000208616;-1045309.688000001013279;0
910;-742219.000000000000000;-1042529.000000000000000;0
4739;-742751.690000001341105;-1042699.230000000447035;0
326;-742682.000000000000000;-1044102.000000000000000;0
1285;-742198.000000000000000;-1044467.000000000000000;0
7678;-742388.550999999046326;-1045109.184000000357628;0
4668;-742810.210000000894070;-1042618.969999998807907;0
3957;-743415.125000000000000;-1043567.214999999850988;0
3306;-743787.127999998629093;-1042847.872999999672174;0
1006;-741930.000000000000000;-1044565.000000000000000;123
5149;-743072.195999998599291;-1043377.370999999344349;0
4875;-742814.660000000149012;-1042937.800000000745058;0
4159;-742455.734999999403954;-1043898.035000000149012;0
4758;-742854.840999998152256;-1042811.914000000804663;0
5411;-742776.079999998211861;-1042905.300000000745058;0
1137;-741538.000000000000000;-1044442.000000000000000;0
4579;-742378.747999999672174;-1042626.699999999254942;0
5582;-743410.127000000327826;-1043640.197999998927116;0
2138;-742958.000000000000000;-1045095.000000000000000;0
207;-743142.000000000000000;-1043590.000000000000000;0
5065;-742796.800999999046326;-1043254.010000001639128;0
2695;-743455.570000000298023;-1042040.780000001192093;0
8085;-741919.059999998658895;-1045407.820000000298023;0
4073;-742939.109999999403954;-1043858.504999998956919;0
7741;-742302.225999999791384;-1045079.842999998480082;0
1871;-743440.000000000000000;-1044260.000000000000000;0
2136;-742993.000000000000000;-1045103.000000000000000;0
6203;-742316.357000000774860;-1043062.256000000983477;0
5700;-743416.574000000953674;-1043630.223999999463558;0
1244;-742127.000000000000000;-1044527.000000000000000;0
3981;-743341.517000000923872;-1043837.353999998420477;0
7022;-743155.660000000149012;-1044074.410000000149012;0
4848;-742977.940000001341105;-1042862.019999999552965;0
347;-742542.000000000000000;-1043795.000000000000000;0
5745;-743415.129000000655651;-1043695.054000001400709;0
4321;-742265.214999999850988;-1043235.418999999761581;0
5738;-743410.412999998778105;-1043691.800000000745058;0
4510;-742483.149999998509884;-1042738.460000000894070;0
3834;-743079.190000001341105;-1042579.899999998509884;0
1703;-741320.000000000000000;-1044686.000000000000000;0
3768;-743006.370000001043081;-1042978.829999998211861;0
1546;-742219.000000000000000;-1044147.000000000000000;0
1830;-742961.000000000000000;-1044087.000000000000000;0
5140;-743035.789999999105930;-1043514.489999998360872;0
303;-742895.000000000000000;-1044116.000000000000000;0
2358;-742370.000000000000000;-1045593.000000000000000;0
4765;-742822.897999998182058;-1042850.499000001698732;0
4660;-742801.596999999135733;-1042487.965999998152256;0
6179;-742312.195000000298023;-1043059.041000001132488;0
1145;-741386.000000000000000;-1044461.000000000000000;0
6768;-741255.769999999552965;-1044419.920000001788139;0
4963;-742396.510000001639128;-1043031.829999998211861;0
639;-741958.000000000000000;-1043294.000000000000000;0
1381;-742115.000000000000000;-1044999.000000000000000;0
7281;-742801.859999999403954;-1044705.300000000745058;0
5418;-742434.890000000596046;-1042864.780000001192093;0
5417;-742604.429000001400709;-1042550.491999998688698;0
5597;-743414.056000001728535;-1043680.309000000357628;0
191;-743424.000000000000000;-1043599.000000000000000;0
7315;-742603.960000000894070;-1045022.870000001043081;0
553;-742251.000000000000000;-1043741.000000000000000;0
8055;-742223.859999999403954;-1045007.899999998509884;0
2422;-742473.000000000000000;-1045096.000000000000000;0
4711;-742803.300000000745058;-1042601.140000000596046;0
8044;-742176.640000000596046;-1044778.420000001788139;0
7700;-742371.105999998748302;-1044818.445000000298023;0
5369;-742583.364999998360872;-1042976.820999998599291;0
6239;-742363.504999998956919;-1043069.298000000417233;0
1490;-741023.000000000000000;-1044335.000000000000000;0
722;-742139.000000000000000;-1043009.000000000000000;0
575;-742053.000000000000000;-1043541.000000000000000;0
5118;-742835.168000001460314;-1043315.074000000953674;0
385;-742436.000000000000000;-1043742.000000000000000;0
4251;-742136.420000001788139;-1043379.969999998807907;0
6178;-742312.960000000894070;-1043060.445999998599291;0
4770;-742872.535000000149012;-1042899.679000001400709;0
580;-742010.000000000000000;-1043443.000000000000000;0
680;-742402.109999999403954;-1043166.679999999701977;0
3302;-743795.043999999761581;-1042863.539000000804663;0
4878;-742876.434000000357628;-1042964.004000000655651;0
5960;-743141.460999999195337;-1043339.964999999850988;0
4808;-743110.859999999403954;-1042784.829999998211861;0
3787;-743130.989999998360872;-1042979.320000000298023;0
4733;-742767.890000000596046;-1042671.010000001639128;0
4036;-743246.920000001788139;-1043771.574999999254942;0
5704;-743417.484999999403954;-1043635.530999999493361;0
882;-741825.000000000000000;-1042788.000000000000000;0
4625;-742594.258000001311302;-1042576.114000000059605;0
3460;-744993.289000000804663;-1042693.587000001221895;0
2691;-743451.850000001490116;-1042126.063999999314547;0
6277;-742304.633999999612570;-1043024.256000000983477;0
3110;-743743.295000001788139;-1042640.627000000327826;0
3613;-744986.447999998927116;-1042275.537999998778105;0
3958;-743416.328000001609325;-1043572.265999998897314;0
5292;-743055.866000000387430;-1043215.710999999195337;0
6708;-742268.296999998390675;-1044748.438000001013279;0
518;-742194.000000000000000;-1043131.000000000000000;0
918;-743437.000000000000000;-1043904.000000000000000;0
6785;-741294.269999999552965;-1044465.800000000745058;0
5955;-742960.732999999076128;-1043520.888999998569489;0
8280;-742150.949999999254942;-1042770.420000001788139;0
5723;-743420.903000000864267;-1043631.703999999910593;0
5598;-743412.839999999850988;-1043680.403000000864267;0
2479;-741247.800000000745058;-1044609.379999998956919;0
6175;-742315.256999999284744;-1043064.660999998450279;0
3954;-743409.050999999046326;-1043550.699999999254942;0
1477;-741482.750000000000000;-1044212.480000000447035;0
5687;-743415.142000000923872;-1043630.285999998450279;0
5684;-743397.274000000208616;-1043719.995999999344349;0
3377;-743832.151999998837709;-1042925.721000000834465;0
4640;-742588.572999998927116;-1042544.848999999463558;0
344;-742557.000000000000000;-1043847.000000000000000;0
4742;-742822.300000000745058;-1042747.920000001788139;0
1586;-742372.000000000000000;-1044785.000000000000000;0
6167;-742313.859999999403954;-1043063.607000000774860;0
6320;-741766.848000001162291;-1042614.989999998360872;0
1257;-742070.000000000000000;-1044815.000000000000000;0
6223;-742316.076000001281500;-1043058.679000001400709;0
4927;-742447.969999998807907;-1042874.710000000894070;0
4654;-742797.372999999672174;-1042533.888999998569489;0
3358;-743952.916999999433756;-1043047.306000001728535;0
4427;-742190.519999999552965;-1043099.440000001341105;0
7698;-742389.168000001460314;-1044818.684000000357628;0
1498;-741382.000000000000000;-1044310.000000000000000;0
1624;-742551.000000000000000;-1044318.000000000000000;0
1123;-741734.000000000000000;-1044442.000000000000000;0
318;-742434.000000000000000;-1044213.000000000000000;0
5923;-742953.765000000596046;-1043015.067999999970198;0
6561;-741307.890000000596046;-1043937.809999998658895;0
5222;-743271.000000000000000;-1043543.149999998509884;0
6338;-742247.910000000149012;-1042851.670000001788139;0
4198;-742192.445000000298023;-1043760.521000001579523;0
1704;-741289.000000000000000;-1044690.000000000000000;0
1499;-741413.000000000000000;-1044304.000000000000000;0
6291;-743672.399000000208616;-1042955.638000000268221;0
6171;-742310.780999999493361;-1043057.971000000834465;0
5371;-742052.149999998509884;-1043011.940000001341105;0
2270;-742954.000000000000000;-1045592.000000000000000;0
4923;-742431.019999999552965;-1042882.210000000894070;0
600;-741840.000000000000000;-1043212.000000000000000;0
5941;-742044.835000000894070;-1043561.903999999165535;0
3282;-743619.890999998897314;-1042841.907000001519918;0
4666;-742808.710000000894070;-1042576.609999999403954;0
4920;-742444.449999999254942;-1042928.980000000447035;0
7187;-742595.019999999552965;-1044739.962000001221895;0
