OID_;X;Y;TEMPERATURE
3614;-744984.548999998718500;-1042283.640999998897314;0
110;-744127.000000000000000;-1042724.000000000000000;0
3019;-744463.447999998927116;-1042784.646000001579523;0
3568;-744718.817999999970198;-1042588.614999998360872;0
3692;-744525.876499999314547;-1042540.534000001847744;0
3580;-744924.973999999463558;-1042593.699999999254942;0
2605;-745393.842999998480082;-1042860.796000000089407;0
5975;-745052.346999999135733;-1042674.673000000417233;0
118;-745135.000000000000000;-1042687.000000000000000;0
3542;-744575.274000000208616;-1042656.160000000149012;0
2696;-743477.489999998360872;-1042038.000000000000000;0
2520;-741847.000000000000000;-1045324.000000000000000;0
696;-742077.000000000000000;-1042913.000000000000000;0
7259;-742935.280000001192093;-1044869.829999998211861;0
1524;-741710.000000000000000;-1043844.000000000000000;0
2070;-742993.000000000000000;-1044723.000000000000000;0
3066;-744075.627000000327826;-1042883.837000001221895;0
725;-741983.000000000000000;-1042939.000000000000000;0
2149;-742819.000000000000000;-1045024.000000000000000;0
6;-743464.000000000000000;-1042594.000000000000000;0
3216;-743615.890999998897314;-1042451.129999998956919;0
8077;-742038.989999998360872;-1045265.309999998658895;0
2154;-742805.000000000000000;-1045147.000000000000000;0
509;-741991.000000000000000;-1043143.000000000000000;0
1780;-741214.000000000000000;-1043934.000000000000000;0
7410;-743525.730000000447035;-1045377.420000001788139;0
651;-742490.000000000000000;-1043564.000000000000000;0
2185;-743216.000000000000000;-1045130.000000000000000;0
2193;-743531.000000000000000;-1045204.000000000000000;0
6946;-742974.765000000596046;-1043929.388000000268221;0
6556;-741290.410000000149012;-1044041.471000000834465;0
4098;-742789.157000001519918;-1043861.918999999761581;0
2226;-743057.000000000000000;-1045470.000000000000000;0
3211;-743651.409000001847744;-1042483.458999998867512;0
7716;-743023.190999999642372;-1045843.241999998688698;0
6872;-741751.719999998807907;-1045296.679999999701977;0
7397;-743021.859999999403954;-1045682.989999998360872;0
1756;-742165.000000000000000;-1045209.000000000000000;0
2275;-742845.000000000000000;-1045719.000000000000000;0
4080;-742832.480000000447035;-1043782.030000001192093;0
2397;-742181.000000000000000;-1045368.000000000000000;0
7744;-742941.256999999284744;-1045533.171000000089407;0
2760;-743863.331000000238419;-1043483.304000001400709;0
7347;-742557.690000001341105;-1045177.440000001341105;0
2095;-743178.000000000000000;-1044734.000000000000000;0
2755;-744003.879000000655651;-1043471.734000001102686;0
2316;-742823.000000000000000;-1045463.000000000000000;0
2334;-742872.000000000000000;-1045519.000000000000000;0
1584;-742368.000000000000000;-1044717.000000000000000;0
2218;-743091.000000000000000;-1045372.000000000000000;0
2404;-742179.000000000000000;-1045467.000000000000000;0
350;-742505.000000000000000;-1043757.000000000000000;0
2274;-742870.000000000000000;-1045732.000000000000000;0
4025;-743202.881000000983477;-1043852.008000001311302;0
3919;-743904.947000000625849;-1043493.929999999701977;0
2049;-743499.000000000000000;-1045071.000000000000000;0
1382;-742096.000000000000000;-1045023.000000000000000;0
7740;-742301.949999999254942;-1045061.239000000059605;0
7189;-742588.486999999731779;-1044766.690999999642372;0
3760;-743233.829999998211861;-1042978.739999998360872;0
6746;-742405.083999998867512;-1044259.199999999254942;0
1760;-741162.000000000000000;-1044101.000000000000000;0
2060;-742659.000000000000000;-1044472.000000000000000;0
1036;-741961.000000000000000;-1044922.000000000000000;0
3128;-743948.160000000149012;-1042657.320000000298023;0
6823;-741313.910000000149012;-1044788.510000001639128;0
524;-742255.000000000000000;-1043913.000000000000000;0
6314;-743939.670000001788139;-1042606.239999998360872;0
7202;-742561.410000000149012;-1044949.640000000596046;0
7325;-743032.969999998807907;-1045186.298999998718500;0
3107;-743778.888000000268221;-1042682.131999999284744;0
2322;-742651.000000000000000;-1045483.000000000000000;0
4145;-742687.109999999403954;-1043837.125000000000000;0
7026;-743217.644999999552965;-1044082.329999998211861;0
3233;-744152.962999999523163;-1042686.791999999433756;0
340;-742588.000000000000000;-1043906.000000000000000;0
334;-742631.000000000000000;-1043987.000000000000000;0
2142;-742883.000000000000000;-1045078.000000000000000;0
1518;-741994.000000000000000;-1044011.000000000000000;0
1824;-742963.809999998658895;-1044143.929999999701977;0
4142;-742777.425000000745058;-1044013.440000001341105;0
2487;-742101.000000000000000;-1044308.000000000000000;0
7024;-743182.745000001043081;-1044052.815000001341105;0
7742;-741703.945999998599291;-1045067.738000001758337;0
5271;-742995.381999999284744;-1043229.673000000417233;0
5961;-742431.225000001490116;-1044003.574999999254942;0
4332;-742410.359000001102686;-1043282.916000001132488;0
5241;-743365.063000001013279;-1043245.954999998211861;0
7516;-742248.390000000596046;-1044368.907999999821186;0
7003;-743074.140000000596046;-1044350.280000001192093;0
2326;-742523.000000000000000;-1045498.000000000000000;0
1852;-742739.000000000000000;-1044210.000000000000000;0
6996;-743116.699999999254942;-1044476.469999998807907;0
2255;-743181.000000000000000;-1045372.000000000000000;0
382;-742481.000000000000000;-1043751.000000000000000;0
2495;-741982.000000000000000;-1044140.000000000000000;0
7538;-742701.420000001788139;-1045364.109999999403954;0
1655;-741391.000000000000000;-1044651.000000000000000;0
1311;-741646.000000000000000;-1044831.000000000000000;0
2740;-744042.611999999731779;-1043335.940000001341105;0
2641;-743432.578999999910593;-1042583.418999999761581;0
1243;-742122.000000000000000;-1044502.000000000000000;0
4151;-742573.039999999105930;-1044109.035000000149012;0
1448;-741537.000000000000000;-1044716.000000000000000;0
4067;-742913.594999998807907;-1043714.640000000596046;0
3268;-743594.046999998390675;-1042721.412999998778105;0
7140;-742921.300000000745058;-1044469.335000000894070;0
6845;-741527.188000001013279;-1044989.557000000029802;0
1007;-741976.000000000000000;-1044586.000000000000000;0
6647;-741767.690000001341105;-1044068.160000000149012;0
5408;-743696.881000000983477;-1042878.024999998509884;0
1042;-741883.000000000000000;-1044682.000000000000000;0
2244;-743264.000000000000000;-1045331.000000000000000;0
2241;-743319.000000000000000;-1045289.000000000000000;0
7000;-743096.190000001341105;-1044426.870000001043081;0
1291;-742205.000000000000000;-1044568.000000000000000;0
2234;-743425.000000000000000;-1045221.000000000000000;0
5434;-744042.467999998480082;-1043135.986999999731779;0
6705;-742279.050999999046326;-1044655.923000000417233;0
7016;-742557.515000000596046;-1044334.074999999254942;0
1250;-742103.000000000000000;-1044672.000000000000000;0
3269;-743600.679000001400709;-1042731.660000000149012;0
5309;-743033.405000001192093;-1043187.043999999761581;0
1171;-741882.000000000000000;-1044375.000000000000000;0
324;-742694.000000000000000;-1044132.000000000000000;0
1050;-741785.000000000000000;-1044952.000000000000000;0
3994;-743394.864000000059605;-1043949.813999999314547;0
4131;-742844.625000000000000;-1044059.980000000447035;0
747;-741690.000000000000000;-1043000.000000000000000;0
1212;-742038.000000000000000;-1044383.000000000000000;0
1368;-741998.000000000000000;-1044779.000000000000000;0
2337;-742783.000000000000000;-1045544.000000000000000;0
1720;-741436.000000000000000;-1044862.000000000000000;0
316;-742490.000000000000000;-1044202.000000000000000;0
3838;-743113.550000000745058;-1042543.399999998509884;0
732;-741860.000000000000000;-1043003.000000000000000;0
513;-742083.000000000000000;-1043145.000000000000000;0
6726;-742476.517999999225140;-1044410.600000001490116;0
1430;-741993.000000000000000;-1044260.000000000000000;0
7043;-743398.899999998509884;-1044106.629999998956919;0
1025;-741989.000000000000000;-1044602.000000000000000;0
4537;-742303.159000001847744;-1042752.293000001460314;0
4460;-742216.600000001490116;-1042598.850000001490116;0
7217;-742516.318999998271465;-1044582.890000000596046;0
735;-741910.000000000000000;-1043014.000000000000000;0
7986;-741040.829999998211861;-1044408.250000000000000;0
2083;-742588.000000000000000;-1044663.000000000000000;0
7995;-741545.920000001788139;-1045160.100000001490116;0
6848;-741619.096999999135733;-1045007.451999999582767;0
6841;-741583.443999998271465;-1044946.208000000566244;0
4075;-742947.934999998658895;-1043903.649999998509884;0
6391;-742109.269999999552965;-1042498.320000000298023;0
8043;-742180.050000000745058;-1044750.160000000149012;0
3846;-743149.390000000596046;-1042549.600000001490116;0
1488;-741088.000000000000000;-1044212.000000000000000;0
4214;-742229.274999998509884;-1043511.745000001043081;0
1394;-741822.000000000000000;-1044310.000000000000000;0
1297;-742120.000000000000000;-1044453.000000000000000;0
2309;-742322.000000000000000;-1045519.000000000000000;0
3379;-743806.728000000119209;-1042934.574999999254942;0
7721;-742941.157000001519918;-1044215.368000000715256;0
1910;-743460.000000000000000;-1044391.000000000000000;0
3810;-743261.510000001639128;-1042802.960000000894070;0
8281;-742164.160000000149012;-1042778.140000000596046;0
4823;-742936.660000000149012;-1042868.949999999254942;0
7147;-742827.925000000745058;-1044451.385000001639128;0
1089;-741567.949999999254942;-1044538.820000000298023;0
5409;-743745.201000001281500;-1042902.750000000000000;0
284;-743022.000000000000000;-1043758.000000000000000;0
2091;-742920.000000000000000;-1044593.000000000000000;0
4204;-742312.750999998301268;-1043589.962999999523163;0
1458;-741506.000000000000000;-1044384.000000000000000;0
1615;-742367.000000000000000;-1044434.000000000000000;0
4461;-742218.370000001043081;-1042583.800000000745058;0
5265;-743188.572999998927116;-1043226.513999998569489;0
4051;-743236.329999998211861;-1043889.710000000894070;0
1509;-741741.000000000000000;-1044196.000000000000000;0
1629;-742450.000000000000000;-1044518.000000000000000;0
2304;-742442.000000000000000;-1045429.000000000000000;0
4923;-742431.019999999552965;-1042882.210000000894070;0
4309;-742042.329999998211861;-1043492.329999998211861;0
1474;-741604.000000000000000;-1044172.000000000000000;0
4237;-742425.385000001639128;-1043517.421000000089407;0
7143;-742850.414999999105930;-1044473.449999999254942;0
4058;-743138.765000000596046;-1043625.405000001192093;0
1912;-743461.000000000000000;-1044430.000000000000000;0
6699;-742301.118999999016523;-1044484.282999999821186;0
2375;-742438.000000000000000;-1045570.000000000000000;0
1462;-741464.000000000000000;-1044225.000000000000000;0
1189;-741786.000000000000000;-1044043.000000000000000;0
1535;-741873.000000000000000;-1043913.000000000000000;0
3982;-743325.135000001639128;-1043857.684999998658895;0
4427;-742190.519999999552965;-1043099.440000001341105;0
399;-742339.000000000000000;-1043884.000000000000000;0
5239;-743361.096000000834465;-1043279.333999998867512;0
1705;-741257.219999998807907;-1044695.690000001341105;0
7679;-742498.250000000000000;-1045115.879999998956919;0
1604;-742552.000000000000000;-1044918.000000000000000;0
6694;-742280.806000001728535;-1044814.875999998301268;0
6096;-742098.760000001639128;-1043615.589999999850988;0
1377;-742146.969999998807907;-1044922.489999998360872;0
1038;-741956.000000000000000;-1044977.000000000000000;0
557;-742213.000000000000000;-1043713.000000000000000;0
1111;-741167.030000001192093;-1044590.170000001788139;0
4087;-742811.609999999403954;-1043604.190000001341105;0
3943;-743413.429000001400709;-1043376.822000000625849;0
7704;-742256.021000001579523;-1044313.592999998480082;0
4002;-743397.818999998271465;-1044054.317999999970198;0
1607;-742414.000000000000000;-1044379.000000000000000;0
2565;-741043.000000000000000;-1044424.000000000000000;0
5317;-743063.690000001341105;-1043053.769999999552965;0
281;-743045.000000000000000;-1043848.000000000000000;0
4057;-743132.184999998658895;-1043648.719999998807907;0
4808;-743110.859999999403954;-1042784.829999998211861;0
1098;-741435.000000000000000;-1044571.000000000000000;0
5998;-742019.482000000774860;-1043283.164000000804663;0
1457;-741510.000000000000000;-1044411.000000000000000;0
5461;-742442.704999998211861;-1043234.515000000596046;0
1115;-741105.000000000000000;-1044598.000000000000000;0
543;-742361.000000000000000;-1043823.000000000000000;0
1101;-741339.000000000000000;-1044568.000000000000000;0
542;-742367.629999998956919;-1043814.379999998956919;0
1496;-741253.000000000000000;-1044321.000000000000000;0
6715;-742291.912999998778105;-1044948.105999998748302;0
1387;-742155.000000000000000;-1044999.000000000000000;0
2401;-742253.000000000000000;-1045390.000000000000000;0
884;-741771.000000000000000;-1042776.000000000000000;0
5225;-743277.453999999910593;-1043558.087999999523163;0
6794;-741124.372999999672174;-1044792.221000000834465;0
2560;-741251.000000000000000;-1044390.000000000000000;0
1449;-741533.000000000000000;-1044684.000000000000000;0
4475;-741839.219000000506639;-1042687.409000001847744;0
3416;-743754.546000000089407;-1043086.953000001609325;0
2084;-742447.000000000000000;-1044797.000000000000000;0
1170;-741893.000000000000000;-1044403.000000000000000;0
598;-741853.000000000000000;-1043233.000000000000000;0
1590;-742377.000000000000000;-1044885.000000000000000;0
529;-742162.000000000000000;-1043803.000000000000000;0
1373;-742143.000000000000000;-1044822.000000000000000;0
1163;-741072.820000000298023;-1044501.940000001341105;0
4652;-742775.500000000000000;-1042533.997999999672174;0
1482;-741289.000000000000000;-1044232.000000000000000;0
4507;-742472.469999998807907;-1042720.199999999254942;0
7164;-742596.114999998360872;-1044447.173000000417233;0
4786;-742953.361000001430511;-1042655.886999998241663;0
5174;-743296.331000000238419;-1043439.800000000745058;0
6240;-742364.495999999344349;-1043067.289999999105930;0
707;-741897.000000000000000;-1042863.000000000000000;0
261;-743429.000000000000000;-1043723.000000000000000;0
3769;-742978.969999998807907;-1042975.300000000745058;0
4225;-742115.607999999076128;-1043452.125000000000000;0
4735;-742686.059999998658895;-1042669.260000001639128;0
7130;-743306.429999999701977;-1044539.519999999552965;0
6099;-741947.280000001192093;-1043424.289999999105930;0
5511;-743426.401000000536442;-1043599.129999998956919;0
713;-741800.000000000000000;-1042859.000000000000000;0
2035;-743435.000000000000000;-1044802.000000000000000;0
5955;-742960.732999999076128;-1043520.888999998569489;0
5435;-744041.557000000029802;-1043128.000999998301268;0
3389;-743919.920000001788139;-1043153.510000001639128;0
5595;-743416.488000001758337;-1043680.118999999016523;0
3360;-743950.688000001013279;-1042982.188000001013279;0
2511;-743050.000000000000000;-1044050.000000000000000;0
1506;-741642.000000000000000;-1044236.000000000000000;0
4620;-742539.574000000953674;-1042537.307999998331070;0
7248;-742757.960000000894070;-1044826.929999999701977;0
4558;-742373.019999999552965;-1042506.949999999254942;0
2038;-743342.000000000000000;-1044806.000000000000000;0
817;-741937.000000000000000;-1042586.000000000000000;0
8270;-742019.480000000447035;-1042725.870000001043081;0
5226;-743310.730000000447035;-1043553.269999999552965;0
6769;-741281.120000001043081;-1044417.780000001192093;0
1413;-741631.000000000000000;-1044621.000000000000000;0
5958;-742962.513999998569489;-1043517.497999999672174;0
4458;-742245.679999999701977;-1042633.960000000894070;0
4766;-742803.037999998778105;-1042842.532999999821186;0
467;-741757.000000000000000;-1043352.000000000000000;0
1197;-741657.000000000000000;-1043865.000000000000000;0
462;-741707.000000000000000;-1043294.000000000000000;0
6506;-741743.019999999552965;-1044571.050000000745058;0
7170;-742667.579999998211861;-1044492.469999998807907;0
7048;-743392.429999999701977;-1044236.170000001788139;0
3347;-743959.280000001192093;-1043034.447000000625849;0
5113;-742946.795000001788139;-1043444.427999999374151;0
6784;-741318.109999999403954;-1044460.920000001788139;0
4622;-742533.901000000536442;-1042569.660000000149012;0
4604;-742463.967999998480082;-1042613.381999999284744;0
6507;-741738.839999999850988;-1044541.820000000298023;0
3973;-743161.204999998211861;-1043723.574999999254942;0
2499;-741884.000000000000000;-1044011.000000000000000;0
7287;-742809.579999998211861;-1044785.789999999105930;0
5111;-742892.337999999523163;-1043424.370999999344349;0
4768;-742862.888000000268221;-1042936.997999999672174;0
6152;-742310.348999999463558;-1043060.046999998390675;0
5110;-742876.271999999880791;-1043449.013000000268221;0
1924;-743359.000000000000000;-1044320.000000000000000;0
3092;-743909.377999998629093;-1042780.322999998927116;0
1126;-741684.000000000000000;-1044450.000000000000000;0
4852;-742992.449999999254942;-1042849.890000000596046;0
6565;-741325.239999998360872;-1044209.190000001341105;0
171;-743448.000000000000000;-1043399.000000000000000;0
345;-742559.000000000000000;-1043826.000000000000000;0
4702;-742669.300000000745058;-1042747.399999998509884;0
4774;-742900.078999999910593;-1042854.859000001102686;0
1346;-741769.000000000000000;-1044817.000000000000000;0
786;-741706.000000000000000;-1042606.000000000000000;0
6276;-742310.815999999642372;-1043016.000999998301268;0
1674;-741099.000000000000000;-1044736.000000000000000;0
8258;-742053.760000001639128;-1042683.769999999552965;0
5588;-743425.002000000327826;-1043679.451999999582767;0
1983;-743474.000000000000000;-1044709.000000000000000;0
4228;-742132.969999998807907;-1043331.449999999254942;0
7275;-742794.339999999850988;-1044627.140000000596046;0
7962;-741640.190000001341105;-1044316.800000000745058;0
2041;-743531.000000000000000;-1044957.000000000000000;0
3956;-743414.039999999105930;-1043561.081999998539686;0
819;-741987.000000000000000;-1042599.000000000000000;0
5205;-743251.475000001490116;-1043328.679000001400709;0
4600;-742647.000000000000000;-1042709.000000000000000;0
3958;-743416.328000001609325;-1043572.265999998897314;0
4950;-742354.289999999105930;-1042955.670000001788139;0
4529;-742762.920000001788139;-1042885.809999998658895;0
6105;-742213.883000001311302;-1043111.734000001102686;0
1821;-742995.000000000000000;-1044239.000000000000000;0
3767;-743033.910000000149012;-1042982.390000000596046;0
6128;-742313.668999999761581;-1043069.186000000685453;0
6268;-742340.850000001490116;-1043018.881000000983477;0
6180;-742311.429000001400709;-1043057.635999999940395;0
6131;-742311.329999998211861;-1043064.982999999076128;0
2026;-743351.000000000000000;-1045022.000000000000000;0
265;-743344.000000000000000;-1043735.000000000000000;0
5176;-743321.252999998629093;-1043447.495000001043081;0
6242;-742366.677999999374151;-1043062.949000000953674;0
5735;-743414.589999999850988;-1043687.874000001698732;0
7658;-742333.647999998182058;-1045313.331999998539686;0
5657;-743429.199999999254942;-1043706.837999999523163;0
1952;-743316.000000000000000;-1044495.000000000000000;0
5700;-743416.574000000953674;-1043630.223999999463558;0
6351;-741874.269999999552965;-1042706.859999999403954;0
1251;-742091.000000000000000;-1044690.000000000000000;0
6298;-741804.910000000149012;-1042692.300000000745058;0
4603;-742442.480000000447035;-1042617.250000000000000;0
568;-742116.000000000000000;-1043604.000000000000000;0
4796;-743054.247999999672174;-1042682.918000001460314;0
6195;-742314.956000000238419;-1043061.181000001728535;0
1087;-741605.000000000000000;-1044533.000000000000000;0
5145;-743058.063000001013279;-1043471.706999998539686;0
1596;-742323.000000000000000;-1045037.000000000000000;0
4983;-742587.776000000536442;-1043013.068999998271465;0
4788;-742970.409000001847744;-1042588.238000001758337;0
3795;-743173.190000001341105;-1042842.170000001788139;0
4821;-742966.550000000745058;-1042877.969999998807907;0
1330;-741817.000000000000000;-1044709.000000000000000;0
576;-742054.000000000000000;-1043517.000000000000000;0
3805;-743035.760000001639128;-1042913.550000000745058;0
3812;-743231.179999999701977;-1042815.199999999254942;0
4906;-742448.370000001043081;-1042815.789999999105930;0
7354;-743365.449000000953674;-1045150.535999998450279;0
4494;-741874.920000001788139;-1042616.660000000149012;0
4653;-742788.747999999672174;-1042524.557000000029802;0
2019;-743264.000000000000000;-1044921.000000000000000;0
1761;-741194.000000000000000;-1044104.000000000000000;0
5734;-743412.366999998688698;-1043688.041999999433756;0
1048;-741805.000000000000000;-1044896.000000000000000;0
6113;-742229.061000000685453;-1043368.359000001102686;0
4508;-742449.140000000596046;-1042725.980000000447035;0
4947;-742399.918000001460314;-1042993.458000000566244;0
4898;-742571.280000001192093;-1042840.859999999403954;0
1944;-743280.000000000000000;-1044400.000000000000000;0
5450;-743130.769000001251698;-1043378.403000000864267;0
952;-742274.000000000000000;-1043018.000000000000000;0
4699;-742676.469999998807907;-1042731.760000001639128;0
6171;-742310.780999999493361;-1043057.971000000834465;0
1438;-741809.000000000000000;-1044350.000000000000000;0
3747;-743250.879999998956919;-1042956.620000001043081;0
4954;-742405.539999999105930;-1043024.640000000596046;0
602;-741828.000000000000000;-1043190.000000000000000;0
263;-743389.000000000000000;-1043725.000000000000000;0
3820;-743111.699999999254942;-1042659.320000000298023;0
4730;-742831.050000000745058;-1042696.600000001490116;0
4506;-742419.730000000447035;-1042717.019999999552965;0
6244;-742368.587000001221895;-1043059.245999999344349;0
4426;-742197.589999999850988;-1043031.679999999701977;0
1395;-741799.000000000000000;-1044291.000000000000000;0
1942;-743283.000000000000000;-1044370.000000000000000;0
3761;-743202.559999998658895;-1042981.710000000894070;0
1985;-743478.000000000000000;-1044769.000000000000000;0
679;-742404.000000000000000;-1043185.000000000000000;0
4976;-742494.337000001221895;-1043009.743000000715256;0
6164;-742316.155999999493361;-1043067.784000001847744;0
1973;-743394.000000000000000;-1044931.000000000000000;0
408;-742317.000000000000000;-1044182.000000000000000;0
877;-741951.000000000000000;-1042610.000000000000000;0
2446;-742750.000000000000000;-1044164.000000000000000;0
5643;-743428.701999999582767;-1043689.872999999672174;0
1810;-743136.000000000000000;-1044544.000000000000000;0
6221;-742317.633000001311302;-1043061.541000001132488;0
623;-742254.000000000000000;-1043325.000000000000000;0
5502;-743427.894999999552965;-1043706.885000001639128;0
91;-744044.000000000000000;-1043053.000000000000000;0
3806;-743010.089999999850988;-1042912.410000000149012;0
4250;-742144.109999999403954;-1043367.519999999552965;0
5996;-742061.879000000655651;-1043284.276999998837709;0
4531;-742746.070000000298023;-1042885.980000000447035;0
5505;-743428.315000001341105;-1043675.633000001311302;0
4896;-742589.649999998509884;-1042838.989999998360872;0
2029;-743393.000000000000000;-1045068.000000000000000;0
6144;-742308.925000000745058;-1043059.002000000327826;0
1423;-742167.000000000000000;-1044150.000000000000000;0
5665;-743419.725000001490116;-1043711.682000000029802;0
1235;-742150.000000000000000;-1044330.000000000000000;0
4335;-742398.230000000447035;-1043445.760000001639128;0
7107;-743425.260000001639128;-1044646.199999999254942;0
6826;-741405.300000000745058;-1044777.199999999254942;0
2020;-743260.000000000000000;-1044941.000000000000000;0
1792;-742165.000000000000000;-1044209.000000000000000;0
4597;-742620.600000001490116;-1042680.690000001341105;0
5456;-742761.041000001132488;-1043254.350999999791384;0
4516;-742588.570000000298023;-1042771.460000000894070;0
4969;-742465.059999998658895;-1043095.034000001847744;0
4509;-742502.519999999552965;-1042732.079999998211861;0
6273;-742321.806000001728535;-1043017.085000000894070;0
3222;-744040.953000001609325;-1042659.842000000178814;0
6136;-742315.081999998539686;-1043070.210000000894070;0
4033;-743319.719999998807907;-1043793.300000000745058;0
4853;-742981.855000000447035;-1042884.537000000476837;0
6203;-742316.357000000774860;-1043062.256000000983477;0
6279;-742306.210000000894070;-1043033.421999998390675;0
5959;-742962.548999998718500;-1043523.155000001192093;0
5455;-742823.936000000685453;-1043283.644999999552965;0
5244;-743361.021000001579523;-1043374.999000001698732;0
6157;-742314.026999998837709;-1043065.331000000238419;0
7728;-743360.581999998539686;-1044610.631000000983477;0
1113;-741134.809999998658895;-1044594.289999999105930;0
90;-744040.000000000000000;-1043095.000000000000000;0
4063;-742855.079999998211861;-1043654.695000000298023;0
5085;-742867.414000000804663;-1043226.135000001639128;0
4577;-742376.686000000685453;-1042590.309999998658895;0
619;-742229.000000000000000;-1043277.000000000000000;0
6142;-742310.477000001817942;-1043061.813000001013279;0
5170;-743246.743000000715256;-1043425.304000001400709;0
4559;-742400.530000001192093;-1042503.760000001639128;0
4990;-742657.837999999523163;-1043024.199999999254942;0
2535;-742042.000000000000000;-1044071.000000000000000;0
2134;-743028.000000000000000;-1045111.000000000000000;0
6789;-741187.510000001639128;-1044470.660000000149012;0
678;-742421.000000000000000;-1043181.000000000000000;0
4974;-742489.458999998867512;-1043047.024999998509884;0
5119;-742850.592999998480082;-1043328.484999999403954;0
5645;-743428.886999998241663;-1043692.285999998450279;0
5234;-743348.486000001430511;-1043412.741999998688698;0
6133;-742309.820000000298023;-1043062.171999998390675;0
4980;-742521.857999999076128;-1043030.853000000119209;0
6439;-741765.070999998599291;-1042636.877999998629093;0
2398;-742150.000000000000000;-1045370.000000000000000;0
4733;-742767.890000000596046;-1042671.010000001639128;0
6197;-742313.425000000745058;-1043058.370999999344349;0
6688;-742383.146999999880791;-1045009.361000001430511;0
5644;-743428.793999999761581;-1043691.079999998211861;0
6155;-742315.557999998331070;-1043068.140999998897314;0
6277;-742304.633999999612570;-1043024.256000000983477;0
7246;-742736.730000000447035;-1044825.399999998509884;0
6275;-742314.603999998420477;-1043016.407999999821186;0
6294;-742653.550000000745058;-1042686.140000000596046;0
7045;-743400.745000001043081;-1044160.004999998956919;0
190;-743443.000000000000000;-1043597.000000000000000;0
583;-741975.000000000000000;-1043434.000000000000000;0
4757;-742873.984000001102686;-1042820.212000001221895;0
1426;-742056.000000000000000;-1044228.000000000000000;0
4244;-742179.410000000149012;-1043422.000000000000000;0
5221;-743263.820000000298023;-1043556.920000001788139;0
5647;-743429.070999998599291;-1043694.699000000953674;0
4804;-743020.045000001788139;-1042704.315999999642372;0
5064;-742811.537999998778105;-1043238.886999998241663;0
1340;-741695.000000000000000;-1044759.000000000000000;0
4339;-742459.269000001251698;-1043367.923000000417233;0
4175;-742721.254999998956919;-1043775.890000000596046;0
5418;-742434.890000000596046;-1042864.780000001192093;0
639;-741958.000000000000000;-1043294.000000000000000;0
1117;-741066.000000000000000;-1044603.000000000000000;0
4953;-742431.500999998301268;-1043027.399999998509884;0
4792;-743051.280000001192093;-1042654.962999999523163;0
6997;-743109.160000000149012;-1044453.600000001490116;0
4611;-742532.804999999701977;-1042593.420000001788139;0
3960;-743418.563000001013279;-1043583.526000000536442;0
2141;-742897.000000000000000;-1045094.000000000000000;0
5267;-743190.021999999880791;-1043149.807000000029802;0
1954;-743372.000000000000000;-1044497.000000000000000;0
788;-741637.000000000000000;-1042607.000000000000000;0
5642;-743428.609999999403954;-1043688.666999999433756;0
2052;-743403.000000000000000;-1045075.000000000000000;0
3789;-743137.469999998807907;-1042933.670000001788139;0
629;-742200.000000000000000;-1043289.000000000000000;0
6154;-742316.324000000953674;-1043069.546000000089407;0
874;-741755.000000000000000;-1042675.000000000000000;0
4325;-742270.679000001400709;-1043141.787999998778105;0
4664;-742806.739999998360872;-1042547.980000000447035;0
1963;-743410.000000000000000;-1044689.000000000000000;0
4945;-742422.162999998778105;-1043009.861000001430511;0
4767;-742786.899999998509884;-1042835.736000001430511;0
