OID_;X;Y;TEMPERATURE
5995;-744441.440999999642372;-1042779.568999998271465;0
3527;-744805.695999998599291;-1042671.809000000357628;0
3538;-744616.304000001400709;-1042656.734000001102686;0
3585;-744920.065000001341105;-1042522.129999998956919;0
3460;-744993.289000000804663;-1042693.587000001221895;0
3466;-745113.802000001072884;-1042675.725000001490116;0
3612;-744996.545000001788139;-1042292.646000001579523;0
3706;-744567.589999999850988;-1042534.585000000894070;0
3537;-744632.945000000298023;-1042671.657000001519918;0
2758;-743919.949999999254942;-1043488.059999998658895;0
1775;-741246.000000000000000;-1044012.000000000000000;0
2641;-743432.578999999910593;-1042583.418999999761581;0
3211;-743651.409000001847744;-1042483.458999998867512;0
2809;-744090.649999998509884;-1043371.184000000357628;0
350;-742505.000000000000000;-1043757.000000000000000;0
5787;-743470.390000000596046;-1042099.079999998211861;0
1492;-741096.000000000000000;-1044331.000000000000000;0
1584;-742368.000000000000000;-1044717.000000000000000;0
1524;-741710.000000000000000;-1043844.000000000000000;0
514;-742119.000000000000000;-1043141.000000000000000;0
7409;-743521.629999998956919;-1045356.570000000298023;0
1521;-741808.000000000000000;-1043917.000000000000000;0
7140;-742921.300000000745058;-1044469.335000000894070;0
7011;-742831.309999998658895;-1044257.245000001043081;0
6339;-742245.460000000894070;-1042835.780000001192093;0
4064;-742879.655000001192093;-1043647.420000001788139;0
2167;-743021.000000000000000;-1045154.000000000000000;0
1661;-741426.000000000000000;-1044846.000000000000000;0
4237;-742425.385000001639128;-1043517.421000000089407;0
5066;-742827.379000000655651;-1043252.267999999225140;0
2152;-742814.000000000000000;-1045106.000000000000000;0
7218;-742534.100000001490116;-1044603.559999998658895;0
7514;-742304.866000000387430;-1044375.124000001698732;0
3268;-743594.046999998390675;-1042721.412999998778105;0
7170;-742667.579999998211861;-1044492.469999998807907;0
4582;-742390.164999999105930;-1042606.546000000089407;0
1761;-741194.000000000000000;-1044104.000000000000000;0
1814;-743095.000000000000000;-1044510.000000000000000;0
7017;-742571.059999998658895;-1044267.640000000596046;0
7021;-743129.019999999552965;-1044076.230000000447035;0
1693;-741613.000000000000000;-1044649.000000000000000;0
1702;-741348.000000000000000;-1044682.000000000000000;0
4078;-742842.960000000894070;-1043832.824999999254942;0
1983;-743474.000000000000000;-1044709.000000000000000;0
2097;-743143.000000000000000;-1044742.000000000000000;0
1843;-743041.600000001490116;-1044324.489999998360872;0
2233;-743461.000000000000000;-1045218.000000000000000;0
1;-743520.000000000000000;-1042472.000000000000000;0
725;-741983.000000000000000;-1042939.000000000000000;0
7715;-743042.480000000447035;-1045860.798999998718500;0
2400;-742087.000000000000000;-1045374.000000000000000;0
4559;-742400.530000001192093;-1042503.760000001639128;70
7259;-742935.280000001192093;-1044869.829999998211861;0
590;-741935.000000000000000;-1043331.000000000000000;0
4008;-743250.114999998360872;-1044043.905999999493361;0
3389;-743919.920000001788139;-1043153.510000001639128;0
1301;-741896.000000000000000;-1044703.000000000000000;0
6357;-741947.870000001043081;-1042701.129999998956919;0
283;-743026.000000000000000;-1043788.000000000000000;0
881;-741806.000000000000000;-1042815.000000000000000;0
2243;-743292.000000000000000;-1045310.000000000000000;0
2889;-744074.103999998420477;-1043194.559999998658895;0
3997;-743395.094999998807907;-1044031.109999999403954;24
7047;-743395.495000001043081;-1044210.765000000596046;0
6695;-742306.234000001102686;-1044816.138999998569489;0
7245;-742748.780000001192093;-1044837.699999999254942;0
4175;-742721.254999998956919;-1043775.890000000596046;0
4135;-742747.719999998807907;-1044085.660000000149012;0
2108;-743147.000000000000000;-1045086.000000000000000;0
2051;-743434.000000000000000;-1045074.000000000000000;0
6040;-742075.469999998807907;-1043676.809999998658895;0
2490;-742063.000000000000000;-1044273.000000000000000;0
7945;-742063.179999999701977;-1044077.379999998956919;0
4221;-742209.576000001281500;-1043499.238000001758337;0
3750;-743221.379999998956919;-1042925.429999999701977;0
4147;-742649.245000001043081;-1043870.320000000298023;0
2039;-743308.000000000000000;-1044808.000000000000000;0
995;-741906.000000000000000;-1044434.000000000000000;0
3810;-743261.510000001639128;-1042802.960000000894070;145
8263;-742151.089999999850988;-1042702.239999998360872;0
7204;-742561.000000000000000;-1044976.910000000149012;0
7214;-742470.679999999701977;-1044531.269999999552965;0
1957;-743402.000000000000000;-1044519.000000000000000;0
736;-741880.000000000000000;-1043017.000000000000000;114
839;-742021.000000000000000;-1042510.000000000000000;0
5267;-743190.021999999880791;-1043149.807000000029802;0
3286;-743679.592999998480082;-1042870.787000000476837;0
1128;-741655.000000000000000;-1044448.000000000000000;0
2383;-742220.000000000000000;-1045517.000000000000000;0
4473;-741822.449999999254942;-1042676.699000000953674;0
1516;-741928.000000000000000;-1044062.000000000000000;0
527;-742186.000000000000000;-1043818.000000000000000;0
917;-742121.000000000000000;-1043008.000000000000000;0
907;-742211.000000000000000;-1042511.000000000000000;0
4054;-743269.304999999701977;-1043797.405000001192093;0
2485;-741285.420000001788139;-1044820.140000000596046;0
1554;-741348.000000000000000;-1044238.000000000000000;0
2393;-742054.000000000000000;-1045282.000000000000000;0
918;-743437.000000000000000;-1043904.000000000000000;0
1369;-742029.000000000000000;-1044788.000000000000000;0
4459;-742274.829999998211861;-1042644.269999999552965;0
3761;-743202.559999998658895;-1042981.710000000894070;0
317;-742464.000000000000000;-1044207.000000000000000;0
8045;-742173.070000000298023;-1044806.519999999552965;0
4341;-742488.855000000447035;-1043325.412999998778105;0
7171;-742671.969999998807907;-1044508.219999998807907;0
8284;-742219.410000000149012;-1042809.500000000000000;0
1815;-743083.000000000000000;-1044478.000000000000000;0
1932;-743359.000000000000000;-1044408.000000000000000;0
1196;-741677.000000000000000;-1043894.000000000000000;0
1114;-741151.059999998658895;-1044607.410000000149012;0
1187;-741805.000000000000000;-1044071.000000000000000;0
5744;-743412.905999999493361;-1043695.221000000834465;0
753;-741692.000000000000000;-1042713.000000000000000;0
599;-741837.000000000000000;-1043243.000000000000000;0
2380;-742308.000000000000000;-1045401.000000000000000;0
6753;-742485.511999998241663;-1044950.206999998539686;0
2318;-742763.000000000000000;-1045470.000000000000000;0
4119;-742717.223999999463558;-1043999.837999999523163;0
1907;-743446.000000000000000;-1044345.000000000000000;0
1141;-741454.000000000000000;-1044453.000000000000000;0
1133;-741604.000000000000000;-1044433.000000000000000;0
5997;-742040.579999998211861;-1043282.651999998837709;0
4503;-742402.579999998211861;-1042702.839999999850988;0
2137;-742971.000000000000000;-1045111.000000000000000;0
4771;-742890.828000001609325;-1042889.975000001490116;0
577;-742038.000000000000000;-1043521.000000000000000;0
3100;-743941.234000001102686;-1042742.857999999076128;0
3109;-743754.403999999165535;-1042652.872000001370907;0
1366;-742109.000000000000000;-1044948.000000000000000;0
786;-741706.000000000000000;-1042606.000000000000000;0
2368;-742507.000000000000000;-1045456.000000000000000;0
1103;-741306.000000000000000;-1044572.000000000000000;0
1287;-742217.000000000000000;-1044486.000000000000000;0
280;-743053.000000000000000;-1043875.000000000000000;0
1852;-742739.000000000000000;-1044210.000000000000000;0
2223;-743053.000000000000000;-1045437.000000000000000;0
5777;-742926.357000000774860;-1043427.357999999076128;0
6853;-741548.899000000208616;-1045052.295000001788139;0
4587;-742482.011999998241663;-1042641.392999999225140;0
3837;-743093.699999999254942;-1042577.890000000596046;0
7003;-743074.140000000596046;-1044350.280000001192093;0
6653;-741657.920000001788139;-1044136.789999999105930;0
3322;-743927.326000001281500;-1042934.425999999046326;0
5326;-742969.850000001490116;-1043038.800000000745058;0
2453;-742941.000000000000000;-1044121.000000000000000;0
5296;-743058.934999998658895;-1043177.035000000149012;215
1090;-741581.000000000000000;-1044552.000000000000000;0
4653;-742788.747999999672174;-1042524.557000000029802;0
1902;-743459.000000000000000;-1044269.000000000000000;0
4019;-743157.434999998658895;-1043897.410000000149012;0
6699;-742301.118999999016523;-1044484.282999999821186;0
7735;-742196.594999998807907;-1045243.149999998509884;0
5176;-743321.252999998629093;-1043447.495000001043081;0
3414;-743757.269999999552965;-1043051.379999998956919;0
3846;-743149.390000000596046;-1042549.600000001490116;0
4153;-742555.934999998658895;-1044073.285000000149012;0
2263;-742989.000000000000000;-1045714.000000000000000;0
1243;-742122.000000000000000;-1044502.000000000000000;0
3831;-743005.140000000596046;-1042638.440000001341105;0
172;-743456.000000000000000;-1043433.000000000000000;0
2278;-742791.000000000000000;-1045657.000000000000000;0
3343;-743911.989000000059605;-1043070.489000000059605;0
8054;-742230.239999998360872;-1044988.530000001192093;0
836;-742006.000000000000000;-1042525.000000000000000;0
7037;-743316.085000000894070;-1044222.170000001788139;0
4969;-742465.059999998658895;-1043095.034000001847744;0
5014;-742563.771999999880791;-1042993.241999998688698;0
7282;-742809.410000000149012;-1044693.629999998956919;0
1148;-741324.000000000000000;-1044481.000000000000000;0
4895;-742596.936999998986721;-1042829.168000001460314;0
4075;-742947.934999998658895;-1043903.649999998509884;0
4156;-742513.734999999403954;-1043978.035000000149012;0
6814;-741118.537999998778105;-1044802.493000000715256;0
985;-741823.000000000000000;-1044444.000000000000000;0
563;-742155.000000000000000;-1043660.000000000000000;0
164;-743392.000000000000000;-1043230.000000000000000;0
5693;-743415.905000001192093;-1043640.377000000327826;0
7153;-742889.646999999880791;-1044547.438000001013279;0
307;-742781.000000000000000;-1044143.000000000000000;0
2545;-741723.000000000000000;-1044265.000000000000000;0
3238;-744159.147999998182058;-1042638.964000001549721;0
1821;-742995.000000000000000;-1044239.000000000000000;0
2216;-743108.000000000000000;-1045349.000000000000000;0
3128;-743948.160000000149012;-1042657.320000000298023;0
1431;-741926.000000000000000;-1044313.000000000000000;0
1020;-742293.000000000000000;-1044615.000000000000000;0
3961;-743419.609999999403954;-1043589.497000001370907;0
1990;-743482.000000000000000;-1044906.000000000000000;0
1327;-742001.000000000000000;-1045024.000000000000000;0
4430;-742235.070000000298023;-1043092.839999999850988;0
1122;-741749.000000000000000;-1044455.000000000000000;0
2325;-742559.000000000000000;-1045494.000000000000000;0
208;-743146.000000000000000;-1043573.000000000000000;0
3291;-743588.212999999523163;-1042790.916999999433756;0
1249;-742097.000000000000000;-1044649.000000000000000;0
6263;-742365.719000000506639;-1043021.282999999821186;0
351;-742509.000000000000000;-1043739.000000000000000;0
1468;-741778.000000000000000;-1044082.000000000000000;0
1409;-741634.000000000000000;-1044170.000000000000000;0
1461;-741473.000000000000000;-1044266.000000000000000;0
2170;-742897.000000000000000;-1045133.000000000000000;0
7147;-742827.925000000745058;-1044451.385000001639128;0
2429;-742485.000000000000000;-1045149.000000000000000;0
5016;-742572.212000001221895;-1042955.526999998837709;0
5118;-742835.168000001460314;-1043315.074000000953674;0
6197;-742313.425000000745058;-1043058.370999999344349;0
2487;-742101.000000000000000;-1044308.000000000000000;0
6258;-742382.381999999284744;-1043032.370999999344349;0
1346;-741769.000000000000000;-1044817.000000000000000;0
798;-741797.000000000000000;-1042590.000000000000000;0
4320;-742264.149000000208616;-1043259.541999999433756;0
4690;-742679.162999998778105;-1042583.138999998569489;55
2054;-743413.000000000000000;-1045010.000000000000000;0
7324;-742833.980000000447035;-1044949.109999999403954;0
4776;-742909.276000000536442;-1042820.587000001221895;0
5284;-743041.022999998182058;-1043277.397999998182058;0
4665;-742824.410000000149012;-1042592.260000001639128;0
2542;-741813.000000000000000;-1044224.000000000000000;0
2332;-742899.000000000000000;-1045516.000000000000000;0
6140;-742311.999000001698732;-1043064.638999998569489;0
513;-742083.000000000000000;-1043145.000000000000000;0
620;-742253.000000000000000;-1043281.000000000000000;0
5645;-743428.886999998241663;-1043692.285999998450279;0
4088;-742812.114999998360872;-1043580.475000001490116;0
1790;-742152.000000000000000;-1044138.000000000000000;0
7742;-741703.945999998599291;-1045067.738000001758337;0
7515;-742273.021999999880791;-1044371.543999999761581;0
6712;-742273.328000001609325;-1044860.912000000476837;0
6448;-744017.179999999701977;-1043123.899999998509884;0
6219;-742319.168999999761581;-1043064.293999999761581;0
2476;-741234.809999998658895;-1044506.690000001341105;0
982;-741992.000000000000000;-1044416.000000000000000;0
2245;-743239.000000000000000;-1045356.000000000000000;0
5372;-742084.010000001639128;-1043008.550000000745058;0
3974;-743140.660000000149012;-1043725.350000001490116;0
3312;-743789.184999998658895;-1042904.234000001102686;0
1384;-742180.000000000000000;-1044969.000000000000000;0
5418;-742434.890000000596046;-1042864.780000001192093;0
3792;-743110.019999999552965;-1042846.530000001192093;0
3991;-743363.940000001341105;-1043857.699999999254942;0
4128;-742915.039999999105930;-1044041.920000001788139;0
3066;-744075.627000000327826;-1042883.837000001221895;0
3101;-743922.754999998956919;-1042745.195000000298023;0
5171;-743266.124000001698732;-1043419.293999999761581;0
1767;-741261.000000000000000;-1044168.000000000000000;0
7647;-742319.918000001460314;-1045405.197999998927116;0
6746;-742405.083999998867512;-1044259.199999999254942;0
6824;-741347.350000001490116;-1044784.280000001192093;0
5143;-743052.232000000774860;-1043454.120000001043081;0
6199;-742319.442000001668930;-1043067.822999998927116;0
6253;-742378.725000001490116;-1043039.690000001341105;0
4817;-742967.460000000894070;-1042782.559999998658895;0
1556;-741195.000000000000000;-1044344.000000000000000;0
1007;-741976.000000000000000;-1044586.000000000000000;0
4779;-742917.822999998927116;-1042727.385000001639128;0
4521;-742681.440000001341105;-1042792.960000000894070;0
4810;-743058.420000001788139;-1042810.050000000745058;0
1537;-741924.000000000000000;-1043954.000000000000000;0
1309;-741611.000000000000000;-1044813.000000000000000;0
505;-741917.000000000000000;-1043153.000000000000000;0
4926;-742452.660000000149012;-1042896.190000001341105;0
625;-742247.000000000000000;-1043299.000000000000000;0
7145;-742812.874000001698732;-1044402.199000000953674;0
551;-742269.000000000000000;-1043755.000000000000000;0
4070;-742925.285000000149012;-1043783.565000001341105;18
6210;-742318.541000001132488;-1043064.662999998778105;0
1049;-741795.000000000000000;-1044923.000000000000000;0
4874;-742795.429999999701977;-1042925.910000000149012;0
7187;-742595.019999999552965;-1044739.962000001221895;0
5968;-742288.989000000059605;-1044168.456999998539686;0
1470;-741728.000000000000000;-1044116.000000000000000;0
7022;-743155.660000000149012;-1044074.410000000149012;0
4798;-743028.991999998688698;-1042693.375000000000000;0
1355;-741899.000000000000000;-1044858.000000000000000;0
6946;-742974.765000000596046;-1043929.388000000268221;0
1427;-742017.000000000000000;-1044256.000000000000000;0
7345;-742613.339999999850988;-1045185.250000000000000;0
6845;-741527.188000001013279;-1044989.557000000029802;0
458;-741726.000000000000000;-1043324.000000000000000;0
4795;-743049.835000000894070;-1042669.013000000268221;0
1984;-743476.000000000000000;-1044743.000000000000000;0
2086;-742404.000000000000000;-1044796.000000000000000;0
1302;-741842.000000000000000;-1044693.000000000000000;0
1487;-741117.000000000000000;-1044216.000000000000000;0
2309;-742322.000000000000000;-1045519.000000000000000;0
1617;-742384.000000000000000;-1044407.000000000000000;0
4526;-742696.690000001341105;-1042823.320000000298023;0
699;-742067.000000000000000;-1042896.000000000000000;0
7958;-741664.710000000894070;-1044289.879999998956919;0
1343;-741714.000000000000000;-1044765.000000000000000;0
5197;-743222.513000000268221;-1043313.989999998360872;0
5655;-743429.699000000953674;-1043704.359999999403954;0
4621;-742536.945999998599291;-1042552.296000000089407;0
2197;-743331.000000000000000;-1045189.000000000000000;0
6359;-742018.440000001341105;-1042712.449999999254942;0
2322;-742651.000000000000000;-1045483.000000000000000;0
8062;-742311.170000001788139;-1045127.960000000894070;0
1735;-741709.000000000000000;-1045434.000000000000000;0
5658;-743428.059999998658895;-1043708.153000000864267;0
5690;-743415.532999999821186;-1043635.447000000625849;0
1875;-743367.000000000000000;-1044261.000000000000000;0
706;-741897.000000000000000;-1042881.000000000000000;0
4849;-742966.960000000894070;-1042893.583999998867512;0
6776;-741098.559999998658895;-1044491.530000001192093;0
746;-741714.000000000000000;-1043020.000000000000000;0
909;-742183.000000000000000;-1042503.000000000000000;0
4890;-742605.287000000476837;-1042838.535000000149012;0
4031;-743135.774000000208616;-1043769.622000001370907;0
1912;-743461.000000000000000;-1044430.000000000000000;0
339;-742606.000000000000000;-1043916.000000000000000;0
2374;-742473.000000000000000;-1045546.000000000000000;0
4898;-742571.280000001192093;-1042840.859999999403954;0
1920;-743384.000000000000000;-1044363.000000000000000;0
1424;-742134.000000000000000;-1044171.000000000000000;0
1611;-742400.000000000000000;-1044442.000000000000000;0
5577;-743409.385999999940395;-1043630.826999999582767;0
4048;-743218.050000000745058;-1043961.320000000298023;0
4517;-742638.449999999254942;-1042779.280000001192093;0
5578;-743409.534000001847744;-1043632.701000001281500;0
5110;-742876.271999999880791;-1043449.013000000268221;0
2513;-742574.000000000000000;-1044441.000000000000000;0
610;-742011.000000000000000;-1043270.000000000000000;0
2516;-742500.000000000000000;-1044414.000000000000000;0
5317;-743063.690000001341105;-1043053.769999999552965;0
1215;-742091.000000000000000;-1044365.000000000000000;0
1190;-741821.000000000000000;-1044110.000000000000000;0
2292;-742819.000000000000000;-1045388.000000000000000;0
1911;-743449.000000000000000;-1044447.000000000000000;0
4722;-742878.030000001192093;-1042626.550000000745058;0
5209;-743271.947999998927116;-1043361.392000000923872;0
8065;-742275.859999999403954;-1045204.550000000745058;0
6499;-741707.811000000685453;-1044907.068999998271465;0
3371;-743840.392999999225140;-1043010.835000000894070;0
8257;-742149.809999998658895;-1045048.399999998509884;0
5203;-743386.346000000834465;-1043274.958000000566244;0
6777;-741073.500000000000000;-1044491.879999998956919;0
6763;-741117.219999998807907;-1044428.989999998360872;0
3809;-742980.300000000745058;-1042944.469999998807907;0
265;-743344.000000000000000;-1043735.000000000000000;0
2020;-743260.000000000000000;-1044941.000000000000000;0
352;-742386.000000000000000;-1043914.000000000000000;0
4336;-742416.888999998569489;-1043431.418000001460314;0
394;-742405.000000000000000;-1043863.000000000000000;0
5223;-743283.699999999254942;-1043535.940000001341105;0
5941;-742044.835000000894070;-1043561.903999999165535;0
3802;-743068.190000001341105;-1042879.710000000894070;0
6229;-742318.326000001281500;-1043061.204999998211861;0
5241;-743365.063000001013279;-1043245.954999998211861;0
1475;-741565.000000000000000;-1044185.000000000000000;0
943;-742292.000000000000000;-1043017.000000000000000;0
6693;-742248.197000000625849;-1044816.127000000327826;0
677;-742425.000000000000000;-1043200.000000000000000;0
6857;-741503.982999999076128;-1044930.340999998152256;0
1033;-741968.000000000000000;-1044843.000000000000000;0
1004;-741898.000000000000000;-1044565.000000000000000;0
6710;-742260.203000001609325;-1044803.609999999403954;0
2284;-742901.000000000000000;-1045502.000000000000000;0
6257;-742381.556000001728535;-1043033.991000000387430;0
7284;-742811.789999999105930;-1044718.210000000894070;0
4240;-742471.613000001758337;-1043552.366000000387430;0
6240;-742364.495999999344349;-1043067.289999999105930;0
5664;-743420.907000001519918;-1043711.245999999344349;0
4599;-742625.879999998956919;-1042698.820000000298023;0
1469;-741752.000000000000000;-1044100.000000000000000;0
5370;-742580.300999999046326;-1042977.140999998897314;0
1055;-741747.000000000000000;-1045038.000000000000000;0
209;-743108.000000000000000;-1043583.000000000000000;0
2307;-742371.000000000000000;-1045477.000000000000000;0
4477;-741858.039999999105930;-1042692.129999998956919;0
4251;-742136.420000001788139;-1043379.969999998807907;0
622;-742271.000000000000000;-1043302.000000000000000;0
1601;-742452.000000000000000;-1044939.000000000000000;0
395;-742369.000000000000000;-1043840.000000000000000;0
6473;-741931.359999999403954;-1044555.109999999403954;0
6652;-741678.190000001341105;-1044132.780000001192093;0
6874;-741789.789999999105930;-1045272.100000001490116;0
7091;-743361.839999999850988;-1044584.039999999105930;0
5592;-743420.136999998241663;-1043679.831999998539686;0
4980;-742521.857999999076128;-1043030.853000000119209;0
5711;-743422.837999999523163;-1043640.131000000983477;0
2375;-742438.000000000000000;-1045570.000000000000000;0
4058;-743138.765000000596046;-1043625.405000001192093;0
203;-743204.000000000000000;-1043607.000000000000000;0
4253;-742109.368000000715256;-1043416.399999998509884;0
1013;-742076.000000000000000;-1044595.000000000000000;0
585;-741960.000000000000000;-1043413.000000000000000;0
4248;-742157.039999999105930;-1043376.699999999254942;0
6178;-742312.960000000894070;-1043060.445999998599291;0
3181;-743898.234999999403954;-1042567.133000001311302;0
4515;-742607.100000001490116;-1042765.780000001192093;0
1086;-741659.000000000000000;-1044542.000000000000000;0
5755;-743415.670000001788139;-1043702.254000000655651;0
6182;-742317.399000000208616;-1043067.136999998241663;0
7174;-742639.019999999552965;-1044564.949999999254942;0
4598;-742602.175000000745058;-1042688.015999998897314;0
5369;-742583.364999998360872;-1042976.820999998599291;0
1534;-741849.000000000000000;-1043893.000000000000000;0
3110;-743743.295000001788139;-1042640.627000000327826;0
5198;-743259.600999999791384;-1043302.061000000685453;0
5581;-743409.978999998420477;-1043638.324000000953674;0
6189;-742312.041999999433756;-1043057.302000001072884;0
1943;-743264.000000000000000;-1044421.000000000000000;0
4909;-742383.146000001579523;-1042799.159000001847744;0
572;-742083.000000000000000;-1043561.000000000000000;0
1288;-742189.000000000000000;-1044543.000000000000000;0
2259;-743001.000000000000000;-1045599.000000000000000;0
5283;-743032.892000000923872;-1043284.399000000208616;0
1598;-742351.000000000000000;-1045090.000000000000000;0
1458;-741506.000000000000000;-1044384.000000000000000;0
5957;-742962.627000000327826;-1043510.905000001192093;0
6112;-742237.710000000894070;-1043370.434999998658895;0
1604;-742552.000000000000000;-1044918.000000000000000;0
6171;-742310.780999999493361;-1043057.971000000834465;0
4841;-742989.993999999016523;-1042765.850999999791384;0
1294;-742061.000000000000000;-1044478.000000000000000;0
6202;-742317.124000001698732;-1043063.651999998837709;0
1448;-741537.000000000000000;-1044716.000000000000000;0
4218;-742263.436999998986721;-1043615.100999999791384;0
4888;-742649.925999999046326;-1042830.767000000923872;0
6198;-742312.659000001847744;-1043056.964999999850988;0
4737;-742718.399999998509884;-1042684.079999998211861;0
3155;-743969.353000000119209;-1042568.828000001609325;0
7347;-742557.690000001341105;-1045177.440000001341105;0
7992;-741480.739999998360872;-1045117.620000001043081;0
2154;-742805.000000000000000;-1045147.000000000000000;0
318;-742434.000000000000000;-1044213.000000000000000;0
6251;-742377.396999999880791;-1043042.284000001847744;0
4699;-742676.469999998807907;-1042731.760000001639128;0
5187;-743086.927000001072884;-1043435.230999998748302;0
1457;-741510.000000000000000;-1044411.000000000000000;0
1707;-741196.219999998807907;-1044702.390000000596046;0
4997;-742492.638000000268221;-1042962.833999998867512;0
674;-742463.000000000000000;-1043211.000000000000000;0
6194;-742315.721000000834465;-1043062.585999999195337;0
1915;-743468.000000000000000;-1044494.000000000000000;0
512;-742063.000000000000000;-1043136.000000000000000;0
4250;-742144.109999999403954;-1043367.519999999552965;0
6273;-742321.806000001728535;-1043017.085000000894070;0
5048;-742867.500000000000000;-1043381.899999998509884;0
570;-742098.000000000000000;-1043582.000000000000000;0
5229;-743327.379999998956919;-1043528.620000001043081;0
5134;-742995.984000001102686;-1043497.364000000059605;0
4680;-742759.370000001043081;-1042864.140000000596046;0
2040;-743285.000000000000000;-1044809.000000000000000;0
2331;-742895.000000000000000;-1045530.000000000000000;0
6767;-741223.949999999254942;-1044422.059999998658895;0
6004;-742061.723000001162291;-1043300.859999999403954;0
4752;-742774.460000000894070;-1042743.280000001192093;0
1494;-741173.000000000000000;-1044326.000000000000000;0
817;-741937.000000000000000;-1042586.000000000000000;0
5676;-743406.725999999791384;-1043716.493000000715256;0
4956;-742383.579999998211861;-1043007.739999998360872;0
5514;-743426.903000000864267;-1043609.252999998629093;0
4900;-742508.089999999850988;-1042815.289999999105930;0
6568;-741292.100000001490116;-1044161.670000001788139;0
1136;-741520.000000000000000;-1044455.000000000000000;0
5235;-743350.096000000834465;-1043388.881000000983477;0
4600;-742647.000000000000000;-1042709.000000000000000;0
1947;-743286.000000000000000;-1044465.000000000000000;0
6193;-742316.486000001430511;-1043063.991000000387430;0
7928;-743542.539999999105930;-1044784.769999999552965;0
6231;-742316.769000001251698;-1043058.344000000506639;0
5639;-743428.337999999523163;-1043685.046999998390675;0
6130;-742312.136999998241663;-1043066.344000000506639;0
8057;-742238.839999999850988;-1045047.489999998360872;0
6225;-742314.519999999552965;-1043055.927000001072884;0
1655;-741391.000000000000000;-1044651.000000000000000;0
4889;-742621.425000000745058;-1042831.109999999403954;0
3233;-744152.962999999523163;-1042686.791999999433756;0
553;-742251.000000000000000;-1043741.000000000000000;0
6201;-742317.888999998569489;-1043065.035000000149012;0
6227;-742319.839999999850988;-1043063.936000000685453;0
4508;-742449.140000000596046;-1042725.980000000447035;0
5000;-742542.798000000417233;-1042978.486999999731779;0
191;-743424.000000000000000;-1043599.000000000000000;0
1816;-743070.000000000000000;-1044444.000000000000000;0
5600;-743410.407000001519918;-1043680.594000000506639;0
2498;-741906.000000000000000;-1044040.000000000000000;0
3020;-744427.359000001102686;-1042798.999000001698732;0
630;-742179.000000000000000;-1043289.000000000000000;0
941;-742098.000000000000000;-1043132.000000000000000;0
5506;-743427.348000001162291;-1043665.644999999552965;0
1538;-741948.000000000000000;-1043973.000000000000000;0
1545;-742236.000000000000000;-1044234.000000000000000;0
4332;-742410.359000001102686;-1043282.916000001132488;0
7980;-741198.179999999701977;-1044410.339999999850988;0
7175;-742651.780000001192093;-1044558.149999998509884;0
6689;-742384.449999999254942;-1045033.609999999403954;0
4825;-742908.839999999850988;-1042860.670000001788139;0
1157;-741172.000000000000000;-1044489.000000000000000;0
222;-742939.000000000000000;-1043526.000000000000000;0
1562;-743199.000000000000000;-1045122.000000000000000;0
1679;-741116.550000000745058;-1044578.600000001490116;0
4177;-742387.940999999642372;-1044182.254999998956919;0
501;-741836.000000000000000;-1043163.000000000000000;0
613;-742089.000000000000000;-1043271.000000000000000;0
930;-744068.000000000000000;-1043405.000000000000000;0
4322;-742266.414000000804663;-1043213.907999999821186;0
2136;-742993.000000000000000;-1045103.000000000000000;0
