OID_;X;Y;TEMPERATURE
3919;-743904.947000000625849;-1043493.929999999701977;0
6746;-742405.083999998867512;-1044259.199999999254942;0
1519;-741754.000000000000000;-1043956.000000000000000;0
5785;-743436.010000001639128;-1042105.550000000745058;0
3032;-744506.962000001221895;-1042717.704999998211861;0
80;-744067.000000000000000;-1043330.000000000000000;0
7155;-742920.776999998837709;-1044546.934000000357628;0
1584;-742368.000000000000000;-1044717.000000000000000;0
463;-741703.000000000000000;-1043287.000000000000000;0
6695;-742306.234000001102686;-1044816.138999998569489;0
2167;-743021.000000000000000;-1045154.000000000000000;0
402;-742342.000000000000000;-1043952.000000000000000;0
1487;-741117.000000000000000;-1044216.000000000000000;0
3111;-743727.034000001847744;-1042625.182999998331070;0
1768;-741265.000000000000000;-1044133.000000000000000;0
3580;-744924.973999999463558;-1042593.699999999254942;0
4075;-742947.934999998658895;-1043903.649999998509884;0
3387;-743960.368000000715256;-1043194.717000000178814;0
7746;-742234.789999999105930;-1045549.890000000596046;0
3371;-743840.392999999225140;-1043010.835000000894070;0
3214;-743628.813000001013279;-1042457.677000001072884;0
3065;-744092.028999999165535;-1042868.519000001251698;0
7409;-743521.629999998956919;-1045356.570000000298023;0
5267;-743190.021999999880791;-1043149.807000000029802;0
1467;-741808.000000000000000;-1044064.000000000000000;0
4062;-742830.460000000894070;-1043654.920000001788139;0
7516;-742248.390000000596046;-1044368.907999999821186;0
8019;-741972.039999999105930;-1044557.089999999850988;0
281;-743045.000000000000000;-1043848.000000000000000;0
4134;-742772.309999998658895;-1044078.870000001043081;0
2755;-744003.879000000655651;-1043471.734000001102686;0
6814;-741118.537999998778105;-1044802.493000000715256;0
4077;-742849.614999998360872;-1043858.745000001043081;0
888;-741994.000000000000000;-1042797.000000000000000;0
8149;-743305.579999998211861;-1043204.070000000298023;0
1253;-742084.000000000000000;-1044730.000000000000000;0
738;-741818.000000000000000;-1043024.000000000000000;0
4173;-742756.320000000298023;-1043749.629999998956919;0
2501;-742746.000000000000000;-1045430.000000000000000;0
2265;-742972.000000000000000;-1045774.000000000000000;0
2241;-743319.000000000000000;-1045289.000000000000000;0
651;-742490.000000000000000;-1043564.000000000000000;0
2498;-741906.000000000000000;-1044040.000000000000000;0
1099;-741376.000000000000000;-1044563.000000000000000;0
23;-743544.000000000000000;-1042505.000000000000000;0
2329;-742432.000000000000000;-1045508.000000000000000;0
585;-741960.000000000000000;-1043413.000000000000000;0
512;-742063.000000000000000;-1043136.000000000000000;61
5405;-744043.826000001281500;-1042674.686000000685453;0
3769;-742978.969999998807907;-1042975.300000000745058;0
7189;-742588.486999999731779;-1044766.690999999642372;0
5086;-742856.307999998331070;-1043239.488000001758337;0
7745;-742933.037000000476837;-1045523.714999999850988;0
4056;-743125.315000001341105;-1043671.969999998807907;0
5122;-742902.166999999433756;-1043373.543999999761581;0
1939;-743269.000000000000000;-1044355.000000000000000;0
872;-741698.000000000000000;-1042669.000000000000000;0
883;-741802.000000000000000;-1042773.000000000000000;0
3752;-743213.949999999254942;-1042902.719999998807907;0
227;-742846.000000000000000;-1043520.000000000000000;0
536;-742085.000000000000000;-1043673.000000000000000;0
1531;-741782.000000000000000;-1043838.000000000000000;0
543;-742361.000000000000000;-1043823.000000000000000;0
6487;-741745.798000000417233;-1044519.414999999105930;0
7285;-742806.960000000894070;-1044758.379999998956919;0
1369;-742029.000000000000000;-1044788.000000000000000;0
6;-743464.000000000000000;-1042594.000000000000000;0
1404;-741692.000000000000000;-1044355.000000000000000;0
3915;-744021.765999998897314;-1043098.603999998420477;0
8059;-742265.730000000447035;-1045081.309999998658895;0
6822;-741283.870000001043081;-1044793.059999998658895;0
2322;-742651.000000000000000;-1045483.000000000000000;0
1727;-741495.000000000000000;-1045103.000000000000000;0
4068;-742917.125000000000000;-1043734.535000000149012;0
3812;-743231.179999999701977;-1042815.199999999254942;0
3239;-744159.614000000059605;-1042651.675000000745058;0
4808;-743110.859999999403954;-1042784.829999998211861;0
2399;-742121.000000000000000;-1045372.000000000000000;0
2232;-743488.000000000000000;-1045234.000000000000000;0
3848;-743094.383999999612570;-1042505.245000001043081;0
6558;-741292.800000000745058;-1044013.629999998956919;0
506;-741980.000000000000000;-1043158.000000000000000;0
1172;-741869.000000000000000;-1044348.000000000000000;0
4162;-742497.193999998271465;-1044160.030000001192093;0
2250;-743234.000000000000000;-1045435.000000000000000;0
7171;-742671.969999998807907;-1044508.219999998807907;0
3761;-743202.559999998658895;-1042981.710000000894070;0
1376;-742165.000000000000000;-1044873.000000000000000;0
6657;-741565.760000001639128;-1044156.980000000447035;0
2394;-742273.000000000000000;-1045360.000000000000000;0
1214;-742064.000000000000000;-1044358.000000000000000;0
4334;-742384.170000001788139;-1043468.820000000298023;0
1739;-741831.780000001192093;-1045213.809999998658895;0
6776;-741098.559999998658895;-1044491.530000001192093;0
6825;-741380.010000001639128;-1044780.089999999850988;0
3092;-743909.377999998629093;-1042780.322999998927116;0
6014;-742844.000000000000000;-1043239.482999999076128;0
7961;-741602.260000001639128;-1044314.350000001490116;0
6652;-741678.190000001341105;-1044132.780000001192093;0
6249;-742373.554999999701977;-1043049.822000000625849;0
4120;-742715.179999999701977;-1043974.089999999850988;0
2046;-743382.000000000000000;-1044968.000000000000000;0
1004;-741898.000000000000000;-1044565.000000000000000;0
6320;-741766.848000001162291;-1042614.989999998360872;0
1477;-741482.750000000000000;-1044212.480000000447035;0
2257;-742956.000000000000000;-1045558.000000000000000;0
3566;-744732.028000000864267;-1042600.848000001162291;0
1590;-742377.000000000000000;-1044885.000000000000000;0
540;-742144.000000000000000;-1043804.000000000000000;0
7218;-742534.100000001490116;-1044603.559999998658895;0
5231;-743342.107000000774860;-1043497.627000000327826;0
4712;-742830.309999998658895;-1042614.969999998807907;0
6104;-742208.646999999880791;-1043103.999000001698732;0
2221;-743076.000000000000000;-1045412.000000000000000;0
6717;-742311.105999998748302;-1044960.396999999880791;0
4652;-742775.500000000000000;-1042533.997999999672174;0
1038;-741956.000000000000000;-1044977.000000000000000;0
5993;-743947.829999998211861;-1042646.350000001490116;0
1116;-741125.980000000447035;-1044610.410000000149012;0
2016;-743230.000000000000000;-1044873.000000000000000;0
4936;-742454.684000000357628;-1042685.620999999344349;0
4623;-742533.778999999165535;-1042585.824000000953674;0
1991;-743482.000000000000000;-1044929.000000000000000;0
6432;-742029.997999999672174;-1043511.272999998182058;0
597;-741855.000000000000000;-1043268.000000000000000;0
3820;-743111.699999999254942;-1042659.320000000298023;0
743;-741682.000000000000000;-1043020.000000000000000;0
2566;-741010.000000000000000;-1044427.000000000000000;0
1619;-742426.000000000000000;-1044401.000000000000000;0
1110;-741220.730000000447035;-1044598.480000000447035;0
3378;-743818.598999999463558;-1042922.491999998688698;0
2213;-743188.000000000000000;-1045298.000000000000000;0
4788;-742970.409000001847744;-1042588.238000001758337;0
1852;-742739.000000000000000;-1044210.000000000000000;0
2082;-742569.000000000000000;-1044642.000000000000000;0
5389;-744380.177000001072884;-1042796.489000000059605;0
671;-742489.000000000000000;-1043245.000000000000000;0
1126;-741684.000000000000000;-1044450.000000000000000;0
6995;-743129.710000000894070;-1044496.579999998211861;0
4218;-742263.436999998986721;-1043615.100999999791384;0
217;-742998.000000000000000;-1043554.000000000000000;0
4250;-742144.109999999403954;-1043367.519999999552965;0
1611;-742400.000000000000000;-1044442.000000000000000;0
5998;-742019.482000000774860;-1043283.164000000804663;0
1451;-741522.000000000000000;-1044602.000000000000000;0
1014;-742097.000000000000000;-1044586.000000000000000;0
696;-742077.000000000000000;-1042913.000000000000000;0
1342;-741721.000000000000000;-1044783.000000000000000;0
502;-741901.000000000000000;-1043169.000000000000000;0
2335;-742825.000000000000000;-1045539.000000000000000;0
5651;-743429.440999999642372;-1043699.524999998509884;0
7002;-743079.250000000000000;-1044377.170000001788139;0
5641;-743428.517000000923872;-1043687.460000000894070;0
2129;-743108.000000000000000;-1045142.000000000000000;0
1553;-741350.000000000000000;-1044268.000000000000000;0
2362;-742301.000000000000000;-1045580.000000000000000;0
1304;-741810.000000000000000;-1044684.000000000000000;0
4793;-743035.089999999850988;-1042650.028000000864267;0
7086;-743333.149999998509884;-1044527.250000000000000;0
4754;-742745.359999999403954;-1042759.160000000149012;0
4959;-742331.289999999105930;-1043002.690000001341105;0
1963;-743410.000000000000000;-1044689.000000000000000;0
2327;-742491.000000000000000;-1045502.000000000000000;0
1088;-741617.000000000000000;-1044547.000000000000000;0
7324;-742833.980000000447035;-1044949.109999999403954;0
7043;-743398.899999998509884;-1044106.629999998956919;27
6996;-743116.699999999254942;-1044476.469999998807907;0
2524;-742108.000000000000000;-1044191.000000000000000;0
346;-742540.000000000000000;-1043816.000000000000000;0
172;-743456.000000000000000;-1043433.000000000000000;0
810;-741934.000000000000000;-1042519.000000000000000;0
1226;-742204.000000000000000;-1044247.000000000000000;0
177;-743376.000000000000000;-1043232.000000000000000;0
5738;-743410.412999998778105;-1043691.800000000745058;0
7016;-742557.515000000596046;-1044334.074999999254942;0
6830;-741526.739999998360872;-1044761.309000000357628;0
6832;-741552.254000000655651;-1044899.227000001817942;0
2516;-742500.000000000000000;-1044414.000000000000000;0
1722;-741672.000000000000000;-1045029.000000000000000;0
8283;-742198.600000001490116;-1042801.980000000447035;0
1662;-741451.000000000000000;-1044403.000000000000000;0
6389;-742141.199999999254942;-1042497.030000001192093;0
675;-742446.000000000000000;-1043215.000000000000000;0
1957;-743402.000000000000000;-1044519.000000000000000;0
1439;-741772.000000000000000;-1044379.000000000000000;0
1984;-743476.000000000000000;-1044743.000000000000000;0
1316;-741765.000000000000000;-1044903.000000000000000;0
5713;-743423.890999998897314;-1043636.899999998509884;0
1382;-742096.000000000000000;-1045023.000000000000000;0
4742;-742822.300000000745058;-1042747.920000001788139;0
556;-742222.000000000000000;-1043702.000000000000000;0
4575;-742336.600000001490116;-1042692.170000001788139;0
5936;-743333.519000001251698;-1043956.541999999433756;0
2393;-742054.000000000000000;-1045282.000000000000000;0
1289;-742211.000000000000000;-1044521.000000000000000;0
5144;-743052.642000000923872;-1043488.940000001341105;0
6721;-742321.052999999374151;-1044705.548000000417233;0
921;-743338.000000000000000;-1043818.000000000000000;0
6479;-741969.831000000238419;-1044454.850000001490116;0
5450;-743130.769000001251698;-1043378.403000000864267;0
5461;-742442.704999998211861;-1043234.515000000596046;0
7280;-742806.989999998360872;-1044667.600000001490116;0
4978;-742491.822999998927116;-1043028.688000001013279;0
4630;-742646.271999999880791;-1042652.089999999850988;0
4559;-742400.530000001192093;-1042503.760000001639128;0
5657;-743429.199999999254942;-1043706.837999999523163;0
2418;-742410.000000000000000;-1045109.000000000000000;0
4964;-742390.059999998658895;-1043044.839999999850988;0
1857;-742574.000000000000000;-1044318.000000000000000;0
2419;-742418.000000000000000;-1045101.000000000000000;0
1929;-743440.000000000000000;-1044410.000000000000000;0
6265;-742353.164999999105930;-1043020.054999999701977;0
7655;-742266.583000000566244;-1045284.133999999612570;0
4427;-742190.519999999552965;-1043099.440000001341105;0
4321;-742265.214999999850988;-1043235.418999999761581;0
5968;-742288.989000000059605;-1044168.456999998539686;0
5434;-744042.467999998480082;-1043135.986999999731779;0
1309;-741611.000000000000000;-1044813.000000000000000;0
2545;-741723.000000000000000;-1044265.000000000000000;0
882;-741825.000000000000000;-1042788.000000000000000;0
3702;-744567.984999999403954;-1042510.802000001072884;0
4896;-742589.649999998509884;-1042838.989999998360872;0
1298;-741964.000000000000000;-1044736.000000000000000;0
6364;-742003.519999999552965;-1042660.690000001341105;0
545;-742337.000000000000000;-1043805.000000000000000;0
5136;-742992.278000000864267;-1043472.440000001341105;0
4144;-742704.414999999105930;-1043822.484999999403954;0
4830;-743043.449999999254942;-1042882.359999999403954;0
376;-742530.000000000000000;-1043680.000000000000000;0
2512;-743070.000000000000000;-1044052.000000000000000;0
8277;-742111.260000001639128;-1042746.399999998509884;0
2433;-742514.000000000000000;-1045081.000000000000000;0
1412;-741635.760000001639128;-1044654.449999999254942;0
2331;-742895.000000000000000;-1045530.000000000000000;0
3527;-744805.695999998599291;-1042671.809000000357628;0
6705;-742279.050999999046326;-1044655.923000000417233;0
4138;-742883.587000001221895;-1043997.287999998778105;0
5421;-742337.905999999493361;-1042777.837999999523163;0
4628;-742619.598000001162291;-1042609.989999998360872;0
341;-742592.000000000000000;-1043889.000000000000000;0
4953;-742431.500999998301268;-1043027.399999998509884;0
4877;-742845.760000001639128;-1042956.589999999850988;0
4839;-742984.162000000476837;-1042715.425000000745058;0
2152;-742814.000000000000000;-1045106.000000000000000;0
6266;-742349.021000001579523;-1043019.662999998778105;0
2051;-743434.000000000000000;-1045074.000000000000000;0
2218;-743091.000000000000000;-1045372.000000000000000;0
699;-742067.000000000000000;-1042896.000000000000000;0
4020;-743160.616000000387430;-1043872.782999999821186;0
5686;-743394.912000000476837;-1043720.872000001370907;0
1426;-742056.000000000000000;-1044228.000000000000000;0
727;-742001.000000000000000;-1042962.000000000000000;0
4900;-742508.089999999850988;-1042815.289999999105930;0
5325;-742997.480000000447035;-1043042.289999999105930;0
5696;-743417.096000000834465;-1043637.135999999940395;0
1296;-742100.000000000000000;-1044473.000000000000000;0
876;-741953.000000000000000;-1042636.000000000000000;0
351;-742509.000000000000000;-1043739.000000000000000;0
4221;-742209.576000001281500;-1043499.238000001758337;0
8073;-742120.640000000596046;-1045259.500000000000000;0
2310;-742301.000000000000000;-1045537.000000000000000;0
6963;-743004.519999999552965;-1044166.870000001043081;0
5234;-743348.486000001430511;-1043412.741999998688698;0
7142;-742872.445000000298023;-1044472.239999998360872;0
3949;-743420.780000001192093;-1043527.820000000298023;0
528;-742187.000000000000000;-1043838.000000000000000;0
4563;-742461.379999998956919;-1042526.230000000447035;0
2343;-742674.000000000000000;-1045557.000000000000000;0
5941;-742044.835000000894070;-1043561.903999999165535;0
274;-743359.000000000000000;-1043833.000000000000000;0
5178;-743386.421000000089407;-1043452.486000001430511;0
6178;-742312.960000000894070;-1043060.445999998599291;0
1970;-743380.000000000000000;-1044854.000000000000000;0
1240;-742145.000000000000000;-1044418.000000000000000;0
1875;-743367.000000000000000;-1044261.000000000000000;0
6192;-742317.252000000327826;-1043065.394999999552965;0
4335;-742398.230000000447035;-1043445.760000001639128;0
4333;-742428.420000001788139;-1043255.609999999403954;0
7721;-742941.157000001519918;-1044215.368000000715256;0
6359;-742018.440000001341105;-1042712.449999999254942;0
1458;-741506.000000000000000;-1044384.000000000000000;0
3413;-743776.791000001132488;-1043071.675000000745058;0
2080;-742685.000000000000000;-1044460.000000000000000;0
5711;-743422.837999999523163;-1043640.131000000983477;0
4981;-742536.340999998152256;-1043014.929999999701977;0
3093;-743925.421999998390675;-1042803.127000000327826;0
4518;-742623.960000000894070;-1042786.719999998807907;0
4531;-742746.070000000298023;-1042885.980000000447035;0
6153;-742309.583999998867512;-1043058.640999998897314;0
6449;-743140.379999998956919;-1043395.559999998658895;0
1599;-742237.000000000000000;-1044977.000000000000000;0
3457;-745069.765000000596046;-1042699.907000001519918;0
1933;-743329.000000000000000;-1044407.000000000000000;0
7143;-742850.414999999105930;-1044473.449999999254942;0
2096;-743154.000000000000000;-1044724.000000000000000;0
827;-742218.000000000000000;-1042626.000000000000000;0
1544;-742236.000000000000000;-1044198.000000000000000;0
6169;-742312.320000000298023;-1043060.791999999433756;0
879;-741947.000000000000000;-1042541.000000000000000;0
6132;-742310.590999998152256;-1043063.552999999374151;0
7967;-741508.109999999403954;-1044369.239999998360872;0
282;-743034.000000000000000;-1043819.000000000000000;0
7019;-742585.024999998509884;-1044210.725000001490116;0
1370;-742061.000000000000000;-1044797.000000000000000;0
3517;-744882.524000000208616;-1042691.002000000327826;0
1518;-741994.000000000000000;-1044011.000000000000000;0
5504;-743428.977000001817942;-1043686.274000000208616;0
1499;-741413.000000000000000;-1044304.000000000000000;0
3287;-743711.173999998718500;-1042886.515999998897314;0
6208;-742320.098000001162291;-1043067.458999998867512;0
1359;-742000.000000000000000;-1044897.000000000000000;0
4577;-742376.686000000685453;-1042590.309999998658895;0
1287;-742217.000000000000000;-1044486.000000000000000;0
1760;-741162.000000000000000;-1044101.000000000000000;0
3160;-743959.590999998152256;-1042557.386999998241663;0
3396;-743905.006000000983477;-1043084.449999999254942;0
846;-742175.000000000000000;-1042517.000000000000000;0
6831;-741523.252000000327826;-1044883.298000000417233;0
2032;-743526.000000000000000;-1044797.000000000000000;0
7000;-743096.190000001341105;-1044426.870000001043081;0
5959;-742962.548999998718500;-1043523.155000001192093;0
4760;-742826.947000000625849;-1042799.914000000804663;0
541;-742258.000000000000000;-1043678.000000000000000;0
5745;-743415.129000000655651;-1043695.054000001400709;0
3273;-743642.442999999970198;-1042796.677999999374151;0
1149;-741311.000000000000000;-1044471.000000000000000;0
677;-742425.000000000000000;-1043200.000000000000000;0
1353;-741862.000000000000000;-1044843.000000000000000;0
7004;-743069.289999999105930;-1044326.469999998807907;0
1816;-743070.000000000000000;-1044444.000000000000000;0
2075;-743114.000000000000000;-1044772.000000000000000;0
3289;-743584.761999998241663;-1042769.188000001013279;0
1654;-741387.000000000000000;-1044621.000000000000000;0
3323;-743934.361999999731779;-1042945.002999998629093;0
1263;-742048.000000000000000;-1044929.000000000000000;0
5035;-742658.587999999523163;-1043006.899000000208616;0
6284;-742309.677999999374151;-1043054.043999999761581;0
1527;-741676.000000000000000;-1043775.000000000000000;0
4251;-742136.420000001788139;-1043379.969999998807907;0
6499;-741707.811000000685453;-1044907.068999998271465;0
4775;-742898.375999998301268;-1042802.914000000804663;0
7261;-742970.839999999850988;-1044878.739999998360872;0
4558;-742373.019999999552965;-1042506.949999999254942;0
611;-742037.000000000000000;-1043267.000000000000000;0
263;-743389.000000000000000;-1043725.000000000000000;0
5208;-743237.954999998211861;-1043368.065999999642372;0
1724;-741478.000000000000000;-1045023.000000000000000;0
3842;-743141.300000000745058;-1042637.030000001192093;0
4931;-742449.300000000745058;-1042791.403000000864267;0
4034;-743295.410000000149012;-1043786.070000000298023;0
779;-741708.000000000000000;-1042533.000000000000000;0
1286;-742221.460000000894070;-1044465.969999998807907;0
6399;-742013.379999998956919;-1042502.739999998360872;0
4827;-743046.359999999403954;-1042958.140000000596046;0
5999;-741991.910000000149012;-1043282.079999998211861;0
5295;-743047.995000001043081;-1043185.530000001192093;0
2048;-743528.000000000000000;-1045069.000000000000000;0
6946;-742974.765000000596046;-1043929.388000000268221;0
6397;-742033.839999999850988;-1042501.859999999403954;0
4740;-742757.410000000149012;-1042715.589999999850988;0
4629;-742630.986000001430511;-1042626.096000000834465;0
4220;-742214.344999998807907;-1043580.359999999403954;0
4928;-742444.890000000596046;-1042854.899999998509884;0
330;-742659.000000000000000;-1044043.000000000000000;0
4465;-742180.250000000000000;-1042584.370000001043081;0
5272;-743000.013999998569489;-1043245.364000000059605;0
4663;-742820.800000000745058;-1042560.039999999105930;0
2197;-743331.000000000000000;-1045189.000000000000000;0
6565;-741325.239999998360872;-1044209.190000001341105;0
7968;-741473.980000000447035;-1044379.839999999850988;0
1586;-742372.000000000000000;-1044785.000000000000000;0
4736;-742701.269999999552965;-1042690.000000000000000;0
728;-741997.000000000000000;-1042918.000000000000000;0
4511;-742539.859999999403954;-1042744.070000000298023;0
6114;-742234.250000000000000;-1043361.324999999254942;0
2083;-742588.000000000000000;-1044663.000000000000000;0
6217;-742320.725999999791384;-1043067.133999999612570;0
7200;-742561.710999999195337;-1044911.469999998807907;0
1264;-742059.000000000000000;-1044942.000000000000000;0
2026;-743351.000000000000000;-1045022.000000000000000;0
5717;-743422.208999998867512;-1043629.984000001102686;0
1918;-743377.000000000000000;-1044428.000000000000000;0
4820;-742927.769999999552965;-1042786.710000000894070;0
6181;-742318.164999999105930;-1043068.541999999433756;0
1936;-743293.000000000000000;-1044272.000000000000000;0
1535;-741873.000000000000000;-1043913.000000000000000;0
4459;-742274.829999998211861;-1042644.269999999552965;0
1916;-743371.000000000000000;-1044484.000000000000000;0
6256;-742380.723000001162291;-1043035.640000000596046;0
7808;-741986.629999998956919;-1044440.109999999403954;0
5110;-742876.271999999880791;-1043449.013000000268221;0
5411;-742776.079999998211861;-1042905.300000000745058;0
6699;-742301.118999999016523;-1044484.282999999821186;0
3835;-743050.579999998211861;-1042590.109999999403954;0
4696;-742682.817000001668930;-1042658.543999999761581;0
2550;-741576.000000000000000;-1044342.000000000000000;0
396;-742388.000000000000000;-1043886.000000000000000;0
7047;-743395.495000001043081;-1044210.765000000596046;0
1762;-741227.000000000000000;-1044108.000000000000000;0
6787;-741242.429999999701977;-1044471.370000001043081;0
1541;-742026.000000000000000;-1044034.000000000000000;0
7025;-743199.914999999105930;-1044070.515000000596046;0
4324;-742269.346000000834465;-1043165.410999998450279;0
7992;-741480.739999998360872;-1045117.620000001043081;0
4426;-742197.589999999850988;-1043031.679999999701977;0
4894;-742610.888999998569489;-1042819.686999998986721;0
5510;-743424.346000000834465;-1043626.458999998867512;0
5222;-743271.000000000000000;-1043543.149999998509884;0
5701;-743417.076999999582767;-1043630.140000000596046;0
1735;-741709.000000000000000;-1045434.000000000000000;0
6136;-742315.081999998539686;-1043070.210000000894070;0
2561;-741214.000000000000000;-1044393.000000000000000;0
8272;-742042.399999998509884;-1042732.559999998658895;0
8069;-742226.440000001341105;-1045255.949999999254942;0
4954;-742405.539999999105930;-1043024.640000000596046;0
4587;-742482.011999998241663;-1042641.392999999225140;0
4619;-742460.010000001639128;-1042480.890000000596046;0
6218;-742319.947000000625849;-1043065.767999999225140;0
1178;-741952.000000000000000;-1044311.000000000000000;0
4031;-743135.774000000208616;-1043769.622000001370907;0
5250;-743328.995000001043081;-1043178.495000001043081;0
7168;-742792.969999998807907;-1044547.879999998956919;0
3976;-743088.861000001430511;-1043707.728000000119209;0
1324;-741943.000000000000000;-1044994.000000000000000;0
4832;-743039.079999998211861;-1042840.850000001490116;0
7150;-742820.427000001072884;-1044516.962000001221895;0
5730;-743418.855999998748302;-1043638.949000000953674;0
631;-742153.000000000000000;-1043288.000000000000000;0
5417;-742604.429000001400709;-1042550.491999998688698;0
6838;-741701.057999998331070;-1044977.087000001221895;0
1808;-743187.000000000000000;-1044539.000000000000000;0
591;-741912.000000000000000;-1043346.000000000000000;0
4252;-742124.022999998182058;-1043390.519000001251698;0
3269;-743600.679000001400709;-1042731.660000000149012;0
2493;-742011.000000000000000;-1044181.000000000000000;0
2453;-742941.000000000000000;-1044121.000000000000000;0
6753;-742485.511999998241663;-1044950.206999998539686;0
6209;-742319.320000000298023;-1043066.114999998360872;0
6354;-741928.410000000149012;-1042711.350000001490116;0
4715;-742877.199999999254942;-1042610.059999998658895;0
6260;-742377.692999999970198;-1043022.434000000357628;0
3568;-744718.817999999970198;-1042588.614999998360872;0
2045;-743418.000000000000000;-1044961.000000000000000;0
6501;-741689.493000000715256;-1044942.905000001192093;0
1832;-743024.000000000000000;-1044100.000000000000000;0
3747;-743250.879999998956919;-1042956.620000001043081;0
4048;-743218.050000000745058;-1043961.320000000298023;0
3951;-743433.379999998956919;-1043586.600000001490116;0
6223;-742316.076000001281500;-1043058.679000001400709;0
5735;-743414.589999999850988;-1043687.874000001698732;0
209;-743108.000000000000000;-1043583.000000000000000;0
1181;-741920.000000000000000;-1044230.000000000000000;0
5161;-743160.846999999135733;-1043333.914999999105930;0
1912;-743461.000000000000000;-1044430.000000000000000;0
5309;-743033.405000001192093;-1043187.043999999761581;0
7518;-742829.780000001192093;-1045693.210000000894070;0
7130;-743306.429999999701977;-1044539.519999999552965;0
5408;-743696.881000000983477;-1042878.024999998509884;0
2464;-743519.000000000000000;-1044697.000000000000000;0
733;-741963.000000000000000;-1043018.000000000000000;0
1016;-742147.000000000000000;-1044590.000000000000000;0
1455;-741517.000000000000000;-1044468.000000000000000;0
5584;-743408.885000001639128;-1043643.532000001519918;0
4166;-742448.504999998956919;-1044046.885000001639128;0
5700;-743416.574000000953674;-1043630.223999999463558;0
1138;-741500.000000000000000;-1044458.000000000000000;0
6220;-742318.432999998331070;-1043062.949999999254942;0
6144;-742308.925000000745058;-1043059.002000000327826;0
7541;-742644.280000001192093;-1045370.789999999105930;0
6908;-741713.539999999105930;-1045085.160000000149012;0
5666;-743418.543999999761581;-1043712.120000001043081;0
614;-742111.000000000000000;-1043271.000000000000000;0
4429;-742222.260000001639128;-1043102.250000000000000;0
7154;-742908.467000000178814;-1044547.784000001847744;0
4743;-742812.449999999254942;-1042729.609999999403954;0
2189;-743472.000000000000000;-1045183.000000000000000;0
1855;-742642.000000000000000;-1044286.000000000000000;0
698;-742041.000000000000000;-1042903.000000000000000;0
4951;-742335.579999998211861;-1042934.429999999701977;0
4963;-742396.510000001639128;-1043031.829999998211861;0
4670;-742810.120000001043081;-1042644.289999999105930;0
171;-743448.000000000000000;-1043399.000000000000000;0
560;-742181.000000000000000;-1043665.000000000000000;0
5064;-742811.537999998778105;-1043238.886999998241663;0
1500;-741441.000000000000000;-1044299.000000000000000;0
821;-742048.000000000000000;-1042601.000000000000000;0
4130;-742868.460000000894070;-1044055.510000001639128;0
1705;-741257.219999998807907;-1044695.690000001341105;0
4009;-743231.157999999821186;-1044047.155000001192093;0
4123;-742742.956000000238419;-1043901.826000001281500;0
6843;-741569.070000000298023;-1044975.261999998241663;0
4228;-742132.969999998807907;-1043331.449999999254942;0
1573;-742358.000000000000000;-1044452.000000000000000;0
5224;-743293.449999999254942;-1043542.160000000149012;0
2579;-742497.000000000000000;-1045572.000000000000000;0
8048;-742190.519999999552965;-1044865.730000000447035;0
1683;-741134.429999999701977;-1044711.329999998211861;0
1981;-743406.000000000000000;-1044627.000000000000000;0
7223;-742409.149999998509884;-1044822.649999998509884;0
4947;-742399.918000001460314;-1042993.458000000566244;0
