OID_;X;Y;TEMPERATURE
3614;-744984.548999998718500;-1042283.640999998897314;0
110;-744127.000000000000000;-1042724.000000000000000;3
3019;-744463.447999998927116;-1042784.646000001579523;0
3568;-744718.817999999970198;-1042588.614999998360872;0
3692;-744525.876499999314547;-1042540.534000001847744;0
3580;-744924.973999999463558;-1042593.699999999254942;0
2605;-745393.842999998480082;-1042860.796000000089407;0
5975;-745052.346999999135733;-1042674.673000000417233;0
118;-745135.000000000000000;-1042687.000000000000000;0
3542;-744575.274000000208616;-1042656.160000000149012;0
2696;-743477.489999998360872;-1042038.000000000000000;0
2520;-741847.000000000000000;-1045324.000000000000000;0
6874;-741789.789999999105930;-1045272.100000001490116;0
696;-742077.000000000000000;-1042913.000000000000000;0
7259;-742935.280000001192093;-1044869.829999998211861;0
7246;-742736.730000000447035;-1044825.399999998509884;0
1524;-741710.000000000000000;-1043844.000000000000000;0
7;-743479.000000000000000;-1042567.000000000000000;0
2009;-743221.000000000000000;-1044770.000000000000000;0
2070;-742993.000000000000000;-1044723.000000000000000;0
2021;-743281.000000000000000;-1044948.000000000000000;0
1521;-741808.000000000000000;-1043917.000000000000000;0
2007;-743231.000000000000000;-1044741.000000000000000;0
3066;-744075.627000000327826;-1042883.837000001221895;0
3752;-743213.949999999254942;-1042902.719999998807907;0
709;-741861.000000000000000;-1042862.000000000000000;0
725;-741983.000000000000000;-1042939.000000000000000;0
3111;-743727.034000001847744;-1042625.182999998331070;0
1764;-741163.000000000000000;-1044144.000000000000000;0
5065;-742796.800999999046326;-1043254.010000001639128;0
2149;-742819.000000000000000;-1045024.000000000000000;0
7706;-742313.239999998360872;-1044319.611999999731779;0
3211;-743651.409000001847744;-1042483.458999998867512;0
6;-743464.000000000000000;-1042594.000000000000000;0
3216;-743615.890999998897314;-1042451.129999998956919;0
2043;-743471.000000000000000;-1044959.000000000000000;0
7516;-742248.390000000596046;-1044368.907999999821186;0
8077;-742038.989999998360872;-1045265.309999998658895;0
2398;-742150.000000000000000;-1045370.000000000000000;0
730;-741948.000000000000000;-1042998.000000000000000;0
543;-742361.000000000000000;-1043823.000000000000000;0
2154;-742805.000000000000000;-1045147.000000000000000;0
465;-741728.000000000000000;-1043309.000000000000000;0
7732;-742611.719000000506639;-1044632.203999999910593;0
1629;-742450.000000000000000;-1044518.000000000000000;0
2515;-742517.000000000000000;-1044420.000000000000000;0
316;-742490.000000000000000;-1044202.000000000000000;0
738;-741818.000000000000000;-1043024.000000000000000;0
1540;-742005.000000000000000;-1044009.000000000000000;0
4047;-743210.230000000447035;-1043992.289999999105930;0
2314;-742884.000000000000000;-1045456.000000000000000;0
1619;-742426.000000000000000;-1044401.000000000000000;0
744;-741666.000000000000000;-1042994.000000000000000;0
7018;-742577.747000001370907;-1044239.712999999523163;0
1935;-743276.000000000000000;-1044289.000000000000000;0
7010;-742857.964999999850988;-1044251.155000001192093;4
509;-741991.000000000000000;-1043143.000000000000000;0
1189;-741786.000000000000000;-1044043.000000000000000;0
7142;-742872.445000000298023;-1044472.239999998360872;0
2536;-742003.000000000000000;-1044113.000000000000000;0
600;-741840.000000000000000;-1043212.000000000000000;0
1780;-741214.000000000000000;-1043934.000000000000000;0
1537;-741924.000000000000000;-1043954.000000000000000;0
884;-741771.000000000000000;-1042776.000000000000000;0
2262;-742999.000000000000000;-1045686.000000000000000;0
1942;-743283.000000000000000;-1044370.000000000000000;0
7807;-742647.802999999374151;-1044543.524000000208616;0
7147;-742827.925000000745058;-1044451.385000001639128;0
1892;-743525.000000000000000;-1044425.000000000000000;0
7801;-742459.168999999761581;-1044490.660000000149012;0
2103;-743182.000000000000000;-1044931.000000000000000;0
7278;-742803.899999998509884;-1044636.800000000745058;0
2091;-742920.000000000000000;-1044593.000000000000000;0
4079;-742836.170000001788139;-1043800.960000000894070;0
1272;-742237.000000000000000;-1044545.000000000000000;0
1017;-742167.000000000000000;-1044603.000000000000000;0
2135;-743006.000000000000000;-1045119.000000000000000;0
2212;-743217.000000000000000;-1045279.000000000000000;0
6650;-741714.296999998390675;-1044110.177000001072884;0
1949;-743248.000000000000000;-1044491.000000000000000;0
4180;-742368.370000001043081;-1044115.471999999135733;0
1797;-743098.000000000000000;-1044099.000000000000000;0
5283;-743032.892000000923872;-1043284.399000000208616;0
758;-741658.000000000000000;-1042666.000000000000000;0
7031;-743301.824999999254942;-1044080.774999998509884;0
5294;-743056.328999999910593;-1043196.096999999135733;0
2129;-743108.000000000000000;-1045142.000000000000000;0
283;-743026.000000000000000;-1043788.000000000000000;0
2161;-742876.000000000000000;-1045153.000000000000000;0
1963;-743410.000000000000000;-1044689.000000000000000;0
4331;-742391.967999998480082;-1043310.539000000804663;0
1610;-742374.000000000000000;-1044447.000000000000000;0
7776;-743089.784000001847744;-1045773.409000001847744;0
1240;-742145.000000000000000;-1044418.000000000000000;0
1507;-741673.000000000000000;-1044223.000000000000000;0
6962;-743011.489999998360872;-1044196.070000000298023;0
7044;-743400.635000001639128;-1044135.579999998211861;0
6722;-742357.717000000178814;-1044705.708000000566244;0
1905;-743446.000000000000000;-1044312.000000000000000;0
1971;-743385.000000000000000;-1044881.000000000000000;0
7370;-743215.177999999374151;-1045468.392000000923872;0
6705;-742279.050999999046326;-1044655.923000000417233;0
1919;-743381.000000000000000;-1044393.000000000000000;0
2502;-742750.000000000000000;-1045457.000000000000000;0
1250;-742103.000000000000000;-1044672.000000000000000;0
7162;-743075.840999998152256;-1044541.596000000834465;0
7003;-743074.140000000596046;-1044350.280000001192093;0
1428;-742028.000000000000000;-1044235.000000000000000;0
1996;-743484.000000000000000;-1045063.000000000000000;0
1866;-743456.000000000000000;-1044201.000000000000000;0
5997;-742040.579999998211861;-1043282.651999998837709;0
594;-741896.000000000000000;-1043296.000000000000000;0
6977;-743098.949999999254942;-1044459.879999998956919;0
7000;-743096.190000001341105;-1044426.870000001043081;0
1795;-742155.000000000000000;-1044231.000000000000000;0
6003;-742038.201000001281500;-1043299.010999999940395;0
5969;-742284.809999998658895;-1044169.578000001609325;0
1040;-741904.000000000000000;-1044623.000000000000000;0
510;-742048.000000000000000;-1043150.000000000000000;0
1878;-743324.000000000000000;-1044249.000000000000000;0
526;-742209.000000000000000;-1043849.000000000000000;0
833;-742050.000000000000000;-1042573.000000000000000;0
4007;-743275.230999998748302;-1044049.184999998658895;0
1299;-741943.000000000000000;-1044719.000000000000000;0
395;-742369.000000000000000;-1043840.000000000000000;0
430;-742185.000000000000000;-1043888.000000000000000;0
8018;-741974.039999999105930;-1044442.870000001043081;0
8072;-742148.059999998658895;-1045271.649999998509884;0
7410;-743525.730000000447035;-1045377.420000001788139;0
4168;-742423.695000000298023;-1043984.135000001639128;0
1822;-742986.199999999254942;-1044211.969999998807907;0
559;-742191.000000000000000;-1043693.000000000000000;0
6473;-741931.359999999403954;-1044555.109999999403954;0
2887;-744098.480000000447035;-1043192.508000001311302;0
6712;-742273.328000001609325;-1044860.912000000476837;0
4121;-742721.160000000149012;-1043948.695000000298023;0
1404;-741692.000000000000000;-1044355.000000000000000;0
5198;-743259.600999999791384;-1043302.061000000685453;0
1244;-742127.000000000000000;-1044527.000000000000000;0
3091;-743924.489000000059605;-1042816.170000001788139;0
6701;-742295.142000000923872;-1044533.372000001370907;0
4236;-742406.842999998480082;-1043504.015000000596046;0
4175;-742721.254999998956919;-1043775.890000000596046;0
349;-742524.000000000000000;-1043764.000000000000000;0
3983;-743317.089999999850988;-1043883.160000000149012;0
563;-742155.000000000000000;-1043660.000000000000000;0
2277;-742826.000000000000000;-1045653.000000000000000;0
5303;-743164.818999998271465;-1043211.078000001609325;0
651;-742490.000000000000000;-1043564.000000000000000;0
516;-742160.000000000000000;-1043135.000000000000000;0
4852;-742992.449999999254942;-1042849.890000000596046;0
1984;-743476.000000000000000;-1044743.000000000000000;0
1436;-741869.000000000000000;-1044323.000000000000000;0
984;-741917.000000000000000;-1044411.000000000000000;0
1437;-741840.000000000000000;-1044336.000000000000000;0
2185;-743216.000000000000000;-1045130.000000000000000;0
569;-742096.000000000000000;-1043601.000000000000000;0
334;-742631.000000000000000;-1043987.000000000000000;0
1239;-742138.000000000000000;-1044401.000000000000000;0
4081;-742828.035000000149012;-1043754.850000001490116;0
1352;-741840.000000000000000;-1044854.000000000000000;0
3370;-743858.489999998360872;-1043011.370999999344349;0
6100;-741950.760000001639128;-1043408.109999999403954;0
4088;-742812.114999998360872;-1043580.475000001490116;0
4901;-742520.120000001043081;-1042823.960000000894070;0
6777;-741073.500000000000000;-1044491.879999998956919;0
4458;-742245.679999999701977;-1042633.960000000894070;0
1792;-742165.000000000000000;-1044209.000000000000000;0
7653;-742255.225000001490116;-1045513.048000000417233;0
381;-742465.000000000000000;-1043700.000000000000000;0
1317;-741748.000000000000000;-1044884.000000000000000;0
1311;-741646.000000000000000;-1044831.000000000000000;0
5778;-742917.131000000983477;-1043419.723000001162291;0
2224;-743051.000000000000000;-1045450.000000000000000;0
2256;-743156.000000000000000;-1045353.000000000000000;0
3352;-743954.622000001370907;-1043015.732999999076128;0
2236;-743391.000000000000000;-1045242.000000000000000;0
3304;-743786.739000000059605;-1042873.728999998420477;0
2338;-742797.000000000000000;-1045528.000000000000000;0
8284;-742219.410000000149012;-1042809.500000000000000;0
7656;-742290.328000001609325;-1045294.499000001698732;0
1265;-742047.000000000000000;-1044960.000000000000000;0
6361;-742016.024999998509884;-1042677.243999999016523;0
6385;-742179.530000001192093;-1042495.359999999403954;0
8150;-743304.219999998807907;-1043217.539999999105930;0
2332;-742899.000000000000000;-1045516.000000000000000;0
4075;-742947.934999998658895;-1043903.649999998509884;0
1322;-741906.000000000000000;-1044975.000000000000000;0
1665;-741012.000000000000000;-1044351.000000000000000;0
1724;-741478.000000000000000;-1045023.000000000000000;0
3843;-743139.170000001788139;-1042650.050000000745058;0
2193;-743531.000000000000000;-1045204.000000000000000;0
1420;-741596.000000000000000;-1044382.000000000000000;0
178;-743389.000000000000000;-1043251.000000000000000;0
848;-741973.000000000000000;-1042526.000000000000000;0
4020;-743160.616000000387430;-1043872.782999999821186;0
2259;-743001.000000000000000;-1045599.000000000000000;0
3273;-743642.442999999970198;-1042796.677999999374151;0
1663;-741455.000000000000000;-1044433.000000000000000;0
1558;-741192.000000000000000;-1044273.000000000000000;0
6946;-742974.765000000596046;-1043929.388000000268221;0
2395;-742244.000000000000000;-1045363.000000000000000;0
987;-741814.000000000000000;-1044493.000000000000000;0
4219;-742243.045000001788139;-1043600.660000000149012;0
341;-742592.000000000000000;-1043889.000000000000000;0
7189;-742588.486999999731779;-1044766.690999999642372;0
4592;-742448.190999999642372;-1042642.517999999225140;0
1587;-742372.000000000000000;-1044806.000000000000000;0
943;-742292.000000000000000;-1043017.000000000000000;0
551;-742269.000000000000000;-1043755.000000000000000;0
1370;-742061.000000000000000;-1044797.000000000000000;0
7978;-741231.690000001341105;-1044407.519999999552965;0
5592;-743420.136999998241663;-1043679.831999998539686;0
1447;-741541.000000000000000;-1044744.000000000000000;0
4137;-742705.739999998360872;-1044094.100000001490116;0
4154;-742544.524999998509884;-1044048.190000001341105;0
2432;-742549.000000000000000;-1045078.000000000000000;0
4628;-742619.598000001162291;-1042609.989999998360872;0
2325;-742559.000000000000000;-1045494.000000000000000;0
2080;-742685.000000000000000;-1044460.000000000000000;0
1603;-742525.000000000000000;-1044922.000000000000000;0
2752;-743983.471000000834465;-1043454.780000001192093;0
6275;-742314.603999998420477;-1043016.407999999821186;0
4060;-742896.530000001192093;-1043699.219999998807907;0
4225;-742115.607999999076128;-1043452.125000000000000;0
1460;-741482.000000000000000;-1044302.000000000000000;0
6659;-741515.070000000298023;-1044171.070000000298023;0
1151;-741279.000000000000000;-1044475.000000000000000;0
1703;-741320.000000000000000;-1044686.000000000000000;0
4559;-742400.530000001192093;-1042503.760000001639128;0
4030;-743133.280000001192093;-1043791.552000001072884;0
8273;-742057.820000000298023;-1042728.760000001639128;0
7351;-742529.339999999850988;-1045181.269999999552965;0
1402;-741699.000000000000000;-1044419.000000000000000;0
1083;-741667.000000000000000;-1044526.000000000000000;0
1552;-741351.000000000000000;-1044295.000000000000000;0
6556;-741290.410000000149012;-1044041.471000000834465;0
1302;-741842.000000000000000;-1044693.000000000000000;0
3812;-743231.179999999701977;-1042815.199999999254942;0
4333;-742428.420000001788139;-1043255.609999999403954;0
4054;-743269.304999999701977;-1043797.405000001192093;0
1373;-742143.000000000000000;-1044822.000000000000000;0
1411;-741639.480000000447035;-1044683.019999999552965;0
6718;-742339.493000000715256;-1044956.921999998390675;0
4059;-743142.649999998509884;-1043612.730000000447035;0
1044;-741861.000000000000000;-1044743.000000000000000;0
676;-742442.000000000000000;-1043196.000000000000000;0
5436;-744076.484000001102686;-1043296.519999999552965;0
1384;-742180.000000000000000;-1044969.000000000000000;0
3848;-743094.383999999612570;-1042505.245000001043081;0
636;-742160.000000000000000;-1043325.000000000000000;0
621;-742285.000000000000000;-1043282.000000000000000;0
3389;-743919.920000001788139;-1043153.510000001639128;0
2418;-742410.000000000000000;-1045109.000000000000000;0
1045;-741849.000000000000000;-1044775.000000000000000;0
4990;-742657.837999999523163;-1043024.199999999254942;0
6843;-741569.070000000298023;-1044975.261999998241663;0
4573;-742341.550000000745058;-1042629.699999999254942;0
2330;-742403.000000000000000;-1045511.000000000000000;0
3182;-743923.576000001281500;-1042554.350000001490116;0
5508;-743426.105999998748302;-1043645.960999999195337;0
3800;-743098.550000000745058;-1042863.019999999552965;0
3953;-743407.249000001698732;-1043543.537000000476837;0
6839;-741723.412000000476837;-1044988.993000000715256;0
3974;-743140.660000000149012;-1043725.350000001490116;0
4130;-742868.460000000894070;-1044055.510000001639128;0
826;-742191.000000000000000;-1042616.000000000000000;0
4909;-742383.146000001579523;-1042799.159000001847744;0
5129;-743046.677000001072884;-1043376.409000001847744;0
6826;-741405.300000000745058;-1044777.199999999254942;0
4859;-742966.710000000894070;-1042996.302999999374151;0
3128;-743948.160000000149012;-1042657.320000000298023;0
3836;-743096.070000000298023;-1042561.879999998956919;0
4098;-742789.157000001519918;-1043861.918999999761581;0
5640;-743428.425000000745058;-1043686.254000000655651;0
3292;-743576.905000001192093;-1042781.315000001341105;0
5720;-743418.223000001162291;-1043629.960999999195337;0
4773;-742888.429000001400709;-1042839.530000001192093;0
1108;-741261.000000000000000;-1044593.000000000000000;0
3760;-743233.829999998211861;-1042978.739999998360872;0
2486;-741289.250000000000000;-1044848.829999998211861;0
4768;-742862.888000000268221;-1042936.997999999672174;0
6225;-742314.519999999552965;-1043055.927000001072884;0
5733;-743410.142999999225140;-1043688.210999999195337;0
6806;-741090.381000000983477;-1044706.675999999046326;0
6811;-741110.469999998807907;-1044663.493000000715256;0
1165;-741037.420000001788139;-1044506.500000000000000;0
181;-743421.000000000000000;-1043350.000000000000000;0
1684;-741136.379999998956919;-1044735.140000000596046;0
880;-741793.000000000000000;-1042834.000000000000000;0
4233;-742334.782000001519918;-1043445.793000001460314;0
4506;-742419.730000000447035;-1042717.019999999552965;0
5138;-743030.936000000685453;-1043483.587999999523163;0
1267;-742040.000000000000000;-1044999.000000000000000;0
4649;-742732.228999998420477;-1042525.100000001490116;0
4675;-742805.809999998658895;-1042785.070000000298023;0
6852;-741571.519999999552965;-1045065.932999998331070;0
3418;-743758.105000000447035;-1043107.024999998509884;0
4427;-742190.519999999552965;-1043099.440000001341105;0
6688;-742383.146999999880791;-1045009.361000001430511;0
505;-741917.000000000000000;-1043153.000000000000000;0
4601;-742631.969999998807907;-1042675.629999998956919;0
5726;-743422.414000000804663;-1043635.760999999940395;0
1099;-741376.000000000000000;-1044563.000000000000000;0
795;-741770.000000000000000;-1042577.000000000000000;0
4426;-742197.589999999850988;-1043031.679999999701977;0
6220;-742318.432999998331070;-1043062.949999999254942;0
2492;-742017.000000000000000;-1044210.000000000000000;0
4954;-742405.539999999105930;-1043024.640000000596046;0
7208;-742560.289999999105930;-1045023.789999999105930;0
5066;-742827.379000000655651;-1043252.267999999225140;0
3407;-743772.385999999940395;-1043008.706999998539686;0
628;-742217.370000001043081;-1043308.559999998658895;0
3092;-743909.377999998629093;-1042780.322999998927116;0
6293;-742666.339999999850988;-1042695.188999999314547;0
4629;-742630.986000001430511;-1042626.096000000834465;0
4973;-742480.098000001162291;-1043031.443999998271465;0
4532;-742760.140000000596046;-1042899.600000001490116;87
4818;-742949.140000000596046;-1042791.660000000149012;0
2378;-742372.000000000000000;-1045503.000000000000000;0
8046;-742169.109999999403954;-1044835.660000000149012;0
5323;-743049.401000000536442;-1043038.131000000983477;0
5682;-743399.638000000268221;-1043719.120999999344349;0
6257;-742381.556000001728535;-1043033.991000000387430;0
6726;-742476.517999999225140;-1044410.600000001490116;0
5716;-743423.320999998599291;-1043631.197000000625849;0
2565;-741043.000000000000000;-1044424.000000000000000;0
4790;-743036.497999999672174;-1042635.973999999463558;0
8061;-742290.579999998211861;-1045109.600000001490116;0
2748;-743933.984000001102686;-1043445.734000001102686;0
4951;-742335.579999998211861;-1042934.429999999701977;0
1713;-741207.339999999850988;-1044891.359999999403954;0
3886;-742385.100000001490116;-1042445.500000000000000;0
4726;-742863.519999999552965;-1042684.000000000000000;0
3831;-743005.140000000596046;-1042638.440000001341105;0
7130;-743306.429999999701977;-1044539.519999999552965;0
5167;-743219.324999999254942;-1043405.249000001698732;0
1953;-743344.000000000000000;-1044500.000000000000000;0
4221;-742209.576000001281500;-1043499.238000001758337;0
6354;-741928.410000000149012;-1042711.350000001490116;0
6142;-742310.477000001817942;-1043061.813000001013279;0
2494;-741985.000000000000000;-1044165.000000000000000;0
2324;-742589.000000000000000;-1045490.000000000000000;0
4609;-742557.414000000804663;-1042621.583999998867512;0
5692;-743415.782999999821186;-1043638.765000000596046;0
5584;-743408.885000001639128;-1043643.532000001519918;0
2322;-742651.000000000000000;-1045483.000000000000000;0
713;-741800.000000000000000;-1042859.000000000000000;0
6291;-743672.399000000208616;-1042955.638000000268221;0
694;-742280.000000000000000;-1043043.000000000000000;0
4624;-742577.815000001341105;-1042600.907999999821186;0
6167;-742313.859999999403954;-1043063.607000000774860;0
3964;-743352.359999999403954;-1043540.780000001192093;0
5015;-742575.741000000387430;-1043008.607999999076128;0
6005;-742807.089000001549721;-1043283.201999999582767;0
4924;-742427.890999998897314;-1042890.581000000238419;0
5186;-743270.949999999254942;-1043526.039999999105930;0
5687;-743415.142000000923872;-1043630.285999998450279;0
4888;-742649.925999999046326;-1042830.767000000923872;0
7540;-742660.390000000596046;-1045368.829999998211861;0
309;-742721.000000000000000;-1044157.000000000000000;0
6565;-741325.239999998360872;-1044209.190000001341105;0
4320;-742264.149000000208616;-1043259.541999999433756;0
6499;-741707.811000000685453;-1044907.068999998271465;0
6655;-741614.039999999105930;-1044145.320000000298023;0
1723;-741611.000000000000000;-1045092.000000000000000;0
6269;-742337.300000000745058;-1043018.486000001430511;0
6227;-742319.839999999850988;-1043063.936000000685453;0
4132;-742818.859999999403954;-1044067.969999998807907;0
4510;-742483.149999998509884;-1042738.460000000894070;0
1190;-741821.000000000000000;-1044110.000000000000000;0
1538;-741948.000000000000000;-1043973.000000000000000;0
1621;-742467.000000000000000;-1044322.000000000000000;0
1093;-741494.000000000000000;-1044548.000000000000000;0
6190;-742318.782999999821186;-1043068.206000000238419;0
249;-743433.000000000000000;-1043775.000000000000000;0
2449;-742825.000000000000000;-1044147.000000000000000;0
4723;-742883.429999999701977;-1042644.829999998211861;0
6833;-741571.423000000417233;-1044909.473999999463558;0
576;-742054.000000000000000;-1043517.000000000000000;0
1268;-742046.000000000000000;-1045021.000000000000000;0
5593;-743418.921000000089407;-1043679.927999999374151;0
4795;-743049.835000000894070;-1042669.013000000268221;0
1062;-741560.000000000000000;-1045151.000000000000000;0
2030;-743400.000000000000000;-1045091.000000000000000;0
5960;-743141.460999999195337;-1043339.964999999850988;0
1516;-741928.000000000000000;-1044062.000000000000000;0
6204;-742315.578999999910593;-1043060.826000001281500;0
688;-742284.000000000000000;-1043125.000000000000000;0
3110;-743743.295000001788139;-1042640.627000000327826;0
4947;-742399.918000001460314;-1042993.458000000566244;0
6179;-742312.195000000298023;-1043059.041000001132488;0
3954;-743409.050999999046326;-1043550.699999999254942;0
5209;-743271.947999998927116;-1043361.392000000923872;0
876;-741953.000000000000000;-1042636.000000000000000;0
1696;-741529.000000000000000;-1044660.000000000000000;0
5597;-743414.056000001728535;-1043680.309000000357628;0
5511;-743426.401000000536442;-1043599.129999998956919;0
1553;-741350.000000000000000;-1044268.000000000000000;0
5665;-743419.725000001490116;-1043711.682000000029802;0
2300;-742561.000000000000000;-1045413.000000000000000;0
6254;-742379.344000000506639;-1043038.363000001758337;0
4820;-742927.769999999552965;-1042786.710000000894070;0
1452;-741519.000000000000000;-1044574.000000000000000;0
1456;-741513.000000000000000;-1044437.000000000000000;0
7541;-742644.280000001192093;-1045370.789999999105930;0
1832;-743024.000000000000000;-1044100.000000000000000;0
4724;-742870.089999999850988;-1042658.210000000894070;0
4089;-742812.844999998807907;-1043560.114999998360872;0
5956;-742960.690999999642372;-1043513.846999999135733;0
5133;-742976.300000000745058;-1043502.951999999582767;0
220;-742969.000000000000000;-1043530.000000000000000;0
4966;-742377.289999999105930;-1043071.030000001192093;0
2040;-743285.000000000000000;-1044809.000000000000000;0
4747;-742866.289999999105930;-1042753.390000000596046;0
4728;-742862.960000000894070;-1042727.210000000894070;0
4518;-742623.960000000894070;-1042786.719999998807907;0
3978;-743342.695000000298023;-1043756.835000000894070;0
3995;-743393.225000001490116;-1043973.719999998807907;0
520;-742225.000000000000000;-1043127.000000000000000;0
4206;-742342.340999998152256;-1043547.063000001013279;0
6104;-742208.646999999880791;-1043103.999000001698732;0
6113;-742229.061000000685453;-1043368.359000001102686;0
5738;-743410.412999998778105;-1043691.800000000745058;0
386;-742457.000000000000000;-1043786.000000000000000;0
4814;-743000.489999998360872;-1042803.920000001788139;0
6231;-742316.769000001251698;-1043058.344000000506639;0
6945;-742955.907000001519918;-1043932.182999998331070;0
6105;-742213.883000001311302;-1043111.734000001102686;0
6208;-742320.098000001162291;-1043067.458999998867512;0
1857;-742574.000000000000000;-1044318.000000000000000;0
5113;-742946.795000001788139;-1043444.427999999374151;0
6230;-742317.590999998152256;-1043059.730999998748302;0
4826;-743043.850000001490116;-1042979.600000001490116;0
6249;-742373.554999999701977;-1043049.822000000625849;0
6201;-742317.888999998569489;-1043065.035000000149012;0
7728;-743360.581999998539686;-1044610.631000000983477;0
6181;-742318.164999999105930;-1043068.541999999433756;0
4052;-743252.954999998211861;-1043843.585000000894070;0
4995;-742476.986000001430511;-1042961.239000000059605;0
6719;-742371.686999998986721;-1044952.227000001817942;0
1445;-741553.000000000000000;-1044757.000000000000000;0
4761;-742810.285000000149012;-1042793.122000001370907;0
4224;-742139.756000000983477;-1043462.488000001758337;0
2458;-741019.000000000000000;-1044567.000000000000000;0
3785;-743172.449999999254942;-1042923.850000001490116;0
3947;-743403.787999998778105;-1043488.118999999016523;0
4608;-742555.160999998450279;-1042637.633999999612570;0
5581;-743409.978999998420477;-1043638.324000000953674;0
4774;-742900.078999999910593;-1042854.859000001102686;0
2038;-743342.000000000000000;-1044806.000000000000000;0
1129;-741672.000000000000000;-1044438.000000000000000;0
2226;-743057.000000000000000;-1045470.000000000000000;0
159;-742965.000000000000000;-1042641.000000000000000;0
5693;-743415.905000001192093;-1043640.377000000327826;0
6146;-742314.942000001668930;-1043068.475999999791384;0
1855;-742642.000000000000000;-1044286.000000000000000;0
226;-742879.000000000000000;-1043516.000000000000000;0
6196;-742314.190000001341105;-1043059.774999998509884;0
4693;-742691.399999998509884;-1042612.399999998509884;0
6155;-742315.557999998331070;-1043068.140999998897314;0
5657;-743429.199999999254942;-1043706.837999999523163;0
4322;-742266.414000000804663;-1043213.907999999821186;0
5680;-743402.000000000000000;-1043718.245000001043081;0
8052;-742218.929999999701977;-1044953.719999998807907;0
3295;-743595.543000001460314;-1042827.322000000625849;0
6213;-742316.227000001817942;-1043060.478999998420477;0
5647;-743429.070999998599291;-1043694.699000000953674;0
7993;-741502.752999998629093;-1045126.267000000923872;0
6174;-742316.021999999880791;-1043066.065000001341105;0
4710;-742796.730000000447035;-1042611.769999999552965;0
5317;-743063.690000001341105;-1043053.769999999552965;0
3306;-743787.127999998629093;-1042847.872999999672174;0
4758;-742854.840999998152256;-1042811.914000000804663;0
6240;-742364.495999999344349;-1043067.289999999105930;0
3830;-743013.879999998956919;-1042612.359999999403954;0
739;-741789.000000000000000;-1043028.000000000000000;0
2237;-743368.000000000000000;-1045238.000000000000000;0
6150;-742311.879999998956919;-1043062.857000000774860;0
6004;-742061.723000001162291;-1043300.859999999403954;0
6169;-742312.320000000298023;-1043060.791999999433756;0
4811;-743040.379999998956919;-1042799.609999999403954;0
4665;-742824.410000000149012;-1042592.260000001639128;0
4742;-742822.300000000745058;-1042747.920000001788139;0
1387;-742155.000000000000000;-1044999.000000000000000;0
6159;-742312.495999999344349;-1043062.521000001579523;0
2370;-742460.000000000000000;-1045433.000000000000000;0
4738;-742733.910000000149012;-1042704.890000000596046;0
5717;-743422.208999998867512;-1043629.984000001102686;0
6295;-742653.399999998509884;-1042696.070000000298023;0
5721;-743418.407999999821186;-1043631.800000000745058;0
6387;-742159.980000000447035;-1042496.210000000894070;0
2759;-743890.965999998152256;-1043486.399000000208616;0
3922;-743844.574999999254942;-1043491.188999999314547;0
4801;-742998.943999998271465;-1042721.118000000715256;0
4955;-742383.649999998509884;-1043019.250000000000000;0
3746;-743261.420000001788139;-1042982.839999999850988;0
6823;-741313.910000000149012;-1044788.510000001639128;0
6303;-741823.820000000298023;-1042750.410000000149012;0
4650;-742749.989000000059605;-1042534.539999999105930;0
