OID_;X;Y;TEMPERATURE
2756;-743984.276999998837709;-1043475.763000000268221;0
7077;-743564.359000001102686;-1045385.210000000894070;0
3600;-744886.453000001609325;-1042611.436999998986721;0
3456;-745096.247000001370907;-1042705.502999998629093;0
7798;-743468.929999999701977;-1045091.809999998658895;0
8;-743496.000000000000000;-1042539.000000000000000;0
2696;-743477.489999998360872;-1042038.000000000000000;0
1492;-741096.000000000000000;-1044331.000000000000000;0
6701;-742295.142000000923872;-1044533.372000001370907;0
1486;-741150.000000000000000;-1044219.000000000000000;0
2760;-743863.331000000238419;-1043483.304000001400709;0
727;-742001.000000000000000;-1042962.000000000000000;0
1937;-743273.000000000000000;-1044318.000000000000000;0
1308;-741589.000000000000000;-1044811.000000000000000;0
3747;-743250.879999998956919;-1042956.620000001043081;0
706;-741897.000000000000000;-1042881.000000000000000;0
5382;-744377.920000001788139;-1042814.201000001281500;0
3209;-743668.293999999761581;-1042492.478999998420477;0
3702;-744567.984999999403954;-1042510.802000001072884;0
5436;-744076.484000001102686;-1043296.519999999552965;0
3235;-744146.118000000715256;-1042659.438999999314547;0
4047;-743210.230000000447035;-1043992.289999999105930;0
4086;-742813.079999998211861;-1043631.730000000447035;0
7745;-742933.037000000476837;-1045523.714999999850988;0
1144;-741402.000000000000000;-1044470.000000000000000;0
3273;-743642.442999999970198;-1042796.677999999374151;0
282;-743034.000000000000000;-1043819.000000000000000;0
3097;-743920.339999999850988;-1042769.188999999314547;0
7037;-743316.085000000894070;-1044222.170000001788139;0
503;-741879.000000000000000;-1043158.000000000000000;0
6722;-742357.717000000178814;-1044705.708000000566244;0
2103;-743182.000000000000000;-1044931.000000000000000;0
1872;-743422.000000000000000;-1044246.000000000000000;0
4166;-742448.504999998956919;-1044046.885000001639128;0
302;-742925.000000000000000;-1044109.000000000000000;0
5109;-742850.925999999046326;-1043483.024999998509884;0
2321;-742679.000000000000000;-1045480.000000000000000;0
6606;-741654.631999999284744;-1043906.848000001162291;0
7218;-742534.100000001490116;-1044603.559999998658895;0
4336;-742416.888999998569489;-1043431.418000001460314;0
6820;-741224.105999998748302;-1044799.311999998986721;0
4850;-742956.164000000804663;-1042923.403000000864267;0
908;-742211.000000000000000;-1042501.000000000000000;0
1728;-741473.000000000000000;-1045087.000000000000000;0
3413;-743776.791000001132488;-1043071.675000000745058;0
1705;-741257.219999998807907;-1044695.690000001341105;0
1545;-742236.000000000000000;-1044234.000000000000000;0
6399;-742013.379999998956919;-1042502.739999998360872;0
3790;-743140.809999998658895;-1042908.210000000894070;0
7165;-742711.789999999105930;-1044504.984999999403954;0
379;-742479.000000000000000;-1043679.000000000000000;0
7026;-743217.644999999552965;-1044082.329999998211861;0
3997;-743395.094999998807907;-1044031.109999999403954;0
2057;-742787.000000000000000;-1044365.000000000000000;0
883;-741802.000000000000000;-1042773.000000000000000;0
1089;-741567.949999999254942;-1044538.820000000298023;0
2159;-742822.000000000000000;-1045141.000000000000000;0
3887;-742347.760000001639128;-1042449.881000000983477;0
4070;-742925.285000000149012;-1043783.565000001341105;0
1125;-741728.000000000000000;-1044435.000000000000000;0
2508;-742961.000000000000000;-1044050.000000000000000;0
787;-741714.000000000000000;-1042620.000000000000000;0
571;-742082.000000000000000;-1043581.000000000000000;0
1181;-741920.000000000000000;-1044230.000000000000000;0
215;-743021.000000000000000;-1043558.000000000000000;0
2242;-743321.000000000000000;-1045313.000000000000000;0
1247;-742104.000000000000000;-1044609.000000000000000;0
580;-742010.000000000000000;-1043443.000000000000000;0
592;-741913.000000000000000;-1043311.000000000000000;0
6415;-743180.657999999821186;-1043208.993999999016523;0
7652;-742275.046999998390675;-1045497.052000001072884;0
3157;-743935.576000001281500;-1042567.035000000149012;0
4079;-742836.170000001788139;-1043800.960000000894070;0
2491;-742059.000000000000000;-1044251.000000000000000;0
3033;-744483.675000000745058;-1042733.627000000327826;0
4210;-742178.550000000745058;-1043586.035000000149012;0
672;-742484.000000000000000;-1043226.000000000000000;0
7944;-742086.969999998807907;-1044063.079999998211861;0
395;-742369.000000000000000;-1043840.000000000000000;0
4162;-742497.193999998271465;-1044160.030000001192093;0
6857;-741503.982999999076128;-1044930.340999998152256;0
2149;-742819.000000000000000;-1045024.000000000000000;0
5;-743466.000000000000000;-1042616.000000000000000;0
7822;-743543.072000000625849;-1045082.980000000447035;0
457;-741732.000000000000000;-1043333.000000000000000;0
5284;-743041.022999998182058;-1043277.397999998182058;0
3127;-743955.348000001162291;-1042668.469000000506639;0
4927;-742447.969999998807907;-1042874.710000000894070;0
2291;-742850.000000000000000;-1045401.000000000000000;0
550;-742276.000000000000000;-1043746.000000000000000;0
2891;-744029.914000000804663;-1043200.478000000119209;0
1535;-741873.000000000000000;-1043913.000000000000000;0
3833;-743029.679999999701977;-1042612.300000000745058;0
6505;-741746.570000000298023;-1044600.429999999701977;0
8152;-743293.600000001490116;-1043190.510000001639128;0
1720;-741436.000000000000000;-1044862.000000000000000;0
6478;-741931.429999999701977;-1044453.500000000000000;0
205;-743173.000000000000000;-1043599.000000000000000;0
1991;-743482.000000000000000;-1044929.000000000000000;0
1058;-741667.000000000000000;-1045072.000000000000000;0
6268;-742340.850000001490116;-1043018.881000000983477;0
7249;-742789.010999999940395;-1044830.250000000000000;0
1220;-742147.000000000000000;-1044283.000000000000000;0
384;-742471.000000000000000;-1043766.000000000000000;0
1814;-743095.000000000000000;-1044510.000000000000000;0
3306;-743787.127999998629093;-1042847.872999999672174;0
746;-741714.000000000000000;-1043020.000000000000000;0
2140;-742924.000000000000000;-1045088.000000000000000;0
6699;-742301.118999999016523;-1044484.282999999821186;0
1241;-742132.000000000000000;-1044436.000000000000000;0
4962;-742387.429999999701977;-1043028.129999998956919;0
1973;-743394.000000000000000;-1044931.000000000000000;0
7660;-742321.396999999880791;-1045335.578999999910593;0
5203;-743386.346000000834465;-1043274.958000000566244;0
1837;-743015.000000000000000;-1044249.000000000000000;0
1267;-742040.000000000000000;-1044999.000000000000000;0
3336;-743972.239999998360872;-1043004.743000000715256;0
3986;-743313.355000000447035;-1043956.986999999731779;0
4459;-742274.829999998211861;-1042644.269999999552965;0
684;-742358.000000000000000;-1043136.000000000000000;0
3387;-743960.368000000715256;-1043194.717000000178814;0
5316;-743075.980000000447035;-1043041.059999998658895;0
2341;-742711.000000000000000;-1045552.000000000000000;0
6013;-743372.780000001192093;-1043377.921999998390675;0
1347;-741791.000000000000000;-1044816.000000000000000;0
1442;-741753.000000000000000;-1044375.000000000000000;0
2399;-742121.000000000000000;-1045372.000000000000000;0
5718;-743420.888999998569489;-1043629.666999999433756;0
1932;-743359.000000000000000;-1044408.000000000000000;0
6945;-742955.907000001519918;-1043932.182999998331070;0
7188;-742583.839999999850988;-1044742.870000001043081;0
5063;-742783.370000001043081;-1043241.048999998718500;0
4925;-742455.502000000327826;-1042923.307000000029802;0
2328;-742459.000000000000000;-1045505.000000000000000;0
1538;-741948.000000000000000;-1043973.000000000000000;0
4117;-742733.614999998360872;-1044043.129999998956919;0
5746;-743415.399000000208616;-1043698.644000001251698;0
6295;-742653.399999998509884;-1042696.070000000298023;0
1263;-742048.000000000000000;-1044929.000000000000000;0
3407;-743772.385999999940395;-1043008.706999998539686;0
1775;-741246.000000000000000;-1044012.000000000000000;0
2098;-743134.000000000000000;-1044763.000000000000000;0
1432;-741958.000000000000000;-1044285.000000000000000;0
1663;-741455.000000000000000;-1044433.000000000000000;0
4714;-742856.359999999403954;-1042618.210000000894070;0
4629;-742630.986000001430511;-1042626.096000000834465;0
6835;-741618.964000001549721;-1044934.515000000596046;0
4828;-743048.579999998211861;-1042941.179999999701977;0
5294;-743056.328999999910593;-1043196.096999999135733;0
3283;-743632.767000000923872;-1042846.004000000655651;0
7201;-742571.190000001341105;-1044939.320000000298023;0
2574;-742481.000000000000000;-1045423.000000000000000;0
1620;-742439.000000000000000;-1044323.000000000000000;130
7360;-743228.008000001311302;-1045144.625999998301268;0
7983;-741127.800000000745058;-1044416.199999999254942;0
1763;-741167.000000000000000;-1044108.000000000000000;0
4460;-742216.600000001490116;-1042598.850000001490116;0
1423;-742167.000000000000000;-1044150.000000000000000;0
1137;-741538.000000000000000;-1044442.000000000000000;0
1961;-743397.000000000000000;-1044642.000000000000000;0
5205;-743251.475000001490116;-1043328.679000001400709;0
301;-742613.000000000000000;-1043903.000000000000000;0
5411;-742776.079999998211861;-1042905.300000000745058;0
671;-742489.000000000000000;-1043245.000000000000000;0
2225;-743041.000000000000000;-1045477.000000000000000;0
1696;-741529.000000000000000;-1044660.000000000000000;0
7542;-742623.890000000596046;-1045372.899999998509884;0
4648;-742721.809999998658895;-1042535.192000001668930;0
3975;-743112.984999999403954;-1043716.375999998301268;0
5175;-743313.734999999403954;-1043433.749000001698732;0
4208;-742372.416999999433756;-1043503.423000000417233;0
5449;-743124.745000001043081;-1043406.449000000953674;0
5455;-742823.936000000685453;-1043283.644999999552965;0
2354;-742452.000000000000000;-1045584.000000000000000;0
7137;-742916.074999999254942;-1044400.230000000447035;73
6659;-741515.070000000298023;-1044171.070000000298023;0
1855;-742642.000000000000000;-1044286.000000000000000;0
7355;-743348.309999998658895;-1045148.329999998211861;0
5662;-743423.271000001579523;-1043710.372000001370907;0
1511;-741795.000000000000000;-1044159.000000000000000;0
7045;-743400.745000001043081;-1044160.004999998956919;0
6977;-743098.949999999254942;-1044459.879999998956919;0
4144;-742704.414999999105930;-1043822.484999999403954;0
4849;-742966.960000000894070;-1042893.583999998867512;0
1309;-741611.000000000000000;-1044813.000000000000000;0
2515;-742517.000000000000000;-1044420.000000000000000;0
1929;-743440.000000000000000;-1044410.000000000000000;0
941;-742098.000000000000000;-1043132.000000000000000;0
5224;-743293.449999999254942;-1043542.160000000149012;0
1242;-742137.000000000000000;-1044481.000000000000000;0
4130;-742868.460000000894070;-1044055.510000001639128;0
4207;-742354.105999998748302;-1043530.157999999821186;0
1050;-741785.000000000000000;-1044952.000000000000000;0
7153;-742889.646999999880791;-1044547.438000001013279;0
1753;-742096.000000000000000;-1045195.000000000000000;0
3825;-743056.390000000596046;-1042570.079999998211861;0
4963;-742396.510000001639128;-1043031.829999998211861;0
1558;-741192.000000000000000;-1044273.000000000000000;0
2537;-741975.000000000000000;-1044131.000000000000000;0
7156;-742944.515000000596046;-1044546.140000000596046;0
7325;-743032.969999998807907;-1045186.298999998718500;0
6176;-742314.491000000387430;-1043063.256000000983477;0
7223;-742409.149999998509884;-1044822.649999998509884;0
3993;-743345.100000001490116;-1043930.980000000447035;0
1695;-741550.000000000000000;-1044656.000000000000000;0
4190;-742301.250000000000000;-1044166.100000001490116;0
3432;-743687.646000001579523;-1042976.611999999731779;0
7973;-741347.850000001490116;-1044381.850000001490116;0
4808;-743110.859999999403954;-1042784.829999998211861;0
3535;-744653.131999999284744;-1042674.822000000625849;0
318;-742434.000000000000000;-1044213.000000000000000;0
4789;-742979.506000000983477;-1042555.324999999254942;0
7000;-743096.190000001341105;-1044426.870000001043081;0
2507;-742427.000000000000000;-1044437.000000000000000;0
1473;-741642.000000000000000;-1044158.000000000000000;0
4506;-742419.730000000447035;-1042717.019999999552965;0
6167;-742313.859999999403954;-1043063.607000000774860;0
6118;-743652.447000000625849;-1042857.607999999076128;0
4639;-742567.399999998509884;-1042548.592999998480082;0
3108;-743768.699999999254942;-1042671.241999998688698;0
4021;-743293.295000001788139;-1043876.995000001043081;0
4722;-742878.030000001192093;-1042626.550000000745058;0
4755;-742734.960000000894070;-1042778.019999999552965;0
6273;-742321.806000001728535;-1043017.085000000894070;0
1505;-741606.000000000000000;-1044248.000000000000000;0
4602;-742441.269000001251698;-1042596.320000000298023;0
4224;-742139.756000000983477;-1043462.488000001758337;0
6719;-742371.686999998986721;-1044952.227000001817942;0
5643;-743428.701999999582767;-1043689.872999999672174;0
6814;-741118.537999998778105;-1044802.493000000715256;0
2544;-741753.000000000000000;-1044252.000000000000000;0
635;-742143.000000000000000;-1043317.000000000000000;0
5941;-742044.835000000894070;-1043561.903999999165535;0
540;-742144.000000000000000;-1043804.000000000000000;0
6121;-742069.784000001847744;-1043299.828000001609325;0
6647;-741767.690000001341105;-1044068.160000000149012;0
2086;-742404.000000000000000;-1044796.000000000000000;0
4751;-742791.629999998956919;-1042751.460000000894070;0
6809;-741079.942999999970198;-1044626.942000001668930;0
7706;-742313.239999998360872;-1044319.611999999731779;0
7010;-742857.964999999850988;-1044251.155000001192093;4
5660;-743425.633999999612570;-1043709.497000001370907;0
3841;-743159.929999999701977;-1042641.120000001043081;0
6391;-742109.269999999552965;-1042498.320000000298023;0
115;-745228.000000000000000;-1042764.000000000000000;0
5705;-743417.603000000119209;-1043637.098000001162291;0
4088;-742812.114999998360872;-1043580.475000001490116;0
2231;-743512.000000000000000;-1045263.000000000000000;0
5081;-742917.046000000089407;-1043356.515999998897314;0
4663;-742820.800000000745058;-1042560.039999999105930;0
284;-743022.000000000000000;-1043758.000000000000000;0
3263;-743570.528999999165535;-1042712.653999999165535;0
6104;-742208.646999999880791;-1043103.999000001698732;0
7047;-743395.495000001043081;-1044210.765000000596046;0
5198;-743259.600999999791384;-1043302.061000000685453;0
7004;-743069.289999999105930;-1044326.469999998807907;0
6259;-742383.170000001788139;-1043030.809000000357628;0
8044;-742176.640000000596046;-1044778.420000001788139;0
3064;-744117.098999999463558;-1042868.348999999463558;0
6039;-742085.370000001043081;-1043669.620999999344349;0
634;-742117.000000000000000;-1043309.000000000000000;0
6789;-741187.510000001639128;-1044470.660000000149012;0
524;-742255.000000000000000;-1043913.000000000000000;96
4036;-743246.920000001788139;-1043771.574999999254942;0
1392;-742104.000000000000000;-1045067.000000000000000;0
1593;-742192.000000000000000;-1044826.000000000000000;0
2185;-743216.000000000000000;-1045130.000000000000000;0
1702;-741348.000000000000000;-1044682.000000000000000;0
4783;-742933.866999998688698;-1042668.403000000864267;0
7089;-743344.149999998509884;-1044558.530000001192093;0
6179;-742312.195000000298023;-1043059.041000001132488;0
4114;-742764.195000000298023;-1044131.760000001639128;0
728;-741997.000000000000000;-1042918.000000000000000;0
7705;-742283.471999999135733;-1044316.339999999850988;0
6834;-741594.763000000268221;-1044922.236000001430511;0
649;-742233.000000000000000;-1043382.000000000000000;0
5324;-743025.329999998211861;-1043045.789999999105930;0
1727;-741495.000000000000000;-1045103.000000000000000;0
587;-741944.000000000000000;-1043391.000000000000000;0
5710;-743421.574999999254942;-1043640.598000001162291;0
1454;-741521.000000000000000;-1044499.000000000000000;0
7085;-743327.129999998956919;-1044533.960000000894070;0
6159;-742312.495999999344349;-1043062.521000001579523;0
8050;-742206.719999998807907;-1044915.530000001192093;0
2033;-743500.000000000000000;-1044798.000000000000000;0
348;-742525.000000000000000;-1043787.000000000000000;0
4641;-742591.151999998837709;-1042559.721000000834465;0
3524;-744816.782999999821186;-1042685.140999998897314;0
872;-741698.000000000000000;-1042669.000000000000000;0
4959;-742331.289999999105930;-1043002.690000001341105;0
4990;-742657.837999999523163;-1043024.199999999254942;0
7349;-742516.719999998807907;-1045170.359999999403954;0
7734;-741656.309000000357628;-1044953.727000001817942;0
4876;-742826.449999999254942;-1042944.910000000149012;0
1163;-741072.820000000298023;-1044501.940000001341105;0
7777;-743079.782999999821186;-1045794.026000000536442;0
2082;-742569.000000000000000;-1044642.000000000000000;0
4847;-742981.100000001490116;-1042831.059999998658895;0
6274;-742318.392999999225140;-1043016.747000001370907;0
1171;-741882.000000000000000;-1044375.000000000000000;0
6561;-741307.890000000596046;-1043937.809999998658895;0
3962;-743407.190000001341105;-1043535.730000000447035;0
4689;-742688.114999998360872;-1042568.859999999403954;0
4906;-742448.370000001043081;-1042815.789999999105930;0
6282;-742308.337999999523163;-1043045.984000001102686;0
1502;-741506.000000000000000;-1044283.000000000000000;0
6961;-743023.579999998211861;-1044221.129999998956919;0
4089;-742812.844999998807907;-1043560.114999998360872;0
1612;-742429.000000000000000;-1044425.000000000000000;0
3162;-743983.820000000298023;-1042541.004999998956919;0
1041;-741893.000000000000000;-1044653.000000000000000;0
1927;-743501.000000000000000;-1044407.000000000000000;0
4327;-742333.449000000953674;-1043399.671000000089407;0
7645;-742305.313000001013279;-1045383.625000000000000;0
332;-742645.000000000000000;-1044014.000000000000000;0
1926;-743301.000000000000000;-1044321.000000000000000;0
6181;-742318.164999999105930;-1043068.541999999433756;0
4712;-742830.309999998658895;-1042614.969999998807907;0
4169;-742414.420000001788139;-1043962.329999998211861;0
4982;-742559.320999998599291;-1043012.914000000804663;0
4324;-742269.346000000834465;-1043165.410999998450279;0
1587;-742372.000000000000000;-1044806.000000000000000;0
952;-742274.000000000000000;-1043018.000000000000000;0
7399;-742999.699999999254942;-1045733.309999998658895;0
7739;-742301.399000000208616;-1045040.431000001728535;0
184;-743445.000000000000000;-1043450.000000000000000;0
1482;-741289.000000000000000;-1044232.000000000000000;0
4820;-742927.769999999552965;-1042786.710000000894070;0
2256;-743156.000000000000000;-1045353.000000000000000;0
250;-743428.000000000000000;-1043794.000000000000000;0
6300;-741836.949999999254942;-1042698.329999998211861;0
5695;-743417.217999998480082;-1043638.749000001698732;0
1322;-741906.000000000000000;-1044975.000000000000000;0
5003;-742589.811999998986721;-1042974.888999998569489;0
736;-741880.000000000000000;-1043017.000000000000000;114
7174;-742639.019999999552965;-1044564.949999999254942;0
4320;-742264.149000000208616;-1043259.541999999433756;0
1791;-742157.000000000000000;-1044163.000000000000000;0
1524;-741710.000000000000000;-1043844.000000000000000;0
4325;-742270.679000001400709;-1043141.787999998778105;0
4698;-742673.530000001192093;-1042715.780000001192093;0
7262;-742990.940000001341105;-1044886.989999998360872;0
221;-742951.000000000000000;-1043544.000000000000000;0
6946;-742974.765000000596046;-1043929.388000000268221;0
6269;-742337.300000000745058;-1043018.486000001430511;0
6208;-742320.098000001162291;-1043067.458999998867512;0
7247;-742774.480000000447035;-1044839.850000001490116;0
464;-741713.000000000000000;-1043286.000000000000000;0
4702;-742669.300000000745058;-1042747.399999998509884;0
827;-742218.000000000000000;-1042626.000000000000000;0
2070;-742993.000000000000000;-1044723.000000000000000;0
1306;-741783.000000000000000;-1044653.000000000000000;0
696;-742077.000000000000000;-1042913.000000000000000;0
4580;-742393.905000001192093;-1042551.807000000029802;0
4653;-742788.747999999672174;-1042524.557000000029802;0
1260;-742070.000000000000000;-1044876.000000000000000;0
1030;-741975.000000000000000;-1044753.000000000000000;0
4614;-742493.800000000745058;-1042636.896000001579523;0
4105;-742678.771999999880791;-1043769.206000000238419;0
8082;-741958.629999998956919;-1045352.690000001341105;0
1105;-741274.000000000000000;-1044576.000000000000000;0
4610;-742548.888000000268221;-1042601.879000000655651;0
5755;-743415.670000001788139;-1043702.254000000655651;0
3804;-743040.109999999403954;-1042895.410000000149012;0
6196;-742314.190000001341105;-1043059.774999998509884;0
6359;-742018.440000001341105;-1042712.449999999254942;0
3718;-744739.026999998837709;-1042368.383000001311302;0
4249;-742151.910000000149012;-1043354.719999998807907;0
6397;-742033.839999999850988;-1042501.859999999403954;0
1047;-741816.000000000000000;-1044867.000000000000000;0
2152;-742814.000000000000000;-1045106.000000000000000;0
3953;-743407.249000001698732;-1043543.537000000476837;0
6221;-742317.633000001311302;-1043061.541000001132488;0
4023;-743246.635000001639128;-1043864.364999998360872;0
7203;-742571.300000000745058;-1044963.219999998807907;0
6363;-742027.344999998807907;-1042665.324000000953674;0
8265;-742197.820000000298023;-1042704.260000001639128;0
1365;-742125.050000000745058;-1044945.710000000894070;0
515;-742176.000000000000000;-1043121.000000000000000;0
1830;-742961.000000000000000;-1044087.000000000000000;0
5792;-743363.984999999403954;-1043442.513999998569489;0
2210;-743280.000000000000000;-1045237.000000000000000;0
6702;-742291.596999999135733;-1044564.116999998688698;0
1701;-741378.000000000000000;-1044678.000000000000000;0
8278;-742119.929999999701977;-1042758.710000000894070;0
4772;-742879.881999999284744;-1042872.157000001519918;0
622;-742271.000000000000000;-1043302.000000000000000;0
7410;-743525.730000000447035;-1045377.420000001788139;0
7279;-742799.399999998509884;-1044679.829999998211861;0
4124;-742751.265000000596046;-1043878.414999999105930;0
507;-741953.000000000000000;-1043148.000000000000000;0
8049;-742198.890000000596046;-1044891.600000001490116;0
1648;-741373.000000000000000;-1044431.000000000000000;0
4167;-742438.315000001341105;-1044021.960000000894070;0
6135;-742308.289000000804663;-1043059.340999998152256;0
4895;-742596.936999998986721;-1042829.168000001460314;0
1769;-741260.000000000000000;-1044112.000000000000000;0
1143;-741415.000000000000000;-1044457.000000000000000;0
3797;-743147.989999998360872;-1042854.129999998956919;0
4944;-742430.605999998748302;-1043013.879000000655651;0
3810;-743261.510000001639128;-1042802.960000000894070;145
1035;-741963.000000000000000;-1044896.000000000000000;0
1854;-742675.000000000000000;-1044271.000000000000000;0
7091;-743361.839999999850988;-1044584.039999999105930;0
1026;-741986.000000000000000;-1044631.000000000000000;0
2245;-743239.000000000000000;-1045356.000000000000000;0
4526;-742696.690000001341105;-1042823.320000000298023;0
7958;-741664.710000000894070;-1044289.879999998956919;0
4202;-742285.475999999791384;-1043627.734999999403954;0
2408;-742369.000000000000000;-1045125.000000000000000;0
7519;-742850.620000001043081;-1045673.670000001788139;0
2576;-742487.000000000000000;-1045483.000000000000000;0
2038;-743342.000000000000000;-1044806.000000000000000;0
4509;-742502.519999999552965;-1042732.079999998211861;0
6876;-741825.559999998658895;-1045240.469999998807907;0
1507;-741673.000000000000000;-1044223.000000000000000;0
5421;-742337.905999999493361;-1042777.837999999523163;0
3338;-743968.458999998867512;-1043042.706999998539686;0
5280;-743058.660000000149012;-1043362.201999999582767;0
1678;-741113.109999999403954;-1044552.320000000298023;0
4062;-742830.460000000894070;-1043654.920000001788139;0
669;-742510.000000000000000;-1043260.000000000000000;0
1389;-742281.250000000000000;-1044962.859999999403954;0
5169;-743240.785000000149012;-1043411.081999998539686;0
718;-741691.000000000000000;-1042844.000000000000000;0
337;-742621.000000000000000;-1043941.000000000000000;0
8281;-742164.160000000149012;-1042778.140000000596046;0
5733;-743410.142999999225140;-1043688.210999999195337;0
6366;-741957.399999998509884;-1042652.609999999403954;0
2134;-743028.000000000000000;-1045111.000000000000000;0
6000;-741980.750000000000000;-1043285.629999998956919;0
6483;-741773.829999998211861;-1044640.969000000506639;0
6279;-742306.210000000894070;-1043033.421999998390675;0
4326;-742319.855000000447035;-1043419.918999999761581;0
5600;-743410.407000001519918;-1043680.594000000506639;0
2094;-743203.000000000000000;-1044744.000000000000000;0
4756;-742712.579999998211861;-1042776.829999998211861;0
4656;-742827.763000000268221;-1042494.379999998956919;0
6952;-743044.730999998748302;-1044106.129999998956919;0
516;-742160.000000000000000;-1043135.000000000000000;0
6125;-743428.124000001698732;-1043615.223999999463558;0
7646;-742318.263999998569489;-1045391.811000000685453;0
5517;-743427.287000000476837;-1043618.956999998539686;0
4933;-742437.605000000447035;-1042750.853000000119209;0
4041;-743227.600000001490116;-1043746.495000001043081;0
6242;-742366.677999999374151;-1043062.949000000953674;0
5042;-742731.719000000506639;-1042890.517000000923872;0
674;-742463.000000000000000;-1043211.000000000000000;0
3414;-743757.269999999552965;-1043051.379999998956919;0
6361;-742016.024999998509884;-1042677.243999999016523;0
5196;-743199.263000000268221;-1043326.401000000536442;0
7286;-742814.550000000745058;-1044746.960000000894070;0
1700;-741406.000000000000000;-1044677.000000000000000;0
2096;-743154.000000000000000;-1044724.000000000000000;0
6981;-743063.800000000745058;-1044366.239999998360872;0
4860;-742964.800999999046326;-1043016.107999999076128;0
4710;-742796.730000000447035;-1042611.769999999552965;0
6276;-742310.815999999642372;-1043016.000999998301268;0
4889;-742621.425000000745058;-1042831.109999999403954;0
6225;-742314.519999999552965;-1043055.927000001072884;0
3816;-743149.379999998956919;-1042748.489999998360872;0
4225;-742115.607999999076128;-1043452.125000000000000;0
3944;-743390.002000000327826;-1043413.532999999821186;0
2317;-742792.000000000000000;-1045467.000000000000000;0
4333;-742428.420000001788139;-1043255.609999999403954;0
3886;-742385.100000001490116;-1042445.500000000000000;0
3417;-743776.002999998629093;-1043098.853000000119209;0
6387;-742159.980000000447035;-1042496.210000000894070;0
4757;-742873.984000001102686;-1042820.212000001221895;0
2369;-742503.000000000000000;-1045427.000000000000000;0
1610;-742374.000000000000000;-1044447.000000000000000;0
3210;-743664.019000001251698;-1042478.668999999761581;0
5696;-743417.096000000834465;-1043637.135999999940395;0
6155;-742315.557999998331070;-1043068.140999998897314;0
6138;-742313.561999998986721;-1043067.399000000208616;0
316;-742490.000000000000000;-1044202.000000000000000;0
4056;-743125.315000001341105;-1043671.969999998807907;0
1253;-742084.000000000000000;-1044730.000000000000000;0
2464;-743519.000000000000000;-1044697.000000000000000;0
1381;-742115.000000000000000;-1044999.000000000000000;0
2040;-743285.000000000000000;-1044809.000000000000000;0
4123;-742742.956000000238419;-1043901.826000001281500;0
6168;-742313.092999998480082;-1043062.208999998867512;0
7107;-743425.260000001639128;-1044646.199999999254942;0
3759;-743267.609999999403954;-1042971.300000000745058;0
5683;-743398.456000000238419;-1043719.557999998331070;0
1324;-741943.000000000000000;-1044994.000000000000000;0
7086;-743333.149999998509884;-1044527.250000000000000;0
3920;-743907.039000000804663;-1043516.331000000238419;0
1234;-742162.000000000000000;-1044314.000000000000000;0
2372;-742466.000000000000000;-1045488.000000000000000;0
4060;-742896.530000001192093;-1043699.219999998807907;0
6832;-741552.254000000655651;-1044899.227000001817942;0
6160;-742311.730999998748302;-1043061.116000000387430;0
7206;-742559.920000001788139;-1045003.190000001341105;0
2358;-742370.000000000000000;-1045593.000000000000000;0
4997;-742492.638000000268221;-1042962.833999998867512;0
1839;-742994.469999998807907;-1044185.679999999701977;0
7016;-742557.515000000596046;-1044334.074999999254942;0
1289;-742211.000000000000000;-1044521.000000000000000;0
