OID_;X;Y;TEMPERATURE
3614;-744984.548999998718500;-1042283.640999998897314;0
5790;-743521.019999999552965;-1042064.280000001192093;0
3917;-743967.182999998331070;-1043516.284000001847744;0
2194;-743448.000000000000000;-1045193.000000000000000;0
6870;-741708.260000001639128;-1045321.590999998152256;0
2049;-743499.000000000000000;-1045071.000000000000000;0
3018;-744443.368000000715256;-1042805.962000001221895;0
23;-743544.000000000000000;-1042505.000000000000000;0
2265;-742972.000000000000000;-1045774.000000000000000;0
1532;-741805.000000000000000;-1043858.000000000000000;0
1809;-743160.000000000000000;-1044541.000000000000000;0
2221;-743076.000000000000000;-1045412.000000000000000;0
2809;-744090.649999998509884;-1043371.184000000357628;0
2889;-744074.103999998420477;-1043194.559999998658895;0
3674;-744609.826999999582767;-1042523.997999999672174;0
2277;-742826.000000000000000;-1045653.000000000000000;0
3109;-743754.403999999165535;-1042652.872000001370907;0
748;-741671.000000000000000;-1042971.000000000000000;0
2512;-743070.000000000000000;-1044052.000000000000000;0
3209;-743668.293999999761581;-1042492.478999998420477;0
5069;-742829.063999999314547;-1043280.938000001013279;0
728;-741997.000000000000000;-1042918.000000000000000;0
3811;-743244.620000001043081;-1042809.420000001788139;0
2299;-742592.000000000000000;-1045409.000000000000000;0
4073;-742939.109999999403954;-1043858.504999998956919;0
2246;-743218.000000000000000;-1045379.000000000000000;0
4162;-742497.193999998271465;-1044160.030000001192093;0
343;-742575.000000000000000;-1043857.000000000000000;0
2344;-742691.000000000000000;-1045541.000000000000000;0
1561;-743186.000000000000000;-1045098.000000000000000;0
7258;-742917.370000001043081;-1044865.420000001788139;0
1310;-741623.000000000000000;-1044829.000000000000000;0
5252;-743283.517000000923872;-1043176.197999998927116;0
6981;-743063.800000000745058;-1044366.239999998360872;0
1250;-742103.000000000000000;-1044672.000000000000000;0
504;-741937.000000000000000;-1043164.000000000000000;0
220;-742969.000000000000000;-1043530.000000000000000;0
1946;-743281.000000000000000;-1044437.000000000000000;0
2020;-743260.000000000000000;-1044941.000000000000000;0
5293;-743043.969999998807907;-1043208.554000001400709;0
1584;-742368.000000000000000;-1044717.000000000000000;0
8151;-743319.030000001192093;-1043194.940000001341105;0
4177;-742387.940999999642372;-1044182.254999998956919;0
6676;-742250.239999998360872;-1044174.719999998807907;0
2150;-742812.000000000000000;-1045054.000000000000000;0
7652;-742275.046999998390675;-1045497.052000001072884;0
4173;-742756.320000000298023;-1043749.629999998956919;0
885;-741739.000000000000000;-1042777.000000000000000;0
2466;-743460.000000000000000;-1044740.000000000000000;0
669;-742510.000000000000000;-1043260.000000000000000;0
570;-742098.000000000000000;-1043582.000000000000000;0
1287;-742217.000000000000000;-1044486.000000000000000;0
4120;-742715.179999999701977;-1043974.089999999850988;0
2293;-742786.000000000000000;-1045387.000000000000000;0
4087;-742811.609999999403954;-1043604.190000001341105;0
4239;-742454.206000000238419;-1043538.927999999374151;146
527;-742186.000000000000000;-1043818.000000000000000;0
1487;-741117.000000000000000;-1044216.000000000000000;0
1482;-741289.000000000000000;-1044232.000000000000000;0
1268;-742046.000000000000000;-1045021.000000000000000;0
4070;-742925.285000000149012;-1043783.565000001341105;0
5303;-743164.818999998271465;-1043211.078000001609325;0
403;-742307.000000000000000;-1043931.000000000000000;0
6573;-741294.089999999850988;-1044091.679999999701977;0
2210;-743280.000000000000000;-1045237.000000000000000;0
381;-742465.000000000000000;-1043700.000000000000000;0
1629;-742450.000000000000000;-1044518.000000000000000;0
2316;-742823.000000000000000;-1045463.000000000000000;0
2097;-743143.000000000000000;-1044742.000000000000000;0
3313;-743774.447000000625849;-1042903.081999998539686;0
2473;-743469.000000000000000;-1044899.000000000000000;0
1687;-741142.120000001043081;-1044817.019999999552965;0
7514;-742304.866000000387430;-1044375.124000001698732;0
5168;-743228.796000000089407;-1043420.092000000178814;0
1751;-742046.000000000000000;-1045235.000000000000000;0
6118;-743652.447000000625849;-1042857.607999999076128;0
4060;-742896.530000001192093;-1043699.219999998807907;0
531;-742157.000000000000000;-1043778.000000000000000;0
1676;-741033.000000000000000;-1044755.000000000000000;0
1881;-743269.000000000000000;-1044266.000000000000000;0
1813;-743118.000000000000000;-1044528.000000000000000;0
5136;-742992.278000000864267;-1043472.440000001341105;0
466;-741743.000000000000000;-1043331.000000000000000;0
3582;-744914.405999999493361;-1042603.405999999493361;0
5244;-743361.021000001579523;-1043374.999000001698732;0
2523;-742181.000000000000000;-1044140.000000000000000;0
1359;-742000.000000000000000;-1044897.000000000000000;0
1465;-741870.000000000000000;-1044016.000000000000000;0
1820;-743006.000000000000000;-1044272.000000000000000;0
110;-744127.000000000000000;-1042724.000000000000000;3
2167;-743021.000000000000000;-1045154.000000000000000;0
921;-743338.000000000000000;-1043818.000000000000000;0
2235;-743401.000000000000000;-1045221.000000000000000;0
1912;-743461.000000000000000;-1044430.000000000000000;0
3847;-743122.146999999880791;-1042525.489999998360872;0
2542;-741813.000000000000000;-1044224.000000000000000;0
7644;-742295.089000001549721;-1045373.164999999105930;0
5068;-742837.162999998778105;-1043263.965999998152256;0
1247;-742104.000000000000000;-1044609.000000000000000;0
1330;-741817.000000000000000;-1044709.000000000000000;0
2270;-742954.000000000000000;-1045592.000000000000000;0
6943;-742902.013999998569489;-1043932.647999998182058;0
4783;-742933.866999998688698;-1042668.403000000864267;0
7007;-742923.890000000596046;-1044218.879999998956919;0
6119;-743582.679999999701977;-1042696.969999998807907;0
6809;-741079.942999999970198;-1044626.942000001668930;0
2431;-742498.000000000000000;-1045094.000000000000000;0
6387;-742159.980000000447035;-1042496.210000000894070;0
1198;-741636.000000000000000;-1043836.000000000000000;0
1600;-742418.000000000000000;-1044944.000000000000000;0
514;-742119.000000000000000;-1043141.000000000000000;0
388;-742441.000000000000000;-1043809.000000000000000;0
5129;-743046.677000001072884;-1043376.409000001847744;0
281;-743045.000000000000000;-1043848.000000000000000;205
4609;-742557.414000000804663;-1042621.583999998867512;0
207;-743142.000000000000000;-1043590.000000000000000;0
7026;-743217.644999999552965;-1044082.329999998211861;0
3769;-742978.969999998807907;-1042975.300000000745058;0
1934;-743294.000000000000000;-1044407.000000000000000;0
2165;-742994.000000000000000;-1045179.000000000000000;0
2399;-742121.000000000000000;-1045372.000000000000000;0
1062;-741560.000000000000000;-1045151.000000000000000;0
650;-742263.000000000000000;-1043381.000000000000000;0
3540;-744595.842000000178814;-1042655.640999998897314;0
941;-742098.000000000000000;-1043132.000000000000000;0
6724;-742590.385000001639128;-1044428.910000000149012;0
594;-741896.000000000000000;-1043296.000000000000000;0
4984;-742580.537999998778105;-1043025.210999999195337;0
6824;-741347.350000001490116;-1044784.280000001192093;0
201;-743229.000000000000000;-1043614.000000000000000;0
2761;-743859.467000000178814;-1043468.017000000923872;0
5;-743466.000000000000000;-1042616.000000000000000;27
6698;-742304.160999998450279;-1044462.195999998599291;0
576;-742054.000000000000000;-1043517.000000000000000;0
4327;-742333.449000000953674;-1043399.671000000089407;0
4242;-742214.469999998807907;-1043415.800000000745058;0
249;-743433.000000000000000;-1043775.000000000000000;0
6660;-741490.809999998658895;-1044176.750000000000000;0
3262;-743572.423999998718500;-1042699.197000000625849;0
1460;-741482.000000000000000;-1044302.000000000000000;0
1370;-742061.000000000000000;-1044797.000000000000000;0
1693;-741613.000000000000000;-1044649.000000000000000;0
581;-741991.000000000000000;-1043457.000000000000000;0
4126;-742851.335000000894070;-1044085.449999999254942;0
6846;-741505.875000000000000;-1044995.949000000953674;0
376;-742530.000000000000000;-1043680.000000000000000;0
3791;-743144.839999999850988;-1042881.120000001043081;0
1223;-742190.000000000000000;-1044277.000000000000000;0
2892;-744005.317000001668930;-1043204.537000000476837;0
3370;-743858.489999998360872;-1043011.370999999344349;0
598;-741853.000000000000000;-1043233.000000000000000;0
4219;-742243.045000001788139;-1043600.660000000149012;0
7735;-742196.594999998807907;-1045243.149999998509884;0
698;-742041.000000000000000;-1042903.000000000000000;0
3759;-743267.609999999403954;-1042971.300000000745058;0
1393;-742083.000000000000000;-1045067.000000000000000;0
2402;-742236.000000000000000;-1045408.000000000000000;0
5446;-743190.850000001490116;-1043337.008999999612570;0
1085;-741634.000000000000000;-1044530.000000000000000;0
4430;-742235.070000000298023;-1043092.839999999850988;0
6338;-742247.910000000149012;-1042851.670000001788139;0
226;-742879.000000000000000;-1043516.000000000000000;0
3532;-744710.912999998778105;-1042677.949999999254942;0
3422;-743740.361000001430511;-1043095.657999999821186;0
2055;-743425.000000000000000;-1045038.000000000000000;0
7946;-742007.769999999552965;-1044091.789999999105930;0
7252;-742775.109999999403954;-1044855.940000001341105;0
4807;-743122.570000000298023;-1042767.850000001490116;0
3845;-743172.920000001788139;-1042573.210000000894070;0
4572;-742343.539999999105930;-1042598.289999999105930;0
4144;-742704.414999999105930;-1043822.484999999403954;0
4772;-742879.881999999284744;-1042872.157000001519918;0
2480;-741251.739999998360872;-1044639.480000000447035;0
649;-742233.000000000000000;-1043382.000000000000000;0
2009;-743221.000000000000000;-1044770.000000000000000;0
1006;-741930.000000000000000;-1044565.000000000000000;0
4878;-742876.434000000357628;-1042964.004000000655651;0
3157;-743935.576000001281500;-1042567.035000000149012;0
1852;-742739.000000000000000;-1044210.000000000000000;0
5978;-745078.285000000149012;-1042675.223999999463558;0
4071;-742929.394999999552965;-1043807.585000000894070;0
1172;-741869.000000000000000;-1044348.000000000000000;0
1542;-742043.000000000000000;-1044057.000000000000000;0
2158;-742781.000000000000000;-1045197.000000000000000;0
1428;-742028.000000000000000;-1044235.000000000000000;0
2289;-742915.000000000000000;-1045426.000000000000000;0
516;-742160.000000000000000;-1043135.000000000000000;0
7143;-742850.414999999105930;-1044473.449999999254942;0
6838;-741701.057999998331070;-1044977.087000001221895;0
170;-743440.000000000000000;-1043364.000000000000000;0
3063;-744133.098999999463558;-1042851.478999998420477;0
1096;-741474.000000000000000;-1044566.000000000000000;0
4996;-742488.458999998867512;-1042974.723999999463558;0
2218;-743091.000000000000000;-1045372.000000000000000;0
1903;-743445.000000000000000;-1044281.000000000000000;0
2123;-743299.000000000000000;-1045010.000000000000000;0
1321;-741825.000000000000000;-1044923.000000000000000;0
640;-741983.000000000000000;-1043299.000000000000000;0
8054;-742230.239999998360872;-1044988.530000001192093;0
5272;-743000.013999998569489;-1043245.364000000059605;0
8049;-742198.890000000596046;-1044891.600000001490116;0
6185;-742315.103999998420477;-1043062.923000000417233;0
1345;-741741.000000000000000;-1044789.000000000000000;0
7153;-742889.646999999880791;-1044547.438000001013279;0
4047;-743210.230000000447035;-1043992.289999999105930;0
734;-741935.000000000000000;-1043014.000000000000000;0
296;-742950.170000001788139;-1044097.429999999701977;0
7138;-742917.554999999701977;-1044421.774999998509884;0
4938;-742469.324999999254942;-1042658.263000000268221;0
4227;-742108.530000001192093;-1043326.289999999105930;0
1003;-741913.000000000000000;-1044580.000000000000000;0
5302;-743090.423999998718500;-1043070.048999998718500;0
1617;-742384.000000000000000;-1044407.000000000000000;0
4024;-743223.734999999403954;-1043859.954999998211861;0
1951;-743289.000000000000000;-1044491.000000000000000;0
3992;-743365.899999998509884;-1043881.385000001639128;0
1443;-741727.000000000000000;-1044386.000000000000000;0
4839;-742984.162000000476837;-1042715.425000000745058;0
4002;-743397.818999998271465;-1044054.317999999970198;0
5370;-742580.300999999046326;-1042977.140999998897314;0
735;-741910.000000000000000;-1043014.000000000000000;0
1447;-741541.000000000000000;-1044744.000000000000000;0
1970;-743380.000000000000000;-1044854.000000000000000;0
927;-742021.000000000000000;-1043498.000000000000000;0
1915;-743468.000000000000000;-1044494.000000000000000;0
1492;-741096.000000000000000;-1044331.000000000000000;0
1494;-741173.000000000000000;-1044326.000000000000000;0
1960;-743386.000000000000000;-1044623.000000000000000;0
4207;-742354.105999998748302;-1043530.157999999821186;0
6353;-741893.070000000298023;-1042697.059999998658895;120
7317;-742579.670000001788139;-1045022.239999998360872;0
4944;-742430.605999998748302;-1043013.879000000655651;0
3834;-743079.190000001341105;-1042579.899999998509884;0
3127;-743955.348000001162291;-1042668.469000000506639;0
6826;-741405.300000000745058;-1044777.199999999254942;0
4757;-742873.984000001102686;-1042820.212000001221895;0
1872;-743422.000000000000000;-1044246.000000000000000;0
5111;-742892.337999999523163;-1043424.370999999344349;0
6702;-742291.596999999135733;-1044564.116999998688698;0
7736;-742342.260000001639128;-1045113.918000001460314;0
4305;-742520.295000001788139;-1043993.065000001341105;0
7699;-742381.114000000059605;-1044818.644000001251698;0
5231;-743342.107000000774860;-1043497.627000000327826;0
2457;-741016.000000000000000;-1044542.000000000000000;0
4526;-742696.690000001341105;-1042823.320000000298023;0
6764;-741137.519999999552965;-1044426.289999999105930;0
8273;-742057.820000000298023;-1042728.760000001639128;0
710;-741829.000000000000000;-1042878.000000000000000;0
1155;-741208.000000000000000;-1044484.000000000000000;0
7017;-742571.059999998658895;-1044267.640000000596046;0
4897;-742560.320000000298023;-1042829.359999999403954;0
3997;-743395.094999998807907;-1044031.109999999403954;0
2032;-743526.000000000000000;-1044797.000000000000000;0
6532;-741593.359999999403954;-1044141.059999998658895;0
7743;-741707.912999998778105;-1045072.826999999582767;0
1046;-741838.000000000000000;-1044805.000000000000000;0
1453;-741525.000000000000000;-1044529.000000000000000;0
1533;-741832.000000000000000;-1043879.000000000000000;0
4860;-742964.800999999046326;-1043016.107999999076128;0
520;-742225.000000000000000;-1043127.000000000000000;0
3601;-744894.190999999642372;-1042626.861999999731779;0
8044;-742176.640000000596046;-1044778.420000001788139;0
1760;-741162.000000000000000;-1044101.000000000000000;0
6650;-741714.296999998390675;-1044110.177000001072884;0
4118;-742725.980000000447035;-1044022.765000000596046;0
6125;-743428.124000001698732;-1043615.223999999463558;0
7121;-743339.839999999850988;-1044620.059999998658895;0
394;-742405.000000000000000;-1043863.000000000000000;0
7190;-742577.989999998360872;-1044771.690000001341105;0
560;-742181.000000000000000;-1043665.000000000000000;0
7284;-742811.789999999105930;-1044718.210000000894070;0
7214;-742470.679999999701977;-1044531.269999999552965;0
6293;-742666.339999999850988;-1042695.188999999314547;0
1467;-741808.000000000000000;-1044064.000000000000000;0
4636;-742576.870999999344349;-1042687.116999998688698;0
7004;-743069.289999999105930;-1044326.469999998807907;0
820;-742019.000000000000000;-1042600.000000000000000;0
633;-742100.000000000000000;-1043296.000000000000000;0
1782;-741278.000000000000000;-1043912.000000000000000;0
993;-741977.000000000000000;-1044436.000000000000000;0
3983;-743317.089999999850988;-1043883.160000000149012;0
6707;-742271.293999999761581;-1044721.274999998509884;0
7171;-742671.969999998807907;-1044508.219999998807907;0
269;-743248.000000000000000;-1043725.000000000000000;0
7157;-742964.840999998152256;-1044545.681000001728535;0
8280;-742150.949999999254942;-1042770.420000001788139;0
6337;-742257.140000000596046;-1042864.820000000298023;0
7729;-742623.480999998748302;-1044601.217000000178814;0
3305;-743801.410000000149012;-1042874.962999999523163;0
6486;-741772.072999998927116;-1044516.256000000983477;0
5680;-743402.000000000000000;-1043718.245000001043081;0
7950;-741950.460000000894070;-1044150.710000000894070;0
3885;-742418.339999999850988;-1042442.059999998658895;0
6199;-742319.442000001668930;-1043067.822999998927116;0
2548;-741672.000000000000000;-1044304.000000000000000;0
4665;-742824.410000000149012;-1042592.260000001639128;0
1611;-742400.000000000000000;-1044442.000000000000000;0
329;-742675.000000000000000;-1044052.000000000000000;0
7203;-742571.300000000745058;-1044963.219999998807907;0
3309;-743830.328000001609325;-1042834.535000000149012;0
4928;-742444.890000000596046;-1042854.899999998509884;0
1271;-742240.000000000000000;-1044521.000000000000000;0
3952;-743407.521999999880791;-1043538.500999998301268;0
6172;-742317.552999999374151;-1043068.875999998301268;0
8066;-742286.199999999254942;-1045237.250000000000000;0
1652;-741379.000000000000000;-1044550.000000000000000;0
4323;-742267.879999998956919;-1043190.035000000149012;0
4455;-741714.589000001549721;-1042663.557000000029802;0
4945;-742422.162999998778105;-1043009.861000001430511;0
6747;-742410.170000001788139;-1044287.228000000119209;0
1040;-741904.000000000000000;-1044623.000000000000000;0
1322;-741906.000000000000000;-1044975.000000000000000;0
547;-742316.910000000149012;-1043790.309999998658895;0
3995;-743393.225000001490116;-1043973.719999998807907;0
2085;-742426.000000000000000;-1044797.000000000000000;0
6726;-742476.517999999225140;-1044410.600000001490116;0
4728;-742862.960000000894070;-1042727.210000000894070;0
6220;-742318.432999998331070;-1043062.949999999254942;0
2271;-742945.000000000000000;-1045771.000000000000000;0
6605;-741648.401999998837709;-1043884.642999999225140;0
6297;-742506.859999999403954;-1042634.250000000000000;0
4203;-742299.442000001668930;-1043608.692000001668930;0
8244;-742617.899999998509884;-1045206.480000000447035;0
4991;-742675.414999999105930;-1043031.236000001430511;0
1258;-742076.000000000000000;-1044837.000000000000000;0
339;-742606.000000000000000;-1043916.000000000000000;0
4200;-742219.350000001490116;-1043727.980999998748302;0
6149;-742312.646000001579523;-1043064.261999998241663;0
674;-742463.000000000000000;-1043211.000000000000000;0
912;-741690.000000000000000;-1042686.000000000000000;0
4620;-742539.574000000953674;-1042537.307999998331070;0
1378;-742161.000000000000000;-1044904.000000000000000;0
672;-742484.000000000000000;-1043226.000000000000000;0
2072;-743043.000000000000000;-1044743.000000000000000;0
4681;-742756.870000001043081;-1042844.710000000894070;0
6295;-742653.399999998509884;-1042696.070000000298023;0
4953;-742431.500999998301268;-1043027.399999998509884;0
4341;-742488.855000000447035;-1043325.412999998778105;0
7957;-741692.839999999850988;-1044277.559999998658895;0
4775;-742898.375999998301268;-1042802.914000000804663;0
6849;-741635.855999998748302;-1045019.947999998927116;0
824;-742142.000000000000000;-1042596.000000000000000;0
2359;-742348.000000000000000;-1045581.000000000000000;0
400;-742356.000000000000000;-1043931.000000000000000;0
693;-742284.000000000000000;-1043062.000000000000000;0
6123;-743427.453000001609325;-1043603.083000000566244;0
1452;-741519.000000000000000;-1044574.000000000000000;0
6133;-742309.820000000298023;-1043062.171999998390675;0
5711;-743422.837999999523163;-1043640.131000000983477;0
7732;-742611.719000000506639;-1044632.203999999910593;0
5682;-743399.638000000268221;-1043719.120999999344349;0
7039;-743335.785000000149012;-1044169.030000001192093;0
4599;-742625.879999998956919;-1042698.820000000298023;0
6511;-741291.670000001788139;-1044319.690000001341105;0
4519;-742665.160000000149012;-1042790.820000000298023;0
1855;-742642.000000000000000;-1044286.000000000000000;0
4055;-743119.070000000298023;-1043694.109999999403954;0
4041;-743227.600000001490116;-1043746.495000001043081;0
1118;-741807.000000000000000;-1044459.000000000000000;0
1706;-741225.800000000745058;-1044698.800000000745058;0
6176;-742314.491000000387430;-1043063.256000000983477;0
4647;-742705.322999998927116;-1042525.425000000745058;0
6478;-741931.429999999701977;-1044453.500000000000000;0
8265;-742197.820000000298023;-1042704.260000001639128;0
5296;-743058.934999998658895;-1043177.035000000149012;0
6243;-742367.739999998360872;-1043061.098000001162291;0
821;-742048.000000000000000;-1042601.000000000000000;0
4525;-742716.719999998807907;-1042823.219999998807907;0
722;-742139.000000000000000;-1043009.000000000000000;0
3783;-743211.559999998658895;-1042920.120000001043081;0
2520;-741847.000000000000000;-1045324.000000000000000;0
261;-743429.000000000000000;-1043723.000000000000000;0
5669;-743414.997999999672174;-1043713.431000001728535;0
7244;-742713.559999998658895;-1044823.719999998807907;0
2561;-741214.000000000000000;-1044393.000000000000000;0
4851;-742991.500000000000000;-1042818.243000000715256;0
6488;-741718.210000000894070;-1044532.489999998360872;0
1442;-741753.000000000000000;-1044375.000000000000000;0
4776;-742909.276000000536442;-1042820.587000001221895;0
5421;-742337.905999999493361;-1042777.837999999523163;0
3971;-743206.815000001341105;-1043721.065000001341105;0
1295;-742082.000000000000000;-1044456.000000000000000;0
265;-743344.000000000000000;-1043735.000000000000000;0
4977;-742489.451000001281500;-1042992.394000001251698;0
171;-743448.000000000000000;-1043399.000000000000000;0
4661;-742816.708000000566244;-1042503.918999999761581;0
793;-741697.000000000000000;-1042588.000000000000000;0
1087;-741605.000000000000000;-1044533.000000000000000;0
5579;-743409.682999998331070;-1043634.574999999254942;0
4926;-742452.660000000149012;-1042896.190000001341105;0
2550;-741576.000000000000000;-1044342.000000000000000;0
6694;-742280.806000001728535;-1044814.875999998301268;0
6250;-742374.638999998569489;-1043047.576999999582767;0
5663;-743422.087999999523163;-1043710.807999998331070;0
6163;-742316.921000000089407;-1043069.223000001162291;0
6686;-742381.967000000178814;-1044961.747000001370907;0
262;-743408.000000000000000;-1043731.000000000000000;0
1857;-742574.000000000000000;-1044318.000000000000000;0
1331;-741805.000000000000000;-1044733.000000000000000;0
4727;-742869.390000000596046;-1042700.829999998211861;0
6135;-742308.289000000804663;-1043059.340999998152256;0
2578;-742494.000000000000000;-1045542.000000000000000;0
4502;-742349.309999998658895;-1042718.199999999254942;0
7962;-741640.190000001341105;-1044316.800000000745058;0
3092;-743909.377999998629093;-1042780.322999998927116;0
4699;-742676.469999998807907;-1042731.760000001639128;0
5015;-742575.741000000387430;-1043008.607999999076128;0
4692;-742681.477000001817942;-1042600.622000001370907;0
3948;-743409.451999999582767;-1043515.662000000476837;0
840;-742067.000000000000000;-1042522.000000000000000;0
1906;-743459.000000000000000;-1044325.000000000000000;0
6187;-742313.572999998927116;-1043060.111999999731779;0
890;-742007.000000000000000;-1042740.000000000000000;0
4005;-743325.977000001817942;-1044053.392999999225140;0
216;-743023.000000000000000;-1043539.000000000000000;0
4922;-742443.129999998956919;-1042886.510000001639128;0
1138;-741500.000000000000000;-1044458.000000000000000;0
2059;-742625.000000000000000;-1044459.000000000000000;0
4466;-742177.620000001043081;-1042567.899999998509884;0
6776;-741098.559999998658895;-1044491.530000001192093;0
1058;-741667.000000000000000;-1045072.000000000000000;0
4588;-742421.668999999761581;-1042556.124000001698732;0
3702;-744567.984999999403954;-1042510.802000001072884;0
2524;-742108.000000000000000;-1044191.000000000000000;0
1224;-742174.000000000000000;-1044253.000000000000000;0
463;-741703.000000000000000;-1043287.000000000000000;0
1218;-742120.000000000000000;-1044309.000000000000000;0
3322;-743927.326000001281500;-1042934.425999999046326;0
5719;-743419.508999999612570;-1043629.817999999970198;0
1179;-741934.000000000000000;-1044251.000000000000000;0
4969;-742465.059999998658895;-1043095.034000001847744;0
4740;-742757.410000000149012;-1042715.589999999850988;0
1769;-741260.000000000000000;-1044112.000000000000000;0
248;-743439.000000000000000;-1043748.000000000000000;0
8267;-742240.420000001788139;-1042709.160000000149012;0
1938;-743289.000000000000000;-1044306.000000000000000;0
1164;-741055.000000000000000;-1044515.000000000000000;0
3423;-743731.600000001490116;-1043092.067999999970198;0
844;-742138.000000000000000;-1042519.000000000000000;0
7077;-743564.359000001102686;-1045385.210000000894070;0
4822;-742945.579999998211861;-1042879.910000000149012;0
1700;-741406.000000000000000;-1044677.000000000000000;0
3280;-743624.243999999016523;-1042811.839999999850988;0
3345;-743952.826999999582767;-1043061.079999998211861;0
4603;-742442.480000000447035;-1042617.250000000000000;0
4923;-742431.019999999552965;-1042882.210000000894070;0
702;-741961.000000000000000;-1042885.000000000000000;0
2372;-742466.000000000000000;-1045488.000000000000000;0
7217;-742516.318999998271465;-1044582.890000000596046;0
1914;-743464.000000000000000;-1044458.000000000000000;0
3950;-743426.829999998211861;-1043556.070000000298023;0
6247;-742371.447000000625849;-1043053.739000000059605;0
6138;-742313.561999998986721;-1043067.399000000208616;0
4648;-742721.809999998658895;-1042535.192000001668930;0
6770;-741306.423999998718500;-1044414.120999999344349;0
6104;-742208.646999999880791;-1043103.999000001698732;0
1298;-741964.000000000000000;-1044736.000000000000000;0
678;-742421.000000000000000;-1043181.000000000000000;0
5646;-743428.978999998420477;-1043693.493000000715256;0
4600;-742647.000000000000000;-1042709.000000000000000;0
4744;-742848.129999998956919;-1042759.629999998956919;0
1228;-742220.539999999105930;-1044250.829999998211861;0
4748;-742895.730000000447035;-1042781.289999999105930;0
6261;-742373.956999998539686;-1043022.041999999433756;0
6165;-742315.407000001519918;-1043066.436000000685453;0
7648;-742317.809000000357628;-1045414.322000000625849;0
1411;-741639.480000000447035;-1044683.019999999552965;0
629;-742200.000000000000000;-1043289.000000000000000;0
5138;-743030.936000000685453;-1043483.587999999523163;0
5517;-743427.287000000476837;-1043618.956999998539686;0
5164;-743173.335000000894070;-1043404.677000001072884;0
6177;-742313.717999998480082;-1043061.859999999403954;0
3829;-742992.250000000000000;-1042635.140000000596046;0
4520;-742651.079999998211861;-1042798.449999999254942;0
1052;-741761.000000000000000;-1045002.000000000000000;0
1396;-741798.000000000000000;-1044263.000000000000000;0
720;-741671.000000000000000;-1042815.000000000000000;0
3353;-743954.399999998509884;-1043021.017999999225140;0
2021;-743281.000000000000000;-1044948.000000000000000;0
760;-741646.000000000000000;-1042623.000000000000000;0
3799;-743117.550000000745058;-1042868.160000000149012;0
1304;-741810.000000000000000;-1044684.000000000000000;0
1285;-742198.000000000000000;-1044467.000000000000000;0
4787;-742962.412000000476837;-1042621.662000000476837;0
6281;-742307.629000000655651;-1043042.113000001758337;0
3801;-743091.350000001490116;-1042882.719999998807907;0
7540;-742660.390000000596046;-1045368.829999998211861;0
5149;-743072.195999998599291;-1043377.370999999344349;0
3580;-744924.973999999463558;-1042593.699999999254942;0
1152;-741257.000000000000000;-1044489.000000000000000;0
4978;-742491.822999998927116;-1043028.688000001013279;0
5414;-742582.574999999254942;-1042677.478999998420477;0
4937;-742461.982000000774860;-1042671.942000001668930;0
8282;-742183.519999999552965;-1042790.890000000596046;0
1476;-741531.000000000000000;-1044196.000000000000000;0
1159;-741137.000000000000000;-1044493.000000000000000;0
4894;-742610.888999998569489;-1042819.686999998986721;0
6244;-742368.587000001221895;-1043059.245999999344349;0
4243;-742194.050000000745058;-1043431.899999998509884;0
6251;-742377.396999999880791;-1043042.284000001847744;0
