OID_;X;Y;TEMPERATURE
3614;-744984.548999998718500;-1042283.640999998897314;0
110;-744127.000000000000000;-1042724.000000000000000;0
3019;-744463.447999998927116;-1042784.646000001579523;0
3568;-744718.817999999970198;-1042588.614999998360872;0
3692;-744525.876499999314547;-1042540.534000001847744;0
3580;-744924.973999999463558;-1042593.699999999254942;0
2605;-745393.842999998480082;-1042860.796000000089407;0
5975;-745052.346999999135733;-1042674.673000000417233;0
118;-745135.000000000000000;-1042687.000000000000000;0
3542;-744575.274000000208616;-1042656.160000000149012;0
2696;-743477.489999998360872;-1042038.000000000000000;0
2520;-741847.000000000000000;-1045324.000000000000000;0
7011;-742831.309999998658895;-1044257.245000001043081;0
1760;-741162.000000000000000;-1044101.000000000000000;0
7780;-743046.243000000715256;-1045844.168999999761581;0
4070;-742925.285000000149012;-1043783.565000001341105;43
6946;-742974.765000000596046;-1043929.388000000268221;0
3795;-743173.190000001341105;-1042842.170000001788139;0
8079;-742021.839999999850988;-1045292.179999999701977;0
6874;-741789.789999999105930;-1045272.100000001490116;0
1584;-742368.000000000000000;-1044717.000000000000000;0
7279;-742799.399999998509884;-1044679.829999998211861;0
6726;-742476.517999999225140;-1044410.600000001490116;0
4163;-742487.695000000298023;-1044138.535000000149012;0
696;-742077.000000000000000;-1042913.000000000000000;0
7215;-742484.320000000298023;-1044546.620000001043081;0
7171;-742671.969999998807907;-1044508.219999998807907;0
3109;-743754.403999999165535;-1042652.872000001370907;0
6930;-742046.030000001192093;-1045191.489999998360872;0
8152;-743293.600000001490116;-1043190.510000001639128;0
7259;-742935.280000001192093;-1044869.829999998211861;0
7187;-742595.019999999552965;-1044739.962000001221895;0
885;-741739.000000000000000;-1042777.000000000000000;0
7246;-742736.730000000447035;-1044825.399999998509884;0
2131;-743073.000000000000000;-1045134.000000000000000;0
2433;-742514.000000000000000;-1045081.000000000000000;0
3269;-743600.679000001400709;-1042731.660000000149012;0
1524;-741710.000000000000000;-1043844.000000000000000;0
985;-741823.000000000000000;-1044444.000000000000000;0
744;-741666.000000000000000;-1042994.000000000000000;0
5307;-743082.182000000029802;-1043190.162000000476837;0
7;-743479.000000000000000;-1042567.000000000000000;0
7705;-742283.471999999135733;-1044316.339999999850988;0
1487;-741117.000000000000000;-1044216.000000000000000;0
1317;-741748.000000000000000;-1044884.000000000000000;0
524;-742255.000000000000000;-1043913.000000000000000;0
2255;-743181.000000000000000;-1045372.000000000000000;0
4237;-742425.385000001639128;-1043517.421000000089407;0
3207;-743687.458999998867512;-1042502.859000001102686;0
2009;-743221.000000000000000;-1044770.000000000000000;0
5204;-743246.423999998718500;-1043308.298999998718500;0
527;-742186.000000000000000;-1043818.000000000000000;0
1128;-741655.000000000000000;-1044448.000000000000000;0
2016;-743230.000000000000000;-1044873.000000000000000;0
7514;-742304.866000000387430;-1044375.124000001698732;0
4190;-742301.250000000000000;-1044166.100000001490116;0
2151;-742827.000000000000000;-1045047.000000000000000;0
1482;-741289.000000000000000;-1044232.000000000000000;0
601;-741823.000000000000000;-1043224.000000000000000;0
7350;-742556.390000000596046;-1045185.980000000447035;0
2398;-742150.000000000000000;-1045370.000000000000000;0
5172;-743274.383999999612570;-1043432.322999998927116;0
2070;-742993.000000000000000;-1044723.000000000000000;0
2160;-742849.000000000000000;-1045147.000000000000000;0
2021;-743281.000000000000000;-1044948.000000000000000;0
7411;-743529.510000001639128;-1045393.140000000596046;0
2409;-742363.000000000000000;-1045093.000000000000000;0
3839;-743112.140000000596046;-1042558.280000001192093;0
509;-741991.000000000000000;-1043143.000000000000000;0
2291;-742850.000000000000000;-1045401.000000000000000;0
1318;-741838.000000000000000;-1044940.000000000000000;0
351;-742509.000000000000000;-1043739.000000000000000;0
1772;-741277.000000000000000;-1044012.000000000000000;0
724;-741987.000000000000000;-1042981.000000000000000;0
1943;-743264.000000000000000;-1044421.000000000000000;0
731;-741925.000000000000000;-1042997.000000000000000;0
4169;-742414.420000001788139;-1043962.329999998211861;0
4135;-742747.719999998807907;-1044085.660000000149012;0
1182;-741915.000000000000000;-1044252.000000000000000;0
7653;-742255.225000001490116;-1045513.048000000417233;0
2357;-742388.000000000000000;-1045577.000000000000000;0
2242;-743321.000000000000000;-1045313.000000000000000;0
2326;-742523.000000000000000;-1045498.000000000000000;0
3290;-743573.385000001639128;-1042757.348999999463558;0
8;-743496.000000000000000;-1042539.000000000000000;0
3869;-742407.539999999105930;-1042414.850000001490116;0
7721;-742941.157000001519918;-1044215.368000000715256;0
4455;-741714.589000001549721;-1042663.557000000029802;0
339;-742606.000000000000000;-1043916.000000000000000;0
2081;-742551.000000000000000;-1044621.000000000000000;0
7022;-743155.660000000149012;-1044074.410000000149012;0
17;-743587.000000000000000;-1042394.000000000000000;0
1449;-741533.000000000000000;-1044684.000000000000000;0
8265;-742197.820000000298023;-1042704.260000001639128;0
284;-743022.000000000000000;-1043758.000000000000000;0
1854;-742675.000000000000000;-1044271.000000000000000;0
1818;-743046.000000000000000;-1044380.000000000000000;0
1238;-742150.000000000000000;-1044384.000000000000000;0
2225;-743041.000000000000000;-1045477.000000000000000;0
1521;-741808.000000000000000;-1043917.000000000000000;0
3984;-743314.570000000298023;-1043905.594999998807907;0
2889;-744074.103999998420477;-1043194.559999998658895;0
4245;-742160.210000000894070;-1043410.570000000298023;0
4145;-742687.109999999403954;-1043837.125000000000000;0
2467;-743434.000000000000000;-1044742.000000000000000;0
4083;-742820.771999999880791;-1043708.657000001519918;0
2189;-743472.000000000000000;-1045183.000000000000000;0
1831;-742994.000000000000000;-1044105.000000000000000;0
226;-742879.000000000000000;-1043516.000000000000000;0
7828;-743537.940000001341105;-1045170.530000001192093;0
5267;-743190.021999999880791;-1043149.807000000029802;0
4018;-743153.285000000149012;-1043925.850000001490116;0
3769;-742978.969999998807907;-1042975.300000000745058;0
1821;-742995.000000000000000;-1044239.000000000000000;0
6649;-741731.100000001490116;-1044094.850000001490116;0
2259;-743001.000000000000000;-1045599.000000000000000;0
5408;-743696.881000000983477;-1042878.024999998509884;0
280;-743053.000000000000000;-1043875.000000000000000;0
1596;-742323.000000000000000;-1045037.000000000000000;0
7649;-742319.399999998509884;-1045429.557000000029802;0
7966;-741489.800000000745058;-1044356.219999998807907;0
4331;-742391.967999998480082;-1043310.539000000804663;0
2321;-742679.000000000000000;-1045480.000000000000000;0
2276;-742865.000000000000000;-1045649.000000000000000;0
1929;-743440.000000000000000;-1044410.000000000000000;0
2185;-743216.000000000000000;-1045130.000000000000000;0
4991;-742675.414999999105930;-1043031.236000001430511;0
1540;-742005.000000000000000;-1044009.000000000000000;0
4207;-742354.105999998748302;-1043530.157999999821186;0
389;-742408.000000000000000;-1043783.000000000000000;0
4062;-742830.460000000894070;-1043654.920000001788139;0
2135;-743006.000000000000000;-1045119.000000000000000;0
7037;-743316.085000000894070;-1044222.170000001788139;0
1816;-743070.000000000000000;-1044444.000000000000000;0
1926;-743301.000000000000000;-1044321.000000000000000;0
301;-742613.000000000000000;-1043903.000000000000000;0
3154;-743984.818999998271465;-1042573.844999998807907;0
704;-741929.000000000000000;-1042879.000000000000000;0
2748;-743933.984000001102686;-1043445.734000001102686;0
4097;-742806.000000000000000;-1043874.793999999761581;0
2007;-743231.000000000000000;-1044741.000000000000000;0
4138;-742883.587000001221895;-1043997.287999998778105;0
380;-742501.000000000000000;-1043722.000000000000000;0
3842;-743141.300000000745058;-1042637.030000001192093;0
4768;-742862.888000000268221;-1042936.997999999672174;0
7046;-743398.329999998211861;-1044186.289999999105930;0
1349;-741824.000000000000000;-1044818.000000000000000;0
4005;-743325.977000001817942;-1044053.392999999225140;0
1326;-741927.000000000000000;-1044976.000000000000000;0
6713;-742278.905999999493361;-1044887.284000001847744;0
1142;-741437.000000000000000;-1044466.000000000000000;0
465;-741728.000000000000000;-1043309.000000000000000;0
930;-744068.000000000000000;-1043405.000000000000000;0
1372;-742118.000000000000000;-1044815.000000000000000;0
1509;-741741.000000000000000;-1044196.000000000000000;0
4427;-742190.519999999552965;-1043099.440000001341105;0
7014;-742650.170000001788139;-1044305.010000001639128;0
4210;-742178.550000000745058;-1043586.035000000149012;0
3416;-743754.546000000089407;-1043086.953000001609325;0
538;-742113.000000000000000;-1043652.000000000000000;0
4519;-742665.160000000149012;-1042790.820000000298023;0
6825;-741380.010000001639128;-1044780.089999999850988;0
5316;-743075.980000000447035;-1043041.059999998658895;0
4136;-742726.225000001490116;-1044089.829999998211861;0
7978;-741231.690000001341105;-1044407.519999999552965;0
983;-741953.000000000000000;-1044414.000000000000000;0
4773;-742888.429000001400709;-1042839.530000001192093;0
4603;-742442.480000000447035;-1042617.250000000000000;0
3131;-743940.644999999552965;-1042662.771000001579523;0
304;-742868.000000000000000;-1044122.000000000000000;0
7305;-742795.050000000745058;-1045069.809999998658895;0
737;-741849.000000000000000;-1043021.000000000000000;0
514;-742119.000000000000000;-1043141.000000000000000;0
274;-743359.000000000000000;-1043833.000000000000000;0
1610;-742374.000000000000000;-1044447.000000000000000;0
7151;-742842.649000000208616;-1044545.307000000029802;0
4572;-742343.539999999105930;-1042598.289999999105930;0
558;-742200.000000000000000;-1043683.000000000000000;0
1679;-741116.550000000745058;-1044578.600000001490116;0
6834;-741594.763000000268221;-1044922.236000001430511;0
1251;-742091.000000000000000;-1044690.000000000000000;0
3308;-743813.059999998658895;-1042830.515000000596046;0
1070;-741665.000000000000000;-1044736.000000000000000;0
1298;-741964.000000000000000;-1044736.000000000000000;0
5116;-742947.859000001102686;-1043386.767000000923872;0
909;-742183.000000000000000;-1042503.000000000000000;0
6728;-742547.451000001281500;-1044392.396000001579523;0
4619;-742460.010000001639128;-1042480.890000000596046;0
2373;-742469.000000000000000;-1045517.000000000000000;0
3097;-743920.339999999850988;-1042769.188999999314547;0
4463;-742198.989999998360872;-1042569.030000001192093;0
1761;-741194.000000000000000;-1044104.000000000000000;0
673;-742467.000000000000000;-1043230.000000000000000;0
7024;-743182.745000001043081;-1044052.815000001341105;0
4708;-742755.420000001788139;-1042611.309999998658895;0
1331;-741805.000000000000000;-1044733.000000000000000;0
1095;-741452.000000000000000;-1044553.000000000000000;0
1106;-741293.000000000000000;-1044589.000000000000000;0
632;-742130.000000000000000;-1043287.000000000000000;0
6708;-742268.296999998390675;-1044748.438000001013279;0
5221;-743263.820000000298023;-1043556.920000001788139;0
7961;-741602.260000001639128;-1044314.350000001490116;0
2036;-743404.000000000000000;-1044803.000000000000000;0
6837;-741677.875999998301268;-1044964.791999999433756;0
1464;-741899.000000000000000;-1043994.000000000000000;0
1986;-743480.000000000000000;-1044794.000000000000000;0
7154;-742908.467000000178814;-1044547.784000001847744;0
1438;-741809.000000000000000;-1044350.000000000000000;0
1683;-741134.429999999701977;-1044711.329999998211861;0
7141;-742895.629999998956919;-1044470.910000000149012;0
7950;-741950.460000000894070;-1044150.710000000894070;0
4324;-742269.346000000834465;-1043165.410999998450279;0
2475;-743411.000000000000000;-1044901.000000000000000;0
1288;-742189.000000000000000;-1044543.000000000000000;0
2054;-743413.000000000000000;-1045010.000000000000000;0
2209;-743309.000000000000000;-1045217.000000000000000;0
973;-741908.000000000000000;-1044547.000000000000000;0
1491;-741057.000000000000000;-1044333.000000000000000;0
677;-742425.000000000000000;-1043200.000000000000000;0
4672;-742811.831999998539686;-1042675.907999999821186;0
587;-741944.000000000000000;-1043391.000000000000000;0
7094;-743370.620000001043081;-1044578.289999999105930;0
1697;-741495.000000000000000;-1044664.000000000000000;0
1014;-742097.000000000000000;-1044586.000000000000000;0
5436;-744076.484000001102686;-1043296.519999999552965;0
1287;-742217.000000000000000;-1044486.000000000000000;0
7204;-742561.000000000000000;-1044976.910000000149012;0
1386;-742158.000000000000000;-1044976.000000000000000;0
1219;-742137.000000000000000;-1044315.000000000000000;0
786;-741706.000000000000000;-1042606.000000000000000;0
3954;-743409.050999999046326;-1043550.699999999254942;0
4512;-742515.339999999850988;-1042750.230000000447035;0
6159;-742312.495999999344349;-1043062.521000001579523;0
3373;-743814.043000001460314;-1043018.168000001460314;0
575;-742053.000000000000000;-1043541.000000000000000;0
159;-742965.000000000000000;-1042641.000000000000000;0
7656;-742290.328000001609325;-1045294.499000001698732;0
4031;-743135.774000000208616;-1043769.622000001370907;0
4826;-743043.850000001490116;-1042979.600000001490116;0
1267;-742040.000000000000000;-1044999.000000000000000;0
5122;-742902.166999999433756;-1043373.543999999761581;0
583;-741975.000000000000000;-1043434.000000000000000;0
1418;-741620.000000000000000;-1044458.000000000000000;0
8285;-742232.780000001192093;-1042821.149999998509884;0
3921;-743909.208999998867512;-1043541.574000000953674;0
6256;-742380.723000001162291;-1043035.640000000596046;0
1413;-741631.000000000000000;-1044621.000000000000000;0
4847;-742981.100000001490116;-1042831.059999998658895;0
6353;-741893.070000000298023;-1042697.059999998658895;0
6851;-741595.567000001668930;-1045078.456999998539686;0
6993;-743172.409000001847744;-1044501.339000001549721;0
4731;-742802.002999998629093;-1042654.546000000089407;0
2086;-742404.000000000000000;-1044796.000000000000000;0
4843;-742975.057000000029802;-1042729.682000000029802;0
639;-741958.000000000000000;-1043294.000000000000000;0
4473;-741822.449999999254942;-1042676.699000000953674;0
4962;-742387.429999999701977;-1043028.129999998956919;0
6687;-742383.274000000208616;-1044983.381999999284744;0
722;-742139.000000000000000;-1043009.000000000000000;0
5655;-743429.699000000953674;-1043704.359999999403954;0
3066;-744075.627000000327826;-1042883.837000001221895;0
3810;-743261.510000001639128;-1042802.960000000894070;0
2502;-742750.000000000000000;-1045457.000000000000000;0
6371;-741972.725000001490116;-1042696.274000000208616;0
4809;-743081.589999999850988;-1042799.800000000745058;0
6294;-742653.550000000745058;-1042686.140000000596046;0
4752;-742774.460000000894070;-1042743.280000001192093;0
3824;-743038.059999998658895;-1042573.800000000745058;0
2300;-742561.000000000000000;-1045413.000000000000000;0
3353;-743954.399999998509884;-1043021.017999999225140;0
7143;-742850.414999999105930;-1044473.449999999254942;0
2486;-741289.250000000000000;-1044848.829999998211861;0
4838;-742981.304999999701977;-1042697.471000000834465;0
4504;-742387.329999998211861;-1042714.820000000298023;0
3747;-743250.879999998956919;-1042956.620000001043081;0
4243;-742194.050000000745058;-1043431.899999998509884;0
4926;-742452.660000000149012;-1042896.190000001341105;0
1164;-741055.000000000000000;-1044515.000000000000000;0
1271;-742240.000000000000000;-1044521.000000000000000;0
6136;-742315.081999998539686;-1043070.210000000894070;0
3752;-743213.949999999254942;-1042902.719999998807907;0
5147;-743077.127000000327826;-1043433.221999999135733;0
1032;-741970.000000000000000;-1044813.000000000000000;0
2335;-742825.000000000000000;-1045539.000000000000000;0
4491;-741872.890000000596046;-1042643.989999998360872;0
7169;-742693.079999998211861;-1044394.177999999374151;0
3451;-743684.017000000923872;-1042986.991000000387430;0
1620;-742439.000000000000000;-1044323.000000000000000;0
7933;-743544.570000000298023;-1044950.370000001043081;0
552;-742259.000000000000000;-1043732.000000000000000;0
617;-742179.000000000000000;-1043272.000000000000000;0
2892;-744005.317000001668930;-1043204.537000000476837;0
4227;-742108.530000001192093;-1043326.289999999105930;0
7160;-743028.010999999940395;-1044543.267999999225140;0
5411;-742776.079999998211861;-1042905.300000000745058;0
4844;-742977.256000000983477;-1042754.953000001609325;0
8280;-742150.949999999254942;-1042770.420000001788139;0
6709;-742264.587999999523163;-1044776.254999998956919;0
1955;-743374.000000000000000;-1044515.000000000000000;0
3324;-743935.892000000923872;-1042963.829999998211861;0
1730;-741428.000000000000000;-1045052.000000000000000;0
624;-742241.000000000000000;-1043343.000000000000000;0
6722;-742357.717000000178814;-1044705.708000000566244;0
1871;-743440.000000000000000;-1044260.000000000000000;0
5677;-743405.545000001788139;-1043716.931000001728535;0
4639;-742567.399999998509884;-1042548.592999998480082;0
6768;-741255.769999999552965;-1044419.920000001788139;0
1376;-742165.000000000000000;-1044873.000000000000000;0
6264;-742357.280000001192093;-1043020.445999998599291;0
203;-743204.000000000000000;-1043607.000000000000000;0
6843;-741569.070000000298023;-1044975.261999998241663;0
1558;-741192.000000000000000;-1044273.000000000000000;0
1189;-741786.000000000000000;-1044043.000000000000000;0
2334;-742872.000000000000000;-1045519.000000000000000;0
1699;-741435.000000000000000;-1044671.000000000000000;0
4973;-742480.098000001162291;-1043031.443999998271465;0
4749;-742884.420000001788139;-1042760.329999998211861;0
560;-742181.000000000000000;-1043665.000000000000000;0
5069;-742829.063999999314547;-1043280.938000001013279;0
270;-743230.000000000000000;-1043721.000000000000000;0
5413;-742651.872000001370907;-1042662.627999998629093;0
2397;-742181.000000000000000;-1045368.000000000000000;0
342;-742573.000000000000000;-1043878.000000000000000;0
6147;-742314.177000001072884;-1043067.070999998599291;0
2894;-743960.129000000655651;-1043216.409000001847744;0
4694;-742689.272999998182058;-1042626.495999999344349;0
5178;-743386.421000000089407;-1043452.486000001430511;0
4177;-742387.940999999642372;-1044182.254999998956919;0
1339;-741618.000000000000000;-1045067.000000000000000;0
1043;-741872.000000000000000;-1044711.000000000000000;0
4742;-742822.300000000745058;-1042747.920000001788139;0
4766;-742803.037999998778105;-1042842.532999999821186;0
4963;-742396.510000001639128;-1043031.829999998211861;0
2544;-741753.000000000000000;-1044252.000000000000000;0
3143;-744031.217999998480082;-1042659.508999999612570;0
5461;-742442.704999998211861;-1043234.515000000596046;0
4735;-742686.059999998658895;-1042669.260000001639128;0
4965;-742383.620000001043081;-1043057.500000000000000;0
4633;-742625.931000001728535;-1042639.918999999761581;0
5086;-742856.307999998331070;-1043239.488000001758337;0
6824;-741347.350000001490116;-1044784.280000001192093;0
4334;-742384.170000001788139;-1043468.820000000298023;0
4651;-742756.375000000000000;-1042524.938000001013279;0
1924;-743359.000000000000000;-1044320.000000000000000;0
6279;-742306.210000000894070;-1043033.421999998390675;0
5144;-743052.642000000923872;-1043488.940000001341105;0
6486;-741772.072999998927116;-1044516.256000000983477;0
5578;-743409.534000001847744;-1043632.701000001281500;0
1830;-742961.000000000000000;-1044087.000000000000000;0
7178;-742634.000000000000000;-1044601.890000000596046;0
6229;-742318.326000001281500;-1043061.204999998211861;0
1912;-743461.000000000000000;-1044430.000000000000000;0
4679;-742774.199999999254942;-1042819.160000000149012;0
1166;-741020.000000000000000;-1044520.000000000000000;0
709;-741861.000000000000000;-1042862.000000000000000;0
8044;-742176.640000000596046;-1044778.420000001788139;0
1542;-742043.000000000000000;-1044057.000000000000000;0
4974;-742489.458999998867512;-1043047.024999998509884;0
4901;-742520.120000001043081;-1042823.960000000894070;0
6657;-741565.760000001639128;-1044156.980000000447035;0
7798;-743468.929999999701977;-1045091.809999998658895;0
7017;-742571.059999998658895;-1044267.640000000596046;0
1990;-743482.000000000000000;-1044906.000000000000000;0
4573;-742341.550000000745058;-1042629.699999999254942;0
7198;-742561.769999999552965;-1044881.949999999254942;0
6211;-742317.785000000149012;-1043063.318999998271465;0
5747;-743413.175999999046326;-1043698.811000000685453;0
5270;-742989.153999999165535;-1043210.684999998658895;0
6092;-742001.309999998658895;-1043482.089999999850988;0
5685;-743396.092999998480082;-1043720.434000000357628;0
1226;-742204.000000000000000;-1044247.000000000000000;0
6270;-742333.412999998778105;-1043018.204999998211861;0
5956;-742960.690999999642372;-1043513.846999999135733;0
1390;-742129.000000000000000;-1045069.000000000000000;0
1531;-741782.000000000000000;-1043838.000000000000000;0
579;-742006.000000000000000;-1043477.000000000000000;0
2262;-742999.000000000000000;-1045686.000000000000000;0
4790;-743036.497999999672174;-1042635.973999999463558;0
4538;-742291.464000001549721;-1042734.344000000506639;0
6805;-741109.710000000894070;-1044689.170000001788139;0
4323;-742267.879999998956919;-1043190.035000000149012;0
4075;-742947.934999998658895;-1043903.649999998509884;0
6478;-741931.429999999701977;-1044453.500000000000000;0
7104;-743423.739999998360872;-1044624.530000001192093;0
4982;-742559.320999998599291;-1043012.914000000804663;0
4821;-742966.550000000745058;-1042877.969999998807907;0
531;-742157.000000000000000;-1043778.000000000000000;0
6574;-741292.359999999403954;-1044067.620000001043081;0
4995;-742476.986000001430511;-1042961.239000000059605;0
548;-742297.000000000000000;-1043762.000000000000000;0
3815;-743161.949999999254942;-1042769.750000000000000;0
1790;-742152.000000000000000;-1044138.000000000000000;0
5157;-743178.671999998390675;-1043354.681000001728535;0
6771;-741345.015999998897314;-1044413.647999998182058;0
4893;-742637.320000000298023;-1042818.600999999791384;0
2256;-743156.000000000000000;-1045353.000000000000000;0
1338;-741629.000000000000000;-1045045.000000000000000;0
223;-742920.000000000000000;-1043542.000000000000000;0
1915;-743468.000000000000000;-1044494.000000000000000;0
611;-742037.000000000000000;-1043267.000000000000000;0
1693;-741613.000000000000000;-1044649.000000000000000;0
4948;-742386.929999999701977;-1042992.239999998360872;0
1041;-741893.000000000000000;-1044653.000000000000000;0
6137;-742314.326999999582767;-1043068.837000001221895;0
4122;-742732.074999999254942;-1043923.995000001043081;0
3966;-743363.859999999403954;-1043530.829999998211861;0
554;-742238.000000000000000;-1043717.000000000000000;0
1462;-741464.000000000000000;-1044225.000000000000000;0
6280;-742306.918999999761581;-1043038.083000000566244;0
6283;-742308.969000000506639;-1043049.539999999105930;0
227;-742846.000000000000000;-1043520.000000000000000;0
6673;-742244.289999999105930;-1044153.350000001490116;0
1313;-741681.000000000000000;-1044849.000000000000000;0
399;-742339.000000000000000;-1043884.000000000000000;0
4034;-743295.410000000149012;-1043786.070000000298023;0
4056;-743125.315000001341105;-1043671.969999998807907;0
2227;-743029.000000000000000;-1045506.000000000000000;0
941;-742098.000000000000000;-1043132.000000000000000;0
8050;-742206.719999998807907;-1044915.530000001192093;0
4961;-742309.460000000894070;-1043010.730000000447035;0
7031;-743301.824999999254942;-1044080.774999998509884;0
1181;-741920.000000000000000;-1044230.000000000000000;0
4035;-743274.690000001341105;-1043779.739999998360872;0
263;-743389.000000000000000;-1043725.000000000000000;0
6395;-742057.429999999701977;-1042500.809999998658895;0
5215;-743342.890000000596046;-1043380.368000000715256;0
3309;-743830.328000001609325;-1042834.535000000149012;0
5224;-743293.449999999254942;-1043542.160000000149012;0
2563;-741065.000000000000000;-1044421.000000000000000;0
4876;-742826.449999999254942;-1042944.910000000149012;0
4593;-742510.820000000298023;-1042652.203999999910593;0
8151;-743319.030000001192093;-1043194.940000001341105;0
1705;-741257.219999998807907;-1044695.690000001341105;0
6244;-742368.587000001221895;-1043059.245999999344349;0
4799;-743008.011999998241663;-1042697.245999999344349;0
7028;-743257.254999998956919;-1044104.574999999254942;0
5656;-743429.752999998629093;-1043705.570000000298023;0
6148;-742313.410999998450279;-1043065.666999999433756;0
7088;-743335.559999998658895;-1044546.359999999403954;0
5226;-743310.730000000447035;-1043553.269999999552965;0
879;-741947.000000000000000;-1042541.000000000000000;0
1724;-741478.000000000000000;-1045023.000000000000000;0
6122;-742071.870000001043081;-1043283.660000000149012;0
4793;-743035.089999999850988;-1042650.028000000864267;0
6214;-742315.447999998927116;-1043059.026000000536442;0
4522;-742668.079999998211861;-1042813.780000001192093;0
6220;-742318.432999998331070;-1043062.949999999254942;0
6787;-741242.429999999701977;-1044471.370000001043081;0
1497;-741332.000000000000000;-1044317.000000000000000;0
1682;-741129.769999999552965;-1044685.559999998658895;0
7130;-743306.429999999701977;-1044539.519999999552965;0
7035;-743299.831999998539686;-1044176.241999998688698;0
838;-742043.000000000000000;-1042524.000000000000000;0
5462;-742498.728999998420477;-1042986.947000000625849;0
4053;-743260.039999999105930;-1043823.480000000447035;0
4054;-743269.304999999701977;-1043797.405000001192093;0
2298;-742621.000000000000000;-1045406.000000000000000;0
2489;-742079.000000000000000;-1044278.000000000000000;0
6391;-742109.269999999552965;-1042498.320000000298023;0
1237;-742144.000000000000000;-1044365.000000000000000;0
1423;-742167.000000000000000;-1044150.000000000000000;0
2470;-742936.000000000000000;-1045241.000000000000000;0
4889;-742621.425000000745058;-1042831.109999999403954;0
6372;-741988.530000001192093;-1042699.339999999850988;0
4996;-742488.458999998867512;-1042974.723999999463558;0
690;-742306.000000000000000;-1043081.000000000000000;0
594;-741896.000000000000000;-1043296.000000000000000;0
7949;-741953.559999998658895;-1044123.660000000149012;0
4739;-742751.690000001341105;-1042699.230000000447035;0
5647;-743429.070999998599291;-1043694.699000000953674;0
502;-741901.000000000000000;-1043169.000000000000000;0
4728;-742862.960000000894070;-1042727.210000000894070;0
4951;-742335.579999998211861;-1042934.429999999701977;0
8276;-742095.079999998211861;-1042752.519999999552965;0
6448;-744017.179999999701977;-1043123.899999998509884;0
4662;-742819.471000000834465;-1042530.037000000476837;0
5081;-742917.046000000089407;-1043356.515999998897314;0
4681;-742756.870000001043081;-1042844.710000000894070;0
4673;-742811.420000001788139;-1042756.050000000745058;0
4170;-742407.245000001043081;-1043945.519999999552965;0
4733;-742767.890000000596046;-1042671.010000001639128;0
6363;-742027.344999998807907;-1042665.324000000953674;0
5582;-743410.127000000327826;-1043640.197999998927116;0
641;-742008.000000000000000;-1043304.000000000000000;0
1159;-741137.000000000000000;-1044493.000000000000000;0
4713;-742844.640000000596046;-1042605.980000000447035;0
5597;-743414.056000001728535;-1043680.309000000357628;0
4740;-742757.410000000149012;-1042715.589999999850988;0
5698;-743416.785999998450279;-1043633.638000000268221;0
4784;-742945.712999999523163;-1042685.611999999731779;0
7009;-742877.537000000476837;-1044242.370000001043081;0
4896;-742589.649999998509884;-1042838.989999998360872;0
390;-742429.000000000000000;-1043827.000000000000000;0
6501;-741689.493000000715256;-1044942.905000001192093;0
5165;-743191.168000001460314;-1043398.304000001400709;0
3978;-743342.695000000298023;-1043756.835000000894070;0
5716;-743423.320999998599291;-1043631.197000000625849;0
6242;-742366.677999999374151;-1043062.949000000953674;0
3808;-742987.050000000745058;-1042925.350000001490116;0
1333;-741781.000000000000000;-1044777.000000000000000;0
