OID_;X;Y;TEMPERATURE
3752;-743213.949999999254942;-1042902.719999998807907;0
3614;-744984.548999998718500;-1042283.640999998897314;0
5790;-743521.019999999552965;-1042064.280000001192093;0
1486;-741150.000000000000000;-1044219.000000000000000;0
3233;-744152.962999999523163;-1042686.791999999433756;0
7410;-743525.730000000447035;-1045377.420000001788139;0
3923;-743845.660000000149012;-1043512.260000001639128;0
3917;-743967.182999998331070;-1043516.284000001847744;0
2194;-743448.000000000000000;-1045193.000000000000000;0
6870;-741708.260000001639128;-1045321.590999998152256;0
7018;-742577.747000001370907;-1044239.712999999523163;0
2072;-743043.000000000000000;-1044743.000000000000000;0
2049;-743499.000000000000000;-1045071.000000000000000;0
3018;-744443.368000000715256;-1042805.962000001221895;0
1628;-742449.000000000000000;-1044494.000000000000000;0
3033;-744483.675000000745058;-1042733.627000000327826;0
1622;-742495.000000000000000;-1044321.000000000000000;0
7260;-742953.010000001639128;-1044873.530000001192093;0
23;-743544.000000000000000;-1042505.000000000000000;0
2265;-742972.000000000000000;-1045774.000000000000000;0
4175;-742721.254999998956919;-1043775.890000000596046;0
7153;-742889.646999999880791;-1044547.438000001013279;0
502;-741901.000000000000000;-1043169.000000000000000;0
2007;-743231.000000000000000;-1044741.000000000000000;0
3537;-744632.945000000298023;-1042671.657000001519918;0
4238;-742440.263000000268221;-1043528.236000001430511;0
2149;-742819.000000000000000;-1045024.000000000000000;0
1532;-741805.000000000000000;-1043858.000000000000000;0
7146;-742819.425000000745058;-1044426.225000001490116;73
3326;-744036.002000000327826;-1042922.574999999254942;0
3598;-744894.750000000000000;-1042560.583999998867512;0
277;-743398.000000000000000;-1043928.000000000000000;0
1809;-743160.000000000000000;-1044541.000000000000000;0
1760;-741162.000000000000000;-1044101.000000000000000;0
6580;-741299.379000000655651;-1044005.879000000655651;0
4560;-742427.079999998211861;-1042500.829999998211861;0
2342;-742726.000000000000000;-1045537.000000000000000;0
2016;-743230.000000000000000;-1044873.000000000000000;0
1171;-741882.000000000000000;-1044375.000000000000000;0
884;-741771.000000000000000;-1042776.000000000000000;0
736;-741880.000000000000000;-1043017.000000000000000;114
8080;-741989.600000001490116;-1045310.420000001788139;0
1982;-743408.000000000000000;-1044646.000000000000000;0
1514;-741882.000000000000000;-1044096.000000000000000;0
4099;-742773.870000001043081;-1043846.135999999940395;0
1732;-741840.000000000000000;-1045226.000000000000000;0
2221;-743076.000000000000000;-1045412.000000000000000;0
2809;-744090.649999998509884;-1043371.184000000357628;0
302;-742925.000000000000000;-1044109.000000000000000;0
1584;-742368.000000000000000;-1044717.000000000000000;0
3173;-743915.519000001251698;-1042609.598999999463558;0
2889;-744074.103999998420477;-1043194.559999998658895;0
7083;-743309.980000000447035;-1044509.500000000000000;0
7516;-742248.390000000596046;-1044368.907999999821186;0
6995;-743129.710000000894070;-1044496.579999998211861;0
1923;-743395.000000000000000;-1044274.000000000000000;0
524;-742255.000000000000000;-1043913.000000000000000;96
1508;-741705.000000000000000;-1044210.000000000000000;0
3674;-744609.826999999582767;-1042523.997999999672174;0
2277;-742826.000000000000000;-1045653.000000000000000;0
5;-743466.000000000000000;-1042616.000000000000000;27
3109;-743754.403999999165535;-1042652.872000001370907;0
1305;-741826.000000000000000;-1044678.000000000000000;0
1968;-743397.000000000000000;-1044793.000000000000000;0
7050;-743438.070999998599291;-1044185.932000000029802;0
5250;-743328.995000001043081;-1043178.495000001043081;0
1933;-743329.000000000000000;-1044407.000000000000000;0
3141;-744035.420000001788139;-1042680.460000000894070;0
4341;-742488.855000000447035;-1043325.412999998778105;0
4333;-742428.420000001788139;-1043255.609999999403954;0
2238;-743372.000000000000000;-1045261.000000000000000;0
3261;-743581.445999998599291;-1042690.379999998956919;0
748;-741671.000000000000000;-1042971.000000000000000;0
4326;-742319.855000000447035;-1043419.918999999761581;0
7015;-742554.570000000298023;-1044360.725000001490116;0
7218;-742534.100000001490116;-1044603.559999998658895;0
282;-743034.000000000000000;-1043819.000000000000000;0
4058;-743138.765000000596046;-1043625.405000001192093;0
3833;-743029.679999999701977;-1042612.300000000745058;0
4197;-742179.633999999612570;-1043776.899000000208616;0
4079;-742836.170000001788139;-1043800.960000000894070;0
2157;-742789.000000000000000;-1045161.000000000000000;0
376;-742530.000000000000000;-1043680.000000000000000;0
2404;-742179.000000000000000;-1045467.000000000000000;0
4032;-743136.934999998658895;-1043750.375000000000000;0
1986;-743480.000000000000000;-1044794.000000000000000;0
7275;-742794.339999999850988;-1044627.140000000596046;0
2021;-743281.000000000000000;-1044948.000000000000000;0
1992;-743482.000000000000000;-1044954.000000000000000;0
709;-741861.000000000000000;-1042862.000000000000000;0
461;-741713.000000000000000;-1043304.000000000000000;0
1430;-741993.000000000000000;-1044260.000000000000000;0
2512;-743070.000000000000000;-1044052.000000000000000;0
4127;-742837.324999999254942;-1044032.670000001788139;0
1243;-742122.000000000000000;-1044502.000000000000000;0
2535;-742042.000000000000000;-1044071.000000000000000;0
6944;-742927.063000001013279;-1043928.673000000417233;0
4202;-742285.475999999791384;-1043627.734999999403954;0
1936;-743293.000000000000000;-1044272.000000000000000;0
4826;-743043.850000001490116;-1042979.600000001490116;0
1608;-742391.000000000000000;-1044383.000000000000000;0
3209;-743668.293999999761581;-1042492.478999998420477;0
599;-741837.000000000000000;-1043243.000000000000000;0
1037;-741958.000000000000000;-1044950.000000000000000;0
1554;-741348.000000000000000;-1044238.000000000000000;0
547;-742316.910000000149012;-1043790.309999998658895;0
1503;-741537.000000000000000;-1044272.000000000000000;0
345;-742559.000000000000000;-1043826.000000000000000;0
1319;-741788.000000000000000;-1044905.000000000000000;0
1666;-741017.000000000000000;-1044315.000000000000000;0
515;-742176.000000000000000;-1043121.000000000000000;0
382;-742481.000000000000000;-1043751.000000000000000;0
5069;-742829.063999999314547;-1043280.938000001013279;0
1308;-741589.000000000000000;-1044811.000000000000000;0
1695;-741550.000000000000000;-1044656.000000000000000;0
6090;-742012.260000001639128;-1043497.300000000745058;0
2258;-742974.000000000000000;-1045574.000000000000000;0
6273;-742321.806000001728535;-1043017.085000000894070;0
336;-742616.000000000000000;-1043959.000000000000000;0
1252;-742096.000000000000000;-1044711.000000000000000;0
1571;-742239.000000000000000;-1044186.000000000000000;0
1586;-742372.000000000000000;-1044785.000000000000000;0
6699;-742301.118999999016523;-1044484.282999999821186;87
2322;-742651.000000000000000;-1045483.000000000000000;0
1612;-742429.000000000000000;-1044425.000000000000000;0
5325;-742997.480000000447035;-1043042.289999999105930;0
5116;-742947.859000001102686;-1043386.767000000923872;297
2169;-742902.000000000000000;-1045108.000000000000000;0
728;-741997.000000000000000;-1042918.000000000000000;0
4004;-743345.877000000327826;-1044053.135999999940395;0
2451;-742884.000000000000000;-1044134.000000000000000;0
328;-742670.000000000000000;-1044072.000000000000000;0
5003;-742589.811999998986721;-1042974.888999998569489;0
224;-742904.000000000000000;-1043522.000000000000000;0
4020;-743160.616000000387430;-1043872.782999999821186;0
1925;-743331.000000000000000;-1044321.000000000000000;0
5411;-742776.079999998211861;-1042905.300000000745058;0
1407;-741650.000000000000000;-1044242.000000000000000;0
1464;-741899.000000000000000;-1043994.000000000000000;0
1684;-741136.379999998956919;-1044735.140000000596046;0
1012;-742060.000000000000000;-1044582.000000000000000;0
725;-741983.000000000000000;-1042939.000000000000000;0
3811;-743244.620000001043081;-1042809.420000001788139;0
7979;-741161.500000000000000;-1044398.210000000894070;0
4235;-742390.041999999433756;-1043492.094999998807907;0
8285;-742232.780000001192093;-1042821.149999998509884;0
6846;-741505.875000000000000;-1044995.949000000953674;0
6660;-741490.809999998658895;-1044176.750000000000000;0
1722;-741672.000000000000000;-1045029.000000000000000;0
4242;-742214.469999998807907;-1043415.800000000745058;0
7994;-741529.219999998807907;-1045148.010000001639128;0
3960;-743418.563000001013279;-1043583.526000000536442;0
4498;-741866.120000001043081;-1042718.471000000834465;0
8265;-742197.820000000298023;-1042704.260000001639128;0
7246;-742736.730000000447035;-1044825.399999998509884;0
6116;-742963.905999999493361;-1042886.313000001013279;0
2299;-742592.000000000000000;-1045409.000000000000000;0
2045;-743418.000000000000000;-1044961.000000000000000;0
5165;-743191.168000001460314;-1043398.304000001400709;0
4823;-742936.660000000149012;-1042868.949999999254942;0
2393;-742054.000000000000000;-1045282.000000000000000;0
5515;-743426.960000000894070;-1043612.083999998867512;0
6606;-741654.631999999284744;-1043906.848000001162291;0
3792;-743110.019999999552965;-1042846.530000001192093;0
578;-742023.000000000000000;-1043464.000000000000000;0
825;-742171.000000000000000;-1042598.000000000000000;0
5414;-742582.574999999254942;-1042677.478999998420477;0
1369;-742029.000000000000000;-1044788.000000000000000;0
5198;-743259.600999999791384;-1043302.061000000685453;0
4088;-742812.114999998360872;-1043580.475000001490116;0
7175;-742651.780000001192093;-1044558.149999998509884;0
6686;-742381.967000000178814;-1044961.747000001370907;0
2286;-742894.000000000000000;-1045440.000000000000000;0
1910;-743460.000000000000000;-1044391.000000000000000;0
394;-742405.000000000000000;-1043863.000000000000000;0
4426;-742197.589999999850988;-1043031.679999999701977;0
6836;-741643.532000001519918;-1044947.486999999731779;0
640;-741983.000000000000000;-1043299.000000000000000;0
5307;-743082.182000000029802;-1043190.162000000476837;0
4210;-742178.550000000745058;-1043586.035000000149012;0
1419;-741603.000000000000000;-1044410.000000000000000;0
3845;-743172.920000001788139;-1042573.210000000894070;0
4251;-742136.420000001788139;-1043379.969999998807907;0
3096;-743906.309999998658895;-1042750.539999999105930;0
5676;-743406.725999999791384;-1043716.493000000715256;0
1041;-741893.000000000000000;-1044653.000000000000000;0
6458;-743360.644999999552965;-1043919.311999998986721;0
6193;-742316.486000001430511;-1043063.991000000387430;0
553;-742251.000000000000000;-1043741.000000000000000;0
619;-742229.000000000000000;-1043277.000000000000000;0
1917;-743374.000000000000000;-1044458.000000000000000;0
917;-742121.000000000000000;-1043008.000000000000000;0
5957;-742962.627000000327826;-1043510.905000001192093;0
6242;-742366.677999999374151;-1043062.949000000953674;0
2030;-743400.000000000000000;-1045091.000000000000000;0
4073;-742939.109999999403954;-1043858.504999998956919;0
5410;-742572.837000001221895;-1042981.173999998718500;0
1051;-741775.000000000000000;-1044980.000000000000000;0
3425;-743730.254000000655651;-1043071.712000001221895;0
1438;-741809.000000000000000;-1044350.000000000000000;0
611;-742037.000000000000000;-1043267.000000000000000;0
624;-742241.000000000000000;-1043343.000000000000000;0
7656;-742290.328000001609325;-1045294.499000001698732;0
7025;-743199.914999999105930;-1044070.515000000596046;0
7943;-742063.449999999254942;-1044055.260000001639128;0
7347;-742557.690000001341105;-1045177.440000001341105;0
509;-741991.000000000000000;-1043143.000000000000000;0
4756;-742712.579999998211861;-1042776.829999998211861;0
2292;-742819.000000000000000;-1045388.000000000000000;0
4500;-742315.239999998360872;-1042719.460000000894070;0
3838;-743113.550000000745058;-1042543.399999998509884;0
6828;-741465.309999998658895;-1044768.940000001341105;0
1353;-741862.000000000000000;-1044843.000000000000000;0
6039;-742085.370000001043081;-1043669.620999999344349;0
3750;-743221.379999998956919;-1042925.429999999701977;0
6256;-742380.723000001162291;-1043035.640000000596046;0
6189;-742312.041999999433756;-1043057.302000001072884;0
6694;-742280.806000001728535;-1044814.875999998301268;0
5690;-743415.532999999821186;-1043635.447000000625849;0
4481;-741766.089999999850988;-1042627.859999999403954;0
6246;-742370.552999999374151;-1043055.625999998301268;0
941;-742098.000000000000000;-1043132.000000000000000;0
6810;-741106.350999999791384;-1044631.888999998569489;0
6195;-742314.956000000238419;-1043061.181000001728535;0
2268;-742911.000000000000000;-1045632.000000000000000;0
1838;-743004.480000000447035;-1044216.030000001192093;0
8274;-742065.089999999850988;-1042742.109999999403954;0
5232;-743347.087000001221895;-1043476.425000000745058;0
2480;-741251.739999998360872;-1044639.480000000447035;0
4517;-742638.449999999254942;-1042779.280000001192093;0
4691;-742693.760000001639128;-1042596.969999998807907;0
5588;-743425.002000000327826;-1043679.451999999582767;0
5968;-742288.989000000059605;-1044168.456999998539686;0
4721;-742883.219999998807907;-1042605.010000001639128;0
4323;-742267.879999998956919;-1043190.035000000149012;0
4797;-743049.140999998897314;-1042689.576999999582767;0
1676;-741033.000000000000000;-1044755.000000000000000;0
3094;-743906.500000000000000;-1042759.554999999701977;0
6200;-742318.653999999165535;-1043066.462000001221895;0
4585;-742437.502000000327826;-1042630.243999999016523;0
4906;-742448.370000001043081;-1042815.789999999105930;0
4047;-743210.230000000447035;-1043992.289999999105930;0
4068;-742917.125000000000000;-1043734.535000000149012;0
6708;-742268.296999998390675;-1044748.438000001013279;0
7140;-742921.300000000745058;-1044469.335000000894070;0
2370;-742460.000000000000000;-1045433.000000000000000;0
1137;-741538.000000000000000;-1044442.000000000000000;0
3377;-743832.151999998837709;-1042925.721000000834465;0
177;-743376.000000000000000;-1043232.000000000000000;0
4733;-742767.890000000596046;-1042671.010000001639128;0
310;-742696.000000000000000;-1044162.000000000000000;0
1340;-741695.000000000000000;-1044759.000000000000000;0
5063;-742783.370000001043081;-1043241.048999998718500;0
2246;-743218.000000000000000;-1045379.000000000000000;0
1113;-741134.809999998658895;-1044594.289999999105930;0
2059;-742625.000000000000000;-1044459.000000000000000;0
5035;-742658.587999999523163;-1043006.899000000208616;0
8057;-742238.839999999850988;-1045047.489999998360872;0
1817;-743058.000000000000000;-1044411.000000000000000;0
786;-741706.000000000000000;-1042606.000000000000000;0
3795;-743173.190000001341105;-1042842.170000001788139;0
5020;-742572.699999999254942;-1042891.372999999672174;0
3171;-743937.730000000447035;-1042607.039999999105930;0
4822;-742945.579999998211861;-1042879.910000000149012;0
1427;-742017.000000000000000;-1044256.000000000000000;0
2478;-741241.859999999403954;-1044562.089999999850988;0
7011;-742831.309999998658895;-1044257.245000001043081;0
2894;-743960.129000000655651;-1043216.409000001847744;0
875;-741783.000000000000000;-1042677.000000000000000;0
6702;-742291.596999999135733;-1044564.116999998688698;0
5146;-743064.554000001400709;-1043452.671999998390675;0
4728;-742862.960000000894070;-1042727.210000000894070;0
6821;-741256.649999998509884;-1044796.100000001490116;0
4142;-742777.425000000745058;-1044013.440000001341105;0
5767;-742424.269999999552965;-1042581.609000001102686;0
6179;-742312.195000000298023;-1043059.041000001132488;0
3347;-743959.280000001192093;-1043034.447000000625849;0
1652;-741379.000000000000000;-1044550.000000000000000;0
5390;-744691.164999999105930;-1042676.936000000685453;0
1767;-741261.000000000000000;-1044168.000000000000000;0
1599;-742237.000000000000000;-1044977.000000000000000;0
4950;-742354.289999999105930;-1042955.670000001788139;0
1653;-741384.000000000000000;-1044592.000000000000000;0
4248;-742157.039999999105930;-1043376.699999999254942;0
5648;-743429.164000000804663;-1043695.905999999493361;0
7808;-741986.629999998956919;-1044440.109999999403954;0
4622;-742533.901000000536442;-1042569.660000000149012;0
6180;-742311.429000001400709;-1043057.635999999940395;0
7151;-742842.649000000208616;-1044545.307000000029802;0
6492;-742174.054000001400709;-1044455.534000001847744;0
7033;-743303.864999998360872;-1044132.750000000000000;0
7983;-741127.800000000745058;-1044416.199999999254942;0
2488;-742083.000000000000000;-1044303.000000000000000;0
4529;-742762.920000001788139;-1042885.809999998658895;0
273;-743381.000000000000000;-1043820.000000000000000;0
6607;-741674.456000000238419;-1043925.333999998867512;0
3302;-743795.043999999761581;-1042863.539000000804663;0
2163;-742944.000000000000000;-1045168.000000000000000;0
7183;-742606.379999998956919;-1044692.969999998807907;0
6389;-742141.199999999254942;-1042497.030000001192093;0
2269;-742933.000000000000000;-1045611.000000000000000;0
6222;-742316.855000000447035;-1043060.109999999403954;0
7212;-742559.410000000149012;-1045073.070000000298023;0
7677;-742383.142000000923872;-1045124.221000000834465;0
3975;-743112.984999999403954;-1043716.375999998301268;0
4519;-742665.160000000149012;-1042790.820000000298023;0
6302;-741814.370000001043081;-1042743.910000000149012;0
5211;-743299.236000001430511;-1043364.945000000298023;0
4162;-742497.193999998271465;-1044160.030000001192093;0
4990;-742657.837999999523163;-1043024.199999999254942;0
6360;-742004.925000000745058;-1042692.804000001400709;0
2579;-742497.000000000000000;-1045572.000000000000000;0
3889;-742335.008999999612570;-1042489.949000000953674;0
4814;-743000.489999998360872;-1042803.920000001788139;0
913;-741742.000000000000000;-1042579.000000000000000;0
4902;-742480.460000000894070;-1042802.989999998360872;0
2134;-743028.000000000000000;-1045111.000000000000000;0
1450;-741527.000000000000000;-1044632.000000000000000;0
4083;-742820.771999999880791;-1043708.657000001519918;0
1375;-742151.000000000000000;-1044887.000000000000000;0
5371;-742052.149999998509884;-1043011.940000001341105;0
3601;-744894.190999999642372;-1042626.861999999731779;0
309;-742721.000000000000000;-1044157.000000000000000;0
2108;-743147.000000000000000;-1045086.000000000000000;0
1192;-741801.000000000000000;-1044083.000000000000000;0
343;-742575.000000000000000;-1043857.000000000000000;0
6271;-742329.282000001519918;-1043017.853999998420477;0
5444;-743183.024000000208616;-1043210.600000001490116;0
7176;-742630.820000000298023;-1044585.809999998658895;0
1365;-742125.050000000745058;-1044945.710000000894070;0
3292;-743576.905000001192093;-1042781.315000001341105;0
1497;-741332.000000000000000;-1044317.000000000000000;0
6218;-742319.947000000625849;-1043065.767999999225140;0
6859;-741483.522999998182058;-1044967.043999999761581;0
3787;-743130.989999998360872;-1042979.320000000298023;0
2130;-743095.000000000000000;-1045126.000000000000000;0
4896;-742589.649999998509884;-1042838.989999998360872;0
1110;-741220.730000000447035;-1044598.480000000447035;0
7219;-742443.460000000894070;-1044813.000000000000000;0
7197;-742570.949000000953674;-1044895.548999998718500;0
4566;-742473.846000000834465;-1042545.780000001192093;0
1090;-741581.000000000000000;-1044552.000000000000000;0
8079;-742021.839999999850988;-1045292.179999999701977;0
4637;-742572.578000001609325;-1042742.510999999940395;0
5656;-743429.752999998629093;-1043705.570000000298023;0
1013;-742076.000000000000000;-1044595.000000000000000;0
5682;-743399.638000000268221;-1043719.120999999344349;0
3350;-743955.140999998897314;-1043006.692000001668930;0
5599;-743411.622999999672174;-1043680.499000001698732;0
5170;-743246.743000000715256;-1043425.304000001400709;0
4974;-742489.458999998867512;-1043047.024999998509884;0
5158;-743148.138999998569489;-1043320.254999998956919;0
6507;-741738.839999999850988;-1044541.820000000298023;0
682;-742380.000000000000000;-1043151.000000000000000;0
6652;-741678.190000001341105;-1044132.780000001192093;0
6278;-742305.421999998390675;-1043028.918000001460314;0
5413;-742651.872000001370907;-1042662.627999998629093;0
1390;-742129.000000000000000;-1045069.000000000000000;0
3887;-742347.760000001639128;-1042449.881000000983477;0
2550;-741576.000000000000000;-1044342.000000000000000;0
6167;-742313.859999999403954;-1043063.607000000774860;0
1382;-742096.000000000000000;-1045023.000000000000000;0
5978;-745078.285000000149012;-1042675.223999999463558;0
882;-741825.000000000000000;-1042788.000000000000000;0
3281;-743629.340999998152256;-1042825.692000001668930;0
6776;-741098.559999998658895;-1044491.530000001192093;0
1820;-743006.000000000000000;-1044272.000000000000000;0
6473;-741931.359999999403954;-1044555.109999999403954;0
1239;-742138.000000000000000;-1044401.000000000000000;0
6325;-745069.041000001132488;-1042716.723000001162291;0
5504;-743428.977000001817942;-1043686.274000000208616;0
4781;-742926.519000001251698;-1042695.502999998629093;0
263;-743389.000000000000000;-1043725.000000000000000;0
5308;-743062.039999999105930;-1043186.831999998539686;0
5419;-742434.690000001341105;-1042846.280000001192093;0
4851;-742991.500000000000000;-1042818.243000000715256;0
7000;-743096.190000001341105;-1044426.870000001043081;0
6190;-742318.782999999821186;-1043068.206000000238419;0
2580;-742501.000000000000000;-1045602.000000000000000;0
1494;-741173.000000000000000;-1044326.000000000000000;0
4638;-742553.631999999284744;-1042542.028000000864267;0
3953;-743407.249000001698732;-1043543.537000000476837;0
3314;-743758.675999999046326;-1042905.688999999314547;0
6192;-742317.252000000327826;-1043065.394999999552965;0
2379;-742291.000000000000000;-1045388.000000000000000;0
4964;-742390.059999998658895;-1043044.839999999850988;0
6682;-742329.804000001400709;-1044319.611999999731779;0
4650;-742749.989000000059605;-1042534.539999999105930;0
2418;-742410.000000000000000;-1045109.000000000000000;0
6709;-742264.587999999523163;-1044776.254999998956919;0
4944;-742430.605999998748302;-1043013.879000000655651;0
3766;-743053.532999999821186;-1042996.631000000983477;0
3958;-743416.328000001609325;-1043572.265999998897314;0
6298;-741804.910000000149012;-1042692.300000000745058;0
5584;-743408.885000001639128;-1043643.532000001519918;0
5791;-743256.583000000566244;-1043571.184000000357628;0
4169;-742414.420000001788139;-1043962.329999998211861;0
1570;-742291.000000000000000;-1044183.000000000000000;0
171;-743448.000000000000000;-1043399.000000000000000;0
836;-742006.000000000000000;-1042525.000000000000000;0
1482;-741289.000000000000000;-1044232.000000000000000;0
2222;-743058.000000000000000;-1045420.000000000000000;0
2388;-742096.000000000000000;-1045422.000000000000000;0
4036;-743246.920000001788139;-1043771.574999999254942;0
6219;-742319.168999999761581;-1043064.293999999761581;0
1437;-741840.000000000000000;-1044336.000000000000000;0
5679;-743403.182000000029802;-1043717.807000000029802;0
6239;-742363.504999998956919;-1043069.298000000417233;0
510;-742048.000000000000000;-1043150.000000000000000;0
6272;-742325.379000000655651;-1043017.383000001311302;0
235;-743467.000000000000000;-1043745.000000000000000;0
2242;-743321.000000000000000;-1045313.000000000000000;0
2260;-743019.000000000000000;-1045622.000000000000000;0
1521;-741808.000000000000000;-1043917.000000000000000;0
4898;-742571.280000001192093;-1042840.859999999403954;0
673;-742467.000000000000000;-1043230.000000000000000;0
616;-742153.000000000000000;-1043272.000000000000000;0
683;-742362.000000000000000;-1043155.000000000000000;0
7043;-743398.899999998509884;-1044106.629999998956919;0
4791;-743022.245000001043081;-1042633.714000001549721;0
5459;-742368.519000001251698;-1043474.221999999135733;0
1435;-741903.000000000000000;-1044306.000000000000000;0
5326;-742969.850000001490116;-1043038.800000000745058;0
4597;-742620.600000001490116;-1042680.690000001341105;0
2376;-742411.000000000000000;-1045554.000000000000000;0
7084;-743318.609999999403954;-1044521.789999999105930;0
4836;-742984.245999999344349;-1042653.127999998629093;0
3871;-742356.649999998509884;-1042420.543999999761581;0
2361;-742323.000000000000000;-1045576.000000000000000;0
1543;-742235.000000000000000;-1044164.000000000000000;0
7975;-741349.339999999850988;-1044397.800000000745058;0
674;-742463.000000000000000;-1043211.000000000000000;0
7706;-742313.239999998360872;-1044319.611999999731779;0
6188;-742312.807999998331070;-1043058.706999998539686;0
2486;-741289.250000000000000;-1044848.829999998211861;0
5513;-743426.734999999403954;-1043606.184000000357628;0
1443;-741727.000000000000000;-1044386.000000000000000;0
5663;-743422.087999999523163;-1043710.807999998331070;0
4933;-742437.605000000447035;-1042750.853000000119209;0
3983;-743317.089999999850988;-1043883.160000000149012;0
4571;-742345.710000000894070;-1042568.989999998360872;0
5267;-743190.021999999880791;-1043149.807000000029802;0
4945;-742422.162999998778105;-1043009.861000001430511;0
6693;-742248.197000000625849;-1044816.127000000327826;0
2353;-742484.000000000000000;-1045580.000000000000000;0
1905;-743446.000000000000000;-1044312.000000000000000;0
3822;-743065.039999999105930;-1042594.239999998360872;0
1130;-741624.000000000000000;-1044446.000000000000000;0
1224;-742174.000000000000000;-1044253.000000000000000;0
6161;-742310.964999999850988;-1043059.710999999195337;0
2081;-742551.000000000000000;-1044621.000000000000000;0
6839;-741723.412000000476837;-1044988.993000000715256;0
7028;-743257.254999998956919;-1044104.574999999254942;0
529;-742162.000000000000000;-1043803.000000000000000;0
6202;-742317.124000001698732;-1043063.651999998837709;0
1601;-742452.000000000000000;-1044939.000000000000000;0
4675;-742805.809999998658895;-1042785.070000000298023;0
7299;-743117.530000001192093;-1045145.859999999403954;0
693;-742284.000000000000000;-1043062.000000000000000;0
408;-742317.000000000000000;-1044182.000000000000000;0
987;-741814.000000000000000;-1044493.000000000000000;0
3421;-743743.348000001162291;-1043104.984999999403954;0
6122;-742071.870000001043081;-1043283.660000000149012;0
641;-742008.000000000000000;-1043304.000000000000000;0
513;-742083.000000000000000;-1043145.000000000000000;0
890;-742007.000000000000000;-1042740.000000000000000;0
6449;-743140.379999998956919;-1043395.559999998658895;0
874;-741755.000000000000000;-1042675.000000000000000;0
710;-741829.000000000000000;-1042878.000000000000000;0
6143;-742309.690999999642372;-1043060.385000001639128;0
3981;-743341.517000000923872;-1043837.353999998420477;0
5140;-743035.789999999105930;-1043514.489999998360872;0
3950;-743426.829999998211861;-1043556.070000000298023;0
4740;-742757.410000000149012;-1042715.589999999850988;0
880;-741793.000000000000000;-1042834.000000000000000;0
3980;-743339.260000001639128;-1043798.940000001341105;0
1261;-742057.000000000000000;-1044894.000000000000000;0
7086;-743333.149999998509884;-1044527.250000000000000;0
90;-744040.000000000000000;-1043095.000000000000000;0
8051;-742213.199999999254942;-1044935.890000000596046;0
4765;-742822.897999998182058;-1042850.499000001698732;0
1794;-742151.000000000000000;-1044190.000000000000000;0
1504;-741577.000000000000000;-1044258.000000000000000;0
6363;-742027.344999998807907;-1042665.324000000953674;0
1718;-741366.219999998807907;-1044870.989999998360872;0
1795;-742155.000000000000000;-1044231.000000000000000;0
6722;-742357.717000000178814;-1044705.708000000566244;0
6299;-741803.309999998658895;-1042718.690000001341105;0
1552;-741351.000000000000000;-1044295.000000000000000;0
1378;-742161.000000000000000;-1044904.000000000000000;0
1680;-741122.809999998658895;-1044628.710000000894070;0
8283;-742198.600000001490116;-1042801.980000000447035;0
1388;-742152.000000000000000;-1045026.000000000000000;0
696;-742077.000000000000000;-1042913.000000000000000;0
4670;-742810.120000001043081;-1042644.289999999105930;0
7809;-741981.809999998658895;-1044560.280000001192093;0
907;-742211.000000000000000;-1042511.000000000000000;0
6263;-742365.719000000506639;-1043021.282999999821186;0
4583;-742401.482999999076128;-1042625.886999998241663;0
6704;-742282.179999999701977;-1044623.793999999761581;0
