OID_;X;Y;TEMPERATURE
3614;-744984.548999998718500;-1042283.640999998897314;0
110;-744127.000000000000000;-1042724.000000000000000;0
3019;-744463.447999998927116;-1042784.646000001579523;0
3568;-744718.817999999970198;-1042588.614999998360872;0
3692;-744525.876499999314547;-1042540.534000001847744;0
3580;-744924.973999999463558;-1042593.699999999254942;0
2605;-745393.842999998480082;-1042860.796000000089407;0
5975;-745052.346999999135733;-1042674.673000000417233;0
118;-745135.000000000000000;-1042687.000000000000000;0
7911;-743564.839999999850988;-1045408.649999998509884;0
3542;-744575.274000000208616;-1042656.160000000149012;0
2696;-743477.489999998360872;-1042038.000000000000000;0
3919;-743904.947000000625849;-1043493.929999999701977;0
2520;-741847.000000000000000;-1045324.000000000000000;0
7011;-742831.309999998658895;-1044257.245000001043081;0
743;-741682.000000000000000;-1043020.000000000000000;0
1760;-741162.000000000000000;-1044101.000000000000000;0
23;-743544.000000000000000;-1042505.000000000000000;0
4029;-743130.695999998599291;-1043815.427999999374151;0
7780;-743046.243000000715256;-1045844.168999999761581;0
7258;-742917.370000001043081;-1044865.420000001788139;0
4070;-742925.285000000149012;-1043783.565000001341105;0
1728;-741473.000000000000000;-1045087.000000000000000;0
7721;-742941.157000001519918;-1044215.368000000715256;138
2386;-742139.000000000000000;-1045460.000000000000000;0
1026;-741986.000000000000000;-1044631.000000000000000;0
6946;-742974.765000000596046;-1043929.388000000268221;0
2262;-742999.000000000000000;-1045686.000000000000000;0
2319;-742734.000000000000000;-1045474.000000000000000;0
4131;-742844.625000000000000;-1044059.980000000447035;0
3795;-743173.190000001341105;-1042842.170000001788139;0
8079;-742021.839999999850988;-1045292.179999999701977;0
2277;-742826.000000000000000;-1045653.000000000000000;0
8058;-742263.219999998807907;-1045051.489999998360872;0
3206;-743702.239000000059605;-1042499.019000001251698;0
3214;-743628.813000001013279;-1042457.677000001072884;0
7514;-742304.866000000387430;-1044375.124000001698732;0
6675;-742272.140000000596046;-1044167.469999998807907;0
2315;-742854.000000000000000;-1045460.000000000000000;0
3812;-743231.179999999701977;-1042815.199999999254942;0
2524;-742108.000000000000000;-1044191.000000000000000;0
2210;-743280.000000000000000;-1045237.000000000000000;0
6589;-741303.679999999701977;-1043901.390000000596046;0
4174;-742738.230000000447035;-1043763.155000001192093;0
2103;-743182.000000000000000;-1044931.000000000000000;0
4121;-742721.160000000149012;-1043948.695000000298023;0
1970;-743380.000000000000000;-1044854.000000000000000;0
1486;-741150.000000000000000;-1044219.000000000000000;0
6874;-741789.789999999105930;-1045272.100000001490116;0
3783;-743211.559999998658895;-1042920.120000001043081;0
2328;-742459.000000000000000;-1045505.000000000000000;0
5087;-742847.622999999672174;-1043250.081000000238419;0
1059;-741637.000000000000000;-1045095.000000000000000;0
5067;-742813.465999998152256;-1043267.335999999195337;0
671;-742489.000000000000000;-1043245.000000000000000;0
296;-742950.170000001788139;-1044097.429999999701977;0
224;-742904.000000000000000;-1043522.000000000000000;0
3292;-743576.905000001192093;-1042781.315000001341105;0
2322;-742651.000000000000000;-1045483.000000000000000;0
1320;-741870.000000000000000;-1044957.000000000000000;0
7189;-742588.486999999731779;-1044766.690999999642372;0
309;-742721.000000000000000;-1044157.000000000000000;0
2238;-743372.000000000000000;-1045261.000000000000000;0
6606;-741654.631999999284744;-1043906.848000001162291;0
7216;-742500.129999998956919;-1044564.390000000596046;0
3387;-743960.368000000715256;-1043194.717000000178814;0
4089;-742812.844999998807907;-1043560.114999998360872;0
7829;-743509.649999998509884;-1045166.399999998509884;0
7026;-743217.644999999552965;-1044082.329999998211861;0
3834;-743079.190000001341105;-1042579.899999998509884;0
926;-741894.000000000000000;-1042999.000000000000000;0
1584;-742368.000000000000000;-1044717.000000000000000;0
3819;-743120.250000000000000;-1042679.620000001043081;0
467;-741757.000000000000000;-1043352.000000000000000;0
7325;-743032.969999998807907;-1045186.298999998718500;0
4500;-742315.239999998360872;-1042719.460000000894070;0
2186;-743184.000000000000000;-1045146.000000000000000;0
7153;-742889.646999999880791;-1044547.438000001013279;0
1490;-741023.000000000000000;-1044335.000000000000000;0
2309;-742322.000000000000000;-1045519.000000000000000;0
2150;-742812.000000000000000;-1045054.000000000000000;0
1960;-743386.000000000000000;-1044623.000000000000000;0
7279;-742799.399999998509884;-1044679.829999998211861;0
2139;-742936.000000000000000;-1045103.000000000000000;0
343;-742575.000000000000000;-1043857.000000000000000;0
1475;-741565.000000000000000;-1044185.000000000000000;0
2156;-742796.000000000000000;-1045184.000000000000000;0
2028;-743371.000000000000000;-1045054.000000000000000;0
1056;-741707.000000000000000;-1045042.000000000000000;0
4494;-741874.920000001788139;-1042616.660000000149012;0
4333;-742428.420000001788139;-1043255.609999999403954;0
1749;-742065.000000000000000;-1045064.000000000000000;0
3068;-744158.921000000089407;-1042812.230999998748302;0
4330;-742377.440999999642372;-1043332.162999998778105;0
6499;-741707.811000000685453;-1044907.068999998271465;0
4428;-742206.750000000000000;-1043097.800000000745058;0
1334;-741769.000000000000000;-1044799.000000000000000;0
2050;-743460.000000000000000;-1045072.000000000000000;0
2214;-743162.000000000000000;-1045316.000000000000000;0
7157;-742964.840999998152256;-1044545.681000001728535;0
6841;-741583.443999998271465;-1044946.208000000566244;0
6573;-741294.089999999850988;-1044091.679999999701977;0
1359;-742000.000000000000000;-1044897.000000000000000;0
1295;-742082.000000000000000;-1044456.000000000000000;0
5246;-743373.739999998360872;-1043268.899999998509884;0
6943;-742902.013999998569489;-1043932.647999998182058;0
2223;-743053.000000000000000;-1045437.000000000000000;0
1020;-742293.000000000000000;-1044615.000000000000000;0
1538;-741948.000000000000000;-1043973.000000000000000;0
1698;-741464.000000000000000;-1044668.000000000000000;0
1171;-741882.000000000000000;-1044375.000000000000000;0
4062;-742830.460000000894070;-1043654.920000001788139;0
740;-741759.000000000000000;-1043031.000000000000000;0
2130;-743095.000000000000000;-1045126.000000000000000;0
5113;-742946.795000001788139;-1043444.427999999374151;0
4068;-742917.125000000000000;-1043734.535000000149012;0
7019;-742585.024999998509884;-1044210.725000001490116;0
651;-742490.000000000000000;-1043564.000000000000000;0
6722;-742357.717000000178814;-1044705.708000000566244;0
7516;-742248.390000000596046;-1044368.907999999821186;0
4055;-743119.070000000298023;-1043694.109999999403954;0
4170;-742407.245000001043081;-1043945.519999999552965;0
1412;-741635.760000001639128;-1044654.449999999254942;0
5295;-743047.995000001043081;-1043185.530000001192093;0
4236;-742406.842999998480082;-1043504.015000000596046;0
6822;-741283.870000001043081;-1044793.059999998658895;0
1790;-742152.000000000000000;-1044138.000000000000000;0
2536;-742003.000000000000000;-1044113.000000000000000;0
1917;-743374.000000000000000;-1044458.000000000000000;0
1087;-741605.000000000000000;-1044533.000000000000000;0
5307;-743082.182000000029802;-1043190.162000000476837;0
1602;-742507.000000000000000;-1044924.000000000000000;0
4502;-742349.309999998658895;-1042718.199999999254942;0
2885;-744122.791999999433756;-1043190.208000000566244;0
6726;-742476.517999999225140;-1044410.600000001490116;0
2749;-743924.129999998956919;-1043464.359999999403954;0
6611;-741711.614000000059605;-1043979.263999998569489;0
1250;-742103.000000000000000;-1044672.000000000000000;0
4163;-742487.695000000298023;-1044138.535000000149012;0
598;-741853.000000000000000;-1043233.000000000000000;0
205;-743173.000000000000000;-1043599.000000000000000;0
1483;-741252.000000000000000;-1044224.000000000000000;0
7699;-742381.114000000059605;-1044818.644000001251698;0
696;-742077.000000000000000;-1042913.000000000000000;0
1520;-741777.000000000000000;-1043939.000000000000000;0
1808;-743187.000000000000000;-1044539.000000000000000;0
526;-742209.000000000000000;-1043849.000000000000000;0
1239;-742138.000000000000000;-1044401.000000000000000;0
7215;-742484.320000000298023;-1044546.620000001043081;0
3333;-743967.447999998927116;-1042967.616000000387430;0
872;-741698.000000000000000;-1042669.000000000000000;0
4739;-742751.690000001341105;-1042699.230000000447035;0
6699;-742301.118999999016523;-1044484.282999999821186;107
1987;-743480.000000000000000;-1044820.000000000000000;0
6004;-742061.723000001162291;-1043300.859999999403954;0
2037;-743373.000000000000000;-1044805.000000000000000;0
1185;-741822.000000000000000;-1044095.000000000000000;0
3992;-743365.899999998509884;-1043881.385000001639128;0
1309;-741611.000000000000000;-1044813.000000000000000;0
7032;-743301.464999999850988;-1044106.190000001341105;0
4034;-743295.410000000149012;-1043786.070000000298023;0
7181;-742612.239999998360872;-1044670.160000000149012;0
2492;-742017.000000000000000;-1044210.000000000000000;0
536;-742085.000000000000000;-1043673.000000000000000;0
4813;-743013.550000000745058;-1042793.390000000596046;0
2042;-743505.000000000000000;-1044958.000000000000000;0
510;-742048.000000000000000;-1043150.000000000000000;0
502;-741901.000000000000000;-1043169.000000000000000;0
5129;-743046.677000001072884;-1043376.409000001847744;0
6478;-741931.429999999701977;-1044453.500000000000000;0
1112;-741189.050000000745058;-1044602.469999998807907;0
2060;-742659.000000000000000;-1044472.000000000000000;0
399;-742339.000000000000000;-1043884.000000000000000;0
1872;-743422.000000000000000;-1044246.000000000000000;0
3971;-743206.815000001341105;-1043721.065000001341105;0
3838;-743113.550000000745058;-1042543.399999998509884;0
1873;-743410.000000000000000;-1044260.000000000000000;0
4976;-742494.337000001221895;-1043009.743000000715256;0
1347;-741791.000000000000000;-1044816.000000000000000;0
384;-742471.000000000000000;-1043766.000000000000000;0
6746;-742405.083999998867512;-1044259.199999999254942;0
7045;-743400.745000001043081;-1044160.004999998956919;0
7146;-742819.425000000745058;-1044426.225000001490116;0
647;-742216.000000000000000;-1043375.000000000000000;0
7136;-742914.329999998211861;-1044374.469999998807907;0
2324;-742589.000000000000000;-1045490.000000000000000;0
1607;-742414.000000000000000;-1044379.000000000000000;0
7654;-742242.081000000238419;-1045273.263999998569489;0
7015;-742554.570000000298023;-1044360.725000001490116;0
3313;-743774.447000000625849;-1042903.081999998539686;0
1938;-743289.000000000000000;-1044306.000000000000000;0
5323;-743049.401000000536442;-1043038.131000000983477;0
1454;-741521.000000000000000;-1044499.000000000000000;0
5712;-743423.701000001281500;-1043638.675999999046326;0
1220;-742147.000000000000000;-1044283.000000000000000;0
2373;-742469.000000000000000;-1045517.000000000000000;0
1462;-741464.000000000000000;-1044225.000000000000000;0
6225;-742314.519999999552965;-1043055.927000001072884;0
4003;-743371.839999999850988;-1044053.258999999612570;0
3915;-744021.765999998897314;-1043098.603999998420477;0
2431;-742498.000000000000000;-1045094.000000000000000;0
7171;-742671.969999998807907;-1044508.219999998807907;0
7205;-742570.679999999701977;-1044988.579999998211861;0
1287;-742217.000000000000000;-1044486.000000000000000;0
1658;-741404.000000000000000;-1044751.000000000000000;0
1530;-741753.000000000000000;-1043814.000000000000000;0
1031;-741973.000000000000000;-1044784.000000000000000;0
1415;-741623.000000000000000;-1044561.000000000000000;0
4326;-742319.855000000447035;-1043419.918999999761581;0
7508;-742947.440000001341105;-1045540.690000001341105;0
7644;-742295.089000001549721;-1045373.164999999105930;0
4146;-742666.940000001341105;-1043854.829999998211861;0
4523;-742703.960000000894070;-1042805.670000001788139;0
4051;-743236.329999998211861;-1043889.710000000894070;0
2496;-741953.000000000000000;-1044102.000000000000000;0
7248;-742757.960000000894070;-1044826.929999999701977;0
880;-741793.000000000000000;-1042834.000000000000000;0
6473;-741931.359999999403954;-1044555.109999999403954;0
542;-742367.629999998956919;-1043814.379999998956919;0
2098;-743134.000000000000000;-1044763.000000000000000;0
5437;-744084.208999998867512;-1043295.061999998986721;0
3805;-743035.760000001639128;-1042913.550000000745058;0
7962;-741640.190000001341105;-1044316.800000000745058;0
6370;-741968.780000001192093;-1042685.250000000000000;0
1121;-741765.000000000000000;-1044444.000000000000000;0
6506;-741743.019999999552965;-1044571.050000000745058;0
558;-742200.000000000000000;-1043683.000000000000000;0
6268;-742340.850000001490116;-1043018.881000000983477;0
1420;-741596.000000000000000;-1044382.000000000000000;0
702;-741961.000000000000000;-1042885.000000000000000;0
6766;-741193.449999999254942;-1044424.320000000298023;0
4673;-742811.420000001788139;-1042756.050000000745058;0
408;-742317.000000000000000;-1044182.000000000000000;0
574;-742068.000000000000000;-1043538.000000000000000;0
6689;-742384.449999999254942;-1045033.609999999403954;0
910;-742219.000000000000000;-1042529.000000000000000;0
6711;-742266.486000001430511;-1044832.896000001579523;0
528;-742187.000000000000000;-1043838.000000000000000;0
516;-742160.000000000000000;-1043135.000000000000000;0
3109;-743754.403999999165535;-1042652.872000001370907;0
682;-742380.000000000000000;-1043151.000000000000000;0
6216;-742313.892000000923872;-1043056.272999998182058;0
785;-741702.000000000000000;-1042622.000000000000000;0
3095;-743923.068999998271465;-1042787.789000000804663;87
3420;-743739.186000000685453;-1043112.370000001043081;0
7083;-743309.980000000447035;-1044509.500000000000000;0
4760;-742826.947000000625849;-1042799.914000000804663;0
3868;-742432.381000000983477;-1042412.094000000506639;0
5324;-743025.329999998211861;-1043045.789999999105930;0
6825;-741380.010000001639128;-1044780.089999999850988;0
4876;-742826.449999999254942;-1042944.910000000149012;0
3985;-743312.765000000596046;-1043928.164999999105930;0
5958;-742962.513999998569489;-1043517.497999999672174;0
6514;-741730.449999999254942;-1044087.109999999403954;0
2500;-742743.000000000000000;-1045401.000000000000000;0
588;-741950.000000000000000;-1043352.000000000000000;0
8045;-742173.070000000298023;-1044806.519999999552965;0
4768;-742862.888000000268221;-1042936.997999999672174;0
1168;-741825.000000000000000;-1044403.000000000000000;0
711;-741828.000000000000000;-1042860.000000000000000;0
6930;-742046.030000001192093;-1045191.489999998360872;0
2007;-743231.000000000000000;-1044741.000000000000000;0
535;-742111.000000000000000;-1043714.000000000000000;0
728;-741997.000000000000000;-1042918.000000000000000;0
6160;-742311.730999998748302;-1043061.116000000387430;0
3291;-743588.212999999523163;-1042790.916999999433756;0
5208;-743237.954999998211861;-1043368.065999999642372;0
4075;-742947.934999998658895;-1043903.649999998509884;0
5205;-743251.475000001490116;-1043328.679000001400709;0
1253;-742084.000000000000000;-1044730.000000000000000;0
7086;-743333.149999998509884;-1044527.250000000000000;0
735;-741910.000000000000000;-1043014.000000000000000;0
2755;-744003.879000000655651;-1043471.734000001102686;0
4823;-742936.660000000149012;-1042868.949999999254942;0
838;-742043.000000000000000;-1042524.000000000000000;0
3411;-743769.885999999940395;-1043038.517000000923872;0
5728;-743421.517999999225140;-1043638.609000001102686;0
4507;-742472.469999998807907;-1042720.199999999254942;0
1818;-743046.000000000000000;-1044380.000000000000000;0
4715;-742877.199999999254942;-1042610.059999998658895;0
249;-743433.000000000000000;-1043775.000000000000000;0
1367;-742137.000000000000000;-1044959.000000000000000;0
4821;-742966.550000000745058;-1042877.969999998807907;0
4765;-742822.897999998182058;-1042850.499000001698732;0
4901;-742520.120000001043081;-1042823.960000000894070;0
5691;-743415.714000001549721;-1043637.241000000387430;0
719;-741705.000000000000000;-1042828.000000000000000;0
5016;-742572.212000001221895;-1042955.526999998837709;0
5011;-742644.307999998331070;-1042994.813999999314547;0
5146;-743064.554000001400709;-1043452.671999998390675;0
3312;-743789.184999998658895;-1042904.234000001102686;0
6241;-742365.649999998509884;-1043065.059999998658895;0
5504;-743428.977000001817942;-1043686.274000000208616;0
5;-743466.000000000000000;-1042616.000000000000000;27
6265;-742353.164999999105930;-1043020.054999999701977;0
4220;-742214.344999998807907;-1043580.359999999403954;0
1797;-743098.000000000000000;-1044099.000000000000000;0
550;-742276.000000000000000;-1043746.000000000000000;0
1385;-742194.000000000000000;-1044974.000000000000000;0
7678;-742388.550999999046326;-1045109.184000000357628;0
1246;-742120.000000000000000;-1044570.000000000000000;0
8152;-743293.600000001490116;-1043190.510000001639128;0
2543;-741788.000000000000000;-1044237.000000000000000;0
5767;-742424.269999999552965;-1042581.609000001102686;0
4624;-742577.815000001341105;-1042600.907999999821186;0
3789;-743137.469999998807907;-1042933.670000001788139;0
1910;-743460.000000000000000;-1044391.000000000000000;0
7689;-742554.140000000596046;-1045198.359999999403954;0
6152;-742310.348999999463558;-1043060.046999998390675;0
4845;-742978.655999999493361;-1042776.048000000417233;0
6794;-741124.372999999672174;-1044792.221000000834465;0
619;-742229.000000000000000;-1043277.000000000000000;0
5221;-743263.820000000298023;-1043556.920000001788139;0
4785;-742943.613000001758337;-1042632.072999998927116;0
4207;-742354.105999998748302;-1043530.157999999821186;0
1141;-741454.000000000000000;-1044453.000000000000000;0
6996;-743116.699999999254942;-1044476.469999998807907;0
5678;-743404.363000001758337;-1043717.368999999016523;0
7004;-743069.289999999105930;-1044326.469999998807907;0
2052;-743403.000000000000000;-1045075.000000000000000;0
1878;-743324.000000000000000;-1044249.000000000000000;0
879;-741947.000000000000000;-1042541.000000000000000;0
3974;-743140.660000000149012;-1043725.350000001490116;0
5725;-743422.388000000268221;-1043634.186999998986721;0
6337;-742257.140000000596046;-1042864.820000000298023;0
4692;-742681.477000001817942;-1042600.622000001370907;0
4922;-742443.129999998956919;-1042886.510000001639128;0
351;-742509.000000000000000;-1043739.000000000000000;0
2234;-743425.000000000000000;-1045221.000000000000000;0
1946;-743281.000000000000000;-1044437.000000000000000;0
5655;-743429.699000000953674;-1043704.359999999403954;0
281;-743045.000000000000000;-1043848.000000000000000;0
1469;-741752.000000000000000;-1044100.000000000000000;0
6119;-743582.679999999701977;-1042696.969999998807907;0
5167;-743219.324999999254942;-1043405.249000001698732;0
3816;-743149.379999998956919;-1042748.489999998360872;0
6182;-742317.399000000208616;-1043067.136999998241663;0
586;-741966.000000000000000;-1043374.000000000000000;0
4518;-742623.960000000894070;-1042786.719999998807907;0
1307;-741803.000000000000000;-1044663.000000000000000;0
397;-742355.000000000000000;-1043861.000000000000000;0
4726;-742863.519999999552965;-1042684.000000000000000;0
6206;-742314.043000001460314;-1043058.028999999165535;0
4749;-742884.420000001788139;-1042760.329999998211861;0
4763;-742847.094000000506639;-1042842.671000000089407;0
6134;-742309.011999998241663;-1043060.703000001609325;0
691;-742293.000000000000000;-1043097.000000000000000;0
1432;-741958.000000000000000;-1044285.000000000000000;0
1591;-742378.000000000000000;-1044910.000000000000000;0
4222;-742187.096999999135733;-1043485.890000000596046;0
4046;-743205.699999999254942;-1044009.719999998807907;0
3370;-743858.489999998360872;-1043011.370999999344349;0
8276;-742095.079999998211861;-1042752.519999999552965;0
215;-743021.000000000000000;-1043558.000000000000000;0
1897;-743534.000000000000000;-1044673.000000000000000;0
1988;-743481.000000000000000;-1044849.000000000000000;0
7003;-743074.140000000596046;-1044350.280000001192093;0
3182;-743923.576000001281500;-1042554.350000001490116;0
834;-742049.000000000000000;-1042541.000000000000000;0
6136;-742315.081999998539686;-1043070.210000000894070;0
7144;-742803.668999999761581;-1044378.798999998718500;0
5578;-743409.534000001847744;-1043632.701000001281500;0
3759;-743267.609999999403954;-1042971.300000000745058;0
6230;-742317.590999998152256;-1043059.730999998748302;0
4243;-742194.050000000745058;-1043431.899999998509884;0
4240;-742471.613000001758337;-1043552.366000000387430;0
5698;-743416.785999998450279;-1043633.638000000268221;0
6721;-742321.052999999374151;-1044705.548000000417233;0
5647;-743429.070999998599291;-1043694.699000000953674;0
7206;-742559.920000001788139;-1045003.190000001341105;0
3833;-743029.679999999701977;-1042612.300000000745058;0
2582;-741030.372999999672174;-1044607.635000001639128;0
1458;-741506.000000000000000;-1044384.000000000000000;0
844;-742138.000000000000000;-1042519.000000000000000;0
6351;-741874.269999999552965;-1042706.859999999403954;0
4657;-742806.021999999880791;-1042442.679999999701977;0
2018;-743244.000000000000000;-1044909.000000000000000;0
5598;-743412.839999999850988;-1043680.403000000864267;0
6200;-742318.653999999165535;-1043066.462000001221895;0
4714;-742856.359999999403954;-1042618.210000000894070;0
5721;-743418.407999999821186;-1043631.800000000745058;0
2560;-741251.000000000000000;-1044390.000000000000000;0
817;-741937.000000000000000;-1042586.000000000000000;0
4801;-742998.943999998271465;-1042721.118000000715256;0
4528;-742714.350000001490116;-1042840.010000001639128;0
1473;-741642.000000000000000;-1044158.000000000000000;0
5214;-743307.671999998390675;-1043376.414000000804663;0
6279;-742306.210000000894070;-1043033.421999998390675;0
5267;-743190.021999999880791;-1043149.807000000029802;0
7741;-742302.225999999791384;-1045079.842999998480082;0
8280;-742150.949999999254942;-1042770.420000001788139;0
2255;-743181.000000000000000;-1045372.000000000000000;0
4795;-743049.835000000894070;-1042669.013000000268221;0
4252;-742124.022999998182058;-1043390.519000001251698;0
5579;-743409.682999998331070;-1043634.574999999254942;0
1107;-741239.260000001639128;-1044580.940000001341105;0
6215;-742314.692000001668930;-1043057.682000000029802;0
1472;-741677.000000000000000;-1044145.000000000000000;0
4228;-742132.969999998807907;-1043331.449999999254942;0
5244;-743361.021000001579523;-1043374.999000001698732;0
6809;-741079.942999999970198;-1044626.942000001668930;0
5082;-742925.114000000059605;-1043348.883999999612570;0
4582;-742390.164999999105930;-1042606.546000000089407;0
4247;-742154.829999998211861;-1043394.660000000149012;0
6142;-742310.477000001817942;-1043061.813000001013279;0
4637;-742572.578000001609325;-1042742.510999999940395;0
1037;-741958.000000000000000;-1044950.000000000000000;0
4708;-742755.420000001788139;-1042611.309999998658895;0
6247;-742371.447000000625849;-1043053.739000000059605;0
1809;-743160.000000000000000;-1044541.000000000000000;0
8263;-742151.089999999850988;-1042702.239999998360872;0
4741;-742787.859999999403954;-1042715.800000000745058;0
6272;-742325.379000000655651;-1043017.383000001311302;0
1304;-741810.000000000000000;-1044684.000000000000000;0
4783;-742933.866999998688698;-1042668.403000000864267;0
842;-742101.000000000000000;-1042521.000000000000000;0
3950;-743426.829999998211861;-1043556.070000000298023;0
3280;-743624.243999999016523;-1042811.839999999850988;0
1256;-742084.000000000000000;-1044787.000000000000000;0
6271;-742329.282000001519918;-1043017.853999998420477;0
681;-742383.000000000000000;-1043170.000000000000000;0
6125;-743428.124000001698732;-1043615.223999999463558;0
1157;-741172.000000000000000;-1044489.000000000000000;0
5998;-742019.482000000774860;-1043283.164000000804663;0
7369;-743236.822000000625849;-1045458.699000000953674;0
2511;-743050.000000000000000;-1044050.000000000000000;0
5229;-743327.379999998956919;-1043528.620000001043081;0
779;-741708.000000000000000;-1042533.000000000000000;0
1552;-741351.000000000000000;-1044295.000000000000000;0
4614;-742493.800000000745058;-1042636.896000001579523;0
6759;-741016.559999998658895;-1044436.829999998211861;0
3174;-743908.859000001102686;-1042618.815999999642372;0
6784;-741318.109999999403954;-1044460.920000001788139;0
7291;-742809.960000000894070;-1044827.300000000745058;0
6284;-742309.677999999374151;-1043054.043999999761581;0
5755;-743415.670000001788139;-1043702.254000000655651;0
1952;-743316.000000000000000;-1044495.000000000000000;0
4662;-742819.471000000834465;-1042530.037000000476837;0
1655;-741391.000000000000000;-1044651.000000000000000;0
4322;-742266.414000000804663;-1043213.907999999821186;0
2346;-742654.000000000000000;-1045546.000000000000000;0
5737;-743412.636999998241663;-1043691.631000000983477;0
1494;-741173.000000000000000;-1044326.000000000000000;0
6224;-742315.320000000298023;-1043057.335000000894070;0
4589;-742408.243000000715256;-1042542.631999999284744;0
3948;-743409.451999999582767;-1043515.662000000476837;0
3144;-744012.590999998152256;-1042662.508000001311302;0
6363;-742027.344999998807907;-1042665.324000000953674;0
1379;-742135.000000000000000;-1044975.000000000000000;0
5283;-743032.892000000923872;-1043284.399000000208616;0
3183;-743909.289999999105930;-1042546.210000000894070;0
4137;-742705.739999998360872;-1044094.100000001490116;0
4893;-742637.320000000298023;-1042818.600999999791384;0
202;-743240.000000000000000;-1043597.000000000000000;0
1298;-741964.000000000000000;-1044736.000000000000000;0
6106;-742210.445999998599291;-1043112.203000001609325;0
649;-742233.000000000000000;-1043382.000000000000000;0
4514;-742555.050000000745058;-1042761.809999998658895;0
6191;-742318.017000000923872;-1043066.800999999046326;0
4858;-742955.339999999850988;-1042963.960000000894070;0
7982;-741163.039999999105930;-1044413.210000000894070;0
6092;-742001.309999998658895;-1043482.089999999850988;0
6569;-741287.850000001490116;-1044136.660000000149012;0
6853;-741548.899000000208616;-1045052.295000001788139;0
159;-742965.000000000000000;-1042641.000000000000000;0
1147;-741346.000000000000000;-1044466.000000000000000;0
4076;-742855.589999999850988;-1043882.670000001788139;0
512;-742063.000000000000000;-1043136.000000000000000;0
6270;-742333.412999998778105;-1043018.204999998211861;0
1463;-741933.000000000000000;-1043968.000000000000000;0
6169;-742312.320000000298023;-1043060.791999999433756;0
4892;-742663.079999998211861;-1042817.344999998807907;0
5116;-742947.859000001102686;-1043386.767000000923872;0
4210;-742178.550000000745058;-1043586.035000000149012;0
4200;-742219.350000001490116;-1043727.980999998748302;0
1155;-741208.000000000000000;-1044484.000000000000000;0
4956;-742383.579999998211861;-1043007.739999998360872;0
6278;-742305.421999998390675;-1043028.918000001460314;0
5515;-743426.960000000894070;-1043612.083999998867512;0
6139;-742312.807000000029802;-1043066.006000000983477;0
4139;-742859.625999998301268;-1044000.574999999254942;0
5703;-743417.385000001639128;-1043633.592000000178814;0
6103;-742213.102000001817942;-1043103.528999999165535;0
7179;-742625.429000001400709;-1044622.710000000894070;0
4119;-742717.223999999463558;-1043999.837999999523163;0
4732;-742777.550000000745058;-1042653.539999999105930;0
4753;-742764.600000001490116;-1042761.899999998509884;0
5735;-743414.589999999850988;-1043687.874000001698732;0
1012;-742060.000000000000000;-1044582.000000000000000;0
1431;-741926.000000000000000;-1044313.000000000000000;0
340;-742588.000000000000000;-1043906.000000000000000;0
8275;-742087.910000000149012;-1042738.609999999403954;0
706;-741897.000000000000000;-1042881.000000000000000;0
306;-742809.000000000000000;-1044137.000000000000000;0
6124;-743427.861999999731779;-1043609.043000001460314;0
1551;-741353.000000000000000;-1044326.000000000000000;0
4639;-742567.399999998509884;-1042548.592999998480082;0
1402;-741699.000000000000000;-1044419.000000000000000;0
7729;-742623.480999998748302;-1044601.217000000178814;0
3942;-743420.800000000745058;-1043492.339999999850988;0
