OID_;X;Y;TEMPERATURE
3614;-744984.548999998718500;-1042283.640999998897314;0
110;-744127.000000000000000;-1042724.000000000000000;0
3019;-744463.447999998927116;-1042784.646000001579523;0
3568;-744718.817999999970198;-1042588.614999998360872;0
3692;-744525.876499999314547;-1042540.534000001847744;0
3580;-744924.973999999463558;-1042593.699999999254942;0
2605;-745393.842999998480082;-1042860.796000000089407;0
5975;-745052.346999999135733;-1042674.673000000417233;0
118;-745135.000000000000000;-1042687.000000000000000;0
3542;-744575.274000000208616;-1042656.160000000149012;0
2696;-743477.489999998360872;-1042038.000000000000000;0
2520;-741847.000000000000000;-1045324.000000000000000;0
696;-742077.000000000000000;-1042913.000000000000000;0
7259;-742935.280000001192093;-1044869.829999998211861;0
1524;-741710.000000000000000;-1043844.000000000000000;0
2070;-742993.000000000000000;-1044723.000000000000000;0
3066;-744075.627000000327826;-1042883.837000001221895;0
725;-741983.000000000000000;-1042939.000000000000000;0
6;-743464.000000000000000;-1042594.000000000000000;0
3216;-743615.890999998897314;-1042451.129999998956919;0
2154;-742805.000000000000000;-1045147.000000000000000;0
509;-741991.000000000000000;-1043143.000000000000000;0
7410;-743525.730000000447035;-1045377.420000001788139;0
651;-742490.000000000000000;-1043564.000000000000000;0
2193;-743531.000000000000000;-1045204.000000000000000;0
6946;-742974.765000000596046;-1043929.388000000268221;0
4098;-742789.157000001519918;-1043861.918999999761581;0
2226;-743057.000000000000000;-1045470.000000000000000;0
3211;-743651.409000001847744;-1042483.458999998867512;0
7716;-743023.190999999642372;-1045843.241999998688698;0
6872;-741751.719999998807907;-1045296.679999999701977;0
7397;-743021.859999999403954;-1045682.989999998360872;0
1756;-742165.000000000000000;-1045209.000000000000000;0
2275;-742845.000000000000000;-1045719.000000000000000;0
4080;-742832.480000000447035;-1043782.030000001192093;0
7744;-742941.256999999284744;-1045533.171000000089407;0
2760;-743863.331000000238419;-1043483.304000001400709;0
7347;-742557.690000001341105;-1045177.440000001341105;0
2095;-743178.000000000000000;-1044734.000000000000000;0
2755;-744003.879000000655651;-1043471.734000001102686;0
2316;-742823.000000000000000;-1045463.000000000000000;0
2334;-742872.000000000000000;-1045519.000000000000000;0
1584;-742368.000000000000000;-1044717.000000000000000;0
2218;-743091.000000000000000;-1045372.000000000000000;0
2404;-742179.000000000000000;-1045467.000000000000000;0
350;-742505.000000000000000;-1043757.000000000000000;0
2274;-742870.000000000000000;-1045732.000000000000000;0
4025;-743202.881000000983477;-1043852.008000001311302;0
3919;-743904.947000000625849;-1043493.929999999701977;0
2049;-743499.000000000000000;-1045071.000000000000000;0
1382;-742096.000000000000000;-1045023.000000000000000;0
7189;-742588.486999999731779;-1044766.690999999642372;0
3760;-743233.829999998211861;-1042978.739999998360872;0
6746;-742405.083999998867512;-1044259.199999999254942;0
2060;-742659.000000000000000;-1044472.000000000000000;0
1036;-741961.000000000000000;-1044922.000000000000000;0
6823;-741313.910000000149012;-1044788.510000001639128;0
7202;-742561.410000000149012;-1044949.640000000596046;0
7325;-743032.969999998807907;-1045186.298999998718500;0
3107;-743778.888000000268221;-1042682.131999999284744;0
2322;-742651.000000000000000;-1045483.000000000000000;0
7026;-743217.644999999552965;-1044082.329999998211861;0
334;-742631.000000000000000;-1043987.000000000000000;0
1518;-741994.000000000000000;-1044011.000000000000000;0
1824;-742963.809999998658895;-1044143.929999999701977;0
4142;-742777.425000000745058;-1044013.440000001341105;0
2487;-742101.000000000000000;-1044308.000000000000000;0
7024;-743182.745000001043081;-1044052.815000001341105;0
7742;-741703.945999998599291;-1045067.738000001758337;0
5271;-742995.381999999284744;-1043229.673000000417233;0
5961;-742431.225000001490116;-1044003.574999999254942;0
4332;-742410.359000001102686;-1043282.916000001132488;0
5241;-743365.063000001013279;-1043245.954999998211861;0
7516;-742248.390000000596046;-1044368.907999999821186;0
7003;-743074.140000000596046;-1044350.280000001192093;0
2326;-742523.000000000000000;-1045498.000000000000000;0
2255;-743181.000000000000000;-1045372.000000000000000;0
7538;-742701.420000001788139;-1045364.109999999403954;0
1655;-741391.000000000000000;-1044651.000000000000000;0
1311;-741646.000000000000000;-1044831.000000000000000;0
2740;-744042.611999999731779;-1043335.940000001341105;0
2641;-743432.578999999910593;-1042583.418999999761581;0
1243;-742122.000000000000000;-1044502.000000000000000;0
4151;-742573.039999999105930;-1044109.035000000149012;0
4067;-742913.594999998807907;-1043714.640000000596046;0
3268;-743594.046999998390675;-1042721.412999998778105;0
7140;-742921.300000000745058;-1044469.335000000894070;0
6845;-741527.188000001013279;-1044989.557000000029802;0
1007;-741976.000000000000000;-1044586.000000000000000;0
5408;-743696.881000000983477;-1042878.024999998509884;0
1042;-741883.000000000000000;-1044682.000000000000000;0
2244;-743264.000000000000000;-1045331.000000000000000;0
2241;-743319.000000000000000;-1045289.000000000000000;0
7000;-743096.190000001341105;-1044426.870000001043081;0
1291;-742205.000000000000000;-1044568.000000000000000;0
5434;-744042.467999998480082;-1043135.986999999731779;0
6705;-742279.050999999046326;-1044655.923000000417233;0
7016;-742557.515000000596046;-1044334.074999999254942;0
1250;-742103.000000000000000;-1044672.000000000000000;0
3269;-743600.679000001400709;-1042731.660000000149012;0
1171;-741882.000000000000000;-1044375.000000000000000;0
1050;-741785.000000000000000;-1044952.000000000000000;0
3994;-743394.864000000059605;-1043949.813999999314547;0
4131;-742844.625000000000000;-1044059.980000000447035;0
747;-741690.000000000000000;-1043000.000000000000000;0
1368;-741998.000000000000000;-1044779.000000000000000;0
2337;-742783.000000000000000;-1045544.000000000000000;0
1720;-741436.000000000000000;-1044862.000000000000000;0
316;-742490.000000000000000;-1044202.000000000000000;0
3838;-743113.550000000745058;-1042543.399999998509884;0
513;-742083.000000000000000;-1043145.000000000000000;0
6726;-742476.517999999225140;-1044410.600000001490116;0
1430;-741993.000000000000000;-1044260.000000000000000;0
7043;-743398.899999998509884;-1044106.629999998956919;0
1025;-741989.000000000000000;-1044602.000000000000000;0
7217;-742516.318999998271465;-1044582.890000000596046;0
735;-741910.000000000000000;-1043014.000000000000000;0
7986;-741040.829999998211861;-1044408.250000000000000;0
2083;-742588.000000000000000;-1044663.000000000000000;0
7995;-741545.920000001788139;-1045160.100000001490116;0
6841;-741583.443999998271465;-1044946.208000000566244;0
4075;-742947.934999998658895;-1043903.649999998509884;0
8043;-742180.050000000745058;-1044750.160000000149012;0
3846;-743149.390000000596046;-1042549.600000001490116;0
1488;-741088.000000000000000;-1044212.000000000000000;0
4214;-742229.274999998509884;-1043511.745000001043081;0
2309;-742322.000000000000000;-1045519.000000000000000;0
7721;-742941.157000001519918;-1044215.368000000715256;0
3810;-743261.510000001639128;-1042802.960000000894070;0
7147;-742827.925000000745058;-1044451.385000001639128;0
4204;-742312.750999998301268;-1043589.962999999523163;0
1615;-742367.000000000000000;-1044434.000000000000000;0
4051;-743236.329999998211861;-1043889.710000000894070;0
1629;-742450.000000000000000;-1044518.000000000000000;0
2304;-742442.000000000000000;-1045429.000000000000000;0
1474;-741604.000000000000000;-1044172.000000000000000;0
7143;-742850.414999999105930;-1044473.449999999254942;0
4058;-743138.765000000596046;-1043625.405000001192093;0
1912;-743461.000000000000000;-1044430.000000000000000;0
6699;-742301.118999999016523;-1044484.282999999821186;0
2375;-742438.000000000000000;-1045570.000000000000000;0
1462;-741464.000000000000000;-1044225.000000000000000;0
1189;-741786.000000000000000;-1044043.000000000000000;0
1535;-741873.000000000000000;-1043913.000000000000000;0
3982;-743325.135000001639128;-1043857.684999998658895;0
4427;-742190.519999999552965;-1043099.440000001341105;0
1705;-741257.219999998807907;-1044695.690000001341105;0
7679;-742498.250000000000000;-1045115.879999998956919;0
6694;-742280.806000001728535;-1044814.875999998301268;0
1377;-742146.969999998807907;-1044922.489999998360872;0
4087;-742811.609999999403954;-1043604.190000001341105;0
7704;-742256.021000001579523;-1044313.592999998480082;0
4002;-743397.818999998271465;-1044054.317999999970198;0
1607;-742414.000000000000000;-1044379.000000000000000;0
1101;-741339.000000000000000;-1044568.000000000000000;0
1496;-741253.000000000000000;-1044321.000000000000000;0
6715;-742291.912999998778105;-1044948.105999998748302;0
1387;-742155.000000000000000;-1044999.000000000000000;0
2401;-742253.000000000000000;-1045390.000000000000000;0
884;-741771.000000000000000;-1042776.000000000000000;0
3416;-743754.546000000089407;-1043086.953000001609325;0
2084;-742447.000000000000000;-1044797.000000000000000;0
1170;-741893.000000000000000;-1044403.000000000000000;0
598;-741853.000000000000000;-1043233.000000000000000;0
1590;-742377.000000000000000;-1044885.000000000000000;0
529;-742162.000000000000000;-1043803.000000000000000;0
1373;-742143.000000000000000;-1044822.000000000000000;0
4652;-742775.500000000000000;-1042533.997999999672174;0
1482;-741289.000000000000000;-1044232.000000000000000;0
4225;-742115.607999999076128;-1043452.125000000000000;0
2511;-743050.000000000000000;-1044050.000000000000000;0
4558;-742373.019999999552965;-1042506.949999999254942;0
1197;-741657.000000000000000;-1043865.000000000000000;0
3973;-743161.204999998211861;-1043723.574999999254942;0
2499;-741884.000000000000000;-1044011.000000000000000;0
1924;-743359.000000000000000;-1044320.000000000000000;0
819;-741987.000000000000000;-1042599.000000000000000;0
1821;-742995.000000000000000;-1044239.000000000000000;0
7658;-742333.647999998182058;-1045313.331999998539686;0
568;-742116.000000000000000;-1043604.000000000000000;0
1596;-742323.000000000000000;-1045037.000000000000000;0
1330;-741817.000000000000000;-1044709.000000000000000;0
1942;-743283.000000000000000;-1044370.000000000000000;0
408;-742317.000000000000000;-1044182.000000000000000;0
2446;-742750.000000000000000;-1044164.000000000000000;0
1423;-742167.000000000000000;-1044150.000000000000000;0
4335;-742398.230000000447035;-1043445.760000001639128;0
1792;-742165.000000000000000;-1044209.000000000000000;0
7728;-743360.581999998539686;-1044610.631000000983477;0
2134;-743028.000000000000000;-1045111.000000000000000;0
1954;-743372.000000000000000;-1044497.000000000000000;0
8076;-742050.429999999701977;-1045256.199999999254942;0
1989;-743481.000000000000000;-1044876.000000000000000;0
2891;-744029.914000000804663;-1043200.478000000119209;0
1953;-743344.000000000000000;-1044500.000000000000000;0
2055;-743425.000000000000000;-1045038.000000000000000;0
2024;-743305.000000000000000;-1045000.000000000000000;0
164;-743392.000000000000000;-1043230.000000000000000;0
590;-741935.000000000000000;-1043331.000000000000000;0
1598;-742351.000000000000000;-1045090.000000000000000;0
5003;-742589.811999998986721;-1042974.888999998569489;0
6976;-743107.829999998211861;-1044483.399999998509884;0
7244;-742713.559999998658895;-1044823.719999998807907;0
5578;-743409.534000001847744;-1043632.701000001281500;0
2466;-743460.000000000000000;-1044740.000000000000000;0
7286;-742814.550000000745058;-1044746.960000000894070;0
3752;-743213.949999999254942;-1042902.719999998807907;0
6975;-743116.140000000596046;-1044506.469999998807907;0
4630;-742646.271999999880791;-1042652.089999999850988;0
2545;-741723.000000000000000;-1044265.000000000000000;0
2104;-743176.000000000000000;-1044964.000000000000000;0
1239;-742138.000000000000000;-1044401.000000000000000;0
5779;-742907.197999998927116;-1043414.096999999135733;0
639;-741958.000000000000000;-1043294.000000000000000;0
672;-742484.000000000000000;-1043226.000000000000000;0
1949;-743248.000000000000000;-1044491.000000000000000;0
630;-742179.000000000000000;-1043289.000000000000000;0
1890;-743522.000000000000000;-1044402.000000000000000;0
5699;-743416.657000001519918;-1043631.932999998331070;0
4938;-742469.324999999254942;-1042658.263000000268221;0
2151;-742827.000000000000000;-1045047.000000000000000;0
691;-742293.000000000000000;-1043097.000000000000000;0
4931;-742449.300000000745058;-1042791.403000000864267;0
3100;-743941.234000001102686;-1042742.857999999076128;0
4227;-742108.530000001192093;-1043326.289999999105930;0
8284;-742219.410000000149012;-1042809.500000000000000;0
1149;-741311.000000000000000;-1044471.000000000000000;0
4573;-742341.550000000745058;-1042629.699999999254942;0
5993;-743947.829999998211861;-1042646.350000001490116;0
4785;-742943.613000001758337;-1042632.072999998927116;0
6449;-743140.379999998956919;-1043395.559999998658895;0
2565;-741043.000000000000000;-1044424.000000000000000;0
6227;-742319.839999999850988;-1043063.936000000685453;0
913;-741742.000000000000000;-1042579.000000000000000;0
1991;-743482.000000000000000;-1044929.000000000000000;0
622;-742271.000000000000000;-1043302.000000000000000;0
8079;-742021.839999999850988;-1045292.179999999701977;0
1767;-741261.000000000000000;-1044168.000000000000000;0
5002;-742561.190000001341105;-1042977.401999998837709;0
1663;-741455.000000000000000;-1044433.000000000000000;0
8272;-742042.399999998509884;-1042732.559999998658895;0
3952;-743407.521999999880791;-1043538.500999998301268;0
4144;-742704.414999999105930;-1043822.484999999403954;0
301;-742613.000000000000000;-1043903.000000000000000;0
5244;-743361.021000001579523;-1043374.999000001698732;0
4640;-742588.572999998927116;-1042544.848999999463558;0
4675;-742805.809999998658895;-1042785.070000000298023;0
1295;-742082.000000000000000;-1044456.000000000000000;0
1692;-741125.000000000000000;-1044816.000000000000000;0
4815;-742992.210000000894070;-1042788.359999999403954;0
2469;-742941.000000000000000;-1045215.000000000000000;0
4309;-742042.329999998211861;-1043492.329999998211861;0
1562;-743199.000000000000000;-1045122.000000000000000;0
3392;-743913.699999999254942;-1043165.480000000447035;0
3818;-743130.217999998480082;-1042703.293000001460314;0
2447;-742772.000000000000000;-1044159.000000000000000;0
6139;-742312.807000000029802;-1043066.006000000983477;0
1156;-741191.980000000447035;-1044497.850000001490116;0
4582;-742390.164999999105930;-1042606.546000000089407;0
4728;-742862.960000000894070;-1042727.210000000894070;0
4233;-742334.782000001519918;-1043445.793000001460314;0
346;-742540.000000000000000;-1043816.000000000000000;0
1773;-741281.000000000000000;-1043977.000000000000000;0
4250;-742144.109999999403954;-1043367.519999999552965;0
1452;-741519.000000000000000;-1044574.000000000000000;0
6105;-742213.883000001311302;-1043111.734000001102686;0
1763;-741167.000000000000000;-1044108.000000000000000;0
1124;-741715.000000000000000;-1044452.000000000000000;0
5747;-743413.175999999046326;-1043698.811000000685453;0
6240;-742364.495999999344349;-1043067.289999999105930;0
1603;-742525.000000000000000;-1044922.000000000000000;0
6273;-742321.806000001728535;-1043017.085000000894070;0
1084;-741698.000000000000000;-1044537.000000000000000;0
5157;-743178.671999998390675;-1043354.681000001728535;0
266;-743321.000000000000000;-1043735.000000000000000;0
457;-741732.000000000000000;-1043333.000000000000000;0
378;-742514.000000000000000;-1043703.000000000000000;0
1777;-741169.000000000000000;-1044003.000000000000000;0
2033;-743500.000000000000000;-1044798.000000000000000;0
7946;-742007.769999999552965;-1044091.789999999105930;0
820;-742019.000000000000000;-1042600.000000000000000;0
4978;-742491.822999998927116;-1043028.688000001013279;0
395;-742369.000000000000000;-1043840.000000000000000;0
3368;-743901.462000001221895;-1043012.500999998301268;0
285;-743021.000000000000000;-1043730.000000000000000;0
6226;-742320.660999998450279;-1043065.366999998688698;0
7175;-742651.780000001192093;-1044558.149999998509884;0
1695;-741550.000000000000000;-1044656.000000000000000;0
793;-741697.000000000000000;-1042588.000000000000000;0
4821;-742966.550000000745058;-1042877.969999998807907;0
6271;-742329.282000001519918;-1043017.853999998420477;0
4601;-742631.969999998807907;-1042675.629999998956919;0
1447;-741541.000000000000000;-1044744.000000000000000;0
5669;-743414.997999999672174;-1043713.431000001728535;0
710;-741829.000000000000000;-1042878.000000000000000;0
1085;-741634.000000000000000;-1044530.000000000000000;0
3313;-743774.447000000625849;-1042903.081999998539686;0
1144;-741402.000000000000000;-1044470.000000000000000;0
5214;-743307.671999998390675;-1043376.414000000804663;0
6191;-742318.017000000923872;-1043066.800999999046326;0
4999;-742534.149999998509884;-1042966.892999999225140;0
401;-742324.000000000000000;-1043907.000000000000000;0
6370;-741968.780000001192093;-1042685.250000000000000;0
5086;-742856.307999998331070;-1043239.488000001758337;0
787;-741714.000000000000000;-1042620.000000000000000;0
2090;-742923.000000000000000;-1044566.000000000000000;0
1878;-743324.000000000000000;-1044249.000000000000000;0
5588;-743425.002000000327826;-1043679.451999999582767;0
7963;-741608.199999999254942;-1044329.510000001639128;0
561;-742172.000000000000000;-1043675.000000000000000;0
5692;-743415.782999999821186;-1043638.765000000596046;0
826;-742191.000000000000000;-1042616.000000000000000;0
4577;-742376.686000000685453;-1042590.309999998658895;0
737;-741849.000000000000000;-1043021.000000000000000;0
4958;-742349.620000001043081;-1043004.539999999105930;0
1871;-743440.000000000000000;-1044260.000000000000000;0
7279;-742799.399999998509884;-1044679.829999998211861;0
4328;-742347.322000000625849;-1043375.796999998390675;0
6254;-742379.344000000506639;-1043038.363000001758337;0
1426;-742056.000000000000000;-1044228.000000000000000;0
985;-741823.000000000000000;-1044444.000000000000000;0
6276;-742310.815999999642372;-1043016.000999998301268;0
7045;-743400.745000001043081;-1044160.004999998956919;0
1986;-743480.000000000000000;-1044794.000000000000000;0
208;-743146.000000000000000;-1043573.000000000000000;0
3155;-743969.353000000119209;-1042568.828000001609325;0
713;-741800.000000000000000;-1042859.000000000000000;0
3411;-743769.885999999940395;-1043038.517000000923872;0
1116;-741125.980000000447035;-1044610.410000000149012;0
912;-741690.000000000000000;-1042686.000000000000000;0
1860;-743472.000000000000000;-1044155.000000000000000;0
4965;-742383.620000001043081;-1043057.500000000000000;0
2038;-743342.000000000000000;-1044806.000000000000000;0
6806;-741090.381000000983477;-1044706.675999999046326;0
4833;-743036.859999999403954;-1042820.050000000745058;0
823;-742110.000000000000000;-1042596.000000000000000;0
678;-742421.000000000000000;-1043181.000000000000000;0
7151;-742842.649000000208616;-1044545.307000000029802;0
6339;-742245.460000000894070;-1042835.780000001192093;0
4984;-742580.537999998778105;-1043025.210999999195337;0
5117;-742816.081999998539686;-1043298.302999999374151;0
3843;-743139.170000001788139;-1042650.050000000745058;0
4925;-742455.502000000327826;-1042923.307000000029802;0
5324;-743025.329999998211861;-1043045.789999999105930;0
159;-742965.000000000000000;-1042641.000000000000000;0
5595;-743416.488000001758337;-1043680.118999999016523;0
5682;-743399.638000000268221;-1043719.120999999344349;0
3321;-743903.500999998301268;-1042936.324999999254942;0
4877;-742845.760000001639128;-1042956.589999999850988;0
4208;-742372.416999999433756;-1043503.423000000417233;0
6207;-742313.287000000476837;-1043056.642000000923872;0
6219;-742319.168999999761581;-1043064.293999999761581;0
5668;-743416.179999999701977;-1043712.995000001043081;0
5316;-743075.980000000447035;-1043041.059999998658895;0
4072;-742934.225000001490116;-1043833.899999998509884;0
4773;-742888.429000001400709;-1042839.530000001192093;0
5647;-743429.070999998599291;-1043694.699000000953674;0
7223;-742409.149999998509884;-1044822.649999998509884;0
1358;-741950.000000000000000;-1044887.000000000000000;0
8066;-742286.199999999254942;-1045237.250000000000000;0
6116;-742963.905999999493361;-1042886.313000001013279;0
3978;-743342.695000000298023;-1043756.835000000894070;0
5303;-743164.818999998271465;-1043211.078000001609325;0
6303;-741823.820000000298023;-1042750.410000000149012;0
5110;-742876.271999999880791;-1043449.013000000268221;0
1402;-741699.000000000000000;-1044419.000000000000000;0
1472;-741677.000000000000000;-1044145.000000000000000;0
5733;-743410.142999999225140;-1043688.210999999195337;0
846;-742175.000000000000000;-1042517.000000000000000;0
2237;-743368.000000000000000;-1045238.000000000000000;0
4755;-742734.960000000894070;-1042778.019999999552965;0
5707;-743417.815000001341105;-1043640.510999999940395;0
4738;-742733.910000000149012;-1042704.890000000596046;0
1348;-741801.000000000000000;-1044829.000000000000000;0
4736;-742701.269999999552965;-1042690.000000000000000;0
1459;-741491.000000000000000;-1044340.000000000000000;0
4676;-742792.579999998211861;-1042771.519999999552965;0
4555;-742337.140000000596046;-1042512.379999998956919;0
677;-742425.000000000000000;-1043200.000000000000000;0
1779;-741035.000000000000000;-1044812.000000000000000;0
4679;-742774.199999999254942;-1042819.160000000149012;0
5294;-743056.328999999910593;-1043196.096999999135733;0
3964;-743352.359999999403954;-1043540.780000001192093;0
5705;-743417.603000000119209;-1043637.098000001162291;0
6234;-742324.105000000447035;-1043076.613000001758337;0
4086;-742813.079999998211861;-1043631.730000000447035;0
4514;-742555.050000000745058;-1042761.809999998658895;0
4512;-742515.339999999850988;-1042750.230000000447035;0
6508;-741728.552999999374151;-1044508.050999999046326;0
1340;-741695.000000000000000;-1044759.000000000000000;0
4660;-742801.596999999135733;-1042487.965999998152256;0
6179;-742312.195000000298023;-1043059.041000001132488;0
6281;-742307.629000000655651;-1043042.113000001758337;0
430;-742185.000000000000000;-1043888.000000000000000;0
3966;-743363.859999999403954;-1043530.829999998211861;0
6514;-741730.449999999254942;-1044087.109999999403954;0
2456;-741013.000000000000000;-1044501.000000000000000;0
1510;-741764.000000000000000;-1044180.000000000000000;0
4673;-742811.420000001788139;-1042756.050000000745058;0
1449;-741533.000000000000000;-1044684.000000000000000;0
5133;-742976.300000000745058;-1043502.951999999582767;0
5711;-743422.837999999523163;-1043640.131000000983477;0
3237;-744143.304999999701977;-1042651.339999999850988;0
557;-742213.000000000000000;-1043713.000000000000000;0
314;-742585.000000000000000;-1044184.000000000000000;0
7980;-741198.179999999701977;-1044410.339999999850988;0
6283;-742308.969000000506639;-1043049.539999999105930;0
4723;-742883.429999999701977;-1042644.829999998211861;0
4688;-742676.179000001400709;-1042555.322999998927116;0
7132;-743262.120000001043081;-1044825.699999999254942;0
613;-742089.000000000000000;-1043271.000000000000000;0
3141;-744035.420000001788139;-1042680.460000000894070;0
549;-742290.000000000000000;-1043770.000000000000000;0
5419;-742434.690000001341105;-1042846.280000001192093;0
7362;-743205.807000000029802;-1045156.089999999850988;0
6233;-742319.057000000029802;-1043072.162999998778105;0
1470;-741728.000000000000000;-1044116.000000000000000;0
1419;-741603.000000000000000;-1044410.000000000000000;0
5360;-742453.188999999314547;-1042938.521999999880791;0
5229;-743327.379999998956919;-1043528.620000001043081;0
600;-741840.000000000000000;-1043212.000000000000000;0
8267;-742240.420000001788139;-1042709.160000000149012;0
397;-742355.000000000000000;-1043861.000000000000000;0
5650;-743429.348999999463558;-1043698.318999998271465;0
4031;-743135.774000000208616;-1043769.622000001370907;0
4523;-742703.960000000894070;-1042805.670000001788139;0
5173;-743291.175999999046326;-1043426.754999998956919;0
4825;-742908.839999999850988;-1042860.670000001788139;0
4756;-742712.579999998211861;-1042776.829999998211861;0
4894;-742610.888999998569489;-1042819.686999998986721;0
4064;-742879.655000001192093;-1043647.420000001788139;0
8263;-742151.089999999850988;-1042702.239999998360872;0
4892;-742663.079999998211861;-1042817.344999998807907;0
5141;-743039.598000001162291;-1043495.265000000596046;0
1097;-741414.000000000000000;-1044558.000000000000000;0
4538;-742291.464000001549721;-1042734.344000000506639;0
3768;-743006.370000001043081;-1042978.829999998211861;0
6208;-742320.098000001162291;-1043067.458999998867512;0
6200;-742318.653999999165535;-1043066.462000001221895;0
3761;-743202.559999998658895;-1042981.710000000894070;0
1317;-741748.000000000000000;-1044884.000000000000000;0
514;-742119.000000000000000;-1043141.000000000000000;0
6371;-741972.725000001490116;-1042696.274000000208616;0
4823;-742936.660000000149012;-1042868.949999999254942;0
3803;-743066.289999999105930;-1042896.320000000298023;0
4933;-742437.605000000447035;-1042750.853000000119209;0
4955;-742383.649999998509884;-1043019.250000000000000;0
6155;-742315.557999998331070;-1043068.140999998897314;0
323;-742711.000000000000000;-1044140.000000000000000;0
6261;-742373.956999998539686;-1043022.041999999433756;0
7961;-741602.260000001639128;-1044314.350000001490116;0
465;-741728.000000000000000;-1043309.000000000000000;0
2142;-742883.000000000000000;-1045078.000000000000000;0
2232;-743488.000000000000000;-1045234.000000000000000;0
4996;-742488.458999998867512;-1042974.723999999463558;0
5213;-743326.385999999940395;-1043368.675999999046326;0
5284;-743041.022999998182058;-1043277.397999998182058;0
6140;-742311.999000001698732;-1043064.638999998569489;0
1938;-743289.000000000000000;-1044306.000000000000000;0
6209;-742319.320000000298023;-1043066.114999998360872;0
3945;-743388.361000001430511;-1043434.486000001430511;0
4733;-742767.890000000596046;-1042671.010000001639128;0
1110;-741220.730000000447035;-1044598.480000000447035;0
6163;-742316.921000000089407;-1043069.223000001162291;0
797;-741796.000000000000000;-1042574.000000000000000;0
5138;-743030.936000000685453;-1043483.587999999523163;0
684;-742358.000000000000000;-1043136.000000000000000;0
3750;-743221.379999998956919;-1042925.429999999701977;0
1037;-741958.000000000000000;-1044950.000000000000000;0
821;-742048.000000000000000;-1042601.000000000000000;0
5599;-743411.622999999672174;-1043680.499000001698732;0
5124;-742983.513000000268221;-1043417.271999999880791;0
4749;-742884.420000001788139;-1042760.329999998211861;0
3804;-743040.109999999403954;-1042895.410000000149012;0
6263;-742365.719000000506639;-1043021.282999999821186;0
5683;-743398.456000000238419;-1043719.557999998331070;0
5775;-743915.925000000745058;-1042818.550999999046326;0
5502;-743427.894999999552965;-1043706.885000001639128;0
4845;-742978.655999999493361;-1042776.048000000417233;0
582;-741994.000000000000000;-1043417.000000000000000;0
6014;-742844.000000000000000;-1043239.482999999076128;0
4944;-742430.605999998748302;-1043013.879000000655651;0
5087;-742847.622999999672174;-1043250.081000000238419;0
4210;-742178.550000000745058;-1043586.035000000149012;0
569;-742096.000000000000000;-1043601.000000000000000;0
537;-742099.000000000000000;-1043663.000000000000000;0
6150;-742311.879999998956919;-1043062.857000000774860;0
6250;-742374.638999998569489;-1043047.576999999582767;0
6851;-741595.567000001668930;-1045078.456999998539686;0
693;-742284.000000000000000;-1043062.000000000000000;0
5700;-743416.574000000953674;-1043630.223999999463558;0
5675;-743407.907999999821186;-1043716.054999999701977;0
3304;-743786.739000000059605;-1042873.728999998420477;0
973;-741908.000000000000000;-1044547.000000000000000;0
5126;-743012.193999998271465;-1043403.521000001579523;0
2027;-743374.000000000000000;-1045032.000000000000000;0
4757;-742873.984000001102686;-1042820.212000001221895;0
261;-743429.000000000000000;-1043723.000000000000000;0
4635;-742575.561999998986721;-1042702.701000001281500;0
6558;-741292.800000000745058;-1044013.629999998956919;0
