OID_;X;Y;TEMPERATURE
1584;-742368.000000000000000;-1044717.000000000000000;0
2026;-743351.000000000000000;-1045022.000000000000000;0
1197;-741657.000000000000000;-1043865.000000000000000;0
6580;-741299.379000000655651;-1044005.879000000655651;0
1339;-741618.000000000000000;-1045067.000000000000000;0
2034;-743468.000000000000000;-1044800.000000000000000;0
3020;-744427.359000001102686;-1042798.999000001698732;0
2398;-742150.000000000000000;-1045370.000000000000000;0
1309;-741611.000000000000000;-1044813.000000000000000;0
3537;-744632.945000000298023;-1042671.657000001519918;0
727;-742001.000000000000000;-1042962.000000000000000;0
4072;-742934.225000001490116;-1043833.899999998509884;16
5307;-743082.182000000029802;-1043190.162000000476837;0
4062;-742830.460000000894070;-1043654.920000001788139;0
7183;-742606.379999998956919;-1044692.969999998807907;0
6321;-745084.927999999374151;-1042675.171000000089407;0
318;-742434.000000000000000;-1044213.000000000000000;0
3795;-743173.190000001341105;-1042842.170000001788139;0
843;-742085.000000000000000;-1042507.000000000000000;0
5435;-744041.557000000029802;-1043128.000999998301268;0
2257;-742956.000000000000000;-1045558.000000000000000;0
1922;-743390.000000000000000;-1044308.000000000000000;0
7041;-743381.004999998956919;-1044158.699999999254942;0
5251;-743317.296000000089407;-1043180.037999998778105;69
2343;-742674.000000000000000;-1045557.000000000000000;0
525;-742233.000000000000000;-1043884.000000000000000;0
2268;-742911.000000000000000;-1045632.000000000000000;0
6673;-742244.289999999105930;-1044153.350000001490116;0
2372;-742466.000000000000000;-1045488.000000000000000;0
619;-742229.000000000000000;-1043277.000000000000000;0
7650;-742315.337000001221895;-1045462.039999999105930;0
5317;-743063.690000001341105;-1043053.769999999552965;0
3064;-744117.098999999463558;-1042868.348999999463558;0
4207;-742354.105999998748302;-1043530.157999999821186;0
507;-741953.000000000000000;-1043148.000000000000000;0
3752;-743213.949999999254942;-1042902.719999998807907;0
4457;-741664.109999999403954;-1042615.550000000745058;0
2387;-742118.000000000000000;-1045443.000000000000000;0
1348;-741801.000000000000000;-1044829.000000000000000;0
462;-741707.000000000000000;-1043294.000000000000000;0
3410;-743766.532000001519918;-1043023.280999999493361;0
5231;-743342.107000000774860;-1043497.627000000327826;0
6854;-741522.427999999374151;-1045038.967999998480082;0
3976;-743088.861000001430511;-1043707.728000000119209;0
1628;-742449.000000000000000;-1044494.000000000000000;0
7729;-742623.480999998748302;-1044601.217000000178814;0
348;-742525.000000000000000;-1043787.000000000000000;0
7173;-742660.850000001490116;-1044535.730000000447035;0
584;-741980.000000000000000;-1043396.000000000000000;0
6722;-742357.717000000178814;-1044705.708000000566244;0
1561;-743186.000000000000000;-1045098.000000000000000;0
4041;-743227.600000001490116;-1043746.495000001043081;279
2160;-742849.000000000000000;-1045147.000000000000000;0
7077;-743564.359000001102686;-1045385.210000000894070;0
4331;-742391.967999998480082;-1043310.539000000804663;0
7104;-743423.739999998360872;-1044624.530000001192093;0
4529;-742762.920000001788139;-1042885.809999998658895;0
4167;-742438.315000001341105;-1044021.960000000894070;0
7260;-742953.010000001639128;-1044873.530000001192093;0
547;-742316.910000000149012;-1043790.309999998658895;0
1674;-741099.000000000000000;-1044736.000000000000000;0
3273;-743642.442999999970198;-1042796.677999999374151;0
1498;-741382.000000000000000;-1044310.000000000000000;0
1540;-742005.000000000000000;-1044009.000000000000000;0
680;-742402.109999999403954;-1043166.679999999701977;0
5282;-743037.090999998152256;-1043297.587999999523163;0
4097;-742806.000000000000000;-1043874.793999999761581;0
1621;-742467.000000000000000;-1044322.000000000000000;0
7399;-742999.699999999254942;-1045733.309999998658895;0
7012;-742805.839999999850988;-1044263.870000001043081;0
941;-742098.000000000000000;-1043132.000000000000000;0
6723;-742592.894999999552965;-1044408.905000001192093;0
6439;-741765.070999998599291;-1042636.877999998629093;0
1375;-742151.000000000000000;-1044887.000000000000000;0
2222;-743058.000000000000000;-1045420.000000000000000;0
3800;-743098.550000000745058;-1042863.019999999552965;0
1051;-741775.000000000000000;-1044980.000000000000000;0
2123;-743299.000000000000000;-1045010.000000000000000;0
1285;-742198.000000000000000;-1044467.000000000000000;0
4212;-742205.245000001043081;-1043548.410000000149012;0
6311;-743930.489999998360872;-1042569.390000000596046;0
4137;-742705.739999998360872;-1044094.100000001490116;0
532;-742114.000000000000000;-1043737.000000000000000;0
731;-741925.000000000000000;-1042997.000000000000000;0
2458;-741019.000000000000000;-1044567.000000000000000;0
1158;-741152.320000000298023;-1044503.030000001192093;0
558;-742200.000000000000000;-1043683.000000000000000;0
2210;-743280.000000000000000;-1045237.000000000000000;0
5789;-743505.210000000894070;-1042076.410000000149012;0
747;-741690.000000000000000;-1043000.000000000000000;0
3843;-743139.170000001788139;-1042650.050000000745058;0
6945;-742955.907000001519918;-1043932.182999998331070;0
502;-741901.000000000000000;-1043169.000000000000000;0
6931;-742050.949999999254942;-1045191.190000001341105;0
4242;-742214.469999998807907;-1043415.800000000745058;0
701;-742023.000000000000000;-1042885.000000000000000;0
7014;-742650.170000001788139;-1044305.010000001639128;0
6873;-741769.339999999850988;-1045285.489999998360872;0
1251;-742091.000000000000000;-1044690.000000000000000;0
4334;-742384.170000001788139;-1043468.820000000298023;0
7031;-743301.824999999254942;-1044080.774999998509884;0
5969;-742284.809999998658895;-1044169.578000001609325;0
1440;-741782.000000000000000;-1044362.000000000000000;0
4909;-742383.146000001579523;-1042799.159000001847744;0
4151;-742573.039999999105930;-1044109.035000000149012;0
1653;-741384.000000000000000;-1044592.000000000000000;0
3580;-744924.973999999463558;-1042593.699999999254942;0
351;-742509.000000000000000;-1043739.000000000000000;0
2524;-742108.000000000000000;-1044191.000000000000000;0
1474;-741604.000000000000000;-1044172.000000000000000;0
7516;-742248.390000000596046;-1044368.907999999821186;0
1243;-742122.000000000000000;-1044502.000000000000000;0
390;-742429.000000000000000;-1043827.000000000000000;0
1758;-741097.000000000000000;-1044094.000000000000000;0
7157;-742964.840999998152256;-1044545.681000001728535;0
1487;-741117.000000000000000;-1044216.000000000000000;0
5370;-742580.300999999046326;-1042977.140999998897314;0
1338;-741629.000000000000000;-1045045.000000000000000;0
4619;-742460.010000001639128;-1042480.890000000596046;0
3919;-743904.947000000625849;-1043493.929999999701977;0
6212;-742317.006000000983477;-1043061.888000000268221;0
1531;-741782.000000000000000;-1043838.000000000000000;0
7706;-742313.239999998360872;-1044319.611999999731779;0
6308;-741823.129999998956919;-1042770.370000001043081;0
6128;-742313.668999999761581;-1043069.186000000685453;0
2104;-743176.000000000000000;-1044964.000000000000000;0
3393;-743910.969999998807907;-1043143.960000000894070;0
5295;-743047.995000001043081;-1043185.530000001192093;0
4051;-743236.329999998211861;-1043889.710000000894070;0
6473;-741931.359999999403954;-1044555.109999999403954;14
5000;-742542.798000000417233;-1042978.486999999731779;0
1818;-743046.000000000000000;-1044380.000000000000000;0
1693;-741613.000000000000000;-1044649.000000000000000;0
1503;-741537.000000000000000;-1044272.000000000000000;0
1398;-741753.000000000000000;-1044201.000000000000000;0
8278;-742119.929999999701977;-1042758.710000000894070;0
4890;-742605.287000000476837;-1042838.535000000149012;0
5998;-742019.482000000774860;-1043283.164000000804663;0
3846;-743149.390000000596046;-1042549.600000001490116;0
4463;-742198.989999998360872;-1042569.030000001192093;0
7083;-743309.980000000447035;-1044509.500000000000000;0
2376;-742411.000000000000000;-1045554.000000000000000;0
1451;-741522.000000000000000;-1044602.000000000000000;0
8082;-741958.629999998956919;-1045352.690000001341105;0
4142;-742777.425000000745058;-1044013.440000001341105;0
2298;-742621.000000000000000;-1045406.000000000000000;0
3945;-743388.361000001430511;-1043434.486000001430511;0
301;-742613.000000000000000;-1043903.000000000000000;0
4848;-742977.940000001341105;-1042862.019999999552965;0
1138;-741500.000000000000000;-1044458.000000000000000;0
377;-742494.000000000000000;-1043658.000000000000000;0
4781;-742926.519000001251698;-1042695.502999998629093;0
3757;-743300.960000000894070;-1042956.699999999254942;0
3361;-743933.616000000387430;-1042980.793000001460314;0
396;-742388.000000000000000;-1043886.000000000000000;0
6689;-742384.449999999254942;-1045033.609999999403954;0
1623;-742524.000000000000000;-1044319.000000000000000;0
4002;-743397.818999998271465;-1044054.317999999970198;0
3803;-743066.289999999105930;-1042896.320000000298023;0
4749;-742884.420000001788139;-1042760.329999998211861;0
1430;-741993.000000000000000;-1044260.000000000000000;0
4725;-742875.100000001490116;-1042678.230000000447035;0
7281;-742801.859999999403954;-1044705.300000000745058;0
5733;-743410.142999999225140;-1043688.210999999195337;0
3228;-744128.969999998807907;-1042651.059000000357628;0
5110;-742876.271999999880791;-1043449.013000000268221;0
4555;-742337.140000000596046;-1042512.379999998956919;0
6373;-741992.809999998658895;-1042677.000000000000000;0
2133;-743040.000000000000000;-1045127.000000000000000;0
6277;-742304.633999999612570;-1043024.256000000983477;0
1429;-741982.000000000000000;-1044280.000000000000000;0
3562;-744682.454999998211861;-1042610.877000000327826;0
4766;-742803.037999998778105;-1042842.532999999821186;0
713;-741800.000000000000000;-1042859.000000000000000;0
1934;-743294.000000000000000;-1044407.000000000000000;0
2052;-743403.000000000000000;-1045075.000000000000000;0
2423;-742482.000000000000000;-1045106.000000000000000;0
3769;-742978.969999998807907;-1042975.300000000745058;0
218;-743006.000000000000000;-1043537.000000000000000;0
2317;-742792.000000000000000;-1045467.000000000000000;0
6753;-742485.511999998241663;-1044950.206999998539686;0
8050;-742206.719999998807907;-1044915.530000001192093;0
4023;-743246.635000001639128;-1043864.364999998360872;0
6784;-741318.109999999403954;-1044460.920000001788139;0
2044;-743445.000000000000000;-1044960.000000000000000;0
8283;-742198.600000001490116;-1042801.980000000447035;0
6276;-742310.815999999642372;-1043016.000999998301268;0
6129;-742312.925000000745058;-1043067.717000000178814;0
3095;-743923.068999998271465;-1042787.789000000804663;87
1084;-741698.000000000000000;-1044537.000000000000000;0
4058;-743138.765000000596046;-1043625.405000001192093;0
4173;-742756.320000000298023;-1043749.629999998956919;0
1144;-741402.000000000000000;-1044470.000000000000000;0
2189;-743472.000000000000000;-1045183.000000000000000;0
5690;-743415.532999999821186;-1043635.447000000625849;0
5223;-743283.699999999254942;-1043535.940000001341105;0
1384;-742180.000000000000000;-1044969.000000000000000;0
1036;-741961.000000000000000;-1044922.000000000000000;0
3998;-743432.704999998211861;-1043914.274999998509884;0
1108;-741261.000000000000000;-1044593.000000000000000;0
6709;-742264.587999999523163;-1044776.254999998956919;0
7970;-741444.739999998360872;-1044384.980000000447035;0
2032;-743526.000000000000000;-1044797.000000000000000;0
3706;-744567.589999999850988;-1042534.585000000894070;0
639;-741958.000000000000000;-1043294.000000000000000;0
1490;-741023.000000000000000;-1044335.000000000000000;0
5156;-743160.188999999314547;-1043355.291999999433756;0
7143;-742850.414999999105930;-1044473.449999999254942;0
6154;-742316.324000000953674;-1043069.546000000089407;0
8056;-742242.379999998956919;-1045023.460000000894070;0
2039;-743308.000000000000000;-1044808.000000000000000;0
636;-742160.000000000000000;-1043325.000000000000000;0
5024;-742588.655000001192093;-1042886.519000001251698;0
7829;-743509.649999998509884;-1045166.399999998509884;0
6338;-742247.910000000149012;-1042851.670000001788139;0
1479;-741407.000000000000000;-1044225.000000000000000;0
7292;-742821.410000000149012;-1044818.760000001639128;0
737;-741849.000000000000000;-1043021.000000000000000;0
7660;-742321.396999999880791;-1045335.578999999910593;0
7139;-742919.179999999701977;-1044444.434999998658895;0
5064;-742811.537999998778105;-1043238.886999998241663;0
1757;-742189.000000000000000;-1045219.000000000000000;0
3132;-743939.052000001072884;-1042650.916999999433756;0
1140;-741475.000000000000000;-1044461.000000000000000;0
606;-741906.000000000000000;-1043273.000000000000000;0
3787;-743130.989999998360872;-1042979.320000000298023;0
5204;-743246.423999998718500;-1043308.298999998718500;0
7223;-742409.149999998509884;-1044822.649999998509884;0
6974;-743127.620000001043081;-1044518.800000000745058;0
2008;-743242.000000000000000;-1044759.000000000000000;0
2073;-743069.000000000000000;-1044754.000000000000000;0
7808;-741986.629999998956919;-1044440.109999999403954;0
514;-742119.000000000000000;-1043141.000000000000000;0
2288;-742936.000000000000000;-1045436.000000000000000;0
4584;-742417.721999999135733;-1042627.620999999344349;0
1506;-741642.000000000000000;-1044236.000000000000000;0
1860;-743472.000000000000000;-1044155.000000000000000;0
1020;-742293.000000000000000;-1044615.000000000000000;0
4583;-742401.482999999076128;-1042625.886999998241663;0
1819;-743034.000000000000000;-1044350.000000000000000;0
4608;-742555.160999998450279;-1042637.633999999612570;0
574;-742068.000000000000000;-1043538.000000000000000;0
2488;-742083.000000000000000;-1044303.000000000000000;0
1769;-741260.000000000000000;-1044112.000000000000000;0
1965;-743413.000000000000000;-1044726.000000000000000;0
3948;-743409.451999999582767;-1043515.662000000476837;0
4630;-742646.271999999880791;-1042652.089999999850988;0
2449;-742825.000000000000000;-1044147.000000000000000;0
3433;-743896.050000000745058;-1042546.662000000476837;0
2248;-743201.000000000000000;-1045423.000000000000000;0
4923;-742431.019999999552965;-1042882.210000000894070;0
7162;-743075.840999998152256;-1044541.596000000834465;0
2491;-742059.000000000000000;-1044251.000000000000000;0
7248;-742757.960000000894070;-1044826.929999999701977;0
1012;-742060.000000000000000;-1044582.000000000000000;0
2087;-742450.000000000000000;-1044838.000000000000000;0
6505;-741746.570000000298023;-1044600.429999999701977;0
4835;-742967.660000000149012;-1042677.690000001341105;0
2499;-741884.000000000000000;-1044011.000000000000000;0
2484;-741269.109999999403954;-1044779.070000000298023;0
2264;-742977.000000000000000;-1045745.000000000000000;0
4692;-742681.477000001817942;-1042600.622000001370907;0
4224;-742139.756000000983477;-1043462.488000001758337;0
4998;-742514.109000001102686;-1042978.602000001817942;0
6716;-742256.467000000178814;-1044966.368000000715256;0
1936;-743293.000000000000000;-1044272.000000000000000;0
2169;-742902.000000000000000;-1045108.000000000000000;0
4770;-742872.535000000149012;-1042899.679000001400709;0
3944;-743390.002000000327826;-1043413.532999999821186;0
5414;-742582.574999999254942;-1042677.478999998420477;0
1954;-743372.000000000000000;-1044497.000000000000000;0
4321;-742265.214999999850988;-1043235.418999999761581;0
3981;-743341.517000000923872;-1043837.353999998420477;0
1133;-741604.000000000000000;-1044433.000000000000000;0
893;-742956.000000000000000;-1042572.000000000000000;76
2464;-743519.000000000000000;-1044697.000000000000000;0
2150;-742812.000000000000000;-1045054.000000000000000;0
1573;-742358.000000000000000;-1044452.000000000000000;0
4647;-742705.322999998927116;-1042525.425000000745058;0
1337;-741723.000000000000000;-1044886.000000000000000;0
1555;-741196.000000000000000;-1044374.000000000000000;0
818;-741961.000000000000000;-1042598.000000000000000;0
1029;-741978.000000000000000;-1044721.000000000000000;0
1827;-743033.000000000000000;-1044080.000000000000000;0
3201;-743741.188999999314547;-1042531.719000000506639;0
4938;-742469.324999999254942;-1042658.263000000268221;0
1131;-741643.000000000000000;-1044433.000000000000000;0
4250;-742144.109999999403954;-1043367.519999999552965;0
6387;-742159.980000000447035;-1042496.210000000894070;0
1820;-743006.000000000000000;-1044272.000000000000000;0
3834;-743079.190000001341105;-1042579.899999998509884;0
5375;-744998.668000001460314;-1042267.800999999046326;0
1831;-742994.000000000000000;-1044105.000000000000000;0
4698;-742673.530000001192093;-1042715.780000001192093;0
8018;-741974.039999999105930;-1044442.870000001043081;0
6220;-742318.432999998331070;-1043062.949999999254942;0
23;-743544.000000000000000;-1042505.000000000000000;0
4556;-742354.629999998956919;-1042526.789999999105930;0
5209;-743271.947999998927116;-1043361.392000000923872;0
8;-743496.000000000000000;-1042539.000000000000000;0
7945;-742063.179999999701977;-1044077.379999998956919;0
3783;-743211.559999998658895;-1042920.120000001043081;0
2212;-743217.000000000000000;-1045279.000000000000000;0
1588;-742390.000000000000000;-1044837.000000000000000;0
5112;-742942.920000001788139;-1043441.850000001490116;0
5657;-743429.199999999254942;-1043706.837999999523163;0
3216;-743615.890999998897314;-1042451.129999998956919;0
3519;-744889.844999998807907;-1042681.971000000834465;0
5117;-742816.081999998539686;-1043298.302999999374151;0
5757;-743420.747999999672174;-1043633.940999999642372;0
578;-742023.000000000000000;-1043464.000000000000000;0
1377;-742146.969999998807907;-1044922.489999998360872;0
6843;-741569.070000000298023;-1044975.261999998241663;0
1031;-741973.000000000000000;-1044784.000000000000000;0
1399;-741736.000000000000000;-1044167.000000000000000;0
2309;-742322.000000000000000;-1045519.000000000000000;0
4067;-742913.594999998807907;-1043714.640000000596046;0
1514;-741882.000000000000000;-1044096.000000000000000;0
2542;-741813.000000000000000;-1044224.000000000000000;0
5138;-743030.936000000685453;-1043483.587999999523163;0
559;-742191.000000000000000;-1043693.000000000000000;0
3303;-743810.967999998480082;-1042865.596000000834465;0
2149;-742819.000000000000000;-1045024.000000000000000;0
3806;-743010.089999999850988;-1042912.410000000149012;0
1381;-742115.000000000000000;-1044999.000000000000000;0
6130;-742312.136999998241663;-1043066.344000000506639;0
6982;-743055.109999999403954;-1044342.629999998956919;0
3368;-743901.462000001221895;-1043012.500999998301268;0
2057;-742787.000000000000000;-1044365.000000000000000;0
5215;-743342.890000000596046;-1043380.368000000715256;0
1534;-741849.000000000000000;-1043893.000000000000000;0
7176;-742630.820000000298023;-1044585.809999998658895;0
6039;-742085.370000001043081;-1043669.620999999344349;0
346;-742540.000000000000000;-1043816.000000000000000;0
1920;-743384.000000000000000;-1044363.000000000000000;0
6558;-741292.800000000745058;-1044013.629999998956919;0
1312;-741659.000000000000000;-1044848.000000000000000;0
1015;-742126.000000000000000;-1044599.000000000000000;0
8058;-742263.219999998807907;-1045051.489999998360872;0
4478;-741867.359999999403954;-1042693.289999999105930;0
1215;-742091.000000000000000;-1044365.000000000000000;0
285;-743021.000000000000000;-1043730.000000000000000;0
6508;-741728.552999999374151;-1044508.050999999046326;0
1966;-743413.000000000000000;-1044746.000000000000000;0
2070;-742993.000000000000000;-1044723.000000000000000;0
5020;-742572.699999999254942;-1042891.372999999672174;0
1353;-741862.000000000000000;-1044843.000000000000000;0
695;-742207.000000000000000;-1043019.000000000000000;0
5516;-743427.133000001311302;-1043615.250999998301268;0
4009;-743231.157999999821186;-1044047.155000001192093;0
3268;-743594.046999998390675;-1042721.412999998778105;0
2007;-743231.000000000000000;-1044741.000000000000000;0
4605;-742489.238000001758337;-1042616.754999998956919;0
6826;-741405.300000000745058;-1044777.199999999254942;0
1462;-741464.000000000000000;-1044225.000000000000000;0
7198;-742561.769999999552965;-1044881.949999999254942;0
4991;-742675.414999999105930;-1043031.236000001430511;0
4124;-742751.265000000596046;-1043878.414999999105930;0
8258;-742053.760000001639128;-1042683.769999999552965;0
4624;-742577.815000001341105;-1042600.907999999821186;0
647;-742216.000000000000000;-1043375.000000000000000;0
6359;-742018.440000001341105;-1042712.449999999254942;0
4245;-742160.210000000894070;-1043410.570000000298023;0
90;-744040.000000000000000;-1043095.000000000000000;0
4987;-742641.745000001043081;-1043011.309999998658895;0
7278;-742803.899999998509884;-1044636.800000000745058;0
3157;-743935.576000001281500;-1042567.035000000149012;0
1185;-741822.000000000000000;-1044095.000000000000000;0
1434;-741931.000000000000000;-1044293.000000000000000;0
1266;-742052.000000000000000;-1044980.000000000000000;0
1823;-742973.000000000000000;-1044174.000000000000000;0
5408;-743696.881000000983477;-1042878.024999998509884;0
6810;-741106.350999999791384;-1044631.888999998569489;0
3458;-745043.431000001728535;-1042697.631000000983477;0
1240;-742145.000000000000000;-1044418.000000000000000;0
1927;-743501.000000000000000;-1044407.000000000000000;0
6131;-742311.329999998211861;-1043064.982999999076128;0
4896;-742589.649999998509884;-1042838.989999998360872;0
7121;-743339.839999999850988;-1044620.059999998658895;0
5656;-743429.752999998629093;-1043705.570000000298023;0
6872;-741751.719999998807907;-1045296.679999999701977;0
621;-742285.000000000000000;-1043282.000000000000000;0
1497;-741332.000000000000000;-1044317.000000000000000;0
6771;-741345.015999998897314;-1044413.647999998182058;0
5767;-742424.269999999552965;-1042581.609000001102686;0
7242;-742691.750000000000000;-1044821.769999999552965;0
4087;-742811.609999999403954;-1043604.190000001341105;0
4751;-742791.629999998956919;-1042751.460000000894070;0
673;-742467.000000000000000;-1043230.000000000000000;0
4126;-742851.335000000894070;-1044085.449999999254942;0
1447;-741541.000000000000000;-1044744.000000000000000;0
2291;-742850.000000000000000;-1045401.000000000000000;0
4648;-742721.809999998658895;-1042535.192000001668930;0
4476;-741849.620000001043081;-1042690.190000001341105;0
3178;-743875.403999999165535;-1042614.289999999105930;0
1771;-741274.000000000000000;-1044046.000000000000000;0
1361;-742037.000000000000000;-1044911.000000000000000;0
4950;-742354.289999999105930;-1042955.670000001788139;0
6225;-742314.519999999552965;-1043055.927000001072884;0
249;-743433.000000000000000;-1043775.000000000000000;0
5002;-742561.190000001341105;-1042977.401999998837709;0
6127;-742314.456000000238419;-1043070.548999998718500;0
7356;-743331.410000000149012;-1045146.359999999403954;0
6654;-741635.289999999105930;-1044140.820000000298023;0
5683;-743398.456000000238419;-1043719.557999998331070;0
1261;-742057.000000000000000;-1044894.000000000000000;0
4878;-742876.434000000357628;-1042964.004000000655651;0
4088;-742812.114999998360872;-1043580.475000001490116;0
3211;-743651.409000001847744;-1042483.458999998867512;0
1148;-741324.000000000000000;-1044481.000000000000000;0
626;-742236.000000000000000;-1043317.000000000000000;0
6230;-742317.590999998152256;-1043059.730999998748302;0
1812;-743149.000000000000000;-1044528.000000000000000;0
7270;-743152.309999998658895;-1044962.469999998807907;0
5242;-743357.030000001192093;-1043419.239999998360872;0
6271;-742329.282000001519918;-1043017.853999998420477;0
5510;-743424.346000000834465;-1043626.458999998867512;0
675;-742446.000000000000000;-1043215.000000000000000;0
2249;-743211.000000000000000;-1045443.000000000000000;0
3992;-743365.899999998509884;-1043881.385000001639128;0
4491;-741872.890000000596046;-1042643.989999998360872;0
1472;-741677.000000000000000;-1044145.000000000000000;0
7214;-742470.679999999701977;-1044531.269999999552965;0
5937;-744081.739000000059605;-1043323.396999999880791;0
4744;-742848.129999998956919;-1042759.629999998956919;0
5178;-743386.421000000089407;-1043452.486000001430511;0
340;-742588.000000000000000;-1043906.000000000000000;0
1296;-742100.000000000000000;-1044473.000000000000000;0
3339;-743968.859000001102686;-1043058.642000000923872;0
5455;-742823.936000000685453;-1043283.644999999552965;0
2209;-743309.000000000000000;-1045217.000000000000000;0
4920;-742444.449999999254942;-1042928.980000000447035;0
704;-741929.000000000000000;-1042879.000000000000000;0
1455;-741517.000000000000000;-1044468.000000000000000;0
4652;-742775.500000000000000;-1042533.997999999672174;0
4805;-743001.147999998182058;-1042707.644999999552965;0
7220;-742418.820000000298023;-1044813.199999999254942;0
2324;-742589.000000000000000;-1045490.000000000000000;0
5015;-742575.741000000387430;-1043008.607999999076128;0
4903;-742493.579999998211861;-1042816.620000001043081;0
6175;-742315.256999999284744;-1043064.660999998450279;0
1541;-742026.000000000000000;-1044034.000000000000000;0
628;-742217.370000001043081;-1043308.559999998658895;0
1829;-742968.539999999105930;-1044100.210000000894070;0
1043;-741872.000000000000000;-1044711.000000000000000;101
3887;-742347.760000001639128;-1042449.881000000983477;0
4587;-742482.011999998241663;-1042641.392999999225140;0
6856;-741514.510999999940395;-1044912.175999999046326;0
1168;-741825.000000000000000;-1044403.000000000000000;0
4628;-742619.598000001162291;-1042609.989999998360872;0
314;-742585.000000000000000;-1044184.000000000000000;0
630;-742179.000000000000000;-1043289.000000000000000;0
6836;-741643.532000001519918;-1044947.486999999731779;0
5194;-743205.761999998241663;-1043310.581999998539686;0
4426;-742197.589999999850988;-1043031.679999999701977;0
205;-743173.000000000000000;-1043599.000000000000000;0
517;-742207.000000000000000;-1043117.000000000000000;0
2285;-742897.000000000000000;-1045467.000000000000000;0
7721;-742941.157000001519918;-1044215.368000000715256;0
1258;-742076.000000000000000;-1044837.000000000000000;0
1310;-741623.000000000000000;-1044829.000000000000000;0
7043;-743398.899999998509884;-1044106.629999998956919;0
6295;-742653.399999998509884;-1042696.070000000298023;0
6707;-742271.293999999761581;-1044721.274999998509884;0
380;-742501.000000000000000;-1043722.000000000000000;0
2562;-741090.000000000000000;-1044404.000000000000000;0
4980;-742521.857999999076128;-1043030.853000000119209;0
7657;-742317.228999998420477;-1045306.000999998301268;0
735;-741910.000000000000000;-1043014.000000000000000;0
3179;-743902.603999998420477;-1042607.138999998569489;0
5641;-743428.517000000923872;-1043687.460000000894070;0
2520;-741847.000000000000000;-1045324.000000000000000;0
206;-743179.000000000000000;-1043581.000000000000000;0
3822;-743065.039999999105930;-1042594.239999998360872;0
1489;-741055.000000000000000;-1044209.000000000000000;0
2156;-742796.000000000000000;-1045184.000000000000000;0
6845;-741527.188000001013279;-1044989.557000000029802;0
6786;-741269.960000000894070;-1044469.460000000894070;0
1126;-741684.000000000000000;-1044450.000000000000000;0
5511;-743426.401000000536442;-1043599.129999998956919;0
3154;-743984.818999998271465;-1042573.844999998807907;0
1832;-743024.000000000000000;-1044100.000000000000000;0
5293;-743043.969999998807907;-1043208.554000001400709;0
5205;-743251.475000001490116;-1043328.679000001400709;0
5369;-742583.364999998360872;-1042976.820999998599291;0
6360;-742004.925000000745058;-1042692.804000001400709;0
3287;-743711.173999998718500;-1042886.515999998897314;0
6783;-741340.728000000119209;-1044457.412000000476837;0
6211;-742317.785000000149012;-1043063.318999998271465;0
3789;-743137.469999998807907;-1042933.670000001788139;0
5648;-743429.164000000804663;-1043695.905999999493361;0
4237;-742425.385000001639128;-1043517.421000000089407;0
5693;-743415.905000001192093;-1043640.377000000327826;0
6713;-742278.905999999493361;-1044887.284000001847744;0
1120;-741778.000000000000000;-1044457.000000000000000;0
6557;-741291.730000000447035;-1044031.710000000894070;0
5014;-742563.771999999880791;-1042993.241999998688698;0
5236;-743352.302000001072884;-1043362.752000000327826;0
203;-743204.000000000000000;-1043607.000000000000000;0
2029;-743393.000000000000000;-1045068.000000000000000;0
