OID_;X;Y;TEMPERATURE
3614;-744984.548999998718500;-1042283.640999998897314;0
3019;-744463.447999998927116;-1042784.646000001579523;0
3568;-744718.817999999970198;-1042588.614999998360872;0
3692;-744525.876499999314547;-1042540.534000001847744;0
3580;-744924.973999999463558;-1042593.699999999254942;0
2605;-745393.842999998480082;-1042860.796000000089407;0
5975;-745052.346999999135733;-1042674.673000000417233;0
118;-745135.000000000000000;-1042687.000000000000000;0
3542;-744575.274000000208616;-1042656.160000000149012;0
2696;-743477.489999998360872;-1042038.000000000000000;0
2520;-741847.000000000000000;-1045324.000000000000000;0
6872;-741751.719999998807907;-1045296.679999999701977;0
2760;-743863.331000000238419;-1043483.304000001400709;0
2755;-744003.879000000655651;-1043471.734000001102686;0
2404;-742179.000000000000000;-1045467.000000000000000;0
3919;-743904.947000000625849;-1043493.929999999701977;0
3107;-743778.888000000268221;-1042682.131999999284744;0
2740;-744042.611999999731779;-1043335.940000001341105;0
6705;-742279.050999999046326;-1044655.923000000417233;0
6833;-741571.423000000417233;-1044909.473999999463558;0
1486;-741150.000000000000000;-1044219.000000000000000;0
1445;-741553.000000000000000;-1044757.000000000000000;0
1411;-741639.480000000447035;-1044683.019999999552965;0
6828;-741465.309999998658895;-1044768.940000001341105;0
7411;-743529.510000001639128;-1045393.140000000596046;0
385;-742436.000000000000000;-1043742.000000000000000;0
8079;-742021.839999999850988;-1045292.179999999701977;0
2070;-742993.000000000000000;-1044723.000000000000000;0
2097;-743143.000000000000000;-1044742.000000000000000;0
4156;-742513.734999999403954;-1043978.035000000149012;0
7263;-743009.559999998658895;-1044894.379999998956919;0
383;-742450.000000000000000;-1043722.000000000000000;0
4238;-742440.263000000268221;-1043528.236000001430511;0
7654;-742242.081000000238419;-1045273.263999998569489;0
7008;-742899.559999998658895;-1044224.074999999254942;0
2394;-742273.000000000000000;-1045360.000000000000000;0
2160;-742849.000000000000000;-1045147.000000000000000;0
2161;-742876.000000000000000;-1045153.000000000000000;0
8073;-742120.640000000596046;-1045259.500000000000000;0
4075;-742947.934999998658895;-1043903.649999998509884;0
7243;-742724.339999999850988;-1044835.870000001043081;0
7947;-742030.969999998807907;-1044096.679999999701977;0
524;-742255.000000000000000;-1043913.000000000000000;0
1780;-741214.000000000000000;-1043934.000000000000000;0
738;-741818.000000000000000;-1043024.000000000000000;0
1983;-743474.000000000000000;-1044709.000000000000000;0
1519;-741754.000000000000000;-1043956.000000000000000;0
748;-741671.000000000000000;-1042971.000000000000000;0
110;-744127.000000000000000;-1042724.000000000000000;0
7022;-743155.660000000149012;-1044074.410000000149012;0
1764;-741163.000000000000000;-1044144.000000000000000;0
735;-741910.000000000000000;-1043014.000000000000000;0
1287;-742217.000000000000000;-1044486.000000000000000;0
6339;-742245.460000000894070;-1042835.780000001192093;0
514;-742119.000000000000000;-1043141.000000000000000;0
510;-742048.000000000000000;-1043150.000000000000000;0
343;-742575.000000000000000;-1043857.000000000000000;0
2050;-743460.000000000000000;-1045072.000000000000000;0
2008;-743242.000000000000000;-1044759.000000000000000;0
2018;-743244.000000000000000;-1044909.000000000000000;0
4170;-742407.245000001043081;-1043945.519999999552965;0
6722;-742357.717000000178814;-1044705.708000000566244;0
2020;-743260.000000000000000;-1044941.000000000000000;0
1561;-743186.000000000000000;-1045098.000000000000000;0
1251;-742091.000000000000000;-1044690.000000000000000;0
7;-743479.000000000000000;-1042567.000000000000000;0
17;-743587.000000000000000;-1042394.000000000000000;0
5303;-743164.818999998271465;-1043211.078000001609325;0
1492;-741096.000000000000000;-1044331.000000000000000;0
4332;-742410.359000001102686;-1043282.916000001132488;0
3204;-743715.278999999165535;-1042506.118999999016523;0
6;-743464.000000000000000;-1042594.000000000000000;0
1769;-741260.000000000000000;-1044112.000000000000000;0
2133;-743040.000000000000000;-1045127.000000000000000;0
2151;-742827.000000000000000;-1045047.000000000000000;0
2166;-743016.000000000000000;-1045179.000000000000000;0
7324;-742833.980000000447035;-1044949.109999999403954;0
4162;-742497.193999998271465;-1044160.030000001192093;0
6746;-742405.083999998867512;-1044259.199999999254942;0
1766;-741257.000000000000000;-1044204.000000000000000;0
1515;-741913.000000000000000;-1044072.000000000000000;0
2447;-742772.000000000000000;-1044159.000000000000000;0
6700;-742298.611000001430511;-1044507.315999999642372;0
1371;-742089.000000000000000;-1044807.000000000000000;0
2235;-743401.000000000000000;-1045221.000000000000000;0
884;-741771.000000000000000;-1042776.000000000000000;0
1013;-742076.000000000000000;-1044595.000000000000000;0
2189;-743472.000000000000000;-1045183.000000000000000;0
727;-742001.000000000000000;-1042962.000000000000000;0
1091;-741531.480000000447035;-1044543.440000001341105;0
6311;-743930.489999998360872;-1042569.390000000596046;0
728;-741997.000000000000000;-1042918.000000000000000;0
1982;-743408.000000000000000;-1044646.000000000000000;0
696;-742077.000000000000000;-1042913.000000000000000;0
2212;-743217.000000000000000;-1045279.000000000000000;0
3326;-744036.002000000327826;-1042922.574999999254942;0
2226;-743057.000000000000000;-1045470.000000000000000;0
504;-741937.000000000000000;-1043164.000000000000000;0
2043;-743471.000000000000000;-1044959.000000000000000;0
1996;-743484.000000000000000;-1045063.000000000000000;0
7048;-743392.429999999701977;-1044236.170000001788139;0
1695;-741550.000000000000000;-1044656.000000000000000;0
1920;-743384.000000000000000;-1044363.000000000000000;0
3752;-743213.949999999254942;-1042902.719999998807907;0
7212;-742559.410000000149012;-1045073.070000000298023;0
5062;-742798.513999998569489;-1043227.370999999344349;0
2209;-743309.000000000000000;-1045217.000000000000000;0
1991;-743482.000000000000000;-1044929.000000000000000;0
1970;-743380.000000000000000;-1044854.000000000000000;0
1381;-742115.000000000000000;-1044999.000000000000000;0
1987;-743480.000000000000000;-1044820.000000000000000;0
3387;-743960.368000000715256;-1043194.717000000178814;0
2255;-743181.000000000000000;-1045372.000000000000000;0
7515;-742273.021999999880791;-1044371.543999999761581;0
2256;-743156.000000000000000;-1045353.000000000000000;0
3233;-744152.962999999523163;-1042686.791999999433756;0
7776;-743089.784000001847744;-1045773.409000001847744;0
4184;-742311.379999998956919;-1044164.660000000149012;0
6610;-741694.364999998360872;-1043961.170000001788139;0
1523;-741679.000000000000000;-1043865.000000000000000;0
4232;-742315.057999998331070;-1043428.918999999761581;0
1915;-743468.000000000000000;-1044494.000000000000000;0
1603;-742525.000000000000000;-1044922.000000000000000;0
1029;-741978.000000000000000;-1044721.000000000000000;0
5119;-742850.592999998480082;-1043328.484999999403954;0
1324;-741943.000000000000000;-1044994.000000000000000;0
1931;-743388.000000000000000;-1044409.000000000000000;0
1545;-742236.000000000000000;-1044234.000000000000000;0
5434;-744042.467999998480082;-1043135.986999999731779;0
7520;-742808.589999999850988;-1045680.519999999552965;0
1913;-743453.000000000000000;-1044482.000000000000000;0
5135;-742979.611000001430511;-1043468.912999998778105;0
7087;-743339.940000001341105;-1044536.690000001341105;0
7350;-742556.390000000596046;-1045185.980000000447035;0
2417;-742421.000000000000000;-1045135.000000000000000;0
5111;-742892.337999999523163;-1043424.370999999344349;0
1945;-743270.000000000000000;-1044454.000000000000000;0
1058;-741667.000000000000000;-1045072.000000000000000;0
6791;-741047.329999998211861;-1044765.467999998480082;0
1794;-742151.000000000000000;-1044190.000000000000000;0
5208;-743237.954999998211861;-1043368.065999999642372;0
1875;-743367.000000000000000;-1044261.000000000000000;0
3839;-743112.140000000596046;-1042558.280000001192093;0
2262;-742999.000000000000000;-1045686.000000000000000;0
2887;-744098.480000000447035;-1043192.508000001311302;0
531;-742157.000000000000000;-1043778.000000000000000;0
786;-741706.000000000000000;-1042606.000000000000000;0
1926;-743301.000000000000000;-1044321.000000000000000;0
1333;-741781.000000000000000;-1044777.000000000000000;0
5292;-743055.866000000387430;-1043215.710999999195337;0
6976;-743107.829999998211861;-1044483.399999998509884;0
7188;-742583.839999999850988;-1044742.870000001043081;0
599;-741837.000000000000000;-1043243.000000000000000;0
5272;-743000.013999998569489;-1043245.364000000059605;0
6488;-741718.210000000894070;-1044532.489999998360872;0
5035;-742658.587999999523163;-1043006.899000000208616;0
6820;-741224.105999998748302;-1044799.311999998986721;0
6975;-743116.140000000596046;-1044506.469999998807907;0
1423;-742167.000000000000000;-1044150.000000000000000;0
2344;-742691.000000000000000;-1045541.000000000000000;0
639;-741958.000000000000000;-1043294.000000000000000;0
3314;-743758.675999999046326;-1042905.688999999314547;0
8283;-742198.600000001490116;-1042801.980000000447035;0
4070;-742925.285000000149012;-1043783.565000001341105;0
1352;-741840.000000000000000;-1044854.000000000000000;0
2488;-742083.000000000000000;-1044303.000000000000000;0
4067;-742913.594999998807907;-1043714.640000000596046;0
496;-741768.000000000000000;-1043197.000000000000000;0
4342;-742506.473000001162291;-1043301.100000001490116;0
4562;-742471.000000000000000;-1042510.920000001788139;0
4574;-742339.980000000447035;-1042661.570000000298023;0
1610;-742374.000000000000000;-1044447.000000000000000;0
7651;-742295.381000000983477;-1045479.861999999731779;0
674;-742463.000000000000000;-1043211.000000000000000;0
4212;-742205.245000001043081;-1043548.410000000149012;0
1238;-742150.000000000000000;-1044384.000000000000000;0
4105;-742678.771999999880791;-1043769.206000000238419;0
1243;-742122.000000000000000;-1044502.000000000000000;0
1473;-741642.000000000000000;-1044158.000000000000000;0
1607;-742414.000000000000000;-1044379.000000000000000;0
1433;-741895.000000000000000;-1044328.000000000000000;0
1190;-741821.000000000000000;-1044110.000000000000000;0
5223;-743283.699999999254942;-1043535.940000001341105;0
2357;-742388.000000000000000;-1045577.000000000000000;0
206;-743179.000000000000000;-1043581.000000000000000;0
826;-742191.000000000000000;-1042616.000000000000000;0
3811;-743244.620000001043081;-1042809.420000001788139;0
1358;-741950.000000000000000;-1044887.000000000000000;0
2491;-742059.000000000000000;-1044251.000000000000000;0
709;-741861.000000000000000;-1042862.000000000000000;0
6514;-741730.449999999254942;-1044087.109999999403954;0
1418;-741620.000000000000000;-1044458.000000000000000;0
7217;-742516.318999998271465;-1044582.890000000596046;0
467;-741757.000000000000000;-1043352.000000000000000;0
463;-741703.000000000000000;-1043287.000000000000000;0
4650;-742749.989000000059605;-1042534.539999999105930;0
563;-742155.000000000000000;-1043660.000000000000000;0
1307;-741803.000000000000000;-1044663.000000000000000;0
1040;-741904.000000000000000;-1044623.000000000000000;0
1008;-741962.000000000000000;-1044568.000000000000000;0
7514;-742304.866000000387430;-1044375.124000001698732;0
6724;-742590.385000001639128;-1044428.910000000149012;0
4494;-741874.920000001788139;-1042616.660000000149012;0
1004;-741898.000000000000000;-1044565.000000000000000;0
1299;-741943.000000000000000;-1044719.000000000000000;0
6485;-741795.653999999165535;-1044513.458000000566244;0
4035;-743274.690000001341105;-1043779.739999998360872;0
7957;-741692.839999999850988;-1044277.559999998658895;0
1052;-741761.000000000000000;-1045002.000000000000000;0
1337;-741723.000000000000000;-1044886.000000000000000;0
7015;-742554.570000000298023;-1044360.725000001490116;0
1378;-742161.000000000000000;-1044904.000000000000000;0
910;-742219.000000000000000;-1042529.000000000000000;0
4099;-742773.870000001043081;-1043846.135999999940395;0
905;-742312.000000000000000;-1042489.000000000000000;0
1441;-741744.000000000000000;-1044392.000000000000000;0
1168;-741825.000000000000000;-1044403.000000000000000;0
7146;-742819.425000000745058;-1044426.225000001490116;0
7744;-742941.256999999284744;-1045533.171000000089407;0
1171;-741882.000000000000000;-1044375.000000000000000;0
4427;-742190.519999999552965;-1043099.440000001341105;0
1702;-741348.000000000000000;-1044682.000000000000000;0
620;-742253.000000000000000;-1043281.000000000000000;0
3273;-743642.442999999970198;-1042796.677999999374151;0
6943;-742902.013999998569489;-1043932.647999998182058;0
1824;-742963.809999998658895;-1044143.929999999701977;0
3760;-743233.829999998211861;-1042978.739999998360872;0
1629;-742450.000000000000000;-1044518.000000000000000;0
3975;-743112.984999999403954;-1043716.375999998301268;0
6825;-741380.010000001639128;-1044780.089999999850988;0
4116;-742740.429999999701977;-1044064.789999999105930;0
281;-743045.000000000000000;-1043848.000000000000000;0
7017;-742571.059999998658895;-1044267.640000000596046;0
1478;-741443.000000000000000;-1044220.000000000000000;0
3289;-743584.761999998241663;-1042769.188000001013279;0
2289;-742915.000000000000000;-1045426.000000000000000;0
2559;-741323.000000000000000;-1044399.000000000000000;0
4053;-743260.039999999105930;-1043823.480000000447035;0
2526;-741087.000000000000000;-1044616.000000000000000;0
7046;-743398.329999998211861;-1044186.289999999105930;0
4062;-742830.460000000894070;-1043654.920000001788139;0
1268;-742046.000000000000000;-1045021.000000000000000;0
4026;-743178.984999999403954;-1043847.989999998360872;0
7143;-742850.414999999105930;-1044473.449999999254942;0
3945;-743388.361000001430511;-1043434.486000001430511;0
4018;-743153.285000000149012;-1043925.850000001490116;0
226;-742879.000000000000000;-1043516.000000000000000;0
572;-742083.000000000000000;-1043561.000000000000000;0
1596;-742323.000000000000000;-1045037.000000000000000;0
2317;-742792.000000000000000;-1045467.000000000000000;0
3309;-743830.328000001609325;-1042834.535000000149012;0
1818;-743046.000000000000000;-1044380.000000000000000;0
6980;-743071.769999999552965;-1044387.548999998718500;0
684;-742358.000000000000000;-1043136.000000000000000;0
333;-742651.000000000000000;-1043996.000000000000000;0
4962;-742387.429999999701977;-1043028.129999998956919;0
7147;-742827.925000000745058;-1044451.385000001639128;0
3995;-743393.225000001490116;-1043973.719999998807907;0
625;-742247.000000000000000;-1043299.000000000000000;0
7156;-742944.515000000596046;-1044546.140000000596046;0
635;-742143.000000000000000;-1043317.000000000000000;0
8018;-741974.039999999105930;-1044442.870000001043081;0
8260;-742091.730000000447035;-1042690.769999999552965;0
2092;-742917.000000000000000;-1044617.000000000000000;0
1539;-741977.000000000000000;-1043997.000000000000000;0
301;-742613.000000000000000;-1043903.000000000000000;0
4223;-742161.556000001728535;-1043473.138999998569489;0
3361;-743933.616000000387430;-1042980.793000001460314;0
6659;-741515.070000000298023;-1044171.070000000298023;0
6458;-743360.644999999552965;-1043919.311999998986721;0
927;-742021.000000000000000;-1043498.000000000000000;0
583;-741975.000000000000000;-1043434.000000000000000;0
3351;-743954.622000001370907;-1043011.489999998360872;0
7979;-741161.500000000000000;-1044398.210000000894070;0
5042;-742731.719000000506639;-1042890.517000000923872;0
1623;-742524.000000000000000;-1044319.000000000000000;0
3834;-743079.190000001341105;-1042579.899999998509884;0
3092;-743909.377999998629093;-1042780.322999998927116;0
7278;-742803.899999998509884;-1044636.800000000745058;0
1839;-742994.469999998807907;-1044185.679999999701977;0
6361;-742016.024999998509884;-1042677.243999999016523;0
4878;-742876.434000000357628;-1042964.004000000655651;0
5163;-743163.861999999731779;-1043392.113000001758337;0
6143;-742309.690999999642372;-1043060.385000001639128;0
7965;-741515.510000001639128;-1044348.350000001490116;0
2327;-742491.000000000000000;-1045502.000000000000000;0
6753;-742485.511999998241663;-1044950.206999998539686;0
4006;-743302.763000000268221;-1044052.298999998718500;0
1837;-743015.000000000000000;-1044249.000000000000000;0
4848;-742977.940000001341105;-1042862.019999999552965;0
4063;-742855.079999998211861;-1043654.695000000298023;0
4674;-742806.475999999791384;-1042703.594999998807907;0
4511;-742539.859999999403954;-1042744.070000000298023;0
6217;-742320.725999999791384;-1043067.133999999612570;0
1112;-741189.050000000745058;-1044602.469999998807907;0
5666;-743418.543999999761581;-1043712.120000001043081;0
4785;-742943.613000001758337;-1042632.072999998927116;0
4822;-742945.579999998211861;-1042879.910000000149012;0
2453;-742941.000000000000000;-1044121.000000000000000;0
1138;-741500.000000000000000;-1044458.000000000000000;0
5993;-743947.829999998211861;-1042646.350000001490116;0
4800;-742990.043000001460314;-1042700.708000000566244;0
342;-742573.000000000000000;-1043878.000000000000000;0
6179;-742312.195000000298023;-1043059.041000001132488;0
1650;-741371.000000000000000;-1044490.000000000000000;0
2298;-742621.000000000000000;-1045406.000000000000000;0
5000;-742542.798000000417233;-1042978.486999999731779;0
5187;-743086.927000001072884;-1043435.230999998748302;0
3841;-743159.929999999701977;-1042641.120000001043081;0
4622;-742533.901000000536442;-1042569.660000000149012;0
6855;-741501.394999999552965;-1045027.784000001847744;0
5136;-742992.278000000864267;-1043472.440000001341105;0
5214;-743307.671999998390675;-1043376.414000000804663;0
4236;-742406.842999998480082;-1043504.015000000596046;0
3132;-743939.052000001072884;-1042650.916999999433756;0
4792;-743051.280000001192093;-1042654.962999999523163;0
783;-741695.000000000000000;-1042663.000000000000000;0
5323;-743049.401000000536442;-1043038.131000000983477;0
2501;-742746.000000000000000;-1045430.000000000000000;0
5506;-743427.348000001162291;-1043665.644999999552965;0
4931;-742449.300000000745058;-1042791.403000000864267;0
6714;-742287.171000000089407;-1044923.995999999344349;0
4910;-742367.789000000804663;-1042795.280999999493361;0
4739;-742751.690000001341105;-1042699.230000000447035;0
541;-742258.000000000000000;-1043678.000000000000000;0
6178;-742312.960000000894070;-1043060.445999998599291;0
5517;-743427.287000000476837;-1043618.956999998539686;0
1704;-741289.000000000000000;-1044690.000000000000000;0
7963;-741608.199999999254942;-1044329.510000001639128;0
3966;-743363.859999999403954;-1043530.829999998211861;0
6710;-742260.203000001609325;-1044803.609999999403954;0
6696;-742332.717000000178814;-1044815.649999998509884;0
4974;-742489.458999998867512;-1043047.024999998509884;0
7026;-743217.644999999552965;-1044082.329999998211861;0
6219;-742319.168999999761581;-1043064.293999999761581;0
2456;-741013.000000000000000;-1044501.000000000000000;0
954;-742231.000000000000000;-1043024.000000000000000;0
4947;-742399.918000001460314;-1042993.458000000566244;0
6095;-742082.920000001788139;-1043614.710000000894070;0
4711;-742803.300000000745058;-1042601.140000000596046;0
7033;-743303.864999998360872;-1044132.750000000000000;0
527;-742186.000000000000000;-1043818.000000000000000;0
7982;-741163.039999999105930;-1044413.210000000894070;0
1385;-742194.000000000000000;-1044974.000000000000000;0
5643;-743428.701999999582767;-1043689.872999999672174;0
2546;-741750.000000000000000;-1044271.000000000000000;0
3979;-743340.934999998658895;-1043779.414999999105930;0
4966;-742377.289999999105930;-1043071.030000001192093;0
212;-743080.000000000000000;-1043557.000000000000000;0
845;-742126.000000000000000;-1042505.000000000000000;0
882;-741825.000000000000000;-1042788.000000000000000;0
4681;-742756.870000001043081;-1042844.710000000894070;0
4588;-742421.668999999761581;-1042556.124000001698732;0
4898;-742571.280000001192093;-1042840.859999999403954;0
1598;-742351.000000000000000;-1045090.000000000000000;0
5246;-743373.739999998360872;-1043268.899999998509884;0
7224;-742399.359999999403954;-1044829.829999998211861;0
6651;-741697.910000000149012;-1044123.329999998211861;0
8149;-743305.579999998211861;-1043204.070000000298023;0
4510;-742483.149999998509884;-1042738.460000000894070;0
3798;-743131.500000000000000;-1042848.730000000447035;0
6267;-742344.767999999225140;-1043019.272999998182058;0
1531;-741782.000000000000000;-1043838.000000000000000;0
1103;-741306.000000000000000;-1044572.000000000000000;0
3800;-743098.550000000745058;-1042863.019999999552965;0
3414;-743757.269999999552965;-1043051.379999998956919;0
4712;-742830.309999998658895;-1042614.969999998807907;0
5238;-743360.410000000149012;-1043296.723999999463558;0
4827;-743046.359999999403954;-1042958.140000000596046;0
6251;-742377.396999999880791;-1043042.284000001847744;0
4556;-742354.629999998956919;-1042526.789999999105930;0
4056;-743125.315000001341105;-1043671.969999998807907;0
1110;-741220.730000000447035;-1044598.480000000447035;0
551;-742269.000000000000000;-1043755.000000000000000;0
4846;-742981.635999999940395;-1042805.254000000655651;0
6358;-741993.554999999701977;-1042717.964000001549721;0
2085;-742426.000000000000000;-1044797.000000000000000;0
3784;-743187.730000000447035;-1042922.429999999701977;0
4833;-743036.859999999403954;-1042820.050000000745058;0
6189;-742312.041999999433756;-1043057.302000001072884;0
4147;-742649.245000001043081;-1043870.320000000298023;0
3803;-743066.289999999105930;-1042896.320000000298023;0
2372;-742466.000000000000000;-1045488.000000000000000;0
4841;-742989.993999999016523;-1042765.850999999791384;0
7180;-742618.809000000357628;-1044646.109000001102686;0
1850;-742751.000000000000000;-1044237.000000000000000;0
1871;-743440.000000000000000;-1044260.000000000000000;0
5584;-743408.885000001639128;-1043643.532000001519918;0
5518;-743427.500999998301268;-1043621.975000001490116;0
5720;-743418.223000001162291;-1043629.960999999195337;0
543;-742361.000000000000000;-1043823.000000000000000;0
4130;-742868.460000000894070;-1044055.510000001639128;0
6258;-742382.381999999284744;-1043032.370999999344349;0
6222;-742316.855000000447035;-1043060.109999999403954;0
6224;-742315.320000000298023;-1043057.335000000894070;0
6244;-742368.587000001221895;-1043059.245999999344349;0
5692;-743415.782999999821186;-1043638.765000000596046;0
4145;-742687.109999999403954;-1043837.125000000000000;0
4957;-742366.010000001639128;-1043006.059999998658895;0
6174;-742316.021999999880791;-1043066.065000001341105;0
2061;-742681.000000000000000;-1044491.000000000000000;0
6191;-742318.017000000923872;-1043066.800999999046326;0
6262;-742370.024999998509884;-1043021.666000001132488;0
5322;-743060.379999998956919;-1043029.589999999850988;0
4769;-742881.932000000029802;-1042923.590999998152256;0
3960;-743418.563000001013279;-1043583.526000000536442;0
6764;-741137.519999999552965;-1044426.289999999105930;0
6356;-741962.699999999254942;-1042712.320000000298023;0
1587;-742372.000000000000000;-1044806.000000000000000;0
4520;-742651.079999998211861;-1042798.449999999254942;0
6223;-742316.076000001281500;-1043058.679000001400709;0
2321;-742679.000000000000000;-1045480.000000000000000;0
6278;-742305.421999998390675;-1043028.918000001460314;0
877;-741951.000000000000000;-1042610.000000000000000;0
4945;-742422.162999998778105;-1043009.861000001430511;0
6166;-742314.649999998509884;-1043065.006999999284744;0
396;-742388.000000000000000;-1043886.000000000000000;0
4627;-742601.138999998569489;-1042606.791000001132488;0
4114;-742764.195000000298023;-1044131.760000001639128;0
5596;-743415.271999999880791;-1043680.212999999523163;0
6203;-742316.357000000774860;-1043062.256000000983477;0
5690;-743415.532999999821186;-1043635.447000000625849;0
6220;-742318.432999998331070;-1043062.949999999254942;0
3411;-743769.885999999940395;-1043038.517000000923872;0
6246;-742370.552999999374151;-1043055.625999998301268;0
6004;-742061.723000001162291;-1043300.859999999403954;0
6771;-741345.015999998897314;-1044413.647999998182058;0
5665;-743419.725000001490116;-1043711.682000000029802;0
283;-743026.000000000000000;-1043788.000000000000000;0
5653;-743429.589999999850988;-1043701.940999999642372;0
6261;-742373.956999998539686;-1043022.041999999433756;0
3804;-743040.109999999403954;-1042895.410000000149012;0
2409;-742363.000000000000000;-1045093.000000000000000;0
3408;-743789.511999998241663;-1043022.425000000745058;0
4667;-742823.039999999105930;-1042631.620000001043081;0
5657;-743429.199999999254942;-1043706.837999999523163;0
2304;-742442.000000000000000;-1045429.000000000000000;0
6234;-742324.105000000447035;-1043076.613000001758337;0
6149;-742312.646000001579523;-1043064.261999998241663;0
6162;-742310.199999999254942;-1043058.306000001728535;0
1061;-741586.000000000000000;-1045133.000000000000000;0
5504;-743428.977000001817942;-1043686.274000000208616;0
249;-743433.000000000000000;-1043775.000000000000000;0
4526;-742696.690000001341105;-1042823.320000000298023;0
6215;-742314.692000001668930;-1043057.682000000029802;0
5711;-743422.837999999523163;-1043640.131000000983477;0
3815;-743161.949999999254942;-1042769.750000000000000;0
4625;-742594.258000001311302;-1042576.114000000059605;0
6196;-742314.190000001341105;-1043059.774999998509884;0
6243;-742367.739999998360872;-1043061.098000001162291;0
3287;-743711.173999998718500;-1042886.515999998897314;0
614;-742111.000000000000000;-1043271.000000000000000;0
5674;-743409.089999999850988;-1043715.618000000715256;0
7250;-742792.079999998211861;-1044844.600000001490116;0
7218;-742534.100000001490116;-1044603.559999998658895;0
6173;-742316.787000000476837;-1043067.471000000834465;0
952;-742274.000000000000000;-1043018.000000000000000;0
4922;-742443.129999998956919;-1042886.510000001639128;0
322;-742701.000000000000000;-1044153.000000000000000;0
4219;-742243.045000001788139;-1043600.660000000149012;0
6248;-742372.506000000983477;-1043051.769999999552965;0
2088;-742428.000000000000000;-1044838.000000000000000;0
5592;-743420.136999998241663;-1043679.831999998539686;0
6842;-741574.894000001251698;-1044962.013999998569489;0
837;-741990.000000000000000;-1042511.000000000000000;0
5723;-743420.903000000864267;-1043631.703999999910593;0
5651;-743429.440999999642372;-1043699.524999998509884;0
6201;-742317.888999998569489;-1043065.035000000149012;0
6503;-741647.706000000238419;-1044996.008999999612570;0
6202;-742317.124000001698732;-1043063.651999998837709;0
265;-743344.000000000000000;-1043735.000000000000000;0
6250;-742374.638999998569489;-1043047.576999999582767;0
5258;-743356.739999998360872;-1043230.039999999105930;0
7167;-742771.785999998450279;-1044535.168000001460314;0
5508;-743426.105999998748302;-1043645.960999999195337;0
4752;-742774.460000000894070;-1042743.280000001192093;0
1520;-741777.000000000000000;-1043939.000000000000000;0
6204;-742315.578999999910593;-1043060.826000001281500;0
819;-741987.000000000000000;-1042599.000000000000000;0
6147;-742314.177000001072884;-1043067.070999998599291;0
8272;-742042.399999998509884;-1042732.559999998658895;0
3805;-743035.760000001639128;-1042913.550000000745058;0
4761;-742810.285000000149012;-1042793.122000001370907;0
6172;-742317.552999999374151;-1043068.875999998301268;0
4672;-742811.831999998539686;-1042675.907999999821186;0
2302;-742507.000000000000000;-1045419.000000000000000;0
6277;-742304.633999999612570;-1043024.256000000983477;0
4518;-742623.960000000894070;-1042786.719999998807907;0
796;-741771.000000000000000;-1042592.000000000000000;0
5727;-743422.451999999582767;-1043637.473000001162291;0
6154;-742316.324000000953674;-1043069.546000000089407;0
262;-743408.000000000000000;-1043731.000000000000000;0
4243;-742194.050000000745058;-1043431.899999998509884;0
5580;-743409.831000000238419;-1043636.449000000953674;0
5738;-743410.412999998778105;-1043691.800000000745058;0
647;-742216.000000000000000;-1043375.000000000000000;0
4637;-742572.578000001609325;-1042742.510999999940395;0
7976;-741301.260000001639128;-1044401.750000000000000;0
4750;-742784.420000001788139;-1042733.429999999701977;0
7164;-742596.114999998360872;-1044447.173000000417233;0
