OID_;X;Y;TEMPERATURE
3614;-744984.548999998718500;-1042283.640999998897314;0
110;-744127.000000000000000;-1042724.000000000000000;0
3019;-744463.447999998927116;-1042784.646000001579523;0
3568;-744718.817999999970198;-1042588.614999998360872;0
3692;-744525.876499999314547;-1042540.534000001847744;0
3580;-744924.973999999463558;-1042593.699999999254942;0
2605;-745393.842999998480082;-1042860.796000000089407;0
5975;-745052.346999999135733;-1042674.673000000417233;0
8;-743496.000000000000000;-1042539.000000000000000;0
118;-745135.000000000000000;-1042687.000000000000000;0
7911;-743564.839999999850988;-1045408.649999998509884;0
3210;-743664.019000001251698;-1042478.668999999761581;0
2641;-743432.578999999910593;-1042583.418999999761581;0
3542;-744575.274000000208616;-1042656.160000000149012;0
1196;-741677.000000000000000;-1043894.000000000000000;0
2073;-743069.000000000000000;-1044754.000000000000000;0
7146;-742819.425000000745058;-1044426.225000001490116;0
2741;-744016.675000000745058;-1043336.642999999225140;0
2007;-743231.000000000000000;-1044741.000000000000000;0
2217;-743112.000000000000000;-1045360.000000000000000;0
2082;-742569.000000000000000;-1044642.000000000000000;0
1584;-742368.000000000000000;-1044717.000000000000000;0
1781;-741247.000000000000000;-1043923.000000000000000;0
8079;-742021.839999999850988;-1045292.179999999701977;0
2189;-743472.000000000000000;-1045183.000000000000000;0
2696;-743477.489999998360872;-1042038.000000000000000;0
1692;-741125.000000000000000;-1044816.000000000000000;0
528;-742187.000000000000000;-1043838.000000000000000;0
2262;-742999.000000000000000;-1045686.000000000000000;0
3919;-743904.947000000625849;-1043493.929999999701977;0
4237;-742425.385000001639128;-1043517.421000000089407;0
984;-741917.000000000000000;-1044411.000000000000000;0
281;-743045.000000000000000;-1043848.000000000000000;0
1696;-741529.000000000000000;-1044660.000000000000000;0
7263;-743009.559999998658895;-1044894.379999998956919;0
7515;-742273.021999999880791;-1044371.543999999761581;0
5087;-742847.622999999672174;-1043250.081000000238419;0
1945;-743270.000000000000000;-1044454.000000000000000;0
1725;-741536.000000000000000;-1045136.000000000000000;0
4331;-742391.967999998480082;-1043310.539000000804663;0
7164;-742596.114999998360872;-1044447.173000000417233;0
7325;-743032.969999998807907;-1045186.298999998718500;0
7778;-743070.728000000119209;-1045812.342000000178814;0
6977;-743098.949999999254942;-1044459.879999998956919;0
7387;-743066.739999998360872;-1045487.570000000298023;0
6119;-743582.679999999701977;-1042696.969999998807907;0
7143;-742850.414999999105930;-1044473.449999999254942;0
4078;-742842.960000000894070;-1043832.824999999254942;0
6726;-742476.517999999225140;-1044410.600000001490116;0
2285;-742897.000000000000000;-1045467.000000000000000;0
6656;-741590.160000000149012;-1044150.480000000447035;0
3766;-743053.532999999821186;-1042996.631000000983477;0
2346;-742654.000000000000000;-1045546.000000000000000;0
5118;-742835.168000001460314;-1043315.074000000953674;0
5265;-743188.572999998927116;-1043226.513999998569489;0
2520;-741847.000000000000000;-1045324.000000000000000;0
1586;-742372.000000000000000;-1044785.000000000000000;0
1295;-742082.000000000000000;-1044456.000000000000000;0
4085;-742812.431000001728535;-1043657.114000000059605;0
6867;-741638.539999999105930;-1045354.059999998658895;0
3921;-743909.208999998867512;-1043541.574000000953674;0
1007;-741976.000000000000000;-1044586.000000000000000;0
2061;-742681.000000000000000;-1044491.000000000000000;0
1914;-743464.000000000000000;-1044458.000000000000000;0
227;-742846.000000000000000;-1043520.000000000000000;0
4072;-742934.225000001490116;-1043833.899999998509884;0
3870;-742381.989999998360872;-1042417.679999999701977;0
6704;-742282.179999999701977;-1044623.793999999761581;0
2894;-743960.129000000655651;-1043216.409000001847744;0
2562;-741090.000000000000000;-1044404.000000000000000;0
1793;-742166.000000000000000;-1044246.000000000000000;0
1752;-742070.000000000000000;-1045197.000000000000000;0
3973;-743161.204999998211861;-1043723.574999999254942;0
5270;-742989.153999999165535;-1043210.684999998658895;0
561;-742172.000000000000000;-1043675.000000000000000;0
1535;-741873.000000000000000;-1043913.000000000000000;0
6118;-743652.447000000625849;-1042857.607999999076128;0
1197;-741657.000000000000000;-1043865.000000000000000;0
7655;-742266.583000000566244;-1045284.133999999612570;0
6509;-741724.809999998658895;-1044485.162000000476837;0
6499;-741707.811000000685453;-1044907.068999998271465;0
3144;-744012.590999998152256;-1042662.508000001311302;0
4500;-742315.239999998360872;-1042719.460000000894070;0
94;-744054.000000000000000;-1042934.000000000000000;0
4620;-742539.574000000953674;-1042537.307999998331070;0
1971;-743385.000000000000000;-1044881.000000000000000;0
507;-741953.000000000000000;-1043148.000000000000000;0
1248;-742109.000000000000000;-1044631.000000000000000;0
5110;-742876.271999999880791;-1043449.013000000268221;0
1098;-741435.000000000000000;-1044571.000000000000000;0
4156;-742513.734999999403954;-1043978.035000000149012;0
1701;-741378.000000000000000;-1044678.000000000000000;0
2386;-742139.000000000000000;-1045460.000000000000000;0
4178;-742382.640000000596046;-1044160.138000000268221;0
1759;-741128.000000000000000;-1044097.000000000000000;0
1286;-742221.460000000894070;-1044465.969999998807907;0
1308;-741589.000000000000000;-1044811.000000000000000;0
1259;-742064.000000000000000;-1044854.000000000000000;0
1608;-742391.000000000000000;-1044383.000000000000000;0
316;-742490.000000000000000;-1044202.000000000000000;0
4990;-742657.837999999523163;-1043024.199999999254942;0
1936;-743293.000000000000000;-1044272.000000000000000;0
7933;-743544.570000000298023;-1044950.370000001043081;0
2017;-743247.000000000000000;-1044884.000000000000000;0
1629;-742450.000000000000000;-1044518.000000000000000;0
7935;-743156.000000000000000;-1045071.149999998509884;0
2051;-743434.000000000000000;-1045074.000000000000000;0
4057;-743132.184999998658895;-1043648.719999998807907;0
2505;-742762.000000000000000;-1045562.000000000000000;0
1013;-742076.000000000000000;-1044595.000000000000000;0
3996;-743394.274999998509884;-1044004.254999998956919;0
2027;-743374.000000000000000;-1045032.000000000000000;0
2136;-742993.000000000000000;-1045103.000000000000000;0
6504;-741755.193999998271465;-1044619.083000000566244;0
1171;-741882.000000000000000;-1044375.000000000000000;0
1956;-743397.000000000000000;-1044501.000000000000000;0
7027;-743237.269999999552965;-1044095.524999998509884;0
4808;-743110.859999999403954;-1042784.829999998211861;0
5317;-743063.690000001341105;-1043053.769999999552965;0
3838;-743113.550000000745058;-1042543.399999998509884;0
7705;-742283.471999999135733;-1044316.339999999850988;0
2500;-742743.000000000000000;-1045401.000000000000000;0
3781;-743273.059999998658895;-1042814.050000000745058;0
4010;-743200.372999999672174;-1044041.177999999374151;0
582;-741994.000000000000000;-1043417.000000000000000;0
926;-741894.000000000000000;-1042999.000000000000000;0
4630;-742646.271999999880791;-1042652.089999999850988;0
2886;-744104.953999999910593;-1043172.171999998390675;0
2148;-742835.000000000000000;-1045008.000000000000000;0
5411;-742776.079999998211861;-1042905.300000000745058;0
5135;-742979.611000001430511;-1043468.912999998778105;0
7043;-743398.899999998509884;-1044106.629999998956919;0
386;-742457.000000000000000;-1043786.000000000000000;0
673;-742467.000000000000000;-1043230.000000000000000;0
1496;-741253.000000000000000;-1044321.000000000000000;0
4064;-742879.655000001192093;-1043647.420000001788139;0
941;-742098.000000000000000;-1043132.000000000000000;0
2237;-743368.000000000000000;-1045238.000000000000000;0
5747;-743413.175999999046326;-1043698.811000000685453;0
819;-741987.000000000000000;-1042599.000000000000000;0
3373;-743814.043000001460314;-1043018.168000001460314;0
2498;-741906.000000000000000;-1044040.000000000000000;0
351;-742509.000000000000000;-1043739.000000000000000;0
4249;-742151.910000000149012;-1043354.719999998807907;0
6221;-742317.633000001311302;-1043061.541000001132488;0
1874;-743379.000000000000000;-1044247.000000000000000;0
1437;-741840.000000000000000;-1044336.000000000000000;0
1555;-741196.000000000000000;-1044374.000000000000000;0
7961;-741602.260000001639128;-1044314.350000001490116;0
5758;-743420.897999998182058;-1043635.921999998390675;0
3756;-743319.230000000447035;-1042949.019999999552965;0
7968;-741473.980000000447035;-1044379.839999999850988;0
1325;-741894.000000000000000;-1044959.000000000000000;0
1963;-743410.000000000000000;-1044689.000000000000000;0
7157;-742964.840999998152256;-1044545.681000001728535;0
1930;-743415.000000000000000;-1044409.000000000000000;0
2487;-742101.000000000000000;-1044308.000000000000000;0
3292;-743576.905000001192093;-1042781.315000001341105;0
2360;-742331.000000000000000;-1045596.000000000000000;0
2245;-743239.000000000000000;-1045356.000000000000000;0
6982;-743055.109999999403954;-1044342.629999998956919;134
6700;-742298.611000001430511;-1044507.315999999642372;101
1419;-741603.000000000000000;-1044410.000000000000000;0
2156;-742796.000000000000000;-1045184.000000000000000;0
2226;-743057.000000000000000;-1045470.000000000000000;0
1356;-741916.000000000000000;-1044874.000000000000000;0
377;-742494.000000000000000;-1043658.000000000000000;0
2535;-742042.000000000000000;-1044071.000000000000000;0
4895;-742596.936999998986721;-1042829.168000001460314;0
1031;-741973.000000000000000;-1044784.000000000000000;0
4858;-742955.339999999850988;-1042963.960000000894070;0
8242;-742568.629999998956919;-1045197.829999998211861;0
5246;-743373.739999998360872;-1043268.899999998509884;0
6861;-741491.429999999701977;-1045010.300000000745058;0
7248;-742757.960000000894070;-1044826.929999999701977;0
1986;-743480.000000000000000;-1044794.000000000000000;0
1182;-741915.000000000000000;-1044252.000000000000000;0
7649;-742319.399999998509884;-1045429.557000000029802;0
4075;-742947.934999998658895;-1043903.649999998509884;0
545;-742337.000000000000000;-1043805.000000000000000;0
6220;-742318.432999998331070;-1043062.949999999254942;0
1090;-741581.000000000000000;-1044552.000000000000000;0
2576;-742487.000000000000000;-1045483.000000000000000;0
6204;-742315.578999999910593;-1043060.826000001281500;0
596;-741867.000000000000000;-1043259.000000000000000;0
1123;-741734.000000000000000;-1044442.000000000000000;0
2580;-742501.000000000000000;-1045602.000000000000000;0
6847;-741591.993999999016523;-1044992.927999999374151;0
1718;-741366.219999998807907;-1044870.989999998360872;0
1235;-742150.000000000000000;-1044330.000000000000000;0
4676;-742792.579999998211861;-1042771.519999999552965;0
4957;-742366.010000001639128;-1043006.059999998658895;0
1347;-741791.000000000000000;-1044816.000000000000000;0
7118;-743468.750000000000000;-1044677.690000001341105;0
1030;-741975.000000000000000;-1044753.000000000000000;0
1304;-741810.000000000000000;-1044684.000000000000000;0
401;-742324.000000000000000;-1043907.000000000000000;0
1969;-743376.000000000000000;-1044829.000000000000000;0
7519;-742850.620000001043081;-1045673.670000001788139;0
3791;-743144.839999999850988;-1042881.120000001043081;0
6397;-742033.839999999850988;-1042501.859999999403954;0
917;-742121.000000000000000;-1043008.000000000000000;0
7156;-742944.515000000596046;-1044546.140000000596046;0
4321;-742265.214999999850988;-1043235.418999999761581;0
5597;-743414.056000001728535;-1043680.309000000357628;0
532;-742114.000000000000000;-1043737.000000000000000;0
2496;-741953.000000000000000;-1044102.000000000000000;0
6770;-741306.423999998718500;-1044414.120999999344349;0
5409;-743745.201000001281500;-1042902.750000000000000;0
4702;-742669.300000000745058;-1042747.399999998509884;0
1867;-743474.000000000000000;-1044257.000000000000000;0
5583;-743410.274999998509884;-1043642.072000000625849;0
4141;-742804.644999999552965;-1044008.964999999850988;0
2493;-742011.000000000000000;-1044181.000000000000000;0
3182;-743923.576000001281500;-1042554.350000001490116;0
3094;-743906.500000000000000;-1042759.554999999701977;0
457;-741732.000000000000000;-1043333.000000000000000;0
4145;-742687.109999999403954;-1043837.125000000000000;0
1457;-741510.000000000000000;-1044411.000000000000000;0
7086;-743333.149999998509884;-1044527.250000000000000;0
8261;-742108.039999999105930;-1042693.769999999552965;0
720;-741671.000000000000000;-1042815.000000000000000;0
4201;-742269.000000000000000;-1043651.563000001013279;0
6224;-742315.320000000298023;-1043057.335000000894070;0
3812;-743231.179999999701977;-1042815.199999999254942;0
8267;-742240.420000001788139;-1042709.160000000149012;0
2103;-743182.000000000000000;-1044931.000000000000000;0
606;-741906.000000000000000;-1043273.000000000000000;0
3761;-743202.559999998658895;-1042981.710000000894070;0
4046;-743205.699999999254942;-1044009.719999998807907;0
6458;-743360.644999999552965;-1043919.311999998986721;0
5941;-742044.835000000894070;-1043561.903999999165535;0
6137;-742314.326999999582767;-1043068.837000001221895;0
701;-742023.000000000000000;-1042885.000000000000000;0
8283;-742198.600000001490116;-1042801.980000000447035;0
2544;-741753.000000000000000;-1044252.000000000000000;0
1693;-741613.000000000000000;-1044649.000000000000000;0
340;-742588.000000000000000;-1043906.000000000000000;0
2227;-743029.000000000000000;-1045506.000000000000000;0
4512;-742515.339999999850988;-1042750.230000000447035;0
6747;-742410.170000001788139;-1044287.228000000119209;0
3107;-743778.888000000268221;-1042682.131999999284744;0
746;-741714.000000000000000;-1043020.000000000000000;0
8151;-743319.030000001192093;-1043194.940000001341105;0
1593;-742192.000000000000000;-1044826.000000000000000;0
5958;-742962.513999998569489;-1043517.497999999672174;0
8270;-742019.480000000447035;-1042725.870000001043081;0
6687;-742383.274000000208616;-1044983.381999999284744;0
3846;-743149.390000000596046;-1042549.600000001490116;0
5459;-742368.519000001251698;-1043474.221999999135733;0
824;-742142.000000000000000;-1042596.000000000000000;0
4999;-742534.149999998509884;-1042966.892999999225140;0
5125;-742992.826000001281500;-1043402.497999999672174;0
5419;-742434.690000001341105;-1042846.280000001192093;0
4144;-742704.414999999105930;-1043822.484999999403954;0
7281;-742801.859999999403954;-1044705.300000000745058;0
7206;-742559.920000001788139;-1045003.190000001341105;0
4082;-742825.565000001341105;-1043737.364999998360872;0
4926;-742452.660000000149012;-1042896.190000001341105;0
1391;-742117.000000000000000;-1045084.000000000000000;0
6173;-742316.787000000476837;-1043067.471000000834465;0
5654;-743429.644000001251698;-1043703.151000000536442;0
1116;-741125.980000000447035;-1044610.410000000149012;0
7739;-742301.399000000208616;-1045040.431000001728535;0
4241;-742225.929999999701977;-1043394.530000001192093;0
5178;-743386.421000000089407;-1043452.486000001430511;0
6649;-741731.100000001490116;-1044094.850000001490116;0
6961;-743023.579999998211861;-1044221.129999998956919;0
2366;-742513.000000000000000;-1045512.000000000000000;0
1346;-741769.000000000000000;-1044817.000000000000000;0
6191;-742318.017000000923872;-1043066.800999999046326;0
2246;-743218.000000000000000;-1045379.000000000000000;0
503;-741879.000000000000000;-1043158.000000000000000;0
4892;-742663.079999998211861;-1042817.344999998807907;0
800;-741822.000000000000000;-1042588.000000000000000;0
1790;-742152.000000000000000;-1044138.000000000000000;0
6946;-742974.765000000596046;-1043929.388000000268221;0
3942;-743420.800000000745058;-1043492.339999999850988;0
6176;-742314.491000000387430;-1043063.256000000983477;0
2230;-742996.000000000000000;-1045551.000000000000000;0
3371;-743840.392999999225140;-1043010.835000000894070;0
4638;-742553.631999999284744;-1042542.028000000864267;0
1824;-742963.809999998658895;-1044143.929999999701977;0
7216;-742500.129999998956919;-1044564.390000000596046;0
2546;-741750.000000000000000;-1044271.000000000000000;0
4759;-742842.945999998599291;-1042806.664000000804663;0
6389;-742141.199999999254942;-1042497.030000001192093;0
1189;-741786.000000000000000;-1044043.000000000000000;0
7543;-742606.199999999254942;-1045375.109999999403954;0
4427;-742190.519999999552965;-1043099.440000001341105;0
6254;-742379.344000000506639;-1043038.363000001758337;0
7018;-742577.747000001370907;-1044239.712999999523163;0
3313;-743774.447000000625849;-1042903.081999998539686;0
2197;-743331.000000000000000;-1045189.000000000000000;0
4498;-741866.120000001043081;-1042718.471000000834465;0
1380;-742156.000000000000000;-1044947.000000000000000;0
1254;-742090.000000000000000;-1044750.000000000000000;0
7185;-742600.515000000596046;-1044717.333999998867512;0
3816;-743149.379999998956919;-1042748.489999998360872;0
4824;-742918.673000000417233;-1042871.875000000000000;0
6004;-742061.723000001162291;-1043300.859999999403954;0
1094;-741513.000000000000000;-1044561.000000000000000;0
1194;-741721.000000000000000;-1043955.000000000000000;0
3762;-743173.489999998360872;-1042984.559999998658895;0
1329;-742062.000000000000000;-1045046.000000000000000;0
4036;-743246.920000001788139;-1043771.574999999254942;0
7197;-742570.949000000953674;-1044895.548999998718500;0
6270;-742333.412999998778105;-1043018.204999998211861;0
7694;-742486.548999998718500;-1045129.752000000327826;0
6753;-742485.511999998241663;-1044950.206999998539686;0
1988;-743481.000000000000000;-1044849.000000000000000;0
5194;-743205.761999998241663;-1043310.581999998539686;0
1166;-741020.000000000000000;-1044520.000000000000000;0
1155;-741208.000000000000000;-1044484.000000000000000;0
306;-742809.000000000000000;-1044137.000000000000000;0
1059;-741637.000000000000000;-1045095.000000000000000;0
1056;-741707.000000000000000;-1045042.000000000000000;0
5727;-743422.451999999582767;-1043637.473000001162291;0
4531;-742746.070000000298023;-1042885.980000000447035;0
3842;-743141.300000000745058;-1042637.030000001192093;0
7744;-742941.256999999284744;-1045533.171000000089407;0
5232;-743347.087000001221895;-1043476.425000000745058;0
543;-742361.000000000000000;-1043823.000000000000000;0
541;-742258.000000000000000;-1043678.000000000000000;0
3097;-743920.339999999850988;-1042769.188999999314547;0
1448;-741537.000000000000000;-1044716.000000000000000;0
4225;-742115.607999999076128;-1043452.125000000000000;0
1488;-741088.000000000000000;-1044212.000000000000000;0
710;-741829.000000000000000;-1042878.000000000000000;0
7011;-742831.309999998658895;-1044257.245000001043081;0
4220;-742214.344999998807907;-1043580.359999999403954;0
5510;-743424.346000000834465;-1043626.458999998867512;0
684;-742358.000000000000000;-1043136.000000000000000;0
586;-741966.000000000000000;-1043374.000000000000000;0
275;-743361.000000000000000;-1043904.000000000000000;0
204;-743208.000000000000000;-1043588.000000000000000;0
6111;-742241.054000001400709;-1043365.475999999791384;0
1359;-742000.000000000000000;-1044897.000000000000000;0
7981;-741126.370000001043081;-1044401.239999998360872;0
4214;-742229.274999998509884;-1043511.745000001043081;0
3829;-742992.250000000000000;-1042635.140000000596046;0
4689;-742688.114999998360872;-1042568.859999999403954;0
3365;-743840.598999999463558;-1043023.565000001341105;0
6123;-743427.453000001609325;-1043603.083000000566244;0
7943;-742063.449999999254942;-1044055.260000001639128;0
4814;-743000.489999998360872;-1042803.920000001788139;0
5197;-743222.513000000268221;-1043313.989999998360872;0
7700;-742371.105999998748302;-1044818.445000000298023;0
6374;-741977.035000000149012;-1042674.153999999165535;0
4746;-742867.769999999552965;-1042768.570000000298023;0
529;-742162.000000000000000;-1043803.000000000000000;0
4751;-742791.629999998956919;-1042751.460000000894070;0
7163;-743099.541999999433756;-1044532.261999998241663;0
4227;-742108.530000001192093;-1043326.289999999105930;0
5966;-742483.469999998807907;-1043066.721999999135733;0
5416;-742963.127999998629093;-1042713.598000001162291;0
1946;-743281.000000000000000;-1044437.000000000000000;0
6307;-741835.620000001043081;-1042765.149999998509884;0
6708;-742268.296999998390675;-1044748.438000001013279;0
1594;-742304.000000000000000;-1044977.000000000000000;0
1371;-742089.000000000000000;-1044807.000000000000000;0
3964;-743352.359999999403954;-1043540.780000001192093;0
4019;-743157.434999998658895;-1043897.410000000149012;230
1570;-742291.000000000000000;-1044183.000000000000000;0
1338;-741629.000000000000000;-1045045.000000000000000;0
6092;-742001.309999998658895;-1043482.089999999850988;0
4951;-742335.579999998211861;-1042934.429999999701977;0
4722;-742878.030000001192093;-1042626.550000000745058;0
5173;-743291.175999999046326;-1043426.754999998956919;0
725;-741983.000000000000000;-1042939.000000000000000;0
7037;-743316.085000000894070;-1044222.170000001788139;0
6857;-741503.982999999076128;-1044930.340999998152256;0
5591;-743421.353999998420477;-1043679.738000001758337;0
4743;-742812.449999999254942;-1042729.609999999403954;0
2479;-741247.800000000745058;-1044609.379999998956919;0
1862;-743477.000000000000000;-1044188.000000000000000;0
2501;-742746.000000000000000;-1045430.000000000000000;0
4608;-742555.160999998450279;-1042637.633999999612570;0
7147;-742827.925000000745058;-1044451.385000001639128;0
4257;-742056.467000000178814;-1043503.657999999821186;0
1547;-742220.000000000000000;-1044181.000000000000000;0
6201;-742317.888999998569489;-1043065.035000000149012;0
6356;-741962.699999999254942;-1042712.320000000298023;0
8019;-741972.039999999105930;-1044557.089999999850988;0
3353;-743954.399999998509884;-1043021.017999999225140;0
1707;-741196.219999998807907;-1044702.390000000596046;0
513;-742083.000000000000000;-1043145.000000000000000;0
1253;-742084.000000000000000;-1044730.000000000000000;0
5718;-743420.888999998569489;-1043629.666999999433756;0
6265;-742353.164999999105930;-1043020.054999999701977;0
4749;-742884.420000001788139;-1042760.329999998211861;0
1461;-741473.000000000000000;-1044266.000000000000000;0
1765;-741159.000000000000000;-1044178.000000000000000;0
4153;-742555.934999998658895;-1044073.285000000149012;0
501;-741836.000000000000000;-1043163.000000000000000;0
1720;-741436.000000000000000;-1044862.000000000000000;0
672;-742484.000000000000000;-1043226.000000000000000;0
873;-741728.000000000000000;-1042672.000000000000000;0
3369;-743878.633000001311302;-1043011.739000000059605;0
4583;-742401.482999999076128;-1042625.886999998241663;0
1770;-741270.000000000000000;-1044086.000000000000000;0
2399;-742121.000000000000000;-1045372.000000000000000;0
6217;-742320.725999999791384;-1043067.133999999612570;0
378;-742514.000000000000000;-1043703.000000000000000;0
341;-742592.000000000000000;-1043889.000000000000000;0
1808;-743187.000000000000000;-1044539.000000000000000;0
4119;-742717.223999999463558;-1043999.837999999523163;0
2408;-742369.000000000000000;-1045125.000000000000000;0
5306;-743103.326999999582767;-1043193.129000000655651;0
519;-742239.000000000000000;-1043113.000000000000000;0
4459;-742274.829999998211861;-1042644.269999999552965;0
345;-742559.000000000000000;-1043826.000000000000000;0
4669;-742823.199999999254942;-1042658.309999998658895;0
4557;-742381.019999999552965;-1042528.550000000745058;0
4653;-742788.747999999672174;-1042524.557000000029802;0
6181;-742318.164999999105930;-1043068.541999999433756;0
5171;-743266.124000001698732;-1043419.293999999761581;0
6134;-742309.011999998241663;-1043060.703000001609325;0
6963;-743004.519999999552965;-1044166.870000001043081;0
4146;-742666.940000001341105;-1043854.829999998211861;0
6819;-741194.784000001847744;-1044802.818999998271465;0
5303;-743164.818999998271465;-1043211.078000001609325;0
4944;-742430.605999998748302;-1043013.879000000655651;0
5138;-743030.936000000685453;-1043483.587999999523163;0
5656;-743429.752999998629093;-1043705.570000000298023;0
611;-742037.000000000000000;-1043267.000000000000000;0
5175;-743313.734999999403954;-1043433.749000001698732;0
876;-741953.000000000000000;-1042636.000000000000000;0
6151;-742311.114999998360872;-1043061.451000001281500;0
6573;-741294.089999999850988;-1044091.679999999701977;0
4508;-742449.140000000596046;-1042725.980000000447035;0
4821;-742966.550000000745058;-1042877.969999998807907;0
621;-742285.000000000000000;-1043282.000000000000000;0
2269;-742933.000000000000000;-1045611.000000000000000;0
5405;-744043.826000001281500;-1042674.686000000685453;0
1297;-742120.000000000000000;-1044453.000000000000000;0
4952;-742318.899999998509884;-1042915.589999999850988;0
5713;-743423.890999998897314;-1043636.899999998509884;0
4981;-742536.340999998152256;-1043014.929999999701977;0
4710;-742796.730000000447035;-1042611.769999999552965;0
350;-742505.000000000000000;-1043757.000000000000000;0
4891;-742595.048999998718500;-1042857.274999998509884;0
4817;-742967.460000000894070;-1042782.559999998658895;0
4725;-742875.100000001490116;-1042678.230000000447035;0
5667;-743417.361999999731779;-1043712.557000000029802;0
872;-741698.000000000000000;-1042669.000000000000000;0
1559;-741190.000000000000000;-1044242.000000000000000;0
6365;-741979.230000000447035;-1042656.230000000447035;0
3850;-743037.969999998807907;-1042473.780000001192093;0
270;-743230.000000000000000;-1043721.000000000000000;0
1766;-741257.000000000000000;-1044204.000000000000000;0
6245;-742369.682000000029802;-1043057.377000000327826;0
3871;-742356.649999998509884;-1042420.543999999761581;0
4034;-743295.410000000149012;-1043786.070000000298023;0
4738;-742733.910000000149012;-1042704.890000000596046;0
5729;-743420.103000000119209;-1043638.901000000536442;0
2453;-742941.000000000000000;-1044121.000000000000000;0
5688;-743415.267000000923872;-1043631.945000000298023;0
3393;-743910.969999998807907;-1043143.960000000894070;0
883;-741802.000000000000000;-1042773.000000000000000;0
4980;-742521.857999999076128;-1043030.853000000119209;0
688;-742284.000000000000000;-1043125.000000000000000;0
3422;-743740.361000001430511;-1043095.657999999821186;0
5663;-743422.087999999523163;-1043710.807999998331070;0
318;-742434.000000000000000;-1044213.000000000000000;0
4727;-742869.390000000596046;-1042700.829999998211861;0
3759;-743267.609999999403954;-1042971.300000000745058;0
5517;-743427.287000000476837;-1043618.956999998539686;0
324;-742694.000000000000000;-1044132.000000000000000;0
2092;-742917.000000000000000;-1044617.000000000000000;0
1832;-743024.000000000000000;-1044100.000000000000000;0
4473;-741822.449999999254942;-1042676.699000000953674;0
4206;-742342.340999998152256;-1043547.063000001013279;0
3983;-743317.089999999850988;-1043883.160000000149012;0
6842;-741574.894000001251698;-1044962.013999998569489;0
5721;-743418.407999999821186;-1043631.800000000745058;0
7180;-742618.809000000357628;-1044646.109000001102686;0
5198;-743259.600999999791384;-1043302.061000000685453;0
6256;-742380.723000001162291;-1043035.640000000596046;0
1733;-741767.000000000000000;-1045399.000000000000000;0
4677;-742787.309999998658895;-1042797.899999998509884;0
1337;-741723.000000000000000;-1044886.000000000000000;0
4610;-742548.888000000268221;-1042601.879000000655651;0
2372;-742466.000000000000000;-1045488.000000000000000;0
6121;-742069.784000001847744;-1043299.828000001609325;0
6302;-741814.370000001043081;-1042743.910000000149012;0
4504;-742387.329999998211861;-1042714.820000000298023;0
4712;-742830.309999998658895;-1042614.969999998807907;0
575;-742053.000000000000000;-1043541.000000000000000;0
619;-742229.000000000000000;-1043277.000000000000000;0
1360;-741983.000000000000000;-1044900.000000000000000;0
4782;-742938.315999999642372;-1042714.212000001221895;0
2482;-741262.739999998360872;-1044725.530000001192093;0
4219;-742243.045000001788139;-1043600.660000000149012;0
330;-742659.000000000000000;-1044043.000000000000000;0
1778;-741032.000000000000000;-1044785.000000000000000;0
1322;-741906.000000000000000;-1044975.000000000000000;0
90;-744040.000000000000000;-1043095.000000000000000;0
4529;-742762.920000001788139;-1042885.809999998658895;0
622;-742271.000000000000000;-1043302.000000000000000;0
