OID_;X;Y;TEMPERATURE
3614;-744984.548999998718500;-1042283.640999998897314;0
110;-744127.000000000000000;-1042724.000000000000000;0
3019;-744463.447999998927116;-1042784.646000001579523;0
3568;-744718.817999999970198;-1042588.614999998360872;0
3692;-744525.876499999314547;-1042540.534000001847744;0
3580;-744924.973999999463558;-1042593.699999999254942;0
2605;-745393.842999998480082;-1042860.796000000089407;0
5975;-745052.346999999135733;-1042674.673000000417233;0
118;-745135.000000000000000;-1042687.000000000000000;0
3542;-744575.274000000208616;-1042656.160000000149012;0
2696;-743477.489999998360872;-1042038.000000000000000;0
2520;-741847.000000000000000;-1045324.000000000000000;0
696;-742077.000000000000000;-1042913.000000000000000;0
7259;-742935.280000001192093;-1044869.829999998211861;0
1524;-741710.000000000000000;-1043844.000000000000000;0
7;-743479.000000000000000;-1042567.000000000000000;0
2070;-742993.000000000000000;-1044723.000000000000000;0
1521;-741808.000000000000000;-1043917.000000000000000;0
3066;-744075.627000000327826;-1042883.837000001221895;0
3752;-743213.949999999254942;-1042902.719999998807907;0
709;-741861.000000000000000;-1042862.000000000000000;0
725;-741983.000000000000000;-1042939.000000000000000;0
3111;-743727.034000001847744;-1042625.182999998331070;0
1764;-741163.000000000000000;-1044144.000000000000000;0
2149;-742819.000000000000000;-1045024.000000000000000;0
6;-743464.000000000000000;-1042594.000000000000000;0
3216;-743615.890999998897314;-1042451.129999998956919;0
8077;-742038.989999998360872;-1045265.309999998658895;0
2154;-742805.000000000000000;-1045147.000000000000000;0
465;-741728.000000000000000;-1043309.000000000000000;0
1540;-742005.000000000000000;-1044009.000000000000000;0
4047;-743210.230000000447035;-1043992.289999999105930;0
744;-741666.000000000000000;-1042994.000000000000000;0
7010;-742857.964999999850988;-1044251.155000001192093;4
509;-741991.000000000000000;-1043143.000000000000000;0
7142;-742872.445000000298023;-1044472.239999998360872;0
1780;-741214.000000000000000;-1043934.000000000000000;0
884;-741771.000000000000000;-1042776.000000000000000;0
7147;-742827.925000000745058;-1044451.385000001639128;0
2103;-743182.000000000000000;-1044931.000000000000000;0
7278;-742803.899999998509884;-1044636.800000000745058;0
2091;-742920.000000000000000;-1044593.000000000000000;0
1272;-742237.000000000000000;-1044545.000000000000000;0
2135;-743006.000000000000000;-1045119.000000000000000;0
2212;-743217.000000000000000;-1045279.000000000000000;0
1797;-743098.000000000000000;-1044099.000000000000000;0
283;-743026.000000000000000;-1043788.000000000000000;0
4331;-742391.967999998480082;-1043310.539000000804663;0
1240;-742145.000000000000000;-1044418.000000000000000;0
6962;-743011.489999998360872;-1044196.070000000298023;0
6722;-742357.717000000178814;-1044705.708000000566244;0
1905;-743446.000000000000000;-1044312.000000000000000;0
2502;-742750.000000000000000;-1045457.000000000000000;0
7162;-743075.840999998152256;-1044541.596000000834465;0
7003;-743074.140000000596046;-1044350.280000001192093;0
6977;-743098.949999999254942;-1044459.879999998956919;0
7000;-743096.190000001341105;-1044426.870000001043081;0
1795;-742155.000000000000000;-1044231.000000000000000;0
395;-742369.000000000000000;-1043840.000000000000000;0
430;-742185.000000000000000;-1043888.000000000000000;0
7410;-743525.730000000447035;-1045377.420000001788139;0
1822;-742986.199999999254942;-1044211.969999998807907;0
6701;-742295.142000000923872;-1044533.372000001370907;0
651;-742490.000000000000000;-1043564.000000000000000;0
2185;-743216.000000000000000;-1045130.000000000000000;0
381;-742465.000000000000000;-1043700.000000000000000;0
8284;-742219.410000000149012;-1042809.500000000000000;0
2193;-743531.000000000000000;-1045204.000000000000000;0
6946;-742974.765000000596046;-1043929.388000000268221;0
987;-741814.000000000000000;-1044493.000000000000000;0
4219;-742243.045000001788139;-1043600.660000000149012;0
2325;-742559.000000000000000;-1045494.000000000000000;0
4060;-742896.530000001192093;-1043699.219999998807907;0
6659;-741515.070000000298023;-1044171.070000000298023;0
1402;-741699.000000000000000;-1044419.000000000000000;0
6556;-741290.410000000149012;-1044041.471000000834465;0
3848;-743094.383999999612570;-1042505.245000001043081;0
3182;-743923.576000001281500;-1042554.350000001490116;0
3974;-743140.660000000149012;-1043725.350000001490116;0
4130;-742868.460000000894070;-1044055.510000001639128;0
6826;-741405.300000000745058;-1044777.199999999254942;0
4098;-742789.157000001519918;-1043861.918999999761581;0
2486;-741289.250000000000000;-1044848.829999998211861;0
3092;-743909.377999998629093;-1042780.322999998927116;0
309;-742721.000000000000000;-1044157.000000000000000;0
2449;-742825.000000000000000;-1044147.000000000000000;0
1832;-743024.000000000000000;-1044100.000000000000000;0
3995;-743393.225000001490116;-1043973.719999998807907;0
6945;-742955.907000001519918;-1043932.182999998331070;0
2226;-743057.000000000000000;-1045470.000000000000000;0
739;-741789.000000000000000;-1043028.000000000000000;0
2237;-743368.000000000000000;-1045238.000000000000000;0
4071;-742929.394999999552965;-1043807.585000000894070;0
3211;-743651.409000001847744;-1042483.458999998867512;0
2321;-742679.000000000000000;-1045480.000000000000000;0
4208;-742372.416999999433756;-1043503.423000000417233;0
1421;-741587.000000000000000;-1044356.000000000000000;0
3782;-743285.429999999701977;-1042842.460000000894070;0
2055;-743425.000000000000000;-1045038.000000000000000;0
1218;-742120.000000000000000;-1044309.000000000000000;0
1515;-741913.000000000000000;-1044072.000000000000000;0
3314;-743758.675999999046326;-1042905.688999999314547;0
7946;-742007.769999999552965;-1044091.789999999105930;0
7207;-742570.620000001043081;-1045016.149999998509884;0
1509;-741741.000000000000000;-1044196.000000000000000;0
2491;-742059.000000000000000;-1044251.000000000000000;0
993;-741977.000000000000000;-1044436.000000000000000;95
1036;-741961.000000000000000;-1044922.000000000000000;0
1443;-741727.000000000000000;-1044386.000000000000000;0
7716;-743023.190999999642372;-1045843.241999998688698;0
1008;-741962.000000000000000;-1044568.000000000000000;0
1468;-741778.000000000000000;-1044082.000000000000000;0
738;-741818.000000000000000;-1043024.000000000000000;0
317;-742464.000000000000000;-1044207.000000000000000;0
6872;-741751.719999998807907;-1045296.679999999701977;0
7397;-743021.859999999403954;-1045682.989999998360872;0
5067;-742813.465999998152256;-1043267.335999999195337;0
2493;-742011.000000000000000;-1044181.000000000000000;0
1182;-741915.000000000000000;-1044252.000000000000000;0
1433;-741895.000000000000000;-1044328.000000000000000;0
1298;-741964.000000000000000;-1044736.000000000000000;0
2247;-743199.000000000000000;-1045400.000000000000000;0
1409;-741634.000000000000000;-1044170.000000000000000;0
4249;-742151.910000000149012;-1043354.719999998807907;0
973;-741908.000000000000000;-1044547.000000000000000;0
733;-741963.000000000000000;-1043018.000000000000000;0
3292;-743576.905000001192093;-1042781.315000001341105;0
6122;-742071.870000001043081;-1043283.660000000149012;0
1756;-742165.000000000000000;-1045209.000000000000000;0
2275;-742845.000000000000000;-1045719.000000000000000;0
4080;-742832.480000000447035;-1043782.030000001192093;0
7656;-742290.328000001609325;-1045294.499000001698732;0
1014;-742097.000000000000000;-1044586.000000000000000;0
4326;-742319.855000000447035;-1043419.918999999761581;0
2397;-742181.000000000000000;-1045368.000000000000000;0
7744;-742941.256999999284744;-1045533.171000000089407;0
6719;-742371.686999998986721;-1044952.227000001817942;0
3273;-743642.442999999970198;-1042796.677999999374151;0
4324;-742269.346000000834465;-1043165.410999998450279;0
1502;-741506.000000000000000;-1044283.000000000000000;0
7014;-742650.170000001788139;-1044305.010000001639128;0
8262;-742129.620000001043081;-1042698.079999998211861;0
2760;-743863.331000000238419;-1043483.304000001400709;0
2562;-741090.000000000000000;-1044404.000000000000000;0
596;-741867.000000000000000;-1043259.000000000000000;0
1697;-741495.000000000000000;-1044664.000000000000000;13
6491;-742157.708000000566244;-1044457.421999998390675;0
2516;-742500.000000000000000;-1044414.000000000000000;0
3750;-743221.379999998956919;-1042925.429999999701977;0
6727;-742522.868000000715256;-1044395.879999998956919;0
625;-742247.000000000000000;-1043299.000000000000000;0
7347;-742557.690000001341105;-1045177.440000001341105;0
4340;-742473.662000000476837;-1043349.048999998718500;0
2095;-743178.000000000000000;-1044734.000000000000000;0
4500;-742315.239999998360872;-1042719.460000000894070;0
1481;-741335.000000000000000;-1044231.000000000000000;0
2061;-742681.000000000000000;-1044491.000000000000000;0
4135;-742747.719999998807907;-1044085.660000000149012;0
7516;-742248.390000000596046;-1044368.907999999821186;0
1930;-743415.000000000000000;-1044409.000000000000000;0
1112;-741189.050000000745058;-1044602.469999998807907;0
1487;-741117.000000000000000;-1044216.000000000000000;0
5272;-743000.013999998569489;-1043245.364000000059605;0
2755;-744003.879000000655651;-1043471.734000001102686;0
8049;-742198.890000000596046;-1044891.600000001490116;0
7094;-743370.620000001043081;-1044578.289999999105930;0
2316;-742823.000000000000000;-1045463.000000000000000;0
2334;-742872.000000000000000;-1045519.000000000000000;0
2008;-743242.000000000000000;-1044759.000000000000000;0
6675;-742272.140000000596046;-1044167.469999998807907;0
3366;-743913.831000000238419;-1043002.796999998390675;0
4214;-742229.274999998509884;-1043511.745000001043081;0
1546;-742219.000000000000000;-1044147.000000000000000;0
6096;-742098.760000001639128;-1043615.589999999850988;0
1584;-742368.000000000000000;-1044717.000000000000000;0
2218;-743091.000000000000000;-1045372.000000000000000;0
2543;-741788.000000000000000;-1044237.000000000000000;0
6448;-744017.179999999701977;-1043123.899999998509884;0
1614;-742388.000000000000000;-1044432.000000000000000;0
2166;-743016.000000000000000;-1045179.000000000000000;0
2404;-742179.000000000000000;-1045467.000000000000000;0
7992;-741480.739999998360872;-1045117.620000001043081;0
7180;-742618.809000000357628;-1044646.109000001102686;0
7201;-742571.190000001341105;-1044939.320000000298023;0
647;-742216.000000000000000;-1043375.000000000000000;0
350;-742505.000000000000000;-1043757.000000000000000;0
8058;-742263.219999998807907;-1045051.489999998360872;0
5296;-743058.934999998658895;-1043177.035000000149012;0
7704;-742256.021000001579523;-1044313.592999998480082;0
754;-741676.000000000000000;-1042727.000000000000000;0
914;-741715.000000000000000;-1042583.000000000000000;0
1341;-741687.000000000000000;-1044742.000000000000000;0
1229;-742244.000000000000000;-1044253.000000000000000;0
503;-741879.000000000000000;-1043158.000000000000000;32
6806;-741090.381000000983477;-1044706.675999999046326;0
6401;-741992.449999999254942;-1042503.609999999403954;0
2274;-742870.000000000000000;-1045732.000000000000000;0
6415;-743180.657999999821186;-1043208.993999999016523;0
6352;-741906.920000001788139;-1042710.609999999403954;0
6841;-741583.443999998271465;-1044946.208000000566244;0
2130;-743095.000000000000000;-1045126.000000000000000;0
2741;-744016.675000000745058;-1043336.642999999225140;0
5420;-742442.920000001788139;-1042740.519999999552965;0
1607;-742414.000000000000000;-1044379.000000000000000;0
3944;-743390.002000000327826;-1043413.532999999821186;0
79;-744062.000000000000000;-1043257.000000000000000;0
2021;-743281.000000000000000;-1044948.000000000000000;0
6385;-742179.530000001192093;-1042495.359999999403954;0
7095;-743370.940000001341105;-1044597.230000000447035;0
4257;-742056.467000000178814;-1043503.657999999821186;0
7651;-742295.381000000983477;-1045479.861999999731779;0
6200;-742318.653999999165535;-1043066.462000001221895;0
2044;-743445.000000000000000;-1044960.000000000000000;0
1994;-743483.000000000000000;-1045010.000000000000000;0
512;-742063.000000000000000;-1043136.000000000000000;0
7217;-742516.318999998271465;-1044582.890000000596046;0
2418;-742410.000000000000000;-1045109.000000000000000;0
5451;-743276.109000001102686;-1043331.000999998301268;0
3365;-743840.598999999463558;-1043023.565000001341105;0
5513;-743426.734999999403954;-1043606.184000000357628;0
6721;-742321.052999999374151;-1044705.548000000417233;0
2440;-742596.000000000000000;-1044193.000000000000000;0
1317;-741748.000000000000000;-1044884.000000000000000;0
6191;-742318.017000000923872;-1043066.800999999046326;0
5068;-742837.162999998778105;-1043263.965999998152256;0
2480;-741251.739999998360872;-1044639.480000000447035;0
4518;-742623.960000000894070;-1042786.719999998807907;0
582;-741994.000000000000000;-1043417.000000000000000;0
6182;-742317.399000000208616;-1043067.136999998241663;0
892;-742946.000000000000000;-1042607.000000000000000;0
7975;-741349.339999999850988;-1044397.800000000745058;0
1413;-741631.000000000000000;-1044621.000000000000000;0
4426;-742197.589999999850988;-1043031.679999999701977;0
4025;-743202.881000000983477;-1043852.008000001311302;0
6279;-742306.210000000894070;-1043033.421999998390675;0
3919;-743904.947000000625849;-1043493.929999999701977;0
1653;-741384.000000000000000;-1044592.000000000000000;0
6364;-742003.519999999552965;-1042660.690000001341105;0
1971;-743385.000000000000000;-1044881.000000000000000;0
1984;-743476.000000000000000;-1044743.000000000000000;0
546;-742323.640000000596046;-1043781.429999999701977;0
5230;-743335.399999998509884;-1043517.670000001788139;0
6250;-742374.638999998569489;-1043047.576999999582767;0
1329;-742062.000000000000000;-1045046.000000000000000;0
4948;-742386.929999999701977;-1042992.239999998360872;0
1257;-742070.000000000000000;-1044815.000000000000000;0
4033;-743319.719999998807907;-1043793.300000000745058;0
4839;-742984.162000000476837;-1042715.425000000745058;0
3309;-743830.328000001609325;-1042834.535000000149012;0
4829;-743051.579999998211861;-1042916.609999999403954;0
4952;-742318.899999998509884;-1042915.589999999850988;0
522;-742261.000000000000000;-1043122.000000000000000;0
1057;-741686.000000000000000;-1045058.000000000000000;0
1368;-741998.000000000000000;-1044779.000000000000000;0
3769;-742978.969999998807907;-1042975.300000000745058;0
690;-742306.000000000000000;-1043081.000000000000000;0
2892;-744005.317000001668930;-1043204.537000000476837;0
4558;-742373.019999999552965;-1042506.949999999254942;0
4163;-742487.695000000298023;-1044138.535000000149012;0
3148;-744008.699000000953674;-1042624.668999999761581;0
5923;-742953.765000000596046;-1043015.067999999970198;0
1091;-741531.480000000447035;-1044543.440000001341105;0
1386;-742158.000000000000000;-1044976.000000000000000;0
4807;-743122.570000000298023;-1042767.850000001490116;0
6232;-742316.034000001847744;-1043057.000000000000000;0
6148;-742313.410999998450279;-1043065.666999999433756;0
1138;-741500.000000000000000;-1044458.000000000000000;0
676;-742442.000000000000000;-1043196.000000000000000;0
5225;-743277.453999999910593;-1043558.087999999523163;0
6854;-741522.427999999374151;-1045038.967999998480082;0
4962;-742387.429999999701977;-1043028.129999998956919;0
4824;-742918.673000000417233;-1042871.875000000000000;0
1355;-741899.000000000000000;-1044858.000000000000000;0
6273;-742321.806000001728535;-1043017.085000000894070;0
2033;-743500.000000000000000;-1044798.000000000000000;0
4481;-741766.089999999850988;-1042627.859999999403954;0
4981;-742536.340999998152256;-1043014.929999999701977;0
779;-741708.000000000000000;-1042533.000000000000000;0
3808;-742987.050000000745058;-1042925.350000001490116;0
2041;-743531.000000000000000;-1044957.000000000000000;0
3373;-743814.043000001460314;-1043018.168000001460314;0
1388;-742152.000000000000000;-1045026.000000000000000;0
7928;-743542.539999999105930;-1044784.769999999552965;0
7188;-742583.839999999850988;-1044742.870000001043081;0
4924;-742427.890999998897314;-1042890.581000000238419;0
4557;-742381.019999999552965;-1042528.550000000745058;0
1250;-742103.000000000000000;-1044672.000000000000000;0
7979;-741161.500000000000000;-1044398.210000000894070;0
4846;-742981.635999999940395;-1042805.254000000655651;0
4498;-741866.120000001043081;-1042718.471000000834465;0
3786;-743150.480000000447035;-1042925.960000000894070;0
333;-742651.000000000000000;-1043996.000000000000000;0
4792;-743051.280000001192093;-1042654.962999999523163;0
4058;-743138.765000000596046;-1043625.405000001192093;0
4966;-742377.289999999105930;-1043071.030000001192093;0
5511;-743426.401000000536442;-1043599.129999998956919;0
5258;-743356.739999998360872;-1043230.039999999105930;0
7641;-742335.304000001400709;-1045451.613000001758337;0
528;-742187.000000000000000;-1043838.000000000000000;0
4169;-742414.420000001788139;-1043962.329999998211861;0
1150;-741290.000000000000000;-1044485.000000000000000;0
6242;-742366.677999999374151;-1043062.949000000953674;0
680;-742402.109999999403954;-1043166.679999999701977;0
5146;-743064.554000001400709;-1043452.671999998390675;0
4669;-742823.199999999254942;-1042658.309999998658895;0
4597;-742620.600000001490116;-1042680.690000001341105;0
1686;-741143.910000000149012;-1044795.120000001043081;0
4888;-742649.925999999046326;-1042830.767000000923872;0
4726;-742863.519999999552965;-1042684.000000000000000;0
7034;-743299.725999999791384;-1044153.140000000596046;0
8046;-742169.109999999403954;-1044835.660000000149012;0
5196;-743199.263000000268221;-1043326.401000000536442;0
7243;-742724.339999999850988;-1044835.870000001043081;0
4660;-742801.596999999135733;-1042487.965999998152256;0
5370;-742580.300999999046326;-1042977.140999998897314;0
4715;-742877.199999999254942;-1042610.059999998658895;0
516;-742160.000000000000000;-1043135.000000000000000;0
3834;-743079.190000001341105;-1042579.899999998509884;0
1194;-741721.000000000000000;-1043955.000000000000000;0
1933;-743329.000000000000000;-1044407.000000000000000;0
5036;-742666.855999998748302;-1042990.710000000894070;0
7219;-742443.460000000894070;-1044813.000000000000000;0
8050;-742206.719999998807907;-1044915.530000001192093;0
4954;-742405.539999999105930;-1043024.640000000596046;0
5174;-743296.331000000238419;-1043439.800000000745058;0
538;-742113.000000000000000;-1043652.000000000000000;0
5684;-743397.274000000208616;-1043719.995999999344349;0
1458;-741506.000000000000000;-1044384.000000000000000;0
4692;-742681.477000001817942;-1042600.622000001370907;0
1347;-741791.000000000000000;-1044816.000000000000000;0
4613;-742506.557000000029802;-1042597.938000001013279;0
825;-742171.000000000000000;-1042598.000000000000000;0
7050;-743438.070999998599291;-1044185.932000000029802;0
5667;-743417.361999999731779;-1043712.557000000029802;0
4528;-742714.350000001490116;-1042840.010000001639128;0
6145;-742315.708000000566244;-1043069.881999999284744;0
2375;-742438.000000000000000;-1045570.000000000000000;0
4771;-742890.828000001609325;-1042889.975000001490116;0
3286;-743679.592999998480082;-1042870.787000000476837;0
5600;-743410.407000001519918;-1043680.594000000506639;0
5943;-742064.651000000536442;-1043693.136999998241663;0
1600;-742418.000000000000000;-1044944.000000000000000;0
1939;-743269.000000000000000;-1044355.000000000000000;0
591;-741912.000000000000000;-1043346.000000000000000;0
4089;-742812.844999998807907;-1043560.114999998360872;0
1012;-742060.000000000000000;-1044582.000000000000000;0
4200;-742219.350000001490116;-1043727.980999998748302;0
6002;-742018.502000000327826;-1043294.918999999761581;0
5729;-743420.103000000119209;-1043638.901000000536442;0
5322;-743060.379999998956919;-1043029.589999999850988;0
5509;-743425.144999999552965;-1043637.853000000119209;0
6170;-742311.548000000417233;-1043059.381000000983477;0
6134;-742309.011999998241663;-1043060.703000001609325;0
4773;-742888.429000001400709;-1042839.530000001192093;0
342;-742573.000000000000000;-1043878.000000000000000;0
6138;-742313.561999998986721;-1043067.399000000208616;0
6263;-742365.719000000506639;-1043021.282999999821186;0
1444;-741559.000000000000000;-1044786.000000000000000;0
3978;-743342.695000000298023;-1043756.835000000894070;0
1042;-741883.000000000000000;-1044682.000000000000000;0
6224;-742315.320000000298023;-1043057.335000000894070;0
1085;-741634.000000000000000;-1044530.000000000000000;0
2457;-741016.000000000000000;-1044542.000000000000000;0
5725;-743422.388000000268221;-1043634.186999998986721;0
4904;-742460.050000000745058;-1042796.739999998360872;0
4055;-743119.070000000298023;-1043694.109999999403954;0
955;-742230.000000000000000;-1043005.000000000000000;0
2559;-741323.000000000000000;-1044399.000000000000000;0
5779;-742907.197999998927116;-1043414.096999999135733;0
3180;-743900.668000001460314;-1042588.706000000238419;0
4635;-742575.561999998986721;-1042702.701000001281500;0
7032;-743301.464999999850988;-1044106.190000001341105;0
1928;-743474.000000000000000;-1044409.000000000000000;0
4584;-742417.721999999135733;-1042627.620999999344349;0
5446;-743190.850000001490116;-1043337.008999999612570;0
6845;-741527.188000001013279;-1044989.557000000029802;0
6276;-742310.815999999642372;-1043016.000999998301268;0
3379;-743806.728000000119209;-1042934.574999999254942;0
6255;-742379.991999998688698;-1043037.068999998271465;0
6723;-742592.894999999552965;-1044408.905000001192093;0
4589;-742408.243000000715256;-1042542.631999999284744;0
5588;-743425.002000000327826;-1043679.451999999582767;0
7044;-743400.635000001639128;-1044135.579999998211861;0
1046;-741838.000000000000000;-1044805.000000000000000;0
4813;-743013.550000000745058;-1042793.390000000596046;0
273;-743381.000000000000000;-1043820.000000000000000;0
1925;-743331.000000000000000;-1044321.000000000000000;0
4763;-742847.094000000506639;-1042842.671000000089407;0
4728;-742862.960000000894070;-1042727.210000000894070;0
3988;-743309.704999998211861;-1044008.570000000298023;0
5143;-743052.232000000774860;-1043454.120000001043081;0
5695;-743417.217999998480082;-1043638.749000001698732;0
5696;-743417.096000000834465;-1043637.135999999940395;0
5014;-742563.771999999880791;-1042993.241999998688698;0
6241;-742365.649999998509884;-1043065.059999998658895;0
610;-742011.000000000000000;-1043270.000000000000000;0
841;-742056.000000000000000;-1042508.000000000000000;0
6354;-741928.410000000149012;-1042711.350000001490116;0
265;-743344.000000000000000;-1043735.000000000000000;0
3963;-743372.780000001192093;-1043538.789999999105930;0
877;-741951.000000000000000;-1042610.000000000000000;0
3807;-743008.690000001341105;-1042928.690000001341105;0
4105;-742678.771999999880791;-1043769.206000000238419;0
5168;-743228.796000000089407;-1043420.092000000178814;0
3836;-743096.070000000298023;-1042561.879999998956919;0
7215;-742484.320000000298023;-1044546.620000001043081;0
4592;-742448.190999999642372;-1042642.517999999225140;0
6252;-742378.052000001072884;-1043040.958000000566244;0
4638;-742553.631999999284744;-1042542.028000000864267;0
6156;-742314.791999999433756;-1043066.736000001430511;0
4690;-742679.162999998778105;-1042583.138999998569489;0
5517;-743427.287000000476837;-1043618.956999998539686;0
261;-743429.000000000000000;-1043723.000000000000000;0
336;-742616.000000000000000;-1043959.000000000000000;0
4976;-742494.337000001221895;-1043009.743000000715256;0
5734;-743412.366999998688698;-1043688.041999999433756;0
5708;-743418.927999999374151;-1043640.519000001251698;0
4708;-742755.420000001788139;-1042611.309999998658895;0
389;-742408.000000000000000;-1043783.000000000000000;0
6284;-742309.677999999374151;-1043054.043999999761581;0
6504;-741755.193999998271465;-1044619.083000000566244;0
1949;-743248.000000000000000;-1044491.000000000000000;0
613;-742089.000000000000000;-1043271.000000000000000;0
1330;-741817.000000000000000;-1044709.000000000000000;0
547;-742316.910000000149012;-1043790.309999998658895;0
5245;-743368.859999999403954;-1043290.789999999105930;0
1127;-741700.000000000000000;-1044440.000000000000000;0
4859;-742966.710000000894070;-1042996.302999999374151;0
1053;-741768.000000000000000;-1045023.000000000000000;0
1875;-743367.000000000000000;-1044261.000000000000000;0
1591;-742378.000000000000000;-1044910.000000000000000;0
4825;-742908.839999999850988;-1042860.670000001788139;0
974;-741933.000000000000000;-1044544.000000000000000;0
5107;-742857.611999999731779;-1043458.278000000864267;0
4430;-742235.070000000298023;-1043092.839999999850988;0
215;-743021.000000000000000;-1043558.000000000000000;0
5958;-742962.513999998569489;-1043517.497999999672174;0
2049;-743499.000000000000000;-1045071.000000000000000;0
6186;-742314.337999999523163;-1043061.517000000923872;0
7184;-742592.399999998509884;-1044704.010000001639128;0
4779;-742917.822999998927116;-1042727.385000001639128;0
5147;-743077.127000000327826;-1043433.221999999135733;0
4778;-742918.024999998509884;-1042786.565000001341105;0
4524;-742683.789999999105930;-1042823.579999998211861;0
5648;-743429.164000000804663;-1043695.905999999493361;0
1703;-741320.000000000000000;-1044686.000000000000000;0
1164;-741055.000000000000000;-1044515.000000000000000;0
3964;-743352.359999999403954;-1043540.780000001192093;0
827;-742218.000000000000000;-1042626.000000000000000;0
2327;-742491.000000000000000;-1045502.000000000000000;0
392;-742418.000000000000000;-1043843.000000000000000;0
5242;-743357.030000001192093;-1043419.239999998360872;0
4671;-742824.179999999701977;-1042687.210000000894070;0
4701;-742687.780000001192093;-1042761.660000000149012;0
7181;-742612.239999998360872;-1044670.160000000149012;0
4054;-743269.304999999701977;-1043797.405000001192093;0
7118;-743468.750000000000000;-1044677.690000001341105;0
6188;-742312.807999998331070;-1043058.706999998539686;0
3849;-743061.690000001341105;-1042485.920000001788139;0
4772;-742879.881999999284744;-1042872.157000001519918;0
5675;-743407.907999999821186;-1043716.054999999701977;0
6131;-742311.329999998211861;-1043064.982999999076128;0
4174;-742738.230000000447035;-1043763.155000001192093;0
1485;-741184.000000000000000;-1044223.000000000000000;0
5203;-743386.346000000834465;-1043274.958000000566244;0
5416;-742963.127999998629093;-1042713.598000001162291;0
4619;-742460.010000001639128;-1042480.890000000596046;0
6648;-741750.510000001639128;-1044080.329999998211861;0
5418;-742434.890000000596046;-1042864.780000001192093;0
2308;-742345.000000000000000;-1045499.000000000000000;0
4847;-742981.100000001490116;-1042831.059999998658895;0
6568;-741292.100000001490116;-1044161.670000001788139;0
4087;-742811.609999999403954;-1043604.190000001341105;0
628;-742217.370000001043081;-1043308.559999998658895;0
3342;-743922.624000001698732;-1043077.261999998241663;0
2298;-742621.000000000000000;-1045406.000000000000000;0
1356;-741916.000000000000000;-1044874.000000000000000;0
4620;-742539.574000000953674;-1042537.307999998331070;0
4590;-742387.043000001460314;-1042535.971000000834465;0
6243;-742367.739999998360872;-1043061.098000001162291;0
921;-743338.000000000000000;-1043818.000000000000000;0
4743;-742812.449999999254942;-1042729.609999999403954;0
5767;-742424.269999999552965;-1042581.609000001102686;0
7040;-743356.140000000596046;-1044164.359999999403954;0
1319;-741788.000000000000000;-1044905.000000000000000;0
5112;-742942.920000001788139;-1043441.850000001490116;0
1919;-743381.000000000000000;-1044393.000000000000000;0
6308;-741823.129999998956919;-1042770.370000001043081;0
2362;-742301.000000000000000;-1045580.000000000000000;0
1302;-741842.000000000000000;-1044693.000000000000000;0
6192;-742317.252000000327826;-1043065.394999999552965;0
5590;-743422.570000000298023;-1043679.642000000923872;0
6169;-742312.320000000298023;-1043060.791999999433756;0
5246;-743373.739999998360872;-1043268.899999998509884;0
3235;-744146.118000000715256;-1042659.438999999314547;0
6256;-742380.723000001162291;-1043035.640000000596046;0
1389;-742281.250000000000000;-1044962.859999999403954;0
6239;-742363.504999998956919;-1043069.298000000417233;0
7700;-742371.105999998748302;-1044818.445000000298023;0
397;-742355.000000000000000;-1043861.000000000000000;0
