OID_;X;Y;TEMPERATURE
3614;-744984.548999998718500;-1042283.640999998897314;0
110;-744127.000000000000000;-1042724.000000000000000;3
3019;-744463.447999998927116;-1042784.646000001579523;0
3568;-744718.817999999970198;-1042588.614999998360872;0
3692;-744525.876499999314547;-1042540.534000001847744;0
3580;-744924.973999999463558;-1042593.699999999254942;0
2605;-745393.842999998480082;-1042860.796000000089407;0
5975;-745052.346999999135733;-1042674.673000000417233;0
118;-745135.000000000000000;-1042687.000000000000000;0
3542;-744575.274000000208616;-1042656.160000000149012;0
2696;-743477.489999998360872;-1042038.000000000000000;0
2520;-741847.000000000000000;-1045324.000000000000000;0
696;-742077.000000000000000;-1042913.000000000000000;0
7259;-742935.280000001192093;-1044869.829999998211861;0
1524;-741710.000000000000000;-1043844.000000000000000;0
2070;-742993.000000000000000;-1044723.000000000000000;0
3066;-744075.627000000327826;-1042883.837000001221895;0
725;-741983.000000000000000;-1042939.000000000000000;0
6;-743464.000000000000000;-1042594.000000000000000;0
3216;-743615.890999998897314;-1042451.129999998956919;0
2154;-742805.000000000000000;-1045147.000000000000000;0
509;-741991.000000000000000;-1043143.000000000000000;0
7410;-743525.730000000447035;-1045377.420000001788139;0
651;-742490.000000000000000;-1043564.000000000000000;0
2193;-743531.000000000000000;-1045204.000000000000000;0
6946;-742974.765000000596046;-1043929.388000000268221;0
4098;-742789.157000001519918;-1043861.918999999761581;0
2226;-743057.000000000000000;-1045470.000000000000000;0
3211;-743651.409000001847744;-1042483.458999998867512;0
7716;-743023.190999999642372;-1045843.241999998688698;0
6872;-741751.719999998807907;-1045296.679999999701977;0
7397;-743021.859999999403954;-1045682.989999998360872;0
1756;-742165.000000000000000;-1045209.000000000000000;0
2275;-742845.000000000000000;-1045719.000000000000000;0
4080;-742832.480000000447035;-1043782.030000001192093;0
7744;-742941.256999999284744;-1045533.171000000089407;0
2760;-743863.331000000238419;-1043483.304000001400709;0
7347;-742557.690000001341105;-1045177.440000001341105;0
2095;-743178.000000000000000;-1044734.000000000000000;0
2755;-744003.879000000655651;-1043471.734000001102686;0
2316;-742823.000000000000000;-1045463.000000000000000;0
2334;-742872.000000000000000;-1045519.000000000000000;0
1584;-742368.000000000000000;-1044717.000000000000000;0
2218;-743091.000000000000000;-1045372.000000000000000;0
2404;-742179.000000000000000;-1045467.000000000000000;0
350;-742505.000000000000000;-1043757.000000000000000;0
2274;-742870.000000000000000;-1045732.000000000000000;0
4025;-743202.881000000983477;-1043852.008000001311302;0
3919;-743904.947000000625849;-1043493.929999999701977;0
2049;-743499.000000000000000;-1045071.000000000000000;0
1382;-742096.000000000000000;-1045023.000000000000000;0
7189;-742588.486999999731779;-1044766.690999999642372;0
3760;-743233.829999998211861;-1042978.739999998360872;0
6746;-742405.083999998867512;-1044259.199999999254942;0
2060;-742659.000000000000000;-1044472.000000000000000;0
1036;-741961.000000000000000;-1044922.000000000000000;0
6823;-741313.910000000149012;-1044788.510000001639128;0
524;-742255.000000000000000;-1043913.000000000000000;0
7202;-742561.410000000149012;-1044949.640000000596046;0
7325;-743032.969999998807907;-1045186.298999998718500;0
3107;-743778.888000000268221;-1042682.131999999284744;0
2322;-742651.000000000000000;-1045483.000000000000000;0
7026;-743217.644999999552965;-1044082.329999998211861;0
334;-742631.000000000000000;-1043987.000000000000000;0
1518;-741994.000000000000000;-1044011.000000000000000;0
1824;-742963.809999998658895;-1044143.929999999701977;0
4142;-742777.425000000745058;-1044013.440000001341105;0
2487;-742101.000000000000000;-1044308.000000000000000;0
7024;-743182.745000001043081;-1044052.815000001341105;0
7742;-741703.945999998599291;-1045067.738000001758337;0
5271;-742995.381999999284744;-1043229.673000000417233;0
5961;-742431.225000001490116;-1044003.574999999254942;0
4332;-742410.359000001102686;-1043282.916000001132488;0
5241;-743365.063000001013279;-1043245.954999998211861;0
7516;-742248.390000000596046;-1044368.907999999821186;0
7003;-743074.140000000596046;-1044350.280000001192093;0
2326;-742523.000000000000000;-1045498.000000000000000;0
1852;-742739.000000000000000;-1044210.000000000000000;0
2255;-743181.000000000000000;-1045372.000000000000000;0
7538;-742701.420000001788139;-1045364.109999999403954;0
1655;-741391.000000000000000;-1044651.000000000000000;0
1311;-741646.000000000000000;-1044831.000000000000000;0
2740;-744042.611999999731779;-1043335.940000001341105;0
2641;-743432.578999999910593;-1042583.418999999761581;0
1243;-742122.000000000000000;-1044502.000000000000000;0
4151;-742573.039999999105930;-1044109.035000000149012;0
1448;-741537.000000000000000;-1044716.000000000000000;0
4067;-742913.594999998807907;-1043714.640000000596046;0
3268;-743594.046999998390675;-1042721.412999998778105;0
7140;-742921.300000000745058;-1044469.335000000894070;0
6845;-741527.188000001013279;-1044989.557000000029802;0
1007;-741976.000000000000000;-1044586.000000000000000;0
6647;-741767.690000001341105;-1044068.160000000149012;0
5408;-743696.881000000983477;-1042878.024999998509884;0
1042;-741883.000000000000000;-1044682.000000000000000;0
2244;-743264.000000000000000;-1045331.000000000000000;0
2241;-743319.000000000000000;-1045289.000000000000000;0
7000;-743096.190000001341105;-1044426.870000001043081;0
1291;-742205.000000000000000;-1044568.000000000000000;0
2234;-743425.000000000000000;-1045221.000000000000000;0
5434;-744042.467999998480082;-1043135.986999999731779;0
6705;-742279.050999999046326;-1044655.923000000417233;0
7016;-742557.515000000596046;-1044334.074999999254942;0
1250;-742103.000000000000000;-1044672.000000000000000;0
3269;-743600.679000001400709;-1042731.660000000149012;0
5309;-743033.405000001192093;-1043187.043999999761581;0
1171;-741882.000000000000000;-1044375.000000000000000;0
1050;-741785.000000000000000;-1044952.000000000000000;0
3994;-743394.864000000059605;-1043949.813999999314547;0
4131;-742844.625000000000000;-1044059.980000000447035;0
747;-741690.000000000000000;-1043000.000000000000000;0
1368;-741998.000000000000000;-1044779.000000000000000;0
2337;-742783.000000000000000;-1045544.000000000000000;0
1720;-741436.000000000000000;-1044862.000000000000000;0
316;-742490.000000000000000;-1044202.000000000000000;0
3838;-743113.550000000745058;-1042543.399999998509884;0
732;-741860.000000000000000;-1043003.000000000000000;0
513;-742083.000000000000000;-1043145.000000000000000;0
6726;-742476.517999999225140;-1044410.600000001490116;0
1430;-741993.000000000000000;-1044260.000000000000000;0
7043;-743398.899999998509884;-1044106.629999998956919;0
1025;-741989.000000000000000;-1044602.000000000000000;0
7217;-742516.318999998271465;-1044582.890000000596046;0
735;-741910.000000000000000;-1043014.000000000000000;0
7986;-741040.829999998211861;-1044408.250000000000000;0
2083;-742588.000000000000000;-1044663.000000000000000;0
7995;-741545.920000001788139;-1045160.100000001490116;0
6848;-741619.096999999135733;-1045007.451999999582767;0
6841;-741583.443999998271465;-1044946.208000000566244;0
4075;-742947.934999998658895;-1043903.649999998509884;0
8043;-742180.050000000745058;-1044750.160000000149012;0
3846;-743149.390000000596046;-1042549.600000001490116;0
1488;-741088.000000000000000;-1044212.000000000000000;0
4214;-742229.274999998509884;-1043511.745000001043081;0
2309;-742322.000000000000000;-1045519.000000000000000;0
7721;-742941.157000001519918;-1044215.368000000715256;0
3810;-743261.510000001639128;-1042802.960000000894070;0
8281;-742164.160000000149012;-1042778.140000000596046;0
7147;-742827.925000000745058;-1044451.385000001639128;0
284;-743022.000000000000000;-1043758.000000000000000;0
4204;-742312.750999998301268;-1043589.962999999523163;0
1615;-742367.000000000000000;-1044434.000000000000000;0
4051;-743236.329999998211861;-1043889.710000000894070;0
1629;-742450.000000000000000;-1044518.000000000000000;0
2304;-742442.000000000000000;-1045429.000000000000000;0
1474;-741604.000000000000000;-1044172.000000000000000;0
7143;-742850.414999999105930;-1044473.449999999254942;0
4058;-743138.765000000596046;-1043625.405000001192093;0
1912;-743461.000000000000000;-1044430.000000000000000;0
6699;-742301.118999999016523;-1044484.282999999821186;0
2375;-742438.000000000000000;-1045570.000000000000000;0
1462;-741464.000000000000000;-1044225.000000000000000;0
1189;-741786.000000000000000;-1044043.000000000000000;0
1535;-741873.000000000000000;-1043913.000000000000000;0
3982;-743325.135000001639128;-1043857.684999998658895;0
4427;-742190.519999999552965;-1043099.440000001341105;0
1705;-741257.219999998807907;-1044695.690000001341105;0
7679;-742498.250000000000000;-1045115.879999998956919;0
6694;-742280.806000001728535;-1044814.875999998301268;0
6096;-742098.760000001639128;-1043615.589999999850988;0
1377;-742146.969999998807907;-1044922.489999998360872;0
1038;-741956.000000000000000;-1044977.000000000000000;0
557;-742213.000000000000000;-1043713.000000000000000;0
4087;-742811.609999999403954;-1043604.190000001341105;0
7704;-742256.021000001579523;-1044313.592999998480082;0
4002;-743397.818999998271465;-1044054.317999999970198;0
1607;-742414.000000000000000;-1044379.000000000000000;0
1101;-741339.000000000000000;-1044568.000000000000000;0
542;-742367.629999998956919;-1043814.379999998956919;0
1496;-741253.000000000000000;-1044321.000000000000000;0
6715;-742291.912999998778105;-1044948.105999998748302;0
1387;-742155.000000000000000;-1044999.000000000000000;0
2401;-742253.000000000000000;-1045390.000000000000000;0
884;-741771.000000000000000;-1042776.000000000000000;98
3416;-743754.546000000089407;-1043086.953000001609325;0
2084;-742447.000000000000000;-1044797.000000000000000;0
1170;-741893.000000000000000;-1044403.000000000000000;0
598;-741853.000000000000000;-1043233.000000000000000;0
1590;-742377.000000000000000;-1044885.000000000000000;0
529;-742162.000000000000000;-1043803.000000000000000;0
1373;-742143.000000000000000;-1044822.000000000000000;0
4652;-742775.500000000000000;-1042533.997999999672174;0
1482;-741289.000000000000000;-1044232.000000000000000;0
707;-741897.000000000000000;-1042863.000000000000000;0
4225;-742115.607999999076128;-1043452.125000000000000;0
2511;-743050.000000000000000;-1044050.000000000000000;0
4558;-742373.019999999552965;-1042506.949999999254942;0
1197;-741657.000000000000000;-1043865.000000000000000;0
7048;-743392.429999999701977;-1044236.170000001788139;0
3973;-743161.204999998211861;-1043723.574999999254942;0
2499;-741884.000000000000000;-1044011.000000000000000;0
1924;-743359.000000000000000;-1044320.000000000000000;0
3092;-743909.377999998629093;-1042780.322999998927116;0
1346;-741769.000000000000000;-1044817.000000000000000;0
819;-741987.000000000000000;-1042599.000000000000000;0
1821;-742995.000000000000000;-1044239.000000000000000;0
7658;-742333.647999998182058;-1045313.331999998539686;0
1251;-742091.000000000000000;-1044690.000000000000000;0
568;-742116.000000000000000;-1043604.000000000000000;0
1596;-742323.000000000000000;-1045037.000000000000000;0
1330;-741817.000000000000000;-1044709.000000000000000;0
7354;-743365.449000000953674;-1045150.535999998450279;0
1048;-741805.000000000000000;-1044896.000000000000000;0
1942;-743283.000000000000000;-1044370.000000000000000;0
4976;-742494.337000001221895;-1043009.743000000715256;0
408;-742317.000000000000000;-1044182.000000000000000;0
2446;-742750.000000000000000;-1044164.000000000000000;0
1423;-742167.000000000000000;-1044150.000000000000000;0
4335;-742398.230000000447035;-1043445.760000001639128;0
1792;-742165.000000000000000;-1044209.000000000000000;0
4033;-743319.719999998807907;-1043793.300000000745058;0
7728;-743360.581999998539686;-1044610.631000000983477;0
4063;-742855.079999998211861;-1043654.695000000298023;0
2134;-743028.000000000000000;-1045111.000000000000000;0
2398;-742150.000000000000000;-1045370.000000000000000;0
5221;-743263.820000000298023;-1043556.920000001788139;0
5064;-742811.537999998778105;-1043238.886999998241663;0
4792;-743051.280000001192093;-1042654.962999999523163;0
5267;-743190.021999999880791;-1043149.807000000029802;0
1954;-743372.000000000000000;-1044497.000000000000000;0
8076;-742050.429999999701977;-1045256.199999999254942;0
1508;-741705.000000000000000;-1044210.000000000000000;0
1989;-743481.000000000000000;-1044876.000000000000000;0
2891;-744029.914000000804663;-1043200.478000000119209;0
1953;-743344.000000000000000;-1044500.000000000000000;0
2055;-743425.000000000000000;-1045038.000000000000000;0
2024;-743305.000000000000000;-1045000.000000000000000;0
4660;-742801.596999999135733;-1042487.965999998152256;0
164;-743392.000000000000000;-1043230.000000000000000;0
1506;-741642.000000000000000;-1044236.000000000000000;0
590;-741935.000000000000000;-1043331.000000000000000;0
1598;-742351.000000000000000;-1045090.000000000000000;0
682;-742380.000000000000000;-1043151.000000000000000;0
5003;-742589.811999998986721;-1042974.888999998569489;0
6976;-743107.829999998211861;-1044483.399999998509884;0
2040;-743285.000000000000000;-1044809.000000000000000;0
3766;-743053.532999999821186;-1042996.631000000983477;0
3305;-743801.410000000149012;-1042874.962999999523163;0
7244;-742713.559999998658895;-1044823.719999998807907;0
5578;-743409.534000001847744;-1043632.701000001281500;0
2466;-743460.000000000000000;-1044740.000000000000000;0
7286;-742814.550000000745058;-1044746.960000000894070;0
3752;-743213.949999999254942;-1042902.719999998807907;0
6975;-743116.140000000596046;-1044506.469999998807907;0
4630;-742646.271999999880791;-1042652.089999999850988;0
2545;-741723.000000000000000;-1044265.000000000000000;0
5720;-743418.223000001162291;-1043629.960999999195337;0
2104;-743176.000000000000000;-1044964.000000000000000;0
1239;-742138.000000000000000;-1044401.000000000000000;0
3333;-743967.447999998927116;-1042967.616000000387430;0
5779;-742907.197999998927116;-1043414.096999999135733;0
4756;-742712.579999998211861;-1042776.829999998211861;0
221;-742951.000000000000000;-1043544.000000000000000;0
639;-741958.000000000000000;-1043294.000000000000000;0
672;-742484.000000000000000;-1043226.000000000000000;0
1949;-743248.000000000000000;-1044491.000000000000000;0
630;-742179.000000000000000;-1043289.000000000000000;0
1890;-743522.000000000000000;-1044402.000000000000000;0
5699;-743416.657000001519918;-1043631.932999998331070;0
4938;-742469.324999999254942;-1042658.263000000268221;0
2151;-742827.000000000000000;-1045047.000000000000000;0
691;-742293.000000000000000;-1043097.000000000000000;0
4931;-742449.300000000745058;-1042791.403000000864267;0
3100;-743941.234000001102686;-1042742.857999999076128;0
6269;-742337.300000000745058;-1043018.486000001430511;0
6175;-742315.256999999284744;-1043064.660999998450279;0
4671;-742824.179999999701977;-1042687.210000000894070;0
4227;-742108.530000001192093;-1043326.289999999105930;0
5325;-742997.480000000447035;-1043042.289999999105930;0
8284;-742219.410000000149012;-1042809.500000000000000;0
5107;-742857.611999999731779;-1043458.278000000864267;0
4749;-742884.420000001788139;-1042760.329999998211861;0
6004;-742061.723000001162291;-1043300.859999999403954;0
1969;-743376.000000000000000;-1044829.000000000000000;0
4804;-743020.045000001788139;-1042704.315999999642372;0
2170;-742897.000000000000000;-1045133.000000000000000;0
1149;-741311.000000000000000;-1044471.000000000000000;0
6188;-742312.807999998331070;-1043058.706999998539686;0
4573;-742341.550000000745058;-1042629.699999999254942;0
5136;-742992.278000000864267;-1043472.440000001341105;0
5993;-743947.829999998211861;-1042646.350000001490116;0
5722;-743419.659000001847744;-1043631.798000000417233;0
4785;-742943.613000001758337;-1042632.072999998927116;0
6449;-743140.379999998956919;-1043395.559999998658895;0
2565;-741043.000000000000000;-1044424.000000000000000;0
6272;-742325.379000000655651;-1043017.383000001311302;0
6354;-741928.410000000149012;-1042711.350000001490116;0
7047;-743395.495000001043081;-1044210.765000000596046;0
6227;-742319.839999999850988;-1043063.936000000685453;0
1458;-741506.000000000000000;-1044384.000000000000000;0
3183;-743909.289999999105930;-1042546.210000000894070;0
913;-741742.000000000000000;-1042579.000000000000000;0
1991;-743482.000000000000000;-1044929.000000000000000;0
622;-742271.000000000000000;-1043302.000000000000000;0
4465;-742180.250000000000000;-1042584.370000001043081;0
5421;-742337.905999999493361;-1042777.837999999523163;0
8079;-742021.839999999850988;-1045292.179999999701977;0
4743;-742812.449999999254942;-1042729.609999999403954;0
6092;-742001.309999998658895;-1043482.089999999850988;0
1767;-741261.000000000000000;-1044168.000000000000000;0
5002;-742561.190000001341105;-1042977.401999998837709;0
1663;-741455.000000000000000;-1044433.000000000000000;0
5138;-743030.936000000685453;-1043483.587999999523163;0
8272;-742042.399999998509884;-1042732.559999998658895;0
6229;-742318.326000001281500;-1043061.204999998211861;0
4531;-742746.070000000298023;-1042885.980000000447035;0
3952;-743407.521999999880791;-1043538.500999998301268;0
4144;-742704.414999999105930;-1043822.484999999403954;0
4890;-742605.287000000476837;-1042838.535000000149012;0
301;-742613.000000000000000;-1043903.000000000000000;0
4828;-743048.579999998211861;-1042941.179999999701977;0
1694;-741582.000000000000000;-1044653.000000000000000;0
5244;-743361.021000001579523;-1043374.999000001698732;0
4640;-742588.572999998927116;-1042544.848999999463558;0
7278;-742803.899999998509884;-1044636.800000000745058;0
4675;-742805.809999998658895;-1042785.070000000298023;0
1295;-742082.000000000000000;-1044456.000000000000000;0
1692;-741125.000000000000000;-1044816.000000000000000;0
4815;-742992.210000000894070;-1042788.359999999403954;0
2469;-742941.000000000000000;-1045215.000000000000000;0
4309;-742042.329999998211861;-1043492.329999998211861;0
3795;-743173.190000001341105;-1042842.170000001788139;0
1562;-743199.000000000000000;-1045122.000000000000000;0
4757;-742873.984000001102686;-1042820.212000001221895;0
6221;-742317.633000001311302;-1043061.541000001132488;0
6202;-742317.124000001698732;-1043063.651999998837709;0
5957;-742962.627000000327826;-1043510.905000001192093;0
4954;-742405.539999999105930;-1043024.640000000596046;0
3392;-743913.699999999254942;-1043165.480000000447035;0
3818;-743130.217999998480082;-1042703.293000001460314;0
2447;-742772.000000000000000;-1044159.000000000000000;0
6139;-742312.807000000029802;-1043066.006000000983477;0
3797;-743147.989999998360872;-1042854.129999998956919;0
4801;-742998.943999998271465;-1042721.118000000715256;0
4072;-742934.225000001490116;-1043833.899999998509884;0
1156;-741191.980000000447035;-1044497.850000001490116;0
5216;-743284.217999998480082;-1043325.638999998569489;0
4768;-742862.888000000268221;-1042936.997999999672174;0
4582;-742390.164999999105930;-1042606.546000000089407;0
4240;-742471.613000001758337;-1043552.366000000387430;0
4728;-742862.960000000894070;-1042727.210000000894070;0
4233;-742334.782000001519918;-1043445.793000001460314;0
346;-742540.000000000000000;-1043816.000000000000000;0
1773;-741281.000000000000000;-1043977.000000000000000;0
2105;-743158.000000000000000;-1044971.000000000000000;0
1135;-741572.000000000000000;-1044437.000000000000000;0
4250;-742144.109999999403954;-1043367.519999999552965;0
1677;-741109.160000000149012;-1044522.699999999254942;0
1452;-741519.000000000000000;-1044574.000000000000000;0
5645;-743428.886999998241663;-1043692.285999998450279;0
3784;-743187.730000000447035;-1042922.429999999701977;0
4957;-742366.010000001639128;-1043006.059999998658895;0
6152;-742310.348999999463558;-1043060.046999998390675;0
3365;-743840.598999999463558;-1043023.565000001341105;0
1681;-741125.980000000447035;-1044656.269999999552965;0
6105;-742213.883000001311302;-1043111.734000001102686;0
4594;-742555.890999998897314;-1042650.090999998152256;0
5678;-743404.363000001758337;-1043717.368999999016523;0
6157;-742314.026999998837709;-1043065.331000000238419;0
4894;-742610.888999998569489;-1042819.686999998986721;0
1763;-741167.000000000000000;-1044108.000000000000000;0
5680;-743402.000000000000000;-1043718.245000001043081;0
4750;-742784.420000001788139;-1042733.429999999701977;0
1124;-741715.000000000000000;-1044452.000000000000000;0
5747;-743413.175999999046326;-1043698.811000000685453;0
4850;-742956.164000000804663;-1042923.403000000864267;0
5507;-743426.703000001609325;-1043656.230999998748302;0
6240;-742364.495999999344349;-1043067.289999999105930;0
1603;-742525.000000000000000;-1044922.000000000000000;0
6273;-742321.806000001728535;-1043017.085000000894070;0
4776;-742909.276000000536442;-1042820.587000001221895;0
385;-742436.000000000000000;-1043742.000000000000000;0
1084;-741698.000000000000000;-1044537.000000000000000;0
3953;-743407.249000001698732;-1043543.537000000476837;0
2526;-741087.000000000000000;-1044616.000000000000000;0
4744;-742848.129999998956919;-1042759.629999998956919;0
907;-742211.000000000000000;-1042511.000000000000000;0
5157;-743178.671999998390675;-1043354.681000001728535;0
266;-743321.000000000000000;-1043735.000000000000000;0
457;-741732.000000000000000;-1043333.000000000000000;0
378;-742514.000000000000000;-1043703.000000000000000;0
261;-743429.000000000000000;-1043723.000000000000000;0
1777;-741169.000000000000000;-1044003.000000000000000;0
2033;-743500.000000000000000;-1044798.000000000000000;0
4521;-742681.440000001341105;-1042792.960000000894070;0
7946;-742007.769999999552965;-1044091.789999999105930;0
820;-742019.000000000000000;-1042600.000000000000000;0
5505;-743428.315000001341105;-1043675.633000001311302;0
4978;-742491.822999998927116;-1043028.688000001013279;0
395;-742369.000000000000000;-1043840.000000000000000;0
3368;-743901.462000001221895;-1043012.500999998301268;0
6814;-741118.537999998778105;-1044802.493000000715256;0
1137;-741538.000000000000000;-1044442.000000000000000;0
285;-743021.000000000000000;-1043730.000000000000000;0
1516;-741928.000000000000000;-1044062.000000000000000;0
6226;-742320.660999998450279;-1043065.366999998688698;0
7175;-742651.780000001192093;-1044558.149999998509884;0
6168;-742313.092999998480082;-1043062.208999998867512;0
4758;-742854.840999998152256;-1042811.914000000804663;0
4951;-742335.579999998211861;-1042934.429999999701977;0
1695;-741550.000000000000000;-1044656.000000000000000;0
5418;-742434.890000000596046;-1042864.780000001192093;0
793;-741697.000000000000000;-1042588.000000000000000;0
4821;-742966.550000000745058;-1042877.969999998807907;0
3807;-743008.690000001341105;-1042928.690000001341105;0
6271;-742329.282000001519918;-1043017.853999998420477;0
6161;-742310.964999999850988;-1043059.710999999195337;0
6140;-742311.999000001698732;-1043064.638999998569489;0
599;-741837.000000000000000;-1043243.000000000000000;0
7925;-743541.780000001192093;-1044709.149999998509884;0
4601;-742631.969999998807907;-1042675.629999998956919;0
5646;-743428.978999998420477;-1043693.493000000715256;0
1447;-741541.000000000000000;-1044744.000000000000000;0
5669;-743414.997999999672174;-1043713.431000001728535;0
1706;-741225.800000000745058;-1044698.800000000745058;0
5657;-743429.199999999254942;-1043706.837999999523163;0
4730;-742831.050000000745058;-1042696.600000001490116;0
1125;-741728.000000000000000;-1044435.000000000000000;0
1604;-742552.000000000000000;-1044918.000000000000000;0
7356;-743331.410000000149012;-1045146.359999999403954;0
5232;-743347.087000001221895;-1043476.425000000745058;0
710;-741829.000000000000000;-1042878.000000000000000;0
5048;-742867.500000000000000;-1043381.899999998509884;0
1085;-741634.000000000000000;-1044530.000000000000000;0
6231;-742316.769000001251698;-1043058.344000000506639;0
6242;-742366.677999999374151;-1043062.949000000953674;0
3313;-743774.447000000625849;-1042903.081999998539686;0
6014;-742844.000000000000000;-1043239.482999999076128;0
7979;-741161.500000000000000;-1044398.210000000894070;0
1144;-741402.000000000000000;-1044470.000000000000000;0
5214;-743307.671999998390675;-1043376.414000000804663;0
4841;-742989.993999999016523;-1042765.850999999791384;0
6191;-742318.017000000923872;-1043066.800999999046326;0
7177;-742643.059999998658895;-1044579.679999999701977;0
4999;-742534.149999998509884;-1042966.892999999225140;0
5222;-743271.000000000000000;-1043543.149999998509884;0
401;-742324.000000000000000;-1043907.000000000000000;0
6370;-741968.780000001192093;-1042685.250000000000000;0
5658;-743428.059999998658895;-1043708.153000000864267;0
5415;-742954.934000000357628;-1042714.414000000804663;0
6180;-742311.429000001400709;-1043057.635999999940395;0
5228;-743334.289999999105930;-1043545.039999999105930;0
5086;-742856.307999998331070;-1043239.488000001758337;0
5956;-742960.690999999642372;-1043513.846999999135733;0
4762;-742854.192000001668930;-1042825.931000001728535;0
787;-741714.000000000000000;-1042620.000000000000000;0
1780;-741214.000000000000000;-1043934.000000000000000;0
3144;-744012.590999998152256;-1042662.508000001311302;0
2090;-742923.000000000000000;-1044566.000000000000000;0
1878;-743324.000000000000000;-1044249.000000000000000;0
4459;-742274.829999998211861;-1042644.269999999552965;0
5738;-743410.412999998778105;-1043691.800000000745058;0
1122;-741749.000000000000000;-1044455.000000000000000;0
836;-742006.000000000000000;-1042525.000000000000000;0
5588;-743425.002000000327826;-1043679.451999999582767;0
7963;-741608.199999999254942;-1044329.510000001639128;0
561;-742172.000000000000000;-1043675.000000000000000;0
6208;-742320.098000001162291;-1043067.458999998867512;0
5692;-743415.782999999821186;-1043638.765000000596046;0
6215;-742314.692000001668930;-1043057.682000000029802;0
602;-741828.000000000000000;-1043190.000000000000000;0
5792;-743363.984999999403954;-1043442.513999998569489;0
6245;-742369.682000000029802;-1043057.377000000327826;0
3372;-743823.475000001490116;-1043010.432999998331070;0
826;-742191.000000000000000;-1042616.000000000000000;0
1962;-743406.000000000000000;-1044664.000000000000000;0
398;-742372.000000000000000;-1043909.000000000000000;0
6196;-742314.190000001341105;-1043059.774999998509884;0
5508;-743426.105999998748302;-1043645.960999999195337;0
4577;-742376.686000000685453;-1042590.309999998658895;0
843;-742085.000000000000000;-1042507.000000000000000;0
6124;-743427.861999999731779;-1043609.043000001460314;0
6134;-742309.011999998241663;-1043060.703000001609325;0
737;-741849.000000000000000;-1043021.000000000000000;0
5512;-743426.556000001728535;-1043602.920000001788139;0
905;-742312.000000000000000;-1042489.000000000000000;0
4958;-742349.620000001043081;-1043004.539999999105930;0
4826;-743043.850000001490116;-1042979.600000001490116;0
4707;-742743.519999999552965;-1042600.359999999403954;0
6164;-742316.155999999493361;-1043067.784000001847744;0
1871;-743440.000000000000000;-1044260.000000000000000;0
7279;-742799.399999998509884;-1044679.829999998211861;0
4328;-742347.322000000625849;-1043375.796999998390675;0
6254;-742379.344000000506639;-1043038.363000001758337;0
4763;-742847.094000000506639;-1042842.671000000089407;0
5955;-742960.732999999076128;-1043520.888999998569489;0
520;-742225.000000000000000;-1043127.000000000000000;0
6510;-741721.960000000894070;-1044461.815000001341105;0
1426;-742056.000000000000000;-1044228.000000000000000;0
4722;-742878.030000001192093;-1042626.550000000745058;0
6439;-741765.070999998599291;-1042636.877999998629093;0
462;-741707.000000000000000;-1043294.000000000000000;0
1304;-741810.000000000000000;-1044684.000000000000000;0
5360;-742453.188999999314547;-1042938.521999999880791;0
5701;-743417.076999999582767;-1043630.140000000596046;0
6198;-742312.659000001847744;-1043056.964999999850988;0
6248;-742372.506000000983477;-1043051.769999999552965;0
985;-741823.000000000000000;-1044444.000000000000000;0
4494;-741874.920000001788139;-1042616.660000000149012;0
785;-741702.000000000000000;-1042622.000000000000000;0
