OID_;X;Y;TEMPERATURE
3614;-744984.548999998718500;-1042283.640999998897314;0
3019;-744463.447999998927116;-1042784.646000001579523;0
3568;-744718.817999999970198;-1042588.614999998360872;0
3692;-744525.876499999314547;-1042540.534000001847744;0
3580;-744924.973999999463558;-1042593.699999999254942;0
2605;-745393.842999998480082;-1042860.796000000089407;0
5975;-745052.346999999135733;-1042674.673000000417233;0
118;-745135.000000000000000;-1042687.000000000000000;0
3542;-744575.274000000208616;-1042656.160000000149012;0
2696;-743477.489999998360872;-1042038.000000000000000;0
2520;-741847.000000000000000;-1045324.000000000000000;0
3066;-744075.627000000327826;-1042883.837000001221895;0
6872;-741751.719999998807907;-1045296.679999999701977;0
2760;-743863.331000000238419;-1043483.304000001400709;0
2755;-744003.879000000655651;-1043471.734000001102686;0
1584;-742368.000000000000000;-1044717.000000000000000;0
2404;-742179.000000000000000;-1045467.000000000000000;0
3919;-743904.947000000625849;-1043493.929999999701977;0
3107;-743778.888000000268221;-1042682.131999999284744;0
2740;-744042.611999999731779;-1043335.940000001341105;0
2641;-743432.578999999910593;-1042583.418999999761581;0
6705;-742279.050999999046326;-1044655.923000000417233;0
6833;-741571.423000000417233;-1044909.473999999463558;0
1486;-741150.000000000000000;-1044219.000000000000000;0
1445;-741553.000000000000000;-1044757.000000000000000;0
1524;-741710.000000000000000;-1043844.000000000000000;0
1727;-741495.000000000000000;-1045103.000000000000000;0
1723;-741611.000000000000000;-1045092.000000000000000;0
1053;-741768.000000000000000;-1045023.000000000000000;0
1411;-741639.480000000447035;-1044683.019999999552965;0
6828;-741465.309999998658895;-1044768.940000001341105;0
7411;-743529.510000001639128;-1045393.140000000596046;0
3413;-743776.791000001132488;-1043071.675000000745058;0
7212;-742559.410000000149012;-1045073.070000000298023;0
1602;-742507.000000000000000;-1044924.000000000000000;0
2079;-742688.000000000000000;-1044428.000000000000000;0
6845;-741527.188000001013279;-1044989.557000000029802;0
5434;-744042.467999998480082;-1043135.986999999731779;0
1315;-741715.000000000000000;-1044867.000000000000000;0
385;-742436.000000000000000;-1043742.000000000000000;0
7143;-742850.414999999105930;-1044473.449999999254942;0
8079;-742021.839999999850988;-1045292.179999999701977;0
2070;-742993.000000000000000;-1044723.000000000000000;0
2097;-743143.000000000000000;-1044742.000000000000000;0
4156;-742513.734999999403954;-1043978.035000000149012;0
1092;-741549.000000000000000;-1044556.000000000000000;0
7263;-743009.559999998658895;-1044894.379999998956919;0
383;-742450.000000000000000;-1043722.000000000000000;0
4238;-742440.263000000268221;-1043528.236000001430511;0
465;-741728.000000000000000;-1043309.000000000000000;0
7654;-742242.081000000238419;-1045273.263999998569489;0
2893;-743977.276000000536442;-1043208.923999998718500;0
502;-741901.000000000000000;-1043169.000000000000000;0
7008;-742899.559999998658895;-1044224.074999999254942;0
2394;-742273.000000000000000;-1045360.000000000000000;0
2329;-742432.000000000000000;-1045508.000000000000000;0
2160;-742849.000000000000000;-1045147.000000000000000;0
2161;-742876.000000000000000;-1045153.000000000000000;0
8073;-742120.640000000596046;-1045259.500000000000000;0
7652;-742275.046999998390675;-1045497.052000001072884;0
2378;-742372.000000000000000;-1045503.000000000000000;0
7141;-742895.629999998956919;-1044470.910000000149012;0
4075;-742947.934999998658895;-1043903.649999998509884;0
3915;-744021.765999998897314;-1043098.603999998420477;0
7243;-742724.339999999850988;-1044835.870000001043081;0
8152;-743293.600000001490116;-1043190.510000001639128;0
2497;-741932.000000000000000;-1044075.000000000000000;0
4074;-742943.350000001490116;-1043880.304999999701977;0
3369;-743878.633000001311302;-1043011.739000000059605;0
282;-743034.000000000000000;-1043819.000000000000000;0
7282;-742809.410000000149012;-1044693.629999998956919;0
1814;-743095.000000000000000;-1044510.000000000000000;0
1171;-741882.000000000000000;-1044375.000000000000000;0
5409;-743745.201000001281500;-1042902.750000000000000;0
1985;-743478.000000000000000;-1044769.000000000000000;0
4029;-743130.695999998599291;-1043815.427999999374151;0
4334;-742384.170000001788139;-1043468.820000000298023;0
1698;-741464.000000000000000;-1044668.000000000000000;0
1517;-741964.000000000000000;-1044034.000000000000000;0
561;-742172.000000000000000;-1043675.000000000000000;0
7947;-742030.969999998807907;-1044096.679999999701977;0
7828;-743537.940000001341105;-1045170.530000001192093;0
524;-742255.000000000000000;-1043913.000000000000000;96
4088;-742812.114999998360872;-1043580.475000001490116;0
1362;-742017.000000000000000;-1044913.000000000000000;0
2296;-742678.000000000000000;-1045399.000000000000000;0
728;-741997.000000000000000;-1042918.000000000000000;0
2146;-742845.000000000000000;-1044968.000000000000000;0
6824;-741347.350000001490116;-1044784.280000001192093;0
4128;-742915.039999999105930;-1044041.920000001788139;0
2326;-742523.000000000000000;-1045498.000000000000000;0
2323;-742622.000000000000000;-1045487.000000000000000;0
1993;-743483.000000000000000;-1044984.000000000000000;0
1780;-741214.000000000000000;-1043934.000000000000000;0
6848;-741619.096999999135733;-1045007.451999999582767;0
738;-741818.000000000000000;-1043024.000000000000000;0
7798;-743468.929999999701977;-1045091.809999998658895;0
1128;-741655.000000000000000;-1044448.000000000000000;0
1090;-741581.000000000000000;-1044552.000000000000000;0
6505;-741746.570000000298023;-1044600.429999999701977;0
1942;-743283.000000000000000;-1044370.000000000000000;0
1875;-743367.000000000000000;-1044261.000000000000000;0
2168;-743025.000000000000000;-1045134.000000000000000;0
2316;-742823.000000000000000;-1045463.000000000000000;0
1925;-743331.000000000000000;-1044321.000000000000000;0
1910;-743460.000000000000000;-1044391.000000000000000;0
1178;-741952.000000000000000;-1044311.000000000000000;0
1983;-743474.000000000000000;-1044709.000000000000000;0
5062;-742798.513999998569489;-1043227.370999999344349;0
1300;-741917.410000000149012;-1044719.769999999552965;0
1519;-741754.000000000000000;-1043956.000000000000000;0
1950;-743271.000000000000000;-1044490.000000000000000;0
7162;-743075.840999998152256;-1044541.596000000834465;0
548;-742297.000000000000000;-1043762.000000000000000;0
5119;-742850.592999998480082;-1043328.484999999403954;0
701;-742023.000000000000000;-1042885.000000000000000;0
5058;-742837.528999999165535;-1043170.686000000685453;0
748;-741671.000000000000000;-1042971.000000000000000;0
1371;-742089.000000000000000;-1044807.000000000000000;0
110;-744127.000000000000000;-1042724.000000000000000;0
7721;-742941.157000001519918;-1044215.368000000715256;0
1520;-741777.000000000000000;-1043939.000000000000000;0
7085;-743327.129999998956919;-1044533.960000000894070;0
7728;-743360.581999998539686;-1044610.631000000983477;0
1912;-743461.000000000000000;-1044430.000000000000000;0
7022;-743155.660000000149012;-1044074.410000000149012;0
4207;-742354.105999998748302;-1043530.157999999821186;0
317;-742464.000000000000000;-1044207.000000000000000;0
5239;-743361.096000000834465;-1043279.333999998867512;0
7004;-743069.289999999105930;-1044326.469999998807907;0
6692;-742222.114999998360872;-1044818.673000000417233;0
7001;-743085.660000000149012;-1044400.420000001788139;0
1764;-741163.000000000000000;-1044144.000000000000000;0
7516;-742248.390000000596046;-1044368.907999999821186;0
7015;-742554.570000000298023;-1044360.725000001490116;0
2093;-742915.000000000000000;-1044642.000000000000000;0
3843;-743139.170000001788139;-1042650.050000000745058;0
735;-741910.000000000000000;-1043014.000000000000000;0
6004;-742061.723000001162291;-1043300.859999999403954;0
7350;-742556.390000000596046;-1045185.980000000447035;0
4220;-742214.344999998807907;-1043580.359999999403954;0
2222;-743058.000000000000000;-1045420.000000000000000;0
1287;-742217.000000000000000;-1044486.000000000000000;0
2336;-742837.000000000000000;-1045523.000000000000000;0
1553;-741350.000000000000000;-1044268.000000000000000;0
1291;-742205.000000000000000;-1044568.000000000000000;0
7153;-742889.646999999880791;-1044547.438000001013279;0
1345;-741741.000000000000000;-1044789.000000000000000;0
6339;-742245.460000000894070;-1042835.780000001192093;0
1840;-742984.379999998956919;-1044155.149999998509884;0
6353;-741893.070000000298023;-1042697.059999998658895;0
7397;-743021.859999999403954;-1045682.989999998360872;0
8273;-742057.820000000298023;-1042728.760000001639128;0
8275;-742087.910000000149012;-1042738.609999999403954;0
3975;-743112.984999999403954;-1043716.375999998301268;0
2319;-742734.000000000000000;-1045474.000000000000000;0
3767;-743033.910000000149012;-1042982.390000000596046;0
1770;-741270.000000000000000;-1044086.000000000000000;0
3310;-743829.561999998986721;-1042854.063000001013279;0
5186;-743270.949999999254942;-1043526.039999999105930;0
1992;-743482.000000000000000;-1044954.000000000000000;0
7173;-742660.850000001490116;-1044535.730000000447035;0
4333;-742428.420000001788139;-1043255.609999999403954;0
2036;-743404.000000000000000;-1044803.000000000000000;0
3128;-743948.160000000149012;-1042657.320000000298023;0
2283;-742911.000000000000000;-1045532.000000000000000;0
7046;-743398.329999998211861;-1044186.289999999105930;0
1829;-742968.539999999105930;-1044100.210000000894070;0
1360;-741983.000000000000000;-1044900.000000000000000;0
4046;-743205.699999999254942;-1044009.719999998807907;0
2491;-742059.000000000000000;-1044251.000000000000000;0
1618;-742405.000000000000000;-1044404.000000000000000;0
7519;-742850.620000001043081;-1045673.670000001788139;0
1047;-741816.000000000000000;-1044867.000000000000000;0
6698;-742304.160999998450279;-1044462.195999998599291;0
4342;-742506.473000001162291;-1043301.100000001490116;0
1356;-741916.000000000000000;-1044874.000000000000000;0
514;-742119.000000000000000;-1043141.000000000000000;0
510;-742048.000000000000000;-1043150.000000000000000;0
343;-742575.000000000000000;-1043857.000000000000000;0
6728;-742547.451000001281500;-1044392.396000001579523;0
5984;-743985.258000001311302;-1042842.061999998986721;0
4223;-742161.556000001728535;-1043473.138999998569489;0
7044;-743400.635000001639128;-1044135.579999998211861;0
3825;-743056.390000000596046;-1042570.079999998211861;0
5168;-743228.796000000089407;-1043420.092000000178814;0
4067;-742913.594999998807907;-1043714.640000000596046;0
1268;-742046.000000000000000;-1045021.000000000000000;0
7185;-742600.515000000596046;-1044717.333999998867512;0
600;-741840.000000000000000;-1043212.000000000000000;0
1924;-743359.000000000000000;-1044320.000000000000000;0
3795;-743173.190000001341105;-1042842.170000001788139;0
3993;-743345.100000001490116;-1043930.980000000447035;0
1387;-742155.000000000000000;-1044999.000000000000000;0
3750;-743221.379999998956919;-1042925.429999999701977;0
1246;-742120.000000000000000;-1044570.000000000000000;0
2490;-742063.000000000000000;-1044273.000000000000000;0
4764;-742839.835999999195337;-1042859.412999998778105;0
577;-742038.000000000000000;-1043521.000000000000000;0
8054;-742230.239999998360872;-1044988.530000001192093;0
2523;-742181.000000000000000;-1044140.000000000000000;0
6712;-742273.328000001609325;-1044860.912000000476837;0
2507;-742427.000000000000000;-1044437.000000000000000;0
3279;-743638.815999999642372;-1042804.333999998867512;0
225;-742885.000000000000000;-1043535.000000000000000;0
4537;-742303.159000001847744;-1042752.293000001460314;0
4668;-742810.210000000894070;-1042618.969999998807907;0
1504;-741577.000000000000000;-1044258.000000000000000;0
588;-741950.000000000000000;-1043352.000000000000000;0
2446;-742750.000000000000000;-1044164.000000000000000;0
847;-742155.000000000000000;-1042504.000000000000000;0
4574;-742339.980000000447035;-1042661.570000000298023;0
7214;-742470.679999999701977;-1044531.269999999552965;0
824;-742142.000000000000000;-1042596.000000000000000;0
621;-742285.000000000000000;-1043282.000000000000000;0
817;-741937.000000000000000;-1042586.000000000000000;0
7970;-741444.739999998360872;-1044384.980000000447035;0
2050;-743460.000000000000000;-1045072.000000000000000;0
594;-741896.000000000000000;-1043296.000000000000000;0
1121;-741765.000000000000000;-1044444.000000000000000;0
4526;-742696.690000001341105;-1042823.320000000298023;0
827;-742218.000000000000000;-1042626.000000000000000;0
1229;-742244.000000000000000;-1044253.000000000000000;0
7508;-742947.440000001341105;-1045540.690000001341105;0
834;-742049.000000000000000;-1042541.000000000000000;0
1441;-741744.000000000000000;-1044392.000000000000000;0
3261;-743581.445999998599291;-1042690.379999998956919;0
2008;-743242.000000000000000;-1044759.000000000000000;0
2018;-743244.000000000000000;-1044909.000000000000000;0
4170;-742407.245000001043081;-1043945.519999999552965;0
2082;-742569.000000000000000;-1044642.000000000000000;0
6306;-741842.129999998956919;-1042752.739999998360872;0
394;-742405.000000000000000;-1043863.000000000000000;0
1397;-741771.000000000000000;-1044236.000000000000000;0
6677;-742304.892999999225140;-1044202.831999998539686;0
4770;-742872.535000000149012;-1042899.679000001400709;0
1675;-741059.000000000000000;-1044754.000000000000000;0
877;-741951.000000000000000;-1042610.000000000000000;0
7148;-742828.445000000298023;-1044472.094999998807907;0
6722;-742357.717000000178814;-1044705.708000000566244;0
1543;-742235.000000000000000;-1044164.000000000000000;0
2020;-743260.000000000000000;-1044941.000000000000000;0
2515;-742517.000000000000000;-1044420.000000000000000;0
2129;-743108.000000000000000;-1045142.000000000000000;0
1561;-743186.000000000000000;-1045098.000000000000000;0
1656;-741395.000000000000000;-1044688.000000000000000;0
547;-742316.910000000149012;-1043790.309999998658895;0
316;-742490.000000000000000;-1044202.000000000000000;0
4658;-742804.655000001192093;-1042456.622000001370907;0
2562;-741090.000000000000000;-1044404.000000000000000;0
4634;-742635.980000000447035;-1042656.144999999552965;0
1619;-742426.000000000000000;-1044401.000000000000000;0
7514;-742304.866000000387430;-1044375.124000001698732;0
1251;-742091.000000000000000;-1044690.000000000000000;0
3768;-743006.370000001043081;-1042978.829999998211861;0
4325;-742270.679000001400709;-1043141.787999998778105;0
713;-741800.000000000000000;-1042859.000000000000000;0
3747;-743250.879999998956919;-1042956.620000001043081;0
6658;-741538.879999998956919;-1044165.440000001341105;0
4562;-742471.000000000000000;-1042510.920000001788139;0
4585;-742437.502000000327826;-1042630.243999999016523;0
973;-741908.000000000000000;-1044547.000000000000000;0
3782;-743285.429999999701977;-1042842.460000000894070;0
885;-741739.000000000000000;-1042777.000000000000000;0
3787;-743130.989999998360872;-1042979.320000000298023;0
6194;-742315.721000000834465;-1043062.585999999195337;0
5003;-742589.811999998986721;-1042974.888999998569489;0
2220;-743075.000000000000000;-1045396.000000000000000;0
7;-743479.000000000000000;-1042567.000000000000000;0
6820;-741224.105999998748302;-1044799.311999998986721;0
4106;-742664.475000001490116;-1043755.761999998241663;0
4620;-742539.574000000953674;-1042537.307999998331070;0
4840;-742988.201999999582767;-1042740.603999998420477;0
783;-741695.000000000000000;-1042663.000000000000000;0
1589;-742376.000000000000000;-1044861.000000000000000;0
5779;-742907.197999998927116;-1043414.096999999135733;0
6254;-742379.344000000506639;-1043038.363000001758337;0
307;-742781.000000000000000;-1044143.000000000000000;0
4082;-742825.565000001341105;-1043737.364999998360872;0
4761;-742810.285000000149012;-1042793.122000001370907;0
725;-741983.000000000000000;-1042939.000000000000000;0
4705;-742714.100000001490116;-1042599.829999998211861;0
1162;-741087.000000000000000;-1044511.000000000000000;0
531;-742157.000000000000000;-1043778.000000000000000;0
4610;-742548.888000000268221;-1042601.879000000655651;0
4758;-742854.840999998152256;-1042811.914000000804663;0
6224;-742315.320000000298023;-1043057.335000000894070;0
917;-742121.000000000000000;-1043008.000000000000000;0
613;-742089.000000000000000;-1043271.000000000000000;0
6166;-742314.649999998509884;-1043065.006999999284744;0
6767;-741223.949999999254942;-1044422.059999998658895;0
1595;-742313.000000000000000;-1045010.000000000000000;0
2246;-743218.000000000000000;-1045379.000000000000000;0
3838;-743113.550000000745058;-1042543.399999998509884;0
1679;-741116.550000000745058;-1044578.600000001490116;0
6165;-742315.407000001519918;-1043066.436000000685453;0
170;-743440.000000000000000;-1043364.000000000000000;0
339;-742606.000000000000000;-1043916.000000000000000;0
3794;-743091.015000000596046;-1042800.471999999135733;0
7814;-741769.006999999284744;-1044058.535999998450279;0
533;-742137.000000000000000;-1043750.000000000000000;0
795;-741770.000000000000000;-1042577.000000000000000;0
683;-742362.000000000000000;-1043155.000000000000000;0
4509;-742502.519999999552965;-1042732.079999998211861;0
4023;-743246.635000001639128;-1043864.364999998360872;0
5144;-743052.642000000923872;-1043488.940000001341105;0
6149;-742312.646000001579523;-1043064.261999998241663;0
5113;-742946.795000001788139;-1043444.427999999374151;0
5667;-743417.361999999731779;-1043712.557000000029802;0
17;-743587.000000000000000;-1042394.000000000000000;0
5172;-743274.383999999612570;-1043432.322999998927116;0
5504;-743428.977000001817942;-1043686.274000000208616;0
2254;-743235.000000000000000;-1045290.000000000000000;0
693;-742284.000000000000000;-1043062.000000000000000;0
184;-743445.000000000000000;-1043450.000000000000000;0
4041;-743227.600000001490116;-1043746.495000001043081;0
4839;-742984.162000000476837;-1042715.425000000745058;0
5583;-743410.274999998509884;-1043642.072000000625849;0
636;-742160.000000000000000;-1043325.000000000000000;0
5126;-743012.193999998271465;-1043403.521000001579523;0
5505;-743428.315000001341105;-1043675.633000001311302;0
4116;-742740.429999999701977;-1044064.789999999105930;0
1027;-741984.000000000000000;-1044660.000000000000000;0
618;-742203.000000000000000;-1043272.000000000000000;0
7678;-742388.550999999046326;-1045109.184000000357628;0
881;-741806.000000000000000;-1042815.000000000000000;0
4827;-743046.359999999403954;-1042958.140000000596046;0
6264;-742357.280000001192093;-1043020.445999998599291;0
4906;-742448.370000001043081;-1042815.789999999105930;0
1855;-742642.000000000000000;-1044286.000000000000000;0
1101;-741339.000000000000000;-1044568.000000000000000;0
3958;-743416.328000001609325;-1043572.265999998897314;0
207;-743142.000000000000000;-1043590.000000000000000;0
4004;-743345.877000000327826;-1044053.135999999940395;0
5735;-743414.589999999850988;-1043687.874000001698732;0
5966;-742483.469999998807907;-1043066.721999999135733;0
1302;-741842.000000000000000;-1044693.000000000000000;0
5272;-743000.013999998569489;-1043245.364000000059605;0
6147;-742314.177000001072884;-1043067.070999998599291;0
1087;-741605.000000000000000;-1044533.000000000000000;0
6217;-742320.725999999791384;-1043067.133999999612570;0
1112;-741189.050000000745058;-1044602.469999998807907;0
274;-743359.000000000000000;-1043833.000000000000000;0
1383;-742077.000000000000000;-1045046.000000000000000;0
1147;-741346.000000000000000;-1044466.000000000000000;0
1222;-742157.000000000000000;-1044266.000000000000000;0
6190;-742318.782999999821186;-1043068.206000000238419;0
7031;-743301.824999999254942;-1044080.774999998509884;0
6214;-742315.447999998927116;-1043059.026000000536442;0
7723;-741757.929000001400709;-1044043.175000000745058;0
6218;-742319.947000000625849;-1043065.767999999225140;0
5196;-743199.263000000268221;-1043326.401000000536442;0
5303;-743164.818999998271465;-1043211.078000001609325;0
4900;-742508.089999999850988;-1042815.289999999105930;0
4242;-742214.469999998807907;-1043415.800000000745058;0
5691;-743415.714000001549721;-1043637.241000000387430;0
6245;-742369.682000000029802;-1043057.377000000327826;0
4671;-742824.179999999701977;-1042687.210000000894070;0
5722;-743419.659000001847744;-1043631.798000000417233;0
6159;-742312.495999999344349;-1043062.521000001579523;0
1389;-742281.250000000000000;-1044962.859999999403954;0
1507;-741673.000000000000000;-1044223.000000000000000;0
6169;-742312.320000000298023;-1043060.791999999433756;0
4335;-742398.230000000447035;-1043445.760000001639128;0
4229;-742146.929000001400709;-1043334.585000000894070;0
520;-742225.000000000000000;-1043127.000000000000000;0
3978;-743342.695000000298023;-1043756.835000000894070;0
4772;-742879.881999999284744;-1042872.157000001519918;0
1237;-742144.000000000000000;-1044365.000000000000000;0
4151;-742573.039999999105930;-1044109.035000000149012;0
6233;-742319.057000000029802;-1043072.162999998778105;0
6220;-742318.432999998331070;-1043062.949999999254942;0
1492;-741096.000000000000000;-1044331.000000000000000;0
5724;-743422.230999998748302;-1043632.715999998152256;0
6197;-742313.425000000745058;-1043058.370999999344349;0
4120;-742715.179999999701977;-1043974.089999999850988;0
5640;-743428.425000000745058;-1043686.254000000655651;0
5023;-742588.899000000208616;-1042870.296999998390675;0
203;-743204.000000000000000;-1043607.000000000000000;0
1030;-741975.000000000000000;-1044753.000000000000000;0
3347;-743959.280000001192093;-1043034.447000000625849;0
4332;-742410.359000001102686;-1043282.916000001132488;0
4071;-742929.394999999552965;-1043807.585000000894070;0
8056;-742242.379999998956919;-1045023.460000000894070;0
5656;-743429.752999998629093;-1043705.570000000298023;0
2140;-742924.000000000000000;-1045088.000000000000000;0
6178;-742312.960000000894070;-1043060.445999998599291;0
5725;-743422.388000000268221;-1043634.186999998986721;0
3333;-743967.447999998927116;-1042967.616000000387430;0
5369;-742583.364999998360872;-1042976.820999998599291;0
3815;-743161.949999999254942;-1042769.750000000000000;0
6283;-742308.969000000506639;-1043049.539999999105930;0
2240;-743343.000000000000000;-1045290.000000000000000;0
4430;-742235.070000000298023;-1043092.839999999850988;0
4959;-742331.289999999105930;-1043002.690000001341105;0
6119;-743582.679999999701977;-1042696.969999998807907;0
6131;-742311.329999998211861;-1043064.982999999076128;0
5135;-742979.611000001430511;-1043468.912999998778105;0
4571;-742345.710000000894070;-1042568.989999998360872;0
6234;-742324.105000000447035;-1043076.613000001758337;0
6272;-742325.379000000655651;-1043017.383000001311302;0
5296;-743058.934999998658895;-1043177.035000000149012;0
1293;-742037.000000000000000;-1044462.000000000000000;0
5517;-743427.287000000476837;-1043618.956999998539686;0
5514;-743426.903000000864267;-1043609.252999998629093;0
4702;-742669.300000000745058;-1042747.399999998509884;0
1257;-742070.000000000000000;-1044815.000000000000000;0
5680;-743402.000000000000000;-1043718.245000001043081;0
3803;-743066.289999999105930;-1042896.320000000298023;0
6250;-742374.638999998569489;-1043047.576999999582767;0
5294;-743056.328999999910593;-1043196.096999999135733;0
6248;-742372.506000000983477;-1043051.769999999552965;0
3822;-743065.039999999105930;-1042594.239999998360872;0
782;-741695.000000000000000;-1042522.000000000000000;0
2526;-741087.000000000000000;-1044616.000000000000000;0
1714;-741239.129999998956919;-1044887.079999998211861;0
5221;-743263.820000000298023;-1043556.920000001788139;0
4716;-742893.160000000149012;-1042622.780000001192093;0
6243;-742367.739999998360872;-1043061.098000001162291;0
2238;-743372.000000000000000;-1045261.000000000000000;0
222;-742939.000000000000000;-1043526.000000000000000;0
5142;-743039.870000001043081;-1043473.929999999701977;0
4429;-742222.260000001639128;-1043102.250000000000000;0
1110;-741220.730000000447035;-1044598.480000000447035;0
5733;-743410.142999999225140;-1043688.210999999195337;0
4482;-741768.079999998211861;-1042606.449999999254942;0
4829;-743051.579999998211861;-1042916.609999999403954;0
995;-741906.000000000000000;-1044434.000000000000000;0
4955;-742383.649999998509884;-1043019.250000000000000;0
4114;-742764.195000000298023;-1044131.760000001639128;0
1922;-743390.000000000000000;-1044308.000000000000000;0
5666;-743418.543999999761581;-1043712.120000001043081;0
2506;-741267.000000000000000;-1044015.000000000000000;0
4831;-743041.170000001788139;-1042862.530000001192093;0
5502;-743427.894999999552965;-1043706.885000001639128;0
3235;-744146.118000000715256;-1042659.438999999314547;0
1598;-742351.000000000000000;-1045090.000000000000000;0
6294;-742653.550000000745058;-1042686.140000000596046;0
4896;-742589.649999998509884;-1042838.989999998360872;0
6225;-742314.519999999552965;-1043055.927000001072884;0
4749;-742884.420000001788139;-1042760.329999998211861;0
5207;-743208.434999998658895;-1043365.236999999731779;0
6155;-742315.557999998331070;-1043068.140999998897314;0
3212;-743646.699000000953674;-1042469.458999998867512;0
2237;-743368.000000000000000;-1045238.000000000000000;0
4998;-742514.109000001102686;-1042978.602000001817942;0
3183;-743909.289999999105930;-1042546.210000000894070;0
2557;-741318.000000000000000;-1044384.000000000000000;0
7780;-743046.243000000715256;-1045844.168999999761581;0
4790;-743036.497999999672174;-1042635.973999999463558;0
6140;-742311.999000001698732;-1043064.638999998569489;0
6222;-742316.855000000447035;-1043060.109999999403954;0
6210;-742318.541000001132488;-1043064.662999998778105;0
6227;-742319.839999999850988;-1043063.936000000685453;0
4745;-742840.800000000745058;-1042742.120000001043081;0
4002;-743397.818999998271465;-1044054.317999999970198;0
1503;-741537.000000000000000;-1044272.000000000000000;0
3886;-742385.100000001490116;-1042445.500000000000000;0
5705;-743417.603000000119209;-1043637.098000001162291;0
6092;-742001.309999998658895;-1043482.089999999850988;0
8060;-742295.719999998807907;-1045082.859999999403954;0
6145;-742315.708000000566244;-1043069.881999999284744;0
6161;-742310.964999999850988;-1043059.710999999195337;0
1458;-741506.000000000000000;-1044384.000000000000000;0
4727;-742869.390000000596046;-1042700.829999998211861;0
649;-742233.000000000000000;-1043382.000000000000000;0
4117;-742733.614999998360872;-1044043.129999998956919;0
4833;-743036.859999999403954;-1042820.050000000745058;0
1425;-742080.000000000000000;-1044210.000000000000000;0
581;-741991.000000000000000;-1043457.000000000000000;0
5744;-743412.905999999493361;-1043695.221000000834465;0
4124;-742751.265000000596046;-1043878.414999999105930;0
3180;-743900.668000001460314;-1042588.706000000238419;0
7180;-742618.809000000357628;-1044646.109000001102686;0
4710;-742796.730000000447035;-1042611.769999999552965;0
6184;-742315.868999999016523;-1043064.326999999582767;0
943;-742292.000000000000000;-1043017.000000000000000;0
6268;-742340.850000001490116;-1043018.881000000983477;0
5416;-742963.127999998629093;-1042713.598000001162291;0
4588;-742421.668999999761581;-1042556.124000001698732;0
4118;-742725.980000000447035;-1044022.765000000596046;0
4069;-742920.684999998658895;-1043755.420000001788139;0
1648;-741373.000000000000000;-1044431.000000000000000;0
5696;-743417.096000000834465;-1043637.135999999940395;0
4775;-742898.375999998301268;-1042802.914000000804663;0
4982;-742559.320999998599291;-1043012.914000000804663;0
3983;-743317.089999999850988;-1043883.160000000149012;0
4599;-742625.879999998956919;-1042698.820000000298023;0
5203;-743386.346000000834465;-1043274.958000000566244;0
5589;-743423.785999998450279;-1043679.548000000417233;0
6265;-742353.164999999105930;-1043020.054999999701977;0
1420;-741596.000000000000000;-1044382.000000000000000;0
5698;-743416.785999998450279;-1043633.638000000268221;0
7776;-743089.784000001847744;-1045773.409000001847744;0
6187;-742313.572999998927116;-1043060.111999999731779;0
6649;-741731.100000001490116;-1044094.850000001490116;0
1472;-741677.000000000000000;-1044145.000000000000000;0
3204;-743715.278999999165535;-1042506.118999999016523;0
4834;-742972.708000000566244;-1042657.809000000357628;0
2235;-743401.000000000000000;-1045221.000000000000000;0
