OID_;X;Y;TEMPERATURE
2757;-743949.300000000745058;-1043488.500000000000000;0
5786;-743456.410000000149012;-1042105.250000000000000;0
3923;-743845.660000000149012;-1043512.260000001639128;0
3598;-744894.750000000000000;-1042560.583999998867512;0
1765;-741159.000000000000000;-1044178.000000000000000;0
7006;-742995.760000001639128;-1043976.245000001043081;0
7653;-742255.225000001490116;-1045513.048000000417233;0
735;-741910.000000000000000;-1043014.000000000000000;0
1926;-743301.000000000000000;-1044321.000000000000000;0
283;-743026.000000000000000;-1043788.000000000000000;0
2262;-742999.000000000000000;-1045686.000000000000000;0
4858;-742955.339999999850988;-1042963.960000000894070;0
3756;-743319.230000000447035;-1042949.019999999552965;0
2253;-743250.000000000000000;-1045314.000000000000000;0
2194;-743448.000000000000000;-1045193.000000000000000;0
352;-742386.000000000000000;-1043914.000000000000000;0
1992;-743482.000000000000000;-1044954.000000000000000;0
6324;-745068.543000001460314;-1042720.445999998599291;0
2318;-742763.000000000000000;-1045470.000000000000000;0
23;-743544.000000000000000;-1042505.000000000000000;0
2275;-742845.000000000000000;-1045719.000000000000000;0
6979;-743081.460000000894070;-1044413.079999998211861;0
2059;-742625.000000000000000;-1044459.000000000000000;0
1105;-741274.000000000000000;-1044576.000000000000000;0
884;-741771.000000000000000;-1042776.000000000000000;0
633;-742100.000000000000000;-1043296.000000000000000;0
4147;-742649.245000001043081;-1043870.320000000298023;0
4500;-742315.239999998360872;-1042719.460000000894070;0
7995;-741545.920000001788139;-1045160.100000001490116;0
2096;-743154.000000000000000;-1044724.000000000000000;0
3033;-744483.675000000745058;-1042733.627000000327826;0
1519;-741754.000000000000000;-1043956.000000000000000;0
1962;-743406.000000000000000;-1044664.000000000000000;0
6751;-742426.350000001490116;-1044371.070000000298023;0
7809;-741981.809999998658895;-1044560.280000001192093;0
461;-741713.000000000000000;-1043304.000000000000000;0
3837;-743093.699999999254942;-1042577.890000000596046;0
7214;-742470.679999999701977;-1044531.269999999552965;0
1369;-742029.000000000000000;-1044788.000000000000000;0
1035;-741963.000000000000000;-1044896.000000000000000;0
7262;-742990.940000001341105;-1044886.989999998360872;0
1335;-741752.000000000000000;-1044833.000000000000000;0
2397;-742181.000000000000000;-1045368.000000000000000;0
4577;-742376.686000000685453;-1042590.309999998658895;0
2128;-743170.000000000000000;-1045080.000000000000000;0
512;-742063.000000000000000;-1043136.000000000000000;636
6845;-741527.188000001013279;-1044989.557000000029802;0
8066;-742286.199999999254942;-1045237.250000000000000;0
382;-742481.000000000000000;-1043751.000000000000000;0
4175;-742721.254999998956919;-1043775.890000000596046;0
7088;-743335.559999998658895;-1044546.359999999403954;0
596;-741867.000000000000000;-1043259.000000000000000;0
2359;-742348.000000000000000;-1045581.000000000000000;0
6716;-742256.467000000178814;-1044966.368000000715256;0
5194;-743205.761999998241663;-1043310.581999998539686;0
1910;-743460.000000000000000;-1044391.000000000000000;0
7925;-743541.780000001192093;-1044709.149999998509884;0
4222;-742187.096999999135733;-1043485.890000000596046;0
1406;-741663.000000000000000;-1044277.000000000000000;0
7148;-742828.445000000298023;-1044472.094999998807907;0
4811;-743040.379999998956919;-1042799.609999999403954;0
2217;-743112.000000000000000;-1045360.000000000000000;0
824;-742142.000000000000000;-1042596.000000000000000;0
787;-741714.000000000000000;-1042620.000000000000000;0
1968;-743397.000000000000000;-1044793.000000000000000;0
2137;-742971.000000000000000;-1045111.000000000000000;0
690;-742306.000000000000000;-1043081.000000000000000;0
1933;-743329.000000000000000;-1044407.000000000000000;0
2151;-742827.000000000000000;-1045047.000000000000000;0
2161;-742876.000000000000000;-1045153.000000000000000;0
4330;-742377.440999999642372;-1043332.162999998778105;0
6721;-742321.052999999374151;-1044705.548000000417233;0
4046;-743205.699999999254942;-1044009.719999998807907;303
6007;-743187.807000000029802;-1043302.019000001251698;0
4079;-742836.170000001788139;-1043800.960000000894070;0
3208;-743682.739000000059605;-1042488.668999999761581;0
6649;-741731.100000001490116;-1044094.850000001490116;0
1862;-743477.000000000000000;-1044188.000000000000000;0
7965;-741515.510000001639128;-1044348.350000001490116;0
7782;-743012.350000001490116;-1045871.938999999314547;0
525;-742233.000000000000000;-1043884.000000000000000;0
1097;-741414.000000000000000;-1044558.000000000000000;0
1251;-742091.000000000000000;-1044690.000000000000000;0
881;-741806.000000000000000;-1042815.000000000000000;0
8261;-742108.039999999105930;-1042693.769999999552965;0
3544;-744891.706999998539686;-1042640.835999999195337;0
6873;-741769.339999999850988;-1045285.489999998360872;0
1839;-742994.469999998807907;-1044185.679999999701977;0
7014;-742650.170000001788139;-1044305.010000001639128;0
606;-741906.000000000000000;-1043273.000000000000000;0
6589;-741303.679999999701977;-1043901.390000000596046;0
6360;-742004.925000000745058;-1042692.804000001400709;0
1655;-741391.000000000000000;-1044651.000000000000000;0
8077;-742038.989999998360872;-1045265.309999998658895;0
1517;-741964.000000000000000;-1044034.000000000000000;0
3987;-743311.475000001490116;-1043983.175000000745058;0
7208;-742560.289999999105930;-1045023.789999999105930;0
4991;-742675.414999999105930;-1043031.236000001430511;0
7142;-742872.445000000298023;-1044472.239999998360872;0
4025;-743202.881000000983477;-1043852.008000001311302;0
1298;-741964.000000000000000;-1044736.000000000000000;0
8;-743496.000000000000000;-1042539.000000000000000;0
533;-742137.000000000000000;-1043750.000000000000000;0
5144;-743052.642000000923872;-1043488.940000001341105;0
335;-742635.000000000000000;-1043966.000000000000000;0
6310;-744674.719999998807907;-1042585.710000000894070;0
3994;-743394.864000000059605;-1043949.813999999314547;0
3747;-743250.879999998956919;-1042956.620000001043081;0
7410;-743525.730000000447035;-1045377.420000001788139;0
1614;-742388.000000000000000;-1044432.000000000000000;0
3810;-743261.510000001639128;-1042802.960000000894070;0
3820;-743111.699999999254942;-1042659.320000000298023;0
6692;-742222.114999998360872;-1044818.673000000417233;0
1268;-742046.000000000000000;-1045021.000000000000000;0
6806;-741090.381000000983477;-1044706.675999999046326;0
4075;-742947.934999998658895;-1043903.649999998509884;0
1462;-741464.000000000000000;-1044225.000000000000000;0
6039;-742085.370000001043081;-1043669.620999999344349;0
1087;-741605.000000000000000;-1044533.000000000000000;0
2060;-742659.000000000000000;-1044472.000000000000000;0
4659;-742803.311000000685453;-1042470.754999998956919;0
1440;-741782.000000000000000;-1044362.000000000000000;0
5454;-742806.100999999791384;-1043305.197999998927116;0
2083;-742588.000000000000000;-1044663.000000000000000;0
578;-742023.000000000000000;-1043464.000000000000000;0
5323;-743049.401000000536442;-1043038.131000000983477;0
7149;-742823.379000000655651;-1044496.758000001311302;0
7016;-742557.515000000596046;-1044334.074999999254942;0
3290;-743573.385000001639128;-1042757.348999999463558;0
4056;-743125.315000001341105;-1043671.969999998807907;0
701;-742023.000000000000000;-1042885.000000000000000;0
4086;-742813.079999998211861;-1043631.730000000447035;0
3239;-744159.614000000059605;-1042651.675000000745058;0
4069;-742920.684999998658895;-1043755.420000001788139;0
3702;-744567.984999999403954;-1042510.802000001072884;0
4578;-742381.817000001668930;-1042594.177999999374151;0
704;-741929.000000000000000;-1042879.000000000000000;0
7277;-742796.870000001043081;-1044653.429999999701977;0
3786;-743150.480000000447035;-1042925.960000000894070;0
80;-744067.000000000000000;-1043330.000000000000000;0
349;-742524.000000000000000;-1043764.000000000000000;0
4565;-742462.576999999582767;-1042533.901999998837709;0
6153;-742309.583999998867512;-1043058.640999998897314;0
7246;-742736.730000000447035;-1044825.399999998509884;0
3022;-744385.094000000506639;-1042820.482999999076128;0
1138;-741500.000000000000000;-1044458.000000000000000;0
1528;-741698.000000000000000;-1043770.000000000000000;0
5960;-743141.460999999195337;-1043339.964999999850988;0
8079;-742021.839999999850988;-1045292.179999999701977;0
5303;-743164.818999998271465;-1043211.078000001609325;0
4813;-743013.550000000745058;-1042793.390000000596046;0
3737;-745024.934999998658895;-1042390.932000000029802;0
1160;-741114.859999999403954;-1044508.120000001043081;0
8285;-742232.780000001192093;-1042821.149999998509884;0
1086;-741659.000000000000000;-1044542.000000000000000;0
2558;-741286.000000000000000;-1044387.000000000000000;0
5700;-743416.574000000953674;-1043630.223999999463558;0
6170;-742311.548000000417233;-1043059.381000000983477;0
4117;-742733.614999998360872;-1044043.129999998956919;0
7986;-741040.829999998211861;-1044408.250000000000000;0
4238;-742440.263000000268221;-1043528.236000001430511;0
6155;-742315.557999998331070;-1043068.140999998897314;0
4935;-742447.241999998688698;-1042699.399000000208616;0
171;-743448.000000000000000;-1043399.000000000000000;0
1399;-741736.000000000000000;-1044167.000000000000000;0
6753;-742485.511999998241663;-1044950.206999998539686;0
2021;-743281.000000000000000;-1044948.000000000000000;0
1546;-742219.000000000000000;-1044147.000000000000000;0
3976;-743088.861000001430511;-1043707.728000000119209;0
2482;-741262.739999998360872;-1044725.530000001192093;0
1989;-743481.000000000000000;-1044876.000000000000000;0
6448;-744017.179999999701977;-1043123.899999998509884;0
2498;-741906.000000000000000;-1044040.000000000000000;0
1797;-743098.000000000000000;-1044099.000000000000000;0
7706;-742313.239999998360872;-1044319.611999999731779;125
6922;-742056.329999998211861;-1045086.679999999701977;0
1923;-743395.000000000000000;-1044274.000000000000000;0
5210;-743253.673999998718500;-1043370.440999999642372;0
3349;-743960.629000000655651;-1042997.258999999612570;0
4162;-742497.193999998271465;-1044160.030000001192093;0
4979;-742507.703000001609325;-1043016.118000000715256;0
5702;-743417.206000000238419;-1043631.844999998807907;0
4334;-742384.170000001788139;-1043468.820000000298023;0
2446;-742750.000000000000000;-1044164.000000000000000;0
3438;-743746.833000000566244;-1043057.962000001221895;0
3141;-744035.420000001788139;-1042680.460000000894070;0
6274;-742318.392999999225140;-1043016.747000001370907;0
5119;-742850.592999998480082;-1043328.484999999403954;0
5674;-743409.089999999850988;-1043715.618000000715256;0
4706;-742728.070000000298023;-1042610.910000000149012;0
1339;-741618.000000000000000;-1045067.000000000000000;0
6222;-742316.855000000447035;-1043060.109999999403954;0
3108;-743768.699999999254942;-1042671.241999998688698;0
1537;-741924.000000000000000;-1043954.000000000000000;0
6689;-742384.449999999254942;-1045033.609999999403954;0
1287;-742217.000000000000000;-1044486.000000000000000;0
4131;-742844.625000000000000;-1044059.980000000447035;0
1953;-743344.000000000000000;-1044500.000000000000000;0
2301;-742533.000000000000000;-1045416.000000000000000;0
640;-741983.000000000000000;-1043299.000000000000000;0
1795;-742155.000000000000000;-1044231.000000000000000;0
1430;-741993.000000000000000;-1044260.000000000000000;0
5213;-743326.385999999940395;-1043368.675999999046326;0
339;-742606.000000000000000;-1043916.000000000000000;0
7007;-742923.890000000596046;-1044218.879999998956919;0
2344;-742691.000000000000000;-1045541.000000000000000;0
5589;-743423.785999998450279;-1043679.548000000417233;0
6014;-742844.000000000000000;-1043239.482999999076128;0
6354;-741928.410000000149012;-1042711.350000001490116;0
224;-742904.000000000000000;-1043522.000000000000000;0
2227;-743029.000000000000000;-1045506.000000000000000;0
5270;-742989.153999999165535;-1043210.684999998658895;0
1271;-742240.000000000000000;-1044521.000000000000000;0
1317;-741748.000000000000000;-1044884.000000000000000;0
6118;-743652.447000000625849;-1042857.607999999076128;0
4829;-743051.579999998211861;-1042916.609999999403954;0
6697;-742363.109999999403954;-1044816.120000001043081;0
6655;-741614.039999999105930;-1044145.320000000298023;0
6511;-741291.670000001788139;-1044319.690000001341105;0
1412;-741635.760000001639128;-1044654.449999999254942;0
4180;-742368.370000001043081;-1044115.471999999135733;0
6177;-742313.717999998480082;-1043061.859999999403954;0
744;-741666.000000000000000;-1042994.000000000000000;0
7538;-742701.420000001788139;-1045364.109999999403954;0
1780;-741214.000000000000000;-1043934.000000000000000;0
1219;-742137.000000000000000;-1044315.000000000000000;0
392;-742418.000000000000000;-1043843.000000000000000;0
7038;-743316.394999999552965;-1044240.155000001192093;0
507;-741953.000000000000000;-1043148.000000000000000;200
994;-741946.000000000000000;-1044433.000000000000000;0
893;-742956.000000000000000;-1042572.000000000000000;0
6995;-743129.710000000894070;-1044496.579999998211861;0
1375;-742151.000000000000000;-1044887.000000000000000;0
1099;-741376.000000000000000;-1044563.000000000000000;0
6168;-742313.092999998480082;-1043062.208999998867512;0
1696;-741529.000000000000000;-1044660.000000000000000;0
7291;-742809.960000000894070;-1044827.300000000745058;0
1222;-742157.000000000000000;-1044266.000000000000000;0
4746;-742867.769999999552965;-1042768.570000000298023;0
1698;-741464.000000000000000;-1044668.000000000000000;0
7282;-742809.410000000149012;-1044693.629999998956919;0
5686;-743394.912000000476837;-1043720.872000001370907;0
4333;-742428.420000001788139;-1043255.609999999403954;0
4463;-742198.989999998360872;-1042569.030000001192093;0
1181;-741920.000000000000000;-1044230.000000000000000;0
6176;-742314.491000000387430;-1043063.256000000983477;0
6704;-742282.179999999701977;-1044623.793999999761581;0
4848;-742977.940000001341105;-1042862.019999999552965;0
3352;-743954.622000001370907;-1043015.732999999076128;0
4054;-743269.304999999701977;-1043797.405000001192093;0
2332;-742899.000000000000000;-1045516.000000000000000;0
1927;-743501.000000000000000;-1044407.000000000000000;0
7648;-742317.809000000357628;-1045414.322000000625849;0
6771;-741345.015999998897314;-1044413.647999998182058;0
3064;-744117.098999999463558;-1042868.348999999463558;0
2418;-742410.000000000000000;-1045109.000000000000000;0
1545;-742236.000000000000000;-1044234.000000000000000;0
2085;-742426.000000000000000;-1044797.000000000000000;0
4597;-742620.600000001490116;-1042680.690000001341105;0
1103;-741306.000000000000000;-1044572.000000000000000;0
4123;-742742.956000000238419;-1043901.826000001281500;0
6284;-742309.677999999374151;-1043054.043999999761581;0
5293;-743043.969999998807907;-1043208.554000001400709;0
4901;-742520.120000001043081;-1042823.960000000894070;0
7370;-743215.177999999374151;-1045468.392000000923872;0
6485;-741795.653999999165535;-1044513.458000000566244;0
3953;-743407.249000001698732;-1043543.537000000476837;0
1754;-742120.000000000000000;-1045193.000000000000000;0
6763;-741117.219999998807907;-1044428.989999998360872;0
5317;-743063.690000001341105;-1043053.769999999552965;0
5220;-743247.339999999850988;-1043589.050000000745058;0
6749;-742418.210999999195337;-1044329.190999999642372;0
1354;-741877.000000000000000;-1044859.000000000000000;0
7158;-742984.796999998390675;-1044545.407999999821186;0
2242;-743321.000000000000000;-1045313.000000000000000;0
181;-743421.000000000000000;-1043350.000000000000000;0
733;-741963.000000000000000;-1043018.000000000000000;0
6822;-741283.870000001043081;-1044793.059999998658895;0
2329;-742432.000000000000000;-1045508.000000000000000;0
4609;-742557.414000000804663;-1042621.583999998867512;0
7959;-741699.170000001788139;-1044292.620000001043081;0
1378;-742161.000000000000000;-1044904.000000000000000;0
2409;-742363.000000000000000;-1045093.000000000000000;0
4555;-742337.140000000596046;-1042512.379999998956919;0
6151;-742311.114999998360872;-1043061.451000001281500;0
1310;-741623.000000000000000;-1044829.000000000000000;0
6827;-741437.300000000745058;-1044772.629999998956919;0
4717;-742914.300000000745058;-1042625.489999998360872;0
6148;-742313.410999998450279;-1043065.666999999433756;0
5412;-742582.037000000476837;-1042571.986000001430511;0
4922;-742443.129999998956919;-1042886.510000001639128;0
4920;-742444.449999999254942;-1042928.980000000447035;0
2049;-743499.000000000000000;-1045071.000000000000000;0
4764;-742839.835999999195337;-1042859.412999998778105;0
3134;-743932.910999998450279;-1042615.767999999225140;0
7034;-743299.725999999791384;-1044153.140000000596046;0
205;-743173.000000000000000;-1043599.000000000000000;0
4998;-742514.109000001102686;-1042978.602000001817942;0
1504;-741577.000000000000000;-1044258.000000000000000;0
5653;-743429.589999999850988;-1043701.940999999642372;0
1306;-741783.000000000000000;-1044653.000000000000000;0
2369;-742503.000000000000000;-1045427.000000000000000;0
2070;-742993.000000000000000;-1044723.000000000000000;0
1242;-742137.000000000000000;-1044481.000000000000000;0
1003;-741913.000000000000000;-1044580.000000000000000;0
203;-743204.000000000000000;-1043607.000000000000000;0
580;-742010.000000000000000;-1043443.000000000000000;0
4814;-743000.489999998360872;-1042803.920000001788139;0
3380;-743794.508000001311302;-1042935.758999999612570;0
727;-742001.000000000000000;-1042962.000000000000000;0
1167;-741836.000000000000000;-1044429.000000000000000;0
4724;-742870.089999999850988;-1042658.210000000894070;0
5450;-743130.769000001251698;-1043378.403000000864267;0
1819;-743034.000000000000000;-1044350.000000000000000;0
1542;-742043.000000000000000;-1044057.000000000000000;0
1956;-743397.000000000000000;-1044501.000000000000000;0
7145;-742812.874000001698732;-1044402.199000000953674;0
3985;-743312.765000000596046;-1043928.164999999105930;0
6229;-742318.326000001281500;-1043061.204999998211861;0
6282;-742308.337999999523163;-1043045.984000001102686;0
988;-741820.000000000000000;-1044516.000000000000000;0
8149;-743305.579999998211861;-1043204.070000000298023;0
5507;-743426.703000001609325;-1043656.230999998748302;0
7798;-743468.929999999701977;-1045091.809999998658895;0
6785;-741294.269999999552965;-1044465.800000000745058;0
6144;-742308.925000000745058;-1043059.002000000327826;0
5728;-743421.517999999225140;-1043638.609000001102686;0
7677;-742383.142000000923872;-1045124.221000000834465;0
6130;-742312.136999998241663;-1043066.344000000506639;0
5683;-743398.456000000238419;-1043719.557999998331070;0
1812;-743149.000000000000000;-1044528.000000000000000;0
7180;-742618.809000000357628;-1044646.109000001102686;0
3097;-743920.339999999850988;-1042769.188999999314547;0
4815;-742992.210000000894070;-1042788.359999999403954;0
6505;-741746.570000000298023;-1044600.429999999701977;0
746;-741714.000000000000000;-1043020.000000000000000;0
4078;-742842.960000000894070;-1043832.824999999254942;0
1303;-741865.000000000000000;-1044692.000000000000000;0
1325;-741894.000000000000000;-1044959.000000000000000;0
8060;-742295.719999998807907;-1045082.859999999403954;0
552;-742259.000000000000000;-1043732.000000000000000;0
464;-741713.000000000000000;-1043286.000000000000000;0
5959;-742962.548999998718500;-1043523.155000001192093;0
7347;-742557.690000001341105;-1045177.440000001341105;0
4833;-743036.859999999403954;-1042820.050000000745058;0
6103;-742213.102000001817942;-1043103.528999999165535;0
6503;-741647.706000000238419;-1044996.008999999612570;0
4834;-742972.708000000566244;-1042657.809000000357628;0
1515;-741913.000000000000000;-1044072.000000000000000;0
5139;-743032.489999998360872;-1043533.679999999701977;0
4529;-742762.920000001788139;-1042885.809999998658895;0
4509;-742502.519999999552965;-1042732.079999998211861;0
1092;-741549.000000000000000;-1044556.000000000000000;0
1013;-742076.000000000000000;-1044595.000000000000000;0
4593;-742510.820000000298023;-1042652.203999999910593;0
5116;-742947.859000001102686;-1043386.767000000923872;0
6860;-741482.129999998956919;-1044991.089999999850988;0
4779;-742917.822999998927116;-1042727.385000001639128;0
1769;-741260.000000000000000;-1044112.000000000000000;0
2372;-742466.000000000000000;-1045488.000000000000000;0
6508;-741728.552999999374151;-1044508.050999999046326;0
7982;-741163.039999999105930;-1044413.210000000894070;0
6156;-742314.791999999433756;-1043066.736000001430511;0
6196;-742314.190000001341105;-1043059.774999998509884;0
6665;-741433.260000001639128;-1044189.760000001639128;0
7963;-741608.199999999254942;-1044329.510000001639128;0
395;-742369.000000000000000;-1043840.000000000000000;0
5232;-743347.087000001221895;-1043476.425000000745058;0
4052;-743252.954999998211861;-1043843.585000000894070;0
2511;-743050.000000000000000;-1044050.000000000000000;0
1718;-741366.219999998807907;-1044870.989999998360872;0
5451;-743276.109000001102686;-1043331.000999998301268;0
7003;-743074.140000000596046;-1044350.280000001192093;0
4251;-742136.420000001788139;-1043379.969999998807907;0
5591;-743421.353999998420477;-1043679.738000001758337;0
4310;-742031.800000000745058;-1043475.199999999254942;0
4227;-742108.530000001192093;-1043326.289999999105930;0
6838;-741701.057999998331070;-1044977.087000001221895;0
1401;-741723.000000000000000;-1044408.000000000000000;0
6769;-741281.120000001043081;-1044417.780000001192093;0
4528;-742714.350000001490116;-1042840.010000001639128;0
914;-741715.000000000000000;-1042583.000000000000000;0
1118;-741807.000000000000000;-1044459.000000000000000;0
1117;-741066.000000000000000;-1044603.000000000000000;0
4777;-742910.034000001847744;-1042759.350999999791384;0
4781;-742926.519000001251698;-1042695.502999998629093;0
626;-742236.000000000000000;-1043317.000000000000000;0
6106;-742210.445999998599291;-1043112.203000001609325;0
6395;-742057.429999999701977;-1042500.809999998658895;0
397;-742355.000000000000000;-1043861.000000000000000;0
3308;-743813.059999998658895;-1042830.515000000596046;0
8152;-743293.600000001490116;-1043190.510000001639128;0
4527;-742728.050000000745058;-1042838.719999998807907;0
1124;-741715.000000000000000;-1044452.000000000000000;0
389;-742408.000000000000000;-1043783.000000000000000;0
3951;-743433.379999998956919;-1043586.600000001490116;0
4906;-742448.370000001043081;-1042815.789999999105930;0
6216;-742313.892000000923872;-1043056.272999998182058;0
5221;-743263.820000000298023;-1043556.920000001788139;0
5435;-744041.557000000029802;-1043128.000999998301268;0
609;-741984.000000000000000;-1043272.000000000000000;0
3915;-744021.765999998897314;-1043098.603999998420477;0
5284;-743041.022999998182058;-1043277.397999998182058;0
5667;-743417.361999999731779;-1043712.557000000029802;0
3273;-743642.442999999970198;-1042796.677999999374151;0
1628;-742449.000000000000000;-1044494.000000000000000;0
4950;-742354.289999999105930;-1042955.670000001788139;0
5324;-743025.329999998211861;-1043045.789999999105930;0
4241;-742225.929999999701977;-1043394.530000001192093;0
6171;-742310.780999999493361;-1043057.971000000834465;0
5109;-742850.925999999046326;-1043483.024999998509884;0
2018;-743244.000000000000000;-1044909.000000000000000;0
5409;-743745.201000001281500;-1042902.750000000000000;0
6199;-742319.442000001668930;-1043067.822999998927116;0
4893;-742637.320000000298023;-1042818.600999999791384;0
680;-742402.109999999403954;-1043166.679999999701977;0
4331;-742391.967999998480082;-1043310.539000000804663;0
1332;-741793.000000000000000;-1044755.000000000000000;0
3302;-743795.043999999761581;-1042863.539000000804663;0
6162;-742310.199999999254942;-1043058.306000001728535;0
4201;-742269.000000000000000;-1043651.563000001013279;0
6858;-741492.363000001758337;-1044950.462999999523163;0
1127;-741700.000000000000000;-1044440.000000000000000;0
1694;-741582.000000000000000;-1044653.000000000000000;0
6839;-741723.412000000476837;-1044988.993000000715256;0
874;-741755.000000000000000;-1042675.000000000000000;0
3795;-743173.190000001341105;-1042842.170000001788139;0
1017;-742167.000000000000000;-1044603.000000000000000;0
1656;-741395.000000000000000;-1044688.000000000000000;0
8263;-742151.089999999850988;-1042702.239999998360872;0
407;-742340.000000000000000;-1044177.000000000000000;0
6256;-742380.723000001162291;-1043035.640000000596046;0
3995;-743393.225000001490116;-1043973.719999998807907;0
7939;-741306.171999998390675;-1043955.960000000894070;0
7299;-743117.530000001192093;-1045145.859999999403954;0
5668;-743416.179999999701977;-1043712.995000001043081;0
4830;-743043.449999999254942;-1042882.359999999403954;0
4761;-742810.285000000149012;-1042793.122000001370907;0
7153;-742889.646999999880791;-1044547.438000001013279;0
3312;-743789.184999998658895;-1042904.234000001102686;0
4611;-742532.804999999701977;-1042593.420000001788139;0
2090;-742923.000000000000000;-1044566.000000000000000;0
403;-742307.000000000000000;-1043931.000000000000000;0
6509;-741724.809999998658895;-1044485.162000000476837;0
3148;-744008.699000000953674;-1042624.668999999761581;0
3296;-743606.032999999821186;-1042838.453999999910593;0
1044;-741861.000000000000000;-1044743.000000000000000;0
4143;-742750.925000000745058;-1044017.960000000894070;0
346;-742540.000000000000000;-1043816.000000000000000;0
4736;-742701.269999999552965;-1042690.000000000000000;0
843;-742085.000000000000000;-1042507.000000000000000;0
2171;-742893.000000000000000;-1045151.000000000000000;0
7945;-742063.179999999701977;-1044077.379999998956919;0
4425;-742208.820000000298023;-1043035.230000000447035;0
696;-742077.000000000000000;-1042913.000000000000000;0
4969;-742465.059999998658895;-1043095.034000001847744;0
2374;-742473.000000000000000;-1045546.000000000000000;0
4221;-742209.576000001281500;-1043499.238000001758337;0
4320;-742264.149000000208616;-1043259.541999999433756;0
4676;-742792.579999998211861;-1042771.519999999552965;0
6295;-742653.399999998509884;-1042696.070000000298023;0
1919;-743381.000000000000000;-1044393.000000000000000;0
4341;-742488.855000000447035;-1043325.412999998778105;0
4854;-742971.159000001847744;-1042912.429000001400709;0
1732;-741840.000000000000000;-1045226.000000000000000;0
4668;-742810.210000000894070;-1042618.969999998807907;0
6213;-742316.227000001817942;-1043060.478999998420477;0
1700;-741406.000000000000000;-1044677.000000000000000;0
617;-742179.000000000000000;-1043272.000000000000000;0
6359;-742018.440000001341105;-1042712.449999999254942;0
4585;-742437.502000000327826;-1042630.243999999016523;0
836;-742006.000000000000000;-1042525.000000000000000;0
6278;-742305.421999998390675;-1043028.918000001460314;0
5578;-743409.534000001847744;-1043632.701000001281500;0
1929;-743440.000000000000000;-1044410.000000000000000;0
1025;-741989.000000000000000;-1044602.000000000000000;0
3796;-743161.100000001490116;-1042834.149999998509884;0
6164;-742316.155999999493361;-1043067.784000001847744;0
6488;-741718.210000000894070;-1044532.489999998360872;0
755;-741668.000000000000000;-1042700.000000000000000;0
5002;-742561.190000001341105;-1042977.401999998837709;0
3347;-743959.280000001192093;-1043034.447000000625849;0
7542;-742623.890000000596046;-1045372.899999998509884;0
7508;-742947.440000001341105;-1045540.690000001341105;0
4944;-742430.605999998748302;-1043013.879000000655651;0
4210;-742178.550000000745058;-1043586.035000000149012;0
993;-741977.000000000000000;-1044436.000000000000000;0
1286;-742221.460000000894070;-1044465.969999998807907;0
6493;-742196.574000000953674;-1044452.076999999582767;0
5236;-743352.302000001072884;-1043362.752000000327826;0
336;-742616.000000000000000;-1043959.000000000000000;0
1337;-741723.000000000000000;-1044886.000000000000000;0
4749;-742884.420000001788139;-1042760.329999998211861;0
1353;-741862.000000000000000;-1044843.000000000000000;0
8273;-742057.820000000298023;-1042728.760000001639128;0
3183;-743909.289999999105930;-1042546.210000000894070;0
683;-742362.000000000000000;-1043155.000000000000000;0
6270;-742333.412999998778105;-1043018.204999998211861;0
1261;-742057.000000000000000;-1044894.000000000000000;0
4232;-742315.057999998331070;-1043428.918999999761581;0
