OID_;X;Y;TEMPERATURE
5995;-744441.440999999642372;-1042779.568999998271465;0
3527;-744805.695999998599291;-1042671.809000000357628;0
3538;-744616.304000001400709;-1042656.734000001102686;0
3585;-744920.065000001341105;-1042522.129999998956919;0
3460;-744993.289000000804663;-1042693.587000001221895;0
3466;-745113.802000001072884;-1042675.725000001490116;0
3612;-744996.545000001788139;-1042292.646000001579523;0
3706;-744567.589999999850988;-1042534.585000000894070;0
3537;-744632.945000000298023;-1042671.657000001519918;0
2758;-743919.949999999254942;-1043488.059999998658895;0
1775;-741246.000000000000000;-1044012.000000000000000;0
2641;-743432.578999999910593;-1042583.418999999761581;0
3211;-743651.409000001847744;-1042483.458999998867512;0
2809;-744090.649999998509884;-1043371.184000000357628;0
3921;-743909.208999998867512;-1043541.574000000953674;0
110;-744127.000000000000000;-1042724.000000000000000;3
385;-742436.000000000000000;-1043742.000000000000000;0
350;-742505.000000000000000;-1043757.000000000000000;0
5787;-743470.390000000596046;-1042099.079999998211861;0
4086;-742813.079999998211861;-1043631.730000000447035;0
1492;-741096.000000000000000;-1044331.000000000000000;0
7798;-743468.929999999701977;-1045091.809999998658895;0
3108;-743768.699999999254942;-1042671.241999998688698;0
1584;-742368.000000000000000;-1044717.000000000000000;0
7147;-742827.925000000745058;-1044451.385000001639128;0
1524;-741710.000000000000000;-1043844.000000000000000;0
700;-742008.000000000000000;-1042895.000000000000000;0
514;-742119.000000000000000;-1043141.000000000000000;0
528;-742187.000000000000000;-1043838.000000000000000;0
7409;-743521.629999998956919;-1045356.570000000298023;0
6944;-742927.063000001013279;-1043928.673000000417233;0
623;-742254.000000000000000;-1043325.000000000000000;0
1369;-742029.000000000000000;-1044788.000000000000000;0
1521;-741808.000000000000000;-1043917.000000000000000;0
7140;-742921.300000000745058;-1044469.335000000894070;0
3752;-743213.949999999254942;-1042902.719999998807907;0
2485;-741285.420000001788139;-1044820.140000000596046;0
2018;-743244.000000000000000;-1044909.000000000000000;0
4068;-742917.125000000000000;-1043734.535000000149012;0
7011;-742831.309999998658895;-1044257.245000001043081;0
673;-742467.000000000000000;-1043230.000000000000000;0
713;-741800.000000000000000;-1042859.000000000000000;0
7655;-742266.583000000566244;-1045284.133999999612570;0
2061;-742681.000000000000000;-1044491.000000000000000;0
2480;-741251.739999998360872;-1044639.480000000447035;0
7324;-742833.980000000447035;-1044949.109999999403954;0
6339;-742245.460000000894070;-1042835.780000001192093;0
4208;-742372.416999999433756;-1043503.423000000417233;0
3279;-743638.815999999642372;-1042804.333999998867512;0
343;-742575.000000000000000;-1043857.000000000000000;0
2225;-743041.000000000000000;-1045477.000000000000000;0
4064;-742879.655000001192093;-1043647.420000001788139;0
2167;-743021.000000000000000;-1045154.000000000000000;0
1661;-741426.000000000000000;-1044846.000000000000000;0
7184;-742592.399999998509884;-1044704.010000001639128;0
5307;-743082.182000000029802;-1043190.162000000476837;0
1934;-743294.000000000000000;-1044407.000000000000000;0
3886;-742385.100000001490116;-1042445.500000000000000;0
1179;-741934.000000000000000;-1044251.000000000000000;0
4237;-742425.385000001639128;-1043517.421000000089407;0
5066;-742827.379000000655651;-1043252.267999999225140;0
2152;-742814.000000000000000;-1045106.000000000000000;0
7716;-743023.190999999642372;-1045843.241999998688698;0
1310;-741623.000000000000000;-1044829.000000000000000;0
8259;-742072.089999999850988;-1042687.219999998807907;0
1929;-743440.000000000000000;-1044410.000000000000000;0
5265;-743188.572999998927116;-1043226.513999998569489;0
1918;-743377.000000000000000;-1044428.000000000000000;0
7233;-742606.750000000000000;-1044827.379999998956919;0
2036;-743404.000000000000000;-1044803.000000000000000;0
1753;-742096.000000000000000;-1045195.000000000000000;0
787;-741714.000000000000000;-1042620.000000000000000;0
4145;-742687.109999999403954;-1043837.125000000000000;0
4847;-742981.100000001490116;-1042831.059999998658895;0
5250;-743328.995000001043081;-1043178.495000001043081;0
2308;-742345.000000000000000;-1045499.000000000000000;0
8271;-742030.649999998509884;-1042720.129999998956919;0
1248;-742109.000000000000000;-1044631.000000000000000;0
6095;-742082.920000001788139;-1043614.710000000894070;0
3819;-743120.250000000000000;-1042679.620000001043081;0
6746;-742405.083999998867512;-1044259.199999999254942;0
7218;-742534.100000001490116;-1044603.559999998658895;0
1163;-741072.820000000298023;-1044501.940000001341105;0
7514;-742304.866000000387430;-1044375.124000001698732;0
1270;-742242.000000000000000;-1044491.000000000000000;0
1042;-741883.000000000000000;-1044682.000000000000000;0
5110;-742876.271999999880791;-1043449.013000000268221;0
6505;-741746.570000000298023;-1044600.429999999701977;0
2288;-742936.000000000000000;-1045436.000000000000000;0
2326;-742523.000000000000000;-1045498.000000000000000;0
3347;-743959.280000001192093;-1043034.447000000625849;0
8081;-741974.019999999552965;-1045331.530000001192093;0
6478;-741931.429999999701977;-1044453.500000000000000;0
530;-742139.000000000000000;-1043771.000000000000000;0
466;-741743.000000000000000;-1043331.000000000000000;0
332;-742645.000000000000000;-1044014.000000000000000;0
6835;-741618.964000001549721;-1044934.515000000596046;0
1026;-741986.000000000000000;-1044631.000000000000000;0
3268;-743594.046999998390675;-1042721.412999998778105;0
6805;-741109.710000000894070;-1044689.170000001788139;0
7170;-742667.579999998211861;-1044492.469999998807907;0
1698;-741464.000000000000000;-1044668.000000000000000;0
5372;-742084.010000001639128;-1043008.550000000745058;0
1085;-741634.000000000000000;-1044530.000000000000000;0
6692;-742222.114999998360872;-1044818.673000000417233;0
5936;-743333.519000001251698;-1043956.541999999433756;0
6853;-741548.899000000208616;-1045052.295000001788139;0
7538;-742701.420000001788139;-1045364.109999999403954;0
1060;-741610.000000000000000;-1045115.000000000000000;0
2386;-742139.000000000000000;-1045460.000000000000000;0
4134;-742772.309999998658895;-1044078.870000001043081;0
1376;-742165.000000000000000;-1044873.000000000000000;0
506;-741980.000000000000000;-1043158.000000000000000;0
4128;-742915.039999999105930;-1044041.920000001788139;0
698;-742041.000000000000000;-1042903.000000000000000;0
4463;-742198.989999998360872;-1042569.030000001192093;0
6004;-742061.723000001162291;-1043300.859999999403954;0
1872;-743422.000000000000000;-1044246.000000000000000;0
1546;-742219.000000000000000;-1044147.000000000000000;0
2343;-742674.000000000000000;-1045557.000000000000000;0
4506;-742419.730000000447035;-1042717.019999999552965;0
1348;-741801.000000000000000;-1044829.000000000000000;0
1628;-742449.000000000000000;-1044494.000000000000000;0
1823;-742973.000000000000000;-1044174.000000000000000;0
7043;-743398.899999998509884;-1044106.629999998956919;0
974;-741933.000000000000000;-1044544.000000000000000;0
4582;-742390.164999999105930;-1042606.546000000089407;0
1761;-741194.000000000000000;-1044104.000000000000000;0
1539;-741977.000000000000000;-1043997.000000000000000;0
1213;-742068.000000000000000;-1044387.000000000000000;0
1684;-741136.379999998956919;-1044735.140000000596046;0
1814;-743095.000000000000000;-1044510.000000000000000;0
876;-741953.000000000000000;-1042636.000000000000000;0
1395;-741799.000000000000000;-1044291.000000000000000;0
7027;-743237.269999999552965;-1044095.524999998509884;0
2236;-743391.000000000000000;-1045242.000000000000000;0
4223;-742161.556000001728535;-1043473.138999998569489;0
7262;-742990.940000001341105;-1044886.989999998360872;0
3333;-743967.447999998927116;-1042967.616000000387430;0
6840;-741746.993999999016523;-1044999.993999999016523;0
5063;-742783.370000001043081;-1043241.048999998718500;0
5270;-742989.153999999165535;-1043210.684999998658895;0
159;-742965.000000000000000;-1042641.000000000000000;0
1850;-742751.000000000000000;-1044237.000000000000000;0
2086;-742404.000000000000000;-1044796.000000000000000;0
7276;-742801.670000001788139;-1044613.309999998658895;0
284;-743022.000000000000000;-1043758.000000000000000;0
1615;-742367.000000000000000;-1044434.000000000000000;0
817;-741937.000000000000000;-1042586.000000000000000;0
1461;-741473.000000000000000;-1044266.000000000000000;0
3372;-743823.475000001490116;-1043010.432999998331070;0
1939;-743269.000000000000000;-1044355.000000000000000;0
6945;-742955.907000001519918;-1043932.182999998331070;0
1840;-742984.379999998956919;-1044155.149999998509884;0
1095;-741452.000000000000000;-1044553.000000000000000;0
1120;-741778.000000000000000;-1044457.000000000000000;0
549;-742290.000000000000000;-1043770.000000000000000;0
5258;-743356.739999998360872;-1043230.039999999105930;0
216;-743023.000000000000000;-1043539.000000000000000;0
5208;-743237.954999998211861;-1043368.065999999642372;0
2024;-743305.000000000000000;-1045000.000000000000000;0
2885;-744122.791999999433756;-1043190.208000000566244;0
6240;-742364.495999999344349;-1043067.289999999105930;0
1485;-741184.000000000000000;-1044223.000000000000000;0
5235;-743350.096000000834465;-1043388.881000000983477;0
1151;-741279.000000000000000;-1044475.000000000000000;0
4116;-742740.429999999701977;-1044064.789999999105930;0
4331;-742391.967999998480082;-1043310.539000000804663;0
874;-741755.000000000000000;-1042675.000000000000000;0
602;-741828.000000000000000;-1043190.000000000000000;0
4989;-742648.756000000983477;-1043019.318999998271465;0
1214;-742064.000000000000000;-1044358.000000000000000;0
7641;-742335.304000001400709;-1045451.613000001758337;0
3439;-743751.594000000506639;-1043080.798999998718500;0
275;-743361.000000000000000;-1043904.000000000000000;0
7017;-742571.059999998658895;-1044267.640000000596046;0
3314;-743758.675999999046326;-1042905.688999999314547;0
4638;-742553.631999999284744;-1042542.028000000864267;0
400;-742356.000000000000000;-1043931.000000000000000;0
6193;-742316.486000001430511;-1043063.991000000387430;0
7947;-742030.969999998807907;-1044096.679999999701977;0
3093;-743925.421999998390675;-1042803.127000000327826;0
1141;-741454.000000000000000;-1044453.000000000000000;0
711;-741828.000000000000000;-1042860.000000000000000;0
3310;-743829.561999998986721;-1042854.063000001013279;0
1878;-743324.000000000000000;-1044249.000000000000000;0
847;-742155.000000000000000;-1042504.000000000000000;0
7021;-743129.019999999552965;-1044076.230000000447035;331
1693;-741613.000000000000000;-1044649.000000000000000;76
401;-742324.000000000000000;-1043907.000000000000000;0
1702;-741348.000000000000000;-1044682.000000000000000;0
4078;-742842.960000000894070;-1043832.824999999254942;0
1302;-741842.000000000000000;-1044693.000000000000000;0
1503;-741537.000000000000000;-1044272.000000000000000;0
5669;-743414.997999999672174;-1043713.431000001728535;0
1983;-743474.000000000000000;-1044709.000000000000000;0
7356;-743331.410000000149012;-1045146.359999999403954;0
4808;-743110.859999999403954;-1042784.829999998211861;0
5124;-742983.513000000268221;-1043417.271999999880791;0
6691;-742386.879000000655651;-1045082.589000001549721;0
2139;-742936.000000000000000;-1045103.000000000000000;0
340;-742588.000000000000000;-1043906.000000000000000;0
6124;-743427.861999999731779;-1043609.043000001460314;0
7706;-742313.239999998360872;-1044319.611999999731779;0
1328;-742037.000000000000000;-1045043.000000000000000;0
6844;-741545.278999999165535;-1044985.256999999284744;0
1654;-741387.000000000000000;-1044621.000000000000000;0
6201;-742317.888999998569489;-1043065.035000000149012;0
4664;-742806.739999998360872;-1042547.980000000447035;0
841;-742056.000000000000000;-1042508.000000000000000;0
4058;-743138.765000000596046;-1043625.405000001192093;0
890;-742007.000000000000000;-1042740.000000000000000;0
5136;-742992.278000000864267;-1043472.440000001341105;0
5302;-743090.423999998718500;-1043070.048999998718500;0
4033;-743319.719999998807907;-1043793.300000000745058;0
7975;-741349.339999999850988;-1044397.800000000745058;0
2093;-742915.000000000000000;-1044642.000000000000000;0
1817;-743058.000000000000000;-1044411.000000000000000;0
4755;-742734.960000000894070;-1042778.019999999552965;0
1035;-741963.000000000000000;-1044896.000000000000000;0
6560;-741301.682000000029802;-1043959.640000000596046;0
926;-741894.000000000000000;-1042999.000000000000000;0
5746;-743415.399000000208616;-1043698.644000001251698;0
4764;-742839.835999999195337;-1042859.412999998778105;0
1472;-741677.000000000000000;-1044145.000000000000000;0
7970;-741444.739999998360872;-1044384.980000000447035;0
2255;-743181.000000000000000;-1045372.000000000000000;0
4249;-742151.910000000149012;-1043354.719999998807907;0
6234;-742324.105000000447035;-1043076.613000001758337;0
4858;-742955.339999999850988;-1042963.960000000894070;0
625;-742247.000000000000000;-1043299.000000000000000;0
3888;-742331.469999998807907;-1042455.429999999701977;0
1168;-741825.000000000000000;-1044403.000000000000000;0
880;-741793.000000000000000;-1042834.000000000000000;0
6167;-742313.859999999403954;-1043063.607000000774860;0
4055;-743119.070000000298023;-1043694.109999999403954;0
6104;-742208.646999999880791;-1043103.999000001698732;0
889;-742000.000000000000000;-1042770.000000000000000;0
7182;-742597.789999999105930;-1044678.260000001639128;0
1126;-741684.000000000000000;-1044450.000000000000000;0
4659;-742803.311000000685453;-1042470.754999998956919;0
222;-742939.000000000000000;-1043526.000000000000000;0
3846;-743149.390000000596046;-1042549.600000001490116;0
8055;-742223.859999999403954;-1045007.899999998509884;0
7935;-743156.000000000000000;-1045071.149999998509884;0
4429;-742222.260000001639128;-1043102.250000000000000;0
5177;-743336.440999999642372;-1043440.883999999612570;0
2097;-743143.000000000000000;-1044742.000000000000000;0
1306;-741783.000000000000000;-1044653.000000000000000;0
4696;-742682.817000001668930;-1042658.543999999761581;0
1843;-743041.600000001490116;-1044324.489999998360872;0
4340;-742473.662000000476837;-1043349.048999998718500;0
1047;-741816.000000000000000;-1044867.000000000000000;0
4771;-742890.828000001609325;-1042889.975000001490116;0
6313;-743936.949999999254942;-1042594.780000001192093;0
4252;-742124.022999998182058;-1043390.519000001251698;0
2233;-743461.000000000000000;-1045218.000000000000000;0
2493;-742011.000000000000000;-1044181.000000000000000;0
282;-743034.000000000000000;-1043819.000000000000000;0
2179;-742953.000000000000000;-1045258.000000000000000;0
6723;-742592.894999999552965;-1044408.905000001192093;0
5642;-743428.609999999403954;-1043688.666999999433756;0
2473;-743469.000000000000000;-1044899.000000000000000;0
4088;-742812.114999998360872;-1043580.475000001490116;0
171;-743448.000000000000000;-1043399.000000000000000;0
3815;-743161.949999999254942;-1042769.750000000000000;0
4151;-742573.039999999105930;-1044109.035000000149012;0
4633;-742625.931000001728535;-1042639.918999999761581;0
6695;-742306.234000001102686;-1044816.138999998569489;0
5699;-743416.657000001519918;-1043631.932999998331070;0
3800;-743098.550000000745058;-1042863.019999999552965;0
7095;-743370.940000001341105;-1044597.230000000447035;0
7962;-741640.190000001341105;-1044316.800000000745058;0
8267;-742240.420000001788139;-1042709.160000000149012;0
2245;-743239.000000000000000;-1045356.000000000000000;0
4906;-742448.370000001043081;-1042815.789999999105930;0
2037;-743373.000000000000000;-1044805.000000000000000;0
1265;-742047.000000000000000;-1044960.000000000000000;0
941;-742098.000000000000000;-1043132.000000000000000;0
5654;-743429.644000001251698;-1043703.151000000536442;0
1956;-743397.000000000000000;-1044501.000000000000000;0
4634;-742635.980000000447035;-1042656.144999999552965;0
5734;-743412.366999998688698;-1043688.041999999433756;0
3784;-743187.730000000447035;-1042922.429999999701977;0
1457;-741510.000000000000000;-1044411.000000000000000;0
739;-741789.000000000000000;-1043028.000000000000000;0
1224;-742174.000000000000000;-1044253.000000000000000;0
600;-741840.000000000000000;-1043212.000000000000000;0
5128;-743040.467000000178814;-1043389.765999998897314;0
6249;-742373.554999999701977;-1043049.822000000625849;0
748;-741671.000000000000000;-1042971.000000000000000;0
6872;-741751.719999998807907;-1045296.679999999701977;0
1322;-741906.000000000000000;-1044975.000000000000000;0
3128;-743948.160000000149012;-1042657.320000000298023;0
3824;-743038.059999998658895;-1042573.800000000745058;0
6702;-742291.596999999135733;-1044564.116999998688698;0
7279;-742799.399999998509884;-1044679.829999998211861;0
4712;-742830.309999998658895;-1042614.969999998807907;0
7723;-741757.929000001400709;-1044043.175000000745058;0
2226;-743057.000000000000000;-1045470.000000000000000;0
6246;-742370.552999999374151;-1043055.625999998301268;0
1444;-741559.000000000000000;-1044786.000000000000000;0
6223;-742316.076000001281500;-1043058.679000001400709;0
680;-742402.109999999403954;-1043166.679999999701977;0
2550;-741576.000000000000000;-1044342.000000000000000;0
6105;-742213.883000001311302;-1043111.734000001102686;0
7967;-741508.109999999403954;-1044369.239999998360872;0
6749;-742418.210999999195337;-1044329.190999999642372;0
5682;-743399.638000000268221;-1043719.120999999344349;0
5001;-742560.092999998480082;-1042966.206999998539686;0
5325;-742997.480000000447035;-1043042.289999999105930;0
2430;-742493.000000000000000;-1045120.000000000000000;0
3816;-743149.379999998956919;-1042748.489999998360872;0
1;-743520.000000000000000;-1042472.000000000000000;0
6203;-742316.357000000774860;-1043062.256000000983477;0
1245;-742114.000000000000000;-1044548.000000000000000;0
725;-741983.000000000000000;-1042939.000000000000000;0
7039;-743335.785000000149012;-1044169.030000001192093;0
1178;-741952.000000000000000;-1044311.000000000000000;0
6116;-742963.905999999493361;-1042886.313000001013279;0
7188;-742583.839999999850988;-1044742.870000001043081;0
1288;-742189.000000000000000;-1044543.000000000000000;0
1596;-742323.000000000000000;-1045037.000000000000000;0
4018;-743153.285000000149012;-1043925.850000001490116;0
1192;-741801.000000000000000;-1044083.000000000000000;0
2087;-742450.000000000000000;-1044838.000000000000000;0
7318;-742578.910000000149012;-1045033.530000001192093;0
6135;-742308.289000000804663;-1043059.340999998152256;0
943;-742292.000000000000000;-1043017.000000000000000;0
1793;-742166.000000000000000;-1044246.000000000000000;0
1969;-743376.000000000000000;-1044829.000000000000000;0
1421;-741587.000000000000000;-1044356.000000000000000;0
4592;-742448.190999999642372;-1042642.517999999225140;0
1966;-743413.000000000000000;-1044746.000000000000000;0
3392;-743913.699999999254942;-1043165.480000000447035;0
1873;-743410.000000000000000;-1044260.000000000000000;0
5411;-742776.079999998211861;-1042905.300000000745058;0
2340;-742764.000000000000000;-1045532.000000000000000;0
7519;-742850.620000001043081;-1045673.670000001788139;0
6303;-741823.820000000298023;-1042750.410000000149012;0
7244;-742713.559999998658895;-1044823.719999998807907;0
6179;-742312.195000000298023;-1043059.041000001132488;0
6218;-742319.947000000625849;-1043065.767999999225140;0
1285;-742198.000000000000000;-1044467.000000000000000;0
7699;-742381.114000000059605;-1044818.644000001251698;0
6657;-741565.760000001639128;-1044156.980000000447035;0
1428;-742028.000000000000000;-1044235.000000000000000;0
4218;-742263.436999998986721;-1043615.100999999791384;0
1142;-741437.000000000000000;-1044466.000000000000000;0
3097;-743920.339999999850988;-1042769.188999999314547;0
6202;-742317.124000001698732;-1043063.651999998837709;0
797;-741796.000000000000000;-1042574.000000000000000;0
4747;-742866.289999999105930;-1042753.390000000596046;0
522;-742261.000000000000000;-1043122.000000000000000;0
5220;-743247.339999999850988;-1043589.050000000745058;0
1504;-741577.000000000000000;-1044258.000000000000000;0
6228;-742319.103999998420477;-1043062.592000000178814;0
8265;-742197.820000000298023;-1042704.260000001639128;0
6126;-743428.385999999940395;-1043621.800000000745058;0
2329;-742432.000000000000000;-1045508.000000000000000;0
5639;-743428.337999999523163;-1043685.046999998390675;0
2270;-742954.000000000000000;-1045592.000000000000000;0
4560;-742427.079999998211861;-1042500.829999998211861;0
7397;-743021.859999999403954;-1045682.989999998360872;0
582;-741994.000000000000000;-1043417.000000000000000;0
4023;-743246.635000001639128;-1043864.364999998360872;0
3342;-743922.624000001698732;-1043077.261999998241663;0
2249;-743211.000000000000000;-1045443.000000000000000;0
2482;-741262.739999998360872;-1044725.530000001192093;0
4180;-742368.370000001043081;-1044115.471999999135733;0
1556;-741195.000000000000000;-1044344.000000000000000;0
1330;-741817.000000000000000;-1044709.000000000000000;0
5757;-743420.747999999672174;-1043633.940999999642372;0
7293;-742822.780000001192093;-1044833.550000000745058;0
1419;-741603.000000000000000;-1044410.000000000000000;0
4798;-743028.991999998688698;-1042693.375000000000000;0
6789;-741187.510000001639128;-1044470.660000000149012;0
1489;-741055.000000000000000;-1044209.000000000000000;0
4526;-742696.690000001341105;-1042823.320000000298023;0
7257;-742901.879999998956919;-1044859.039999999105930;0
2440;-742596.000000000000000;-1044193.000000000000000;0
2009;-743221.000000000000000;-1044770.000000000000000;0
1089;-741567.949999999254942;-1044538.820000000298023;0
7387;-743066.739999998360872;-1045487.570000000298023;0
3361;-743933.616000000387430;-1042980.793000001460314;0
581;-741991.000000000000000;-1043457.000000000000000;0
3283;-743632.767000000923872;-1042846.004000000655651;0
406;-742366.000000000000000;-1044171.000000000000000;0
1961;-743397.000000000000000;-1044642.000000000000000;0
94;-744054.000000000000000;-1042934.000000000000000;0
2401;-742253.000000000000000;-1045390.000000000000000;0
4890;-742605.287000000476837;-1042838.535000000149012;0
3971;-743206.815000001341105;-1043721.065000001341105;0
5713;-743423.890999998897314;-1043636.899999998509884;0
2029;-743393.000000000000000;-1045068.000000000000000;0
7955;-741807.699999999254942;-1044246.519999999552965;0
5295;-743047.995000001043081;-1043185.530000001192093;0
4839;-742984.162000000476837;-1042715.425000000745058;0
6719;-742371.686999998986721;-1044952.227000001817942;0
5507;-743426.703000001609325;-1043656.230999998748302;0
5745;-743415.129000000655651;-1043695.054000001400709;0
4025;-743202.881000000983477;-1043852.008000001311302;0
563;-742155.000000000000000;-1043660.000000000000000;0
4458;-742245.679999999701977;-1042633.960000000894070;0
4876;-742826.449999999254942;-1042944.910000000149012;0
788;-741637.000000000000000;-1042607.000000000000000;0
1812;-743149.000000000000000;-1044528.000000000000000;0
4625;-742594.258000001311302;-1042576.114000000059605;0
3768;-743006.370000001043081;-1042978.829999998211861;0
5126;-743012.193999998271465;-1043403.521000001579523;0
2286;-742894.000000000000000;-1045440.000000000000000;0
635;-742143.000000000000000;-1043317.000000000000000;0
5590;-743422.570000000298023;-1043679.642000000923872;0
5664;-743420.907000001519918;-1043711.245999999344349;0
4725;-742875.100000001490116;-1042678.230000000447035;0
4791;-743022.245000001043081;-1042633.714000001549721;0
671;-742489.000000000000000;-1043245.000000000000000;0
2211;-743248.000000000000000;-1045258.000000000000000;0
5205;-743251.475000001490116;-1043328.679000001400709;0
5161;-743160.846999999135733;-1043333.914999999105930;0
325;-742700.000000000000000;-1044114.000000000000000;0
7956;-741777.379999998956919;-1044260.170000001788139;0
4744;-742848.129999998956919;-1042759.629999998956919;0
1479;-741407.000000000000000;-1044225.000000000000000;0
6175;-742315.256999999284744;-1043064.660999998450279;0
6211;-742317.785000000149012;-1043063.318999998271465;0
6150;-742311.879999998956919;-1043062.857000000774860;0
5225;-743277.453999999910593;-1043558.087999999523163;0
5660;-743425.633999999612570;-1043709.497000001370907;0
4894;-742610.888999998569489;-1042819.686999998986721;0
4178;-742382.640000000596046;-1044160.138000000268221;0
5505;-743428.315000001341105;-1043675.633000001311302;0
4844;-742977.256000000983477;-1042754.953000001609325;0
1620;-742439.000000000000000;-1044323.000000000000000;0
744;-741666.000000000000000;-1042994.000000000000000;0
2035;-743435.000000000000000;-1044802.000000000000000;0
1034;-741964.000000000000000;-1044876.000000000000000;0
2367;-742510.000000000000000;-1045483.000000000000000;0
2892;-744005.317000001668930;-1043204.537000000476837;0
6771;-741345.015999998897314;-1044413.647999998182058;0
1907;-743446.000000000000000;-1044345.000000000000000;0
7508;-742947.440000001341105;-1045540.690000001341105;0
5016;-742572.212000001221895;-1042955.526999998837709;0
6261;-742373.956999998539686;-1043022.041999999433756;0
4220;-742214.344999998807907;-1043580.359999999403954;0
6151;-742311.114999998360872;-1043061.451000001281500;0
6199;-742319.442000001668930;-1043067.822999998927116;0
6194;-742315.721000000834465;-1043062.585999999195337;0
1538;-741948.000000000000000;-1043973.000000000000000;0
3992;-743365.899999998509884;-1043881.385000001639128;0
6704;-742282.179999999701977;-1044623.793999999761581;0
1398;-741753.000000000000000;-1044201.000000000000000;0
4008;-743250.114999998360872;-1044043.905999999493361;0
4562;-742471.000000000000000;-1042510.920000001788139;0
8065;-742275.859999999403954;-1045204.550000000745058;0
7030;-743291.859999999403954;-1044128.440000001341105;0
5419;-742434.690000001341105;-1042846.280000001192093;0
6663;-741457.949999999254942;-1044194.329999998211861;0
1160;-741114.859999999403954;-1044508.120000001043081;0
3344;-743932.276000000536442;-1043064.493999999016523;0
1751;-742046.000000000000000;-1045235.000000000000000;0
5643;-743428.701999999582767;-1043689.872999999672174;0
2383;-742220.000000000000000;-1045517.000000000000000;0
551;-742269.000000000000000;-1043755.000000000000000;0
1537;-741924.000000000000000;-1043954.000000000000000;0
611;-742037.000000000000000;-1043267.000000000000000;0
3812;-743231.179999999701977;-1042815.199999999254942;0
7205;-742570.679999999701977;-1044988.579999998211861;0
2344;-742691.000000000000000;-1045541.000000000000000;0
6875;-741808.350000001490116;-1045257.269999999552965;0
4525;-742716.719999998807907;-1042823.219999998807907;0
1242;-742137.000000000000000;-1044481.000000000000000;0
6007;-743187.807000000029802;-1043302.019000001251698;0
6503;-741647.706000000238419;-1044996.008999999612570;0
5209;-743271.947999998927116;-1043361.392000000923872;0
4777;-742910.034000001847744;-1042759.350999999791384;0
5726;-743422.414000000804663;-1043635.760999999940395;0
6137;-742314.326999999582767;-1043068.837000001221895;0
4767;-742786.899999998509884;-1042835.736000001430511;0
5164;-743173.335000000894070;-1043404.677000001072884;0
4701;-742687.780000001192093;-1042761.660000000149012;0
5155;-743140.712999999523163;-1043357.901999998837709;0
7653;-742255.225000001490116;-1045513.048000000417233;0
4156;-742513.734999999403954;-1043978.035000000149012;0
6262;-742370.024999998509884;-1043021.666000001132488;0
5000;-742542.798000000417233;-1042978.486999999731779;0
3982;-743325.135000001639128;-1043857.684999998658895;0
5223;-743283.699999999254942;-1043535.940000001341105;0
4031;-743135.774000000208616;-1043769.622000001370907;0
6100;-741950.760000001639128;-1043408.109999999403954;0
6432;-742029.997999999672174;-1043511.272999998182058;0
5666;-743418.543999999761581;-1043712.120000001043081;0
4593;-742510.820000000298023;-1042652.203999999910593;0
6196;-742314.190000001341105;-1043059.774999998509884;0
4905;-742467.730000000447035;-1042815.620000001043081;0
6244;-742368.587000001221895;-1043059.245999999344349;0
6272;-742325.379000000655651;-1043017.383000001311302;0
1839;-742994.469999998807907;-1044185.679999999701977;0
1459;-741491.000000000000000;-1044340.000000000000000;0
4565;-742462.576999999582767;-1042533.901999998837709;0
