OID_;X;Y;TEMPERATURE
2260;-743019.000000000000000;-1045622.000000000000000;0
2325;-742559.000000000000000;-1045494.000000000000000;0
1692;-741125.000000000000000;-1044816.000000000000000;0
2256;-743156.000000000000000;-1045353.000000000000000;0
596;-741867.000000000000000;-1043259.000000000000000;0
1524;-741710.000000000000000;-1043844.000000000000000;0
6746;-742405.083999998867512;-1044259.199999999254942;0
1539;-741977.000000000000000;-1043997.000000000000000;0
4047;-743210.230000000447035;-1043992.289999999105930;0
2149;-742819.000000000000000;-1045024.000000000000000;0
1732;-741840.000000000000000;-1045226.000000000000000;0
2886;-744104.953999999910593;-1043172.171999998390675;0
3981;-743341.517000000923872;-1043837.353999998420477;0
2752;-743983.471000000834465;-1043454.780000001192093;0
284;-743022.000000000000000;-1043758.000000000000000;0
7171;-742671.969999998807907;-1044508.219999998807907;0
2446;-742750.000000000000000;-1044164.000000000000000;0
2081;-742551.000000000000000;-1044621.000000000000000;0
4068;-742917.125000000000000;-1043734.535000000149012;0
6698;-742304.160999998450279;-1044462.195999998599291;0
4135;-742747.719999998807907;-1044085.660000000149012;0
7185;-742600.515000000596046;-1044717.333999998867512;0
2466;-743460.000000000000000;-1044740.000000000000000;0
343;-742575.000000000000000;-1043857.000000000000000;0
2330;-742403.000000000000000;-1045511.000000000000000;0
6704;-742282.179999999701977;-1044623.793999999761581;0
525;-742233.000000000000000;-1043884.000000000000000;247
4120;-742715.179999999701977;-1043974.089999999850988;0
1303;-741865.000000000000000;-1044692.000000000000000;0
6853;-741548.899000000208616;-1045052.295000001788139;0
6722;-742357.717000000178814;-1044705.708000000566244;0
6689;-742384.449999999254942;-1045033.609999999403954;0
2192;-743499.000000000000000;-1045199.000000000000000;0
3310;-743829.561999998986721;-1042854.063000001013279;57
7260;-742953.010000001639128;-1044873.530000001192093;0
2046;-743382.000000000000000;-1044968.000000000000000;0
8051;-742213.199999999254942;-1044935.890000000596046;0
2241;-743319.000000000000000;-1045289.000000000000000;0
1604;-742552.000000000000000;-1044918.000000000000000;0
110;-744127.000000000000000;-1042724.000000000000000;3
1654;-741387.000000000000000;-1044621.000000000000000;0
532;-742114.000000000000000;-1043737.000000000000000;81
7935;-743156.000000000000000;-1045071.149999998509884;0
1409;-741634.000000000000000;-1044170.000000000000000;0
5068;-742837.162999998778105;-1043263.965999998152256;0
1681;-741125.980000000447035;-1044656.269999999552965;0
3818;-743130.217999998480082;-1042703.293000001460314;0
8045;-742173.070000000298023;-1044806.519999999552965;0
4029;-743130.695999998599291;-1043815.427999999374151;0
1360;-741983.000000000000000;-1044900.000000000000000;0
1920;-743384.000000000000000;-1044363.000000000000000;0
1287;-742217.000000000000000;-1044486.000000000000000;0
6;-743464.000000000000000;-1042594.000000000000000;57
3782;-743285.429999999701977;-1042842.460000000894070;0
7739;-742301.399000000208616;-1045040.431000001728535;0
7246;-742736.730000000447035;-1044825.399999998509884;0
398;-742372.000000000000000;-1043909.000000000000000;0
1456;-741513.000000000000000;-1044437.000000000000000;0
227;-742846.000000000000000;-1043520.000000000000000;0
4721;-742883.219999998807907;-1042605.010000001639128;0
458;-741726.000000000000000;-1043324.000000000000000;0
6308;-741823.129999998956919;-1042770.370000001043081;0
4003;-743371.839999999850988;-1044053.258999999612570;0
4874;-742795.429999999701977;-1042925.910000000149012;0
3762;-743173.489999998360872;-1042984.559999998658895;0
7354;-743365.449000000953674;-1045150.535999998450279;0
1222;-742157.000000000000000;-1044266.000000000000000;0
5295;-743047.995000001043081;-1043185.530000001192093;0
512;-742063.000000000000000;-1043136.000000000000000;0
5222;-743271.000000000000000;-1043543.149999998509884;0
6320;-741766.848000001162291;-1042614.989999998360872;0
725;-741983.000000000000000;-1042939.000000000000000;0
7049;-743420.177000001072884;-1044168.629999998956919;0
1772;-741277.000000000000000;-1044012.000000000000000;0
973;-741908.000000000000000;-1044547.000000000000000;0
5252;-743283.517000000923872;-1043176.197999998927116;0
1110;-741220.730000000447035;-1044598.480000000447035;0
1214;-742064.000000000000000;-1044358.000000000000000;0
6837;-741677.875999998301268;-1044964.791999999433756;0
1447;-741541.000000000000000;-1044744.000000000000000;0
5284;-743041.022999998182058;-1043277.397999998182058;0
6565;-741325.239999998360872;-1044209.190000001341105;0
6726;-742476.517999999225140;-1044410.600000001490116;0
7018;-742577.747000001370907;-1044239.712999999523163;0
3966;-743363.859999999403954;-1043530.829999998211861;0
2379;-742291.000000000000000;-1045388.000000000000000;0
728;-741997.000000000000000;-1042918.000000000000000;0
87;-743857.000000000000000;-1043557.000000000000000;0
1957;-743402.000000000000000;-1044519.000000000000000;0
1520;-741777.000000000000000;-1043939.000000000000000;0
223;-742920.000000000000000;-1043542.000000000000000;0
5441;-743196.690000001341105;-1043289.765000000596046;0
7280;-742806.989999998360872;-1044667.600000001490116;0
648;-742246.000000000000000;-1043363.000000000000000;0
1319;-741788.000000000000000;-1044905.000000000000000;0
5121;-742889.114000000059605;-1043362.250000000000000;0
4523;-742703.960000000894070;-1042805.670000001788139;0
2152;-742814.000000000000000;-1045106.000000000000000;0
2456;-741013.000000000000000;-1044501.000000000000000;0
6294;-742653.550000000745058;-1042686.140000000596046;0
1042;-741883.000000000000000;-1044682.000000000000000;0
7146;-742819.425000000745058;-1044426.225000001490116;0
4928;-742444.890000000596046;-1042854.899999998509884;0
1125;-741728.000000000000000;-1044435.000000000000000;0
4984;-742580.537999998778105;-1043025.210999999195337;0
615;-742129.000000000000000;-1043271.000000000000000;0
8077;-742038.989999998360872;-1045265.309999998658895;0
569;-742096.000000000000000;-1043601.000000000000000;0
7801;-742459.168999999761581;-1044490.660000000149012;0
1316;-741765.000000000000000;-1044903.000000000000000;0
5280;-743058.660000000149012;-1043362.201999999582767;0
506;-741980.000000000000000;-1043158.000000000000000;0
4225;-742115.607999999076128;-1043452.125000000000000;0
3578;-744924.046000000089407;-1042547.359000001102686;0
208;-743146.000000000000000;-1043573.000000000000000;0
7776;-743089.784000001847744;-1045773.409000001847744;0
1467;-741808.000000000000000;-1044064.000000000000000;0
8018;-741974.039999999105930;-1044442.870000001043081;0
885;-741739.000000000000000;-1042777.000000000000000;0
1543;-742235.000000000000000;-1044164.000000000000000;0
3460;-744993.289000000804663;-1042693.587000001221895;0
6860;-741482.129999998956919;-1044991.089999999850988;0
7700;-742371.105999998748302;-1044818.445000000298023;0
890;-742007.000000000000000;-1042740.000000000000000;0
2545;-741723.000000000000000;-1044265.000000000000000;0
602;-741828.000000000000000;-1043190.000000000000000;0
876;-741953.000000000000000;-1042636.000000000000000;0
4513;-742579.030000001192093;-1042753.609999999403954;0
6090;-742012.260000001639128;-1043497.300000000745058;0
402;-742342.000000000000000;-1043952.000000000000000;0
178;-743389.000000000000000;-1043251.000000000000000;0
3846;-743149.390000000596046;-1042549.600000001490116;0
5665;-743419.725000001490116;-1043711.682000000029802;0
379;-742479.000000000000000;-1043679.000000000000000;0
4860;-742964.800999999046326;-1043016.107999999076128;0
4235;-742390.041999999433756;-1043492.094999998807907;0
7152;-742867.331999998539686;-1044547.015999998897314;0
3388;-743940.289999999105930;-1043154.210000000894070;0
1731;-741456.000000000000000;-1045017.000000000000000;0
4743;-742812.449999999254942;-1042729.609999999403954;0
3065;-744092.028999999165535;-1042868.519000001251698;0
3945;-743388.361000001430511;-1043434.486000001430511;0
2098;-743134.000000000000000;-1044763.000000000000000;0
7518;-742829.780000001192093;-1045693.210000000894070;0
3426;-743729.493999999016523;-1043061.420000001788139;0
4243;-742194.050000000745058;-1043431.899999998509884;0
6327;-745070.166000001132488;-1042705.697000000625849;0
2386;-742139.000000000000000;-1045460.000000000000000;0
7159;-743013.767000000923872;-1044544.160999998450279;0
554;-742238.000000000000000;-1043717.000000000000000;0
7019;-742585.024999998509884;-1044210.725000001490116;0
1291;-742205.000000000000000;-1044568.000000000000000;0
5786;-743456.410000000149012;-1042105.250000000000000;0
2475;-743411.000000000000000;-1044901.000000000000000;0
1839;-742994.469999998807907;-1044185.679999999701977;0
269;-743248.000000000000000;-1043725.000000000000000;0
1757;-742189.000000000000000;-1045219.000000000000000;0
7002;-743079.250000000000000;-1044377.170000001788139;0
792;-741718.000000000000000;-1042599.000000000000000;0
1299;-741943.000000000000000;-1044719.000000000000000;0
3524;-744816.782999999821186;-1042685.140999998897314;0
6297;-742506.859999999403954;-1042634.250000000000000;0
3153;-743993.857999999076128;-1042576.355000000447035;0
3988;-743309.704999998211861;-1044008.570000000298023;0
4238;-742440.263000000268221;-1043528.236000001430511;0
6166;-742314.649999998509884;-1043065.006999999284744;0
641;-742008.000000000000000;-1043304.000000000000000;0
4570;-742347.760000001639128;-1042540.809999998658895;0
3808;-742987.050000000745058;-1042925.350000001490116;0
5456;-742761.041000001132488;-1043254.350999999791384;0
741;-741730.000000000000000;-1043035.000000000000000;0
4767;-742786.899999998509884;-1042835.736000001430511;0
3464;-745066.756000000983477;-1042677.120999999344349;0
7164;-742596.114999998360872;-1044447.173000000417233;0
6975;-743116.140000000596046;-1044506.469999998807907;0
201;-743229.000000000000000;-1043614.000000000000000;0
610;-742011.000000000000000;-1043270.000000000000000;0
1436;-741869.000000000000000;-1044323.000000000000000;0
3111;-743727.034000001847744;-1042625.182999998331070;0
6206;-742314.043000001460314;-1043058.028999999165535;0
1765;-741159.000000000000000;-1044178.000000000000000;0
1910;-743460.000000000000000;-1044391.000000000000000;0
393;-742384.000000000000000;-1043819.000000000000000;0
7035;-743299.831999998539686;-1044176.241999998688698;0
4811;-743040.379999998956919;-1042799.609999999403954;0
3291;-743588.212999999523163;-1042790.916999999433756;0
1012;-742060.000000000000000;-1044582.000000000000000;0
7047;-743395.495000001043081;-1044210.765000000596046;0
1790;-742152.000000000000000;-1044138.000000000000000;0
2017;-743247.000000000000000;-1044884.000000000000000;0
2512;-743070.000000000000000;-1044052.000000000000000;0
3019;-744463.447999998927116;-1042784.646000001579523;0
4034;-743295.410000000149012;-1043786.070000000298023;0
4746;-742867.769999999552965;-1042768.570000000298023;0
2604;-745373.923999998718500;-1042834.581000000238419;0
6511;-741291.670000001788139;-1044319.690000001341105;0
1843;-743041.600000001490116;-1044324.489999998360872;0
5243;-743357.622000001370907;-1043407.258999999612570;0
2369;-742503.000000000000000;-1045427.000000000000000;0
7318;-742578.910000000149012;-1045033.530000001192093;0
5420;-742442.920000001788139;-1042740.519999999552965;0
4597;-742620.600000001490116;-1042680.690000001341105;0
824;-742142.000000000000000;-1042596.000000000000000;0
2500;-742743.000000000000000;-1045401.000000000000000;0
275;-743361.000000000000000;-1043904.000000000000000;0
1941;-743267.000000000000000;-1044384.000000000000000;246
4556;-742354.629999998956919;-1042526.789999999105930;0
4623;-742533.778999999165535;-1042585.824000000953674;0
5706;-743417.688999999314547;-1043638.852000001817942;0
1254;-742090.000000000000000;-1044750.000000000000000;0
590;-741935.000000000000000;-1043331.000000000000000;0
80;-744067.000000000000000;-1043330.000000000000000;0
7150;-742820.427000001072884;-1044516.962000001221895;0
6298;-741804.910000000149012;-1042692.300000000745058;0
1573;-742358.000000000000000;-1044452.000000000000000;0
4672;-742811.831999998539686;-1042675.907999999821186;0
4074;-742943.350000001490116;-1043880.304999999701977;0
6137;-742314.326999999582767;-1043068.837000001221895;0
1393;-742083.000000000000000;-1045067.000000000000000;0
3769;-742978.969999998807907;-1042975.300000000745058;0
875;-741783.000000000000000;-1042677.000000000000000;0
630;-742179.000000000000000;-1043289.000000000000000;0
2368;-742507.000000000000000;-1045456.000000000000000;0
673;-742467.000000000000000;-1043230.000000000000000;0
3294;-743583.046999998390675;-1042805.258000001311302;0
4057;-743132.184999998658895;-1043648.719999998807907;0
4787;-742962.412000000476837;-1042621.662000000476837;0
6144;-742308.925000000745058;-1043059.002000000327826;0
1373;-742143.000000000000000;-1044822.000000000000000;0
4813;-743013.550000000745058;-1042793.390000000596046;0
4086;-742813.079999998211861;-1043631.730000000447035;0
4213;-742218.094999998807907;-1043529.954999998211861;0
3700;-744597.480999998748302;-1042518.239999998360872;0
1995;-743484.000000000000000;-1045036.000000000000000;0
3214;-743628.813000001013279;-1042457.677000001072884;0
4780;-742928.596000000834465;-1042747.480000000447035;0
1474;-741604.000000000000000;-1044172.000000000000000;0
1594;-742304.000000000000000;-1044977.000000000000000;0
7650;-742315.337000001221895;-1045462.039999999105930;0
5141;-743039.598000001162291;-1043495.265000000596046;0
4837;-742979.105999998748302;-1042672.627999998629093;0
4676;-742792.579999998211861;-1042771.519999999552965;0
2057;-742787.000000000000000;-1044365.000000000000000;0
548;-742297.000000000000000;-1043762.000000000000000;0
2285;-742897.000000000000000;-1045467.000000000000000;0
675;-742446.000000000000000;-1043215.000000000000000;0
1377;-742146.969999998807907;-1044922.489999998360872;0
6104;-742208.646999999880791;-1043103.999000001698732;0
3572;-744646.515000000596046;-1042584.320000000298023;0
3157;-743935.576000001281500;-1042567.035000000149012;0
4740;-742757.410000000149012;-1042715.589999999850988;0
5325;-742997.480000000447035;-1043042.289999999105930;0
1695;-741550.000000000000000;-1044656.000000000000000;0
6257;-742381.556000001728535;-1043033.991000000387430;0
4007;-743275.230999998748302;-1044049.184999998658895;0
4340;-742473.662000000476837;-1043349.048999998718500;0
2347;-742597.000000000000000;-1045567.000000000000000;0
2255;-743181.000000000000000;-1045372.000000000000000;0
1492;-741096.000000000000000;-1044331.000000000000000;0
1653;-741384.000000000000000;-1044592.000000000000000;0
8267;-742240.420000001788139;-1042709.160000000149012;0
7809;-741981.809999998658895;-1044560.280000001192093;0
1459;-741491.000000000000000;-1044340.000000000000000;0
846;-742175.000000000000000;-1042517.000000000000000;0
7008;-742899.559999998658895;-1044224.074999999254942;0
3704;-744530.350000001490116;-1042519.798999998718500;0
1414;-741627.000000000000000;-1044593.000000000000000;0
6145;-742315.708000000566244;-1043069.881999999284744;0
2263;-742989.000000000000000;-1045714.000000000000000;0
1152;-741257.000000000000000;-1044489.000000000000000;0
2165;-742994.000000000000000;-1045179.000000000000000;0
3278;-743698.693999998271465;-1042862.070999998599291;0
6982;-743055.109999999403954;-1044342.629999998956919;0
4889;-742621.425000000745058;-1042831.109999999403954;0
724;-741987.000000000000000;-1042981.000000000000000;0
4557;-742381.019999999552965;-1042528.550000000745058;0
4996;-742488.458999998867512;-1042974.723999999463558;0
8283;-742198.600000001490116;-1042801.980000000447035;0
2164;-742966.000000000000000;-1045172.000000000000000;0
5459;-742368.519000001251698;-1043474.221999999135733;0
1451;-741522.000000000000000;-1044602.000000000000000;0
5069;-742829.063999999314547;-1043280.938000001013279;0
4531;-742746.070000000298023;-1042885.980000000447035;0
3833;-743029.679999999701977;-1042612.300000000745058;0
3786;-743150.480000000447035;-1042925.960000000894070;0
2453;-742941.000000000000000;-1044121.000000000000000;0
4693;-742691.399999998509884;-1042612.399999998509884;0
8278;-742119.929999999701977;-1042758.710000000894070;0
5419;-742434.690000001341105;-1042846.280000001192093;0
995;-741906.000000000000000;-1044434.000000000000000;0
3417;-743776.002999998629093;-1043098.853000000119209;0
2308;-742345.000000000000000;-1045499.000000000000000;0
1314;-741695.000000000000000;-1044866.000000000000000;0
5210;-743253.673999998718500;-1043370.440999999642372;0
4922;-742443.129999998956919;-1042886.510000001639128;0
5158;-743148.138999998569489;-1043320.254999998956919;0
1060;-741610.000000000000000;-1045115.000000000000000;0
8050;-742206.719999998807907;-1044915.530000001192093;0
3356;-743953.732000000774860;-1043037.083000000566244;0
4948;-742386.929999999701977;-1042992.239999998360872;0
3396;-743905.006000000983477;-1043084.449999999254942;0
5976;-745060.993999999016523;-1042674.883000001311302;0
322;-742701.000000000000000;-1044153.000000000000000;0
212;-743080.000000000000000;-1043557.000000000000000;0
4703;-742697.859000001102686;-1042783.011999998241663;0
1428;-742028.000000000000000;-1044235.000000000000000;0
4082;-742825.565000001341105;-1043737.364999998360872;0
2289;-742915.000000000000000;-1045426.000000000000000;0
671;-742489.000000000000000;-1043245.000000000000000;0
5514;-743426.903000000864267;-1043609.252999998629093;0
5025;-742609.543000001460314;-1042894.629000000655651;0
276;-743382.000000000000000;-1043905.000000000000000;0
3539;-744607.903000000864267;-1042668.236999999731779;0
2505;-742762.000000000000000;-1045562.000000000000000;0
6993;-743172.409000001847744;-1044501.339000001549721;0
408;-742317.000000000000000;-1044182.000000000000000;0
4788;-742970.409000001847744;-1042588.238000001758337;0
4564;-742452.267000000923872;-1042534.980999998748302;0
6173;-742316.787000000476837;-1043067.471000000834465;0
823;-742110.000000000000000;-1042596.000000000000000;0
5107;-742857.611999999731779;-1043458.278000000864267;0
4750;-742784.420000001788139;-1042733.429999999701977;0
8280;-742150.949999999254942;-1042770.420000001788139;0
3357;-743953.732000000774860;-1043042.298999998718500;0
4577;-742376.686000000685453;-1042590.309999998658895;0
889;-742000.000000000000000;-1042770.000000000000000;0
4660;-742801.596999999135733;-1042487.965999998152256;0
221;-742951.000000000000000;-1043544.000000000000000;0
271;-743417.000000000000000;-1043795.000000000000000;0
5246;-743373.739999998360872;-1043268.899999998509884;0
4987;-742641.745000001043081;-1043011.309999998658895;0
4175;-742721.254999998956919;-1043775.890000000596046;0
4673;-742811.420000001788139;-1042756.050000000745058;0
2130;-743095.000000000000000;-1045126.000000000000000;0
7038;-743316.394999999552965;-1044240.155000001192093;0
6194;-742315.721000000834465;-1043062.585999999195337;0
6505;-741746.570000000298023;-1044600.429999999701977;0
4955;-742383.649999998509884;-1043019.250000000000000;0
6231;-742316.769000001251698;-1043058.344000000506639;0
330;-742659.000000000000000;-1044043.000000000000000;0
4336;-742416.888999998569489;-1043431.418000001460314;0
6250;-742374.638999998569489;-1043047.576999999582767;0
6134;-742309.011999998241663;-1043060.703000001609325;0
2491;-742059.000000000000000;-1044251.000000000000000;0
4669;-742823.199999999254942;-1042658.309999998658895;0
4849;-742966.960000000894070;-1042893.583999998867512;0
622;-742271.000000000000000;-1043302.000000000000000;0
2080;-742685.000000000000000;-1044460.000000000000000;0
6278;-742305.421999998390675;-1043028.918000001460314;0
351;-742509.000000000000000;-1043739.000000000000000;0
733;-741963.000000000000000;-1043018.000000000000000;0
4140;-742831.635999999940395;-1044004.828999999910593;0
6659;-741515.070000000298023;-1044171.070000000298023;0
6395;-742057.429999999701977;-1042500.809999998658895;0
2370;-742460.000000000000000;-1045433.000000000000000;0
7947;-742030.969999998807907;-1044096.679999999701977;0
6188;-742312.807999998331070;-1043058.706999998539686;0
1347;-741791.000000000000000;-1044816.000000000000000;0
5776;-742933.609000001102686;-1043433.765999998897314;0
308;-742754.000000000000000;-1044149.000000000000000;0
1960;-743386.000000000000000;-1044623.000000000000000;0
8053;-742224.410000000149012;-1044970.879999998956919;0
6149;-742312.646000001579523;-1043064.261999998241663;0
1190;-741821.000000000000000;-1044110.000000000000000;0
616;-742153.000000000000000;-1043272.000000000000000;0
5116;-742947.859000001102686;-1043386.767000000923872;0
4991;-742675.414999999105930;-1043031.236000001430511;0
544;-742343.910000000149012;-1043796.500000000000000;0
5233;-743347.210000000894070;-1043435.807000000029802;0
3352;-743954.622000001370907;-1043015.732999999076128;0
3784;-743187.730000000447035;-1042922.429999999701977;0
3273;-743642.442999999970198;-1042796.677999999374151;0
2222;-743058.000000000000000;-1045420.000000000000000;0
5120;-742868.383999999612570;-1043343.986000001430511;0
3285;-743661.519999999552965;-1042862.697000000625849;0
4615;-742527.811000000685453;-1042658.600999999791384;0
625;-742247.000000000000000;-1043299.000000000000000;0
5645;-743428.886999998241663;-1043692.285999998450279;0
4073;-742939.109999999403954;-1043858.504999998956919;0
1749;-742065.000000000000000;-1045064.000000000000000;0
879;-741947.000000000000000;-1042541.000000000000000;0
1755;-742144.000000000000000;-1045199.000000000000000;0
4180;-742368.370000001043081;-1044115.471999999135733;0
6008;-743902.607000000774860;-1042749.771000001579523;0
6788;-741212.809999998658895;-1044473.129999998956919;0
5733;-743410.142999999225140;-1043688.210999999195337;0
5371;-742052.149999998509884;-1043011.940000001341105;0
1246;-742120.000000000000000;-1044570.000000000000000;0
4975;-742477.829999998211861;-1043016.923000000417233;0
5437;-744084.208999998867512;-1043295.061999998986721;0
4562;-742471.000000000000000;-1042510.920000001788139;0
6500;-741697.967999998480082;-1044926.364999998360872;0
2759;-743890.965999998152256;-1043486.399000000208616;0
628;-742217.370000001043081;-1043308.559999998658895;0
3987;-743311.475000001490116;-1043983.175000000745058;0
4771;-742890.828000001609325;-1042889.975000001490116;0
1091;-741531.480000000447035;-1044543.440000001341105;0
4962;-742387.429999999701977;-1043028.129999998956919;0
1419;-741603.000000000000000;-1044410.000000000000000;0
7958;-741664.710000000894070;-1044289.879999998956919;0
1236;-742156.000000000000000;-1044348.000000000000000;0
1984;-743476.000000000000000;-1044743.000000000000000;0
4244;-742179.410000000149012;-1043422.000000000000000;0
388;-742441.000000000000000;-1043809.000000000000000;0
1778;-741032.000000000000000;-1044785.000000000000000;0
4139;-742859.625999998301268;-1044000.574999999254942;0
1533;-741832.000000000000000;-1043879.000000000000000;0
3885;-742418.339999999850988;-1042442.059999998658895;0
1950;-743271.000000000000000;-1044490.000000000000000;0
4324;-742269.346000000834465;-1043165.410999998450279;0
819;-741987.000000000000000;-1042599.000000000000000;0
674;-742463.000000000000000;-1043211.000000000000000;0
2535;-742042.000000000000000;-1044071.000000000000000;0
7269;-743143.410000000149012;-1044948.879999998956919;0
217;-742998.000000000000000;-1043554.000000000000000;0
3064;-744117.098999999463558;-1042868.348999999463558;0
5600;-743410.407000001519918;-1043680.594000000506639;0
1855;-742642.000000000000000;-1044286.000000000000000;0
1095;-741452.000000000000000;-1044553.000000000000000;0
5746;-743415.399000000208616;-1043698.644000001251698;0
6222;-742316.855000000447035;-1043060.109999999403954;0
4070;-742925.285000000149012;-1043783.565000001341105;0
587;-741944.000000000000000;-1043391.000000000000000;0
3820;-743111.699999999254942;-1042659.320000000298023;0
1762;-741227.000000000000000;-1044108.000000000000000;0
2040;-743285.000000000000000;-1044809.000000000000000;0
6254;-742379.344000000506639;-1043038.363000001758337;0
3752;-743213.949999999254942;-1042902.719999998807907;0
4249;-742151.910000000149012;-1043354.719999998807907;0
249;-743433.000000000000000;-1043775.000000000000000;0
4903;-742493.579999998211861;-1042816.620000001043081;0
3948;-743409.451999999582767;-1043515.662000000476837;0
3392;-743913.699999999254942;-1043165.480000000447035;0
1229;-742244.000000000000000;-1044253.000000000000000;0
6227;-742319.839999999850988;-1043063.936000000685453;0
6259;-742383.170000001788139;-1043030.809000000357628;0
2477;-741238.370000001043081;-1044535.289999999105930;0
1875;-743367.000000000000000;-1044261.000000000000000;0
7182;-742597.789999999105930;-1044678.260000001639128;0
3529;-744773.962999999523163;-1042673.491999998688698;0
5505;-743428.315000001341105;-1043675.633000001311302;0
3535;-744653.131999999284744;-1042674.822000000625849;0
683;-742362.000000000000000;-1043155.000000000000000;0
2484;-741269.109999999403954;-1044779.070000000298023;0
4897;-742560.320000000298023;-1042829.359999999403954;0
835;-741950.000000000000000;-1042513.000000000000000;0
927;-742021.000000000000000;-1043498.000000000000000;0
6218;-742319.947000000625849;-1043065.767999999225140;0
941;-742098.000000000000000;-1043132.000000000000000;0
4004;-743345.877000000327826;-1044053.135999999940395;0
6100;-741950.760000001639128;-1043408.109999999403954;0
1370;-742061.000000000000000;-1044797.000000000000000;0
1371;-742089.000000000000000;-1044807.000000000000000;0
1434;-741931.000000000000000;-1044293.000000000000000;0
5704;-743417.484999999403954;-1043635.530999999493361;0
1661;-741426.000000000000000;-1044846.000000000000000;0
4710;-742796.730000000447035;-1042611.769999999552965;0
1309;-741611.000000000000000;-1044813.000000000000000;0
4824;-742918.673000000417233;-1042871.875000000000000;0
4749;-742884.420000001788139;-1042760.329999998211861;0
845;-742126.000000000000000;-1042505.000000000000000;0
1084;-741698.000000000000000;-1044537.000000000000000;0
2761;-743859.467000000178814;-1043468.017000000923872;0
3692;-744525.876499999314547;-1042540.534000001847744;0
2024;-743305.000000000000000;-1045000.000000000000000;0
4858;-742955.339999999850988;-1042963.960000000894070;0
4791;-743022.245000001043081;-1042633.714000001549721;0
4607;-742508.469999998807907;-1042623.089000001549721;0
4204;-742312.750999998301268;-1043589.962999999523163;0
4845;-742978.655999999493361;-1042776.048000000417233;0
2296;-742678.000000000000000;-1045399.000000000000000;0
8075;-742072.149999998509884;-1045261.399999998509884;0
4506;-742419.730000000447035;-1042717.019999999552965;0
4520;-742651.079999998211861;-1042798.449999999254942;0
2422;-742473.000000000000000;-1045096.000000000000000;0
6719;-742371.686999998986721;-1044952.227000001817942;0
872;-741698.000000000000000;-1042669.000000000000000;0
1140;-741475.000000000000000;-1044461.000000000000000;0
4341;-742488.855000000447035;-1043325.412999998778105;0
1379;-742135.000000000000000;-1044975.000000000000000;0
1956;-743397.000000000000000;-1044501.000000000000000;0
1619;-742426.000000000000000;-1044401.000000000000000;0
1525;-741738.000000000000000;-1043823.000000000000000;0
4756;-742712.579999998211861;-1042776.829999998211861;0
3336;-743972.239999998360872;-1043004.743000000715256;0
5139;-743032.489999998360872;-1043533.679999999701977;0
5157;-743178.671999998390675;-1043354.681000001728535;0
4227;-742108.530000001192093;-1043326.289999999105930;0
349;-742524.000000000000000;-1043764.000000000000000;0
5392;-744709.620999999344349;-1042669.337000001221895;0
1164;-741055.000000000000000;-1044515.000000000000000;0
1708;-741170.820000000298023;-1044705.589999999850988;0
1055;-741747.000000000000000;-1045038.000000000000000;0
5067;-742813.465999998152256;-1043267.335999999195337;0
2210;-743280.000000000000000;-1045237.000000000000000;0
4663;-742820.800000000745058;-1042560.039999999105930;0
8258;-742053.760000001639128;-1042683.769999999552965;0
4002;-743397.818999998271465;-1044054.317999999970198;0
3358;-743952.916999999433756;-1043047.306000001728535;0
2440;-742596.000000000000000;-1044193.000000000000000;0
