OID_;X;Y;TEMPERATURE
3614;-744984.548999998718500;-1042283.640999998897314;0
3019;-744463.447999998927116;-1042784.646000001579523;0
3568;-744718.817999999970198;-1042588.614999998360872;0
3692;-744525.876499999314547;-1042540.534000001847744;0
3580;-744924.973999999463558;-1042593.699999999254942;0
2605;-745393.842999998480082;-1042860.796000000089407;0
5975;-745052.346999999135733;-1042674.673000000417233;0
118;-745135.000000000000000;-1042687.000000000000000;0
3542;-744575.274000000208616;-1042656.160000000149012;0
2696;-743477.489999998360872;-1042038.000000000000000;0
2520;-741847.000000000000000;-1045324.000000000000000;0
6872;-741751.719999998807907;-1045296.679999999701977;0
2760;-743863.331000000238419;-1043483.304000001400709;0
2755;-744003.879000000655651;-1043471.734000001102686;0
2404;-742179.000000000000000;-1045467.000000000000000;0
3919;-743904.947000000625849;-1043493.929999999701977;0
3107;-743778.888000000268221;-1042682.131999999284744;0
2740;-744042.611999999731779;-1043335.940000001341105;0
6705;-742279.050999999046326;-1044655.923000000417233;0
6833;-741571.423000000417233;-1044909.473999999463558;0
1486;-741150.000000000000000;-1044219.000000000000000;0
1445;-741553.000000000000000;-1044757.000000000000000;0
1411;-741639.480000000447035;-1044683.019999999552965;0
6828;-741465.309999998658895;-1044768.940000001341105;0
7411;-743529.510000001639128;-1045393.140000000596046;0
385;-742436.000000000000000;-1043742.000000000000000;0
8079;-742021.839999999850988;-1045292.179999999701977;0
2070;-742993.000000000000000;-1044723.000000000000000;0
2097;-743143.000000000000000;-1044742.000000000000000;0
7263;-743009.559999998658895;-1044894.379999998956919;0
383;-742450.000000000000000;-1043722.000000000000000;0
4238;-742440.263000000268221;-1043528.236000001430511;0
7654;-742242.081000000238419;-1045273.263999998569489;0
7008;-742899.559999998658895;-1044224.074999999254942;0
2394;-742273.000000000000000;-1045360.000000000000000;0
2160;-742849.000000000000000;-1045147.000000000000000;0
2161;-742876.000000000000000;-1045153.000000000000000;0
8073;-742120.640000000596046;-1045259.500000000000000;0
4075;-742947.934999998658895;-1043903.649999998509884;0
7947;-742030.969999998807907;-1044096.679999999701977;0
524;-742255.000000000000000;-1043913.000000000000000;0
1780;-741214.000000000000000;-1043934.000000000000000;0
738;-741818.000000000000000;-1043024.000000000000000;0
1983;-743474.000000000000000;-1044709.000000000000000;0
1519;-741754.000000000000000;-1043956.000000000000000;0
748;-741671.000000000000000;-1042971.000000000000000;0
110;-744127.000000000000000;-1042724.000000000000000;0
7022;-743155.660000000149012;-1044074.410000000149012;0
1764;-741163.000000000000000;-1044144.000000000000000;0
735;-741910.000000000000000;-1043014.000000000000000;0
1287;-742217.000000000000000;-1044486.000000000000000;0
6339;-742245.460000000894070;-1042835.780000001192093;0
514;-742119.000000000000000;-1043141.000000000000000;0
510;-742048.000000000000000;-1043150.000000000000000;0
343;-742575.000000000000000;-1043857.000000000000000;0
2050;-743460.000000000000000;-1045072.000000000000000;0
2008;-743242.000000000000000;-1044759.000000000000000;0
2018;-743244.000000000000000;-1044909.000000000000000;0
6722;-742357.717000000178814;-1044705.708000000566244;0
2020;-743260.000000000000000;-1044941.000000000000000;0
1561;-743186.000000000000000;-1045098.000000000000000;0
1251;-742091.000000000000000;-1044690.000000000000000;0
7;-743479.000000000000000;-1042567.000000000000000;0
17;-743587.000000000000000;-1042394.000000000000000;0
5303;-743164.818999998271465;-1043211.078000001609325;0
1492;-741096.000000000000000;-1044331.000000000000000;0
4332;-742410.359000001102686;-1043282.916000001132488;0
3204;-743715.278999999165535;-1042506.118999999016523;0
6;-743464.000000000000000;-1042594.000000000000000;0
1769;-741260.000000000000000;-1044112.000000000000000;0
2133;-743040.000000000000000;-1045127.000000000000000;0
2151;-742827.000000000000000;-1045047.000000000000000;0
2166;-743016.000000000000000;-1045179.000000000000000;0
7324;-742833.980000000447035;-1044949.109999999403954;0
4162;-742497.193999998271465;-1044160.030000001192093;0
6746;-742405.083999998867512;-1044259.199999999254942;0
1766;-741257.000000000000000;-1044204.000000000000000;0
1515;-741913.000000000000000;-1044072.000000000000000;0
2447;-742772.000000000000000;-1044159.000000000000000;0
6700;-742298.611000001430511;-1044507.315999999642372;0
1371;-742089.000000000000000;-1044807.000000000000000;0
2235;-743401.000000000000000;-1045221.000000000000000;0
884;-741771.000000000000000;-1042776.000000000000000;0
1013;-742076.000000000000000;-1044595.000000000000000;0
2189;-743472.000000000000000;-1045183.000000000000000;0
727;-742001.000000000000000;-1042962.000000000000000;0
1091;-741531.480000000447035;-1044543.440000001341105;0
728;-741997.000000000000000;-1042918.000000000000000;0
1982;-743408.000000000000000;-1044646.000000000000000;0
696;-742077.000000000000000;-1042913.000000000000000;0
2212;-743217.000000000000000;-1045279.000000000000000;0
3326;-744036.002000000327826;-1042922.574999999254942;0
2226;-743057.000000000000000;-1045470.000000000000000;0
504;-741937.000000000000000;-1043164.000000000000000;0
2043;-743471.000000000000000;-1044959.000000000000000;0
1996;-743484.000000000000000;-1045063.000000000000000;0
1695;-741550.000000000000000;-1044656.000000000000000;0
7212;-742559.410000000149012;-1045073.070000000298023;0
5062;-742798.513999998569489;-1043227.370999999344349;0
2209;-743309.000000000000000;-1045217.000000000000000;0
1991;-743482.000000000000000;-1044929.000000000000000;0
1970;-743380.000000000000000;-1044854.000000000000000;0
1381;-742115.000000000000000;-1044999.000000000000000;0
1987;-743480.000000000000000;-1044820.000000000000000;0
3387;-743960.368000000715256;-1043194.717000000178814;0
2255;-743181.000000000000000;-1045372.000000000000000;0
7515;-742273.021999999880791;-1044371.543999999761581;0
2256;-743156.000000000000000;-1045353.000000000000000;0
3233;-744152.962999999523163;-1042686.791999999433756;0
7776;-743089.784000001847744;-1045773.409000001847744;0
4184;-742311.379999998956919;-1044164.660000000149012;0
4232;-742315.057999998331070;-1043428.918999999761581;0
1915;-743468.000000000000000;-1044494.000000000000000;0
1603;-742525.000000000000000;-1044922.000000000000000;0
1029;-741978.000000000000000;-1044721.000000000000000;0
5119;-742850.592999998480082;-1043328.484999999403954;0
1324;-741943.000000000000000;-1044994.000000000000000;0
1545;-742236.000000000000000;-1044234.000000000000000;0
5434;-744042.467999998480082;-1043135.986999999731779;0
7520;-742808.589999999850988;-1045680.519999999552965;0
5135;-742979.611000001430511;-1043468.912999998778105;0
7087;-743339.940000001341105;-1044536.690000001341105;0
7350;-742556.390000000596046;-1045185.980000000447035;0
2417;-742421.000000000000000;-1045135.000000000000000;0
5111;-742892.337999999523163;-1043424.370999999344349;0
1945;-743270.000000000000000;-1044454.000000000000000;0
1058;-741667.000000000000000;-1045072.000000000000000;0
6791;-741047.329999998211861;-1044765.467999998480082;0
1794;-742151.000000000000000;-1044190.000000000000000;0
5208;-743237.954999998211861;-1043368.065999999642372;0
1875;-743367.000000000000000;-1044261.000000000000000;0
3839;-743112.140000000596046;-1042558.280000001192093;0
2262;-742999.000000000000000;-1045686.000000000000000;0
2887;-744098.480000000447035;-1043192.508000001311302;0
531;-742157.000000000000000;-1043778.000000000000000;0
1926;-743301.000000000000000;-1044321.000000000000000;0
1333;-741781.000000000000000;-1044777.000000000000000;0
5292;-743055.866000000387430;-1043215.710999999195337;0
6976;-743107.829999998211861;-1044483.399999998509884;0
7188;-742583.839999999850988;-1044742.870000001043081;0
599;-741837.000000000000000;-1043243.000000000000000;0
5272;-743000.013999998569489;-1043245.364000000059605;0
6488;-741718.210000000894070;-1044532.489999998360872;0
5035;-742658.587999999523163;-1043006.899000000208616;0
6820;-741224.105999998748302;-1044799.311999998986721;0
6975;-743116.140000000596046;-1044506.469999998807907;0
1423;-742167.000000000000000;-1044150.000000000000000;0
2344;-742691.000000000000000;-1045541.000000000000000;0
639;-741958.000000000000000;-1043294.000000000000000;0
8283;-742198.600000001490116;-1042801.980000000447035;0
4070;-742925.285000000149012;-1043783.565000001341105;0
2488;-742083.000000000000000;-1044303.000000000000000;0
4067;-742913.594999998807907;-1043714.640000000596046;0
496;-741768.000000000000000;-1043197.000000000000000;0
4342;-742506.473000001162291;-1043301.100000001490116;0
4574;-742339.980000000447035;-1042661.570000000298023;0
1610;-742374.000000000000000;-1044447.000000000000000;0
7651;-742295.381000000983477;-1045479.861999999731779;0
674;-742463.000000000000000;-1043211.000000000000000;0
4212;-742205.245000001043081;-1043548.410000000149012;0
1238;-742150.000000000000000;-1044384.000000000000000;0
4105;-742678.771999999880791;-1043769.206000000238419;0
1243;-742122.000000000000000;-1044502.000000000000000;0
1473;-741642.000000000000000;-1044158.000000000000000;0
1607;-742414.000000000000000;-1044379.000000000000000;0
1433;-741895.000000000000000;-1044328.000000000000000;0
1190;-741821.000000000000000;-1044110.000000000000000;0
5223;-743283.699999999254942;-1043535.940000001341105;0
2357;-742388.000000000000000;-1045577.000000000000000;0
206;-743179.000000000000000;-1043581.000000000000000;0
826;-742191.000000000000000;-1042616.000000000000000;0
1358;-741950.000000000000000;-1044887.000000000000000;0
2491;-742059.000000000000000;-1044251.000000000000000;0
709;-741861.000000000000000;-1042862.000000000000000;0
6514;-741730.449999999254942;-1044087.109999999403954;0
1418;-741620.000000000000000;-1044458.000000000000000;0
7217;-742516.318999998271465;-1044582.890000000596046;0
467;-741757.000000000000000;-1043352.000000000000000;0
463;-741703.000000000000000;-1043287.000000000000000;0
4650;-742749.989000000059605;-1042534.539999999105930;0
1307;-741803.000000000000000;-1044663.000000000000000;0
1040;-741904.000000000000000;-1044623.000000000000000;0
1008;-741962.000000000000000;-1044568.000000000000000;0
7514;-742304.866000000387430;-1044375.124000001698732;0
4494;-741874.920000001788139;-1042616.660000000149012;0
1004;-741898.000000000000000;-1044565.000000000000000;0
1299;-741943.000000000000000;-1044719.000000000000000;0
6485;-741795.653999999165535;-1044513.458000000566244;0
1052;-741761.000000000000000;-1045002.000000000000000;0
1378;-742161.000000000000000;-1044904.000000000000000;0
910;-742219.000000000000000;-1042529.000000000000000;0
4099;-742773.870000001043081;-1043846.135999999940395;0
7146;-742819.425000000745058;-1044426.225000001490116;0
7744;-742941.256999999284744;-1045533.171000000089407;0
1171;-741882.000000000000000;-1044375.000000000000000;0
4427;-742190.519999999552965;-1043099.440000001341105;0
620;-742253.000000000000000;-1043281.000000000000000;0
3273;-743642.442999999970198;-1042796.677999999374151;0
6943;-742902.013999998569489;-1043932.647999998182058;0
1824;-742963.809999998658895;-1044143.929999999701977;0
3760;-743233.829999998211861;-1042978.739999998360872;0
3975;-743112.984999999403954;-1043716.375999998301268;0
6825;-741380.010000001639128;-1044780.089999999850988;0
4116;-742740.429999999701977;-1044064.789999999105930;0
281;-743045.000000000000000;-1043848.000000000000000;0
1478;-741443.000000000000000;-1044220.000000000000000;0
3289;-743584.761999998241663;-1042769.188000001013279;0
2289;-742915.000000000000000;-1045426.000000000000000;0
2526;-741087.000000000000000;-1044616.000000000000000;0
4062;-742830.460000000894070;-1043654.920000001788139;0
4026;-743178.984999999403954;-1043847.989999998360872;0
7143;-742850.414999999105930;-1044473.449999999254942;0
3945;-743388.361000001430511;-1043434.486000001430511;0
4018;-743153.285000000149012;-1043925.850000001490116;0
226;-742879.000000000000000;-1043516.000000000000000;0
2317;-742792.000000000000000;-1045467.000000000000000;0
3309;-743830.328000001609325;-1042834.535000000149012;0
1818;-743046.000000000000000;-1044380.000000000000000;0
6980;-743071.769999999552965;-1044387.548999998718500;0
684;-742358.000000000000000;-1043136.000000000000000;0
7147;-742827.925000000745058;-1044451.385000001639128;0
3995;-743393.225000001490116;-1043973.719999998807907;0
625;-742247.000000000000000;-1043299.000000000000000;0
8018;-741974.039999999105930;-1044442.870000001043081;0
1539;-741977.000000000000000;-1043997.000000000000000;0
3361;-743933.616000000387430;-1042980.793000001460314;0
6659;-741515.070000000298023;-1044171.070000000298023;0
6458;-743360.644999999552965;-1043919.311999998986721;0
927;-742021.000000000000000;-1043498.000000000000000;0
583;-741975.000000000000000;-1043434.000000000000000;0
3351;-743954.622000001370907;-1043011.489999998360872;0
5042;-742731.719000000506639;-1042890.517000000923872;0
3834;-743079.190000001341105;-1042579.899999998509884;0
3092;-743909.377999998629093;-1042780.322999998927116;0
7278;-742803.899999998509884;-1044636.800000000745058;0
1839;-742994.469999998807907;-1044185.679999999701977;0
4878;-742876.434000000357628;-1042964.004000000655651;0
5163;-743163.861999999731779;-1043392.113000001758337;0
7965;-741515.510000001639128;-1044348.350000001490116;0
4006;-743302.763000000268221;-1044052.298999998718500;0
1837;-743015.000000000000000;-1044249.000000000000000;0
4063;-742855.079999998211861;-1043654.695000000298023;0
2453;-742941.000000000000000;-1044121.000000000000000;0
1138;-741500.000000000000000;-1044458.000000000000000;0
4800;-742990.043000001460314;-1042700.708000000566244;0
342;-742573.000000000000000;-1043878.000000000000000;0
2298;-742621.000000000000000;-1045406.000000000000000;0
5187;-743086.927000001072884;-1043435.230999998748302;0
3841;-743159.929999999701977;-1042641.120000001043081;0
6855;-741501.394999999552965;-1045027.784000001847744;0
5136;-742992.278000000864267;-1043472.440000001341105;0
5214;-743307.671999998390675;-1043376.414000000804663;0
4236;-742406.842999998480082;-1043504.015000000596046;0
4792;-743051.280000001192093;-1042654.962999999523163;0
783;-741695.000000000000000;-1042663.000000000000000;0
2501;-742746.000000000000000;-1045430.000000000000000;0
4910;-742367.789000000804663;-1042795.280999999493361;0
7963;-741608.199999999254942;-1044329.510000001639128;0
3966;-743363.859999999403954;-1043530.829999998211861;0
6710;-742260.203000001609325;-1044803.609999999403954;0
7026;-743217.644999999552965;-1044082.329999998211861;0
2456;-741013.000000000000000;-1044501.000000000000000;0
6095;-742082.920000001788139;-1043614.710000000894070;0
7033;-743303.864999998360872;-1044132.750000000000000;0
527;-742186.000000000000000;-1043818.000000000000000;0
2546;-741750.000000000000000;-1044271.000000000000000;0
212;-743080.000000000000000;-1043557.000000000000000;0
845;-742126.000000000000000;-1042505.000000000000000;0
4681;-742756.870000001043081;-1042844.710000000894070;0
5246;-743373.739999998360872;-1043268.899999998509884;0
4510;-742483.149999998509884;-1042738.460000000894070;0
1531;-741782.000000000000000;-1043838.000000000000000;0
4827;-743046.359999999403954;-1042958.140000000596046;0
6358;-741993.554999999701977;-1042717.964000001549721;0
2085;-742426.000000000000000;-1044797.000000000000000;0
3803;-743066.289999999105930;-1042896.320000000298023;0
7180;-742618.809000000357628;-1044646.109000001102686;0
4130;-742868.460000000894070;-1044055.510000001639128;0
4145;-742687.109999999403954;-1043837.125000000000000;0
2061;-742681.000000000000000;-1044491.000000000000000;0
5322;-743060.379999998956919;-1043029.589999999850988;0
6004;-742061.723000001162291;-1043300.859999999403954;0
3408;-743789.511999998241663;-1043022.425000000745058;0
1061;-741586.000000000000000;-1045133.000000000000000;0
952;-742274.000000000000000;-1043018.000000000000000;0
1550;-741356.000000000000000;-1044363.000000000000000;0
352;-742386.000000000000000;-1043914.000000000000000;0
2059;-742625.000000000000000;-1044459.000000000000000;0
1865;-743458.000000000000000;-1044233.000000000000000;0
616;-742153.000000000000000;-1043272.000000000000000;0
1156;-741191.980000000447035;-1044497.850000001490116;0
5961;-742431.225000001490116;-1044003.574999999254942;0
3781;-743273.059999998658895;-1042814.050000000745058;0
6843;-741569.070000000298023;-1044975.261999998241663;0
787;-741714.000000000000000;-1042620.000000000000000;0
4559;-742400.530000001192093;-1042503.760000001639128;0
570;-742098.000000000000000;-1043582.000000000000000;0
3153;-743993.857999999076128;-1042576.355000000447035;0
1317;-741748.000000000000000;-1044884.000000000000000;0
2370;-742460.000000000000000;-1045433.000000000000000;0
3752;-743213.949999999254942;-1042902.719999998807907;0
1589;-742376.000000000000000;-1044861.000000000000000;0
1399;-741736.000000000000000;-1044167.000000000000000;0
7018;-742577.747000001370907;-1044239.712999999523163;0
4218;-742263.436999998986721;-1043615.100999999791384;0
4851;-742991.500000000000000;-1042818.243000000715256;0
5317;-743063.690000001341105;-1043053.769999999552965;0
5655;-743429.699000000953674;-1043704.359999999403954;0
7740;-742301.949999999254942;-1045061.239000000059605;0
6450;-743166.964999999850988;-1043776.383999999612570;0
6164;-742316.155999999493361;-1043067.784000001847744;0
5370;-742580.300999999046326;-1042977.140999998897314;0
7014;-742650.170000001788139;-1044305.010000001639128;0
3798;-743131.500000000000000;-1042848.730000000447035;0
4690;-742679.162999998778105;-1042583.138999998569489;0
4716;-742893.160000000149012;-1042622.780000001192093;0
3373;-743814.043000001460314;-1043018.168000001460314;0
8053;-742224.410000000149012;-1044970.879999998956919;0
7218;-742534.100000001490116;-1044603.559999998658895;0
1656;-741395.000000000000000;-1044688.000000000000000;0
5414;-742582.574999999254942;-1042677.478999998420477;0
1854;-742675.000000000000000;-1044271.000000000000000;0
555;-742230.000000000000000;-1043726.000000000000000;0
6262;-742370.024999998509884;-1043021.666000001132488;0
1352;-741840.000000000000000;-1044854.000000000000000;0
1922;-743390.000000000000000;-1044308.000000000000000;0
4570;-742347.760000001639128;-1042540.809999998658895;0
6148;-742313.410999998450279;-1043065.666999999433756;0
1588;-742390.000000000000000;-1044837.000000000000000;0
4715;-742877.199999999254942;-1042610.059999998658895;0
6190;-742318.782999999821186;-1043068.206000000238419;0
4054;-743269.304999999701977;-1043797.405000001192093;0
1095;-741452.000000000000000;-1044553.000000000000000;0
6195;-742314.956000000238419;-1043061.181000001728535;0
6138;-742313.561999998986721;-1043067.399000000208616;0
8273;-742057.820000000298023;-1042728.760000001639128;0
544;-742343.910000000149012;-1043796.500000000000000;0
4664;-742806.739999998360872;-1042547.980000000447035;0
6401;-741992.449999999254942;-1042503.609999999403954;0
5701;-743417.076999999582767;-1043630.140000000596046;0
2093;-742915.000000000000000;-1044642.000000000000000;0
3176;-743891.085999999195337;-1042631.991999998688698;0
1920;-743384.000000000000000;-1044363.000000000000000;0
4245;-742160.210000000894070;-1043410.570000000298023;0
6177;-742313.717999998480082;-1043061.859999999403954;0
2324;-742589.000000000000000;-1045490.000000000000000;0
6726;-742476.517999999225140;-1044410.600000001490116;0
327;-742687.000000000000000;-1044082.000000000000000;0
519;-742239.000000000000000;-1043113.000000000000000;0
1556;-741195.000000000000000;-1044344.000000000000000;0
1905;-743446.000000000000000;-1044312.000000000000000;0
4844;-742977.256000000983477;-1042754.953000001609325;0
4903;-742493.579999998211861;-1042816.620000001043081;0
6139;-742312.807000000029802;-1043066.006000000983477;0
6216;-742313.892000000923872;-1043056.272999998182058;0
6211;-742317.785000000149012;-1043063.318999998271465;0
1524;-741710.000000000000000;-1043844.000000000000000;0
6270;-742333.412999998778105;-1043018.204999998211861;0
2092;-742917.000000000000000;-1044617.000000000000000;0
6132;-742310.590999998152256;-1043063.552999999374151;0
5716;-743423.320999998599291;-1043631.197000000625849;0
4117;-742733.614999998360872;-1044043.129999998956919;0
6359;-742018.440000001341105;-1042712.449999999254942;0
624;-742241.000000000000000;-1043343.000000000000000;0
6271;-742329.282000001519918;-1043017.853999998420477;0
5462;-742498.728999998420477;-1042986.947000000625849;0
5505;-743428.315000001341105;-1043675.633000001311302;0
5409;-743745.201000001281500;-1042902.750000000000000;0
5503;-743427.870000001043081;-1043698.647999998182058;0
4849;-742966.960000000894070;-1042893.583999998867512;0
5696;-743417.096000000834465;-1043637.135999999940395;0
576;-742054.000000000000000;-1043517.000000000000000;0
6303;-741823.820000000298023;-1042750.410000000149012;0
5680;-743402.000000000000000;-1043718.245000001043081;0
177;-743376.000000000000000;-1043232.000000000000000;0
6366;-741957.399999998509884;-1042652.609999999403954;0
2513;-742574.000000000000000;-1044441.000000000000000;0
6266;-742349.021000001579523;-1043019.662999998778105;0
7044;-743400.635000001639128;-1044135.579999998211861;0
6167;-742313.859999999403954;-1043063.607000000774860;0
5360;-742453.188999999314547;-1042938.521999999880791;0
6374;-741977.035000000149012;-1042674.153999999165535;0
4768;-742862.888000000268221;-1042936.997999999672174;0
6246;-742370.552999999374151;-1043055.625999998301268;0
6248;-742372.506000000983477;-1043051.769999999552965;0
6151;-742311.114999998360872;-1043061.451000001281500;0
1196;-741677.000000000000000;-1043894.000000000000000;0
4573;-742341.550000000745058;-1042629.699999999254942;0
3799;-743117.550000000745058;-1042868.160000000149012;0
5410;-742572.837000001221895;-1042981.173999998718500;0
6274;-742318.392999999225140;-1043016.747000001370907;0
1707;-741196.219999998807907;-1044702.390000000596046;0
2478;-741241.859999999403954;-1044562.089999999850988;0
4959;-742331.289999999105930;-1043002.690000001341105;0
5518;-743427.500999998301268;-1043621.975000001490116;0
4746;-742867.769999999552965;-1042768.570000000298023;0
6206;-742314.043000001460314;-1043058.028999999165535;0
4623;-742533.778999999165535;-1042585.824000000953674;0
5674;-743409.089999999850988;-1043715.618000000715256;0
1045;-741849.000000000000000;-1044775.000000000000000;0
6295;-742653.399999998509884;-1042696.070000000298023;0
3345;-743952.826999999582767;-1043061.079999998211861;0
6718;-742339.493000000715256;-1044956.921999998390675;0
6605;-741648.401999998837709;-1043884.642999999225140;0
4888;-742649.925999999046326;-1042830.767000000923872;0
2364;-742504.000000000000000;-1045563.000000000000000;0
5643;-743428.701999999582767;-1043689.872999999672174;0
5251;-743317.296000000089407;-1043180.037999998778105;0
4607;-742508.469999998807907;-1042623.089000001549721;0
4956;-742383.579999998211861;-1043007.739999998360872;0
5517;-743427.287000000476837;-1043618.956999998539686;0
5720;-743418.223000001162291;-1043629.960999999195337;0
4033;-743319.719999998807907;-1043793.300000000745058;0
820;-742019.000000000000000;-1042600.000000000000000;0
4891;-742595.048999998718500;-1042857.274999998509884;0
6789;-741187.510000001639128;-1044470.660000000149012;0
913;-741742.000000000000000;-1042579.000000000000000;0
7090;-743353.289999999105930;-1044571.760000001639128;0
1103;-741306.000000000000000;-1044572.000000000000000;0
4984;-742580.537999998778105;-1043025.210999999195337;0
6126;-743428.385999999940395;-1043621.800000000745058;0
6149;-742312.646000001579523;-1043064.261999998241663;0
5420;-742442.920000001788139;-1042740.519999999552965;0
6272;-742325.379000000655651;-1043017.383000001311302;0
6186;-742314.337999999523163;-1043061.517000000923872;0
272;-743396.000000000000000;-1043809.000000000000000;0
6166;-742314.649999998509884;-1043065.006999999284744;0
1169;-741813.000000000000000;-1044376.000000000000000;0
6264;-742357.280000001192093;-1043020.445999998599291;0
5705;-743417.603000000119209;-1043637.098000001162291;0
6234;-742324.105000000447035;-1043076.613000001758337;0
5644;-743428.793999999761581;-1043691.079999998211861;0
7976;-741301.260000001639128;-1044401.750000000000000;0
2576;-742487.000000000000000;-1045483.000000000000000;0
4995;-742476.986000001430511;-1042961.239000000059605;0
4820;-742927.769999999552965;-1042786.710000000894070;0
5713;-743423.890999998897314;-1043636.899999998509884;0
819;-741987.000000000000000;-1042599.000000000000000;0
4965;-742383.620000001043081;-1043057.500000000000000;0
4670;-742810.120000001043081;-1042644.289999999105930;0
6125;-743428.124000001698732;-1043615.223999999463558;0
4770;-742872.535000000149012;-1042899.679000001400709;0
3794;-743091.015000000596046;-1042800.471999999135733;0
387;-742421.000000000000000;-1043763.000000000000000;0
6223;-742316.076000001281500;-1043058.679000001400709;0
4961;-742309.460000000894070;-1043010.730000000447035;0
5681;-743400.820000000298023;-1043718.682000000029802;0
4743;-742812.449999999254942;-1042729.609999999403954;0
6723;-742592.894999999552965;-1044408.905000001192093;0
6198;-742312.659000001847744;-1043056.964999999850988;0
5515;-743426.960000000894070;-1043612.083999998867512;0
1379;-742135.000000000000000;-1044975.000000000000000;0
7152;-742867.331999998539686;-1044547.015999998897314;0
3812;-743231.179999999701977;-1042815.199999999254942;0
4699;-742676.469999998807907;-1042731.760000001639128;0
1405;-741681.000000000000000;-1044325.000000000000000;0
1329;-742062.000000000000000;-1045046.000000000000000;0
332;-742645.000000000000000;-1044014.000000000000000;0
334;-742631.000000000000000;-1043987.000000000000000;0
7249;-742789.010999999940395;-1044830.250000000000000;0
6714;-742287.171000000089407;-1044923.995999999344349;0
190;-743443.000000000000000;-1043597.000000000000000;0
6278;-742305.421999998390675;-1043028.918000001460314;0
627;-742223.000000000000000;-1043335.000000000000000;0
7199;-742570.910000000149012;-1044916.410000000149012;0
5721;-743418.407999999821186;-1043631.800000000745058;0
4325;-742270.679000001400709;-1043141.787999998778105;0
4821;-742966.550000000745058;-1042877.969999998807907;0
5734;-743412.366999998688698;-1043688.041999999433756;0
1126;-741684.000000000000000;-1044450.000000000000000;0
3144;-744012.590999998152256;-1042662.508000001311302;0
5703;-743417.385000001639128;-1043633.592000000178814;0
7292;-742821.410000000149012;-1044818.760000001639128;0
4955;-742383.649999998509884;-1043019.250000000000000;0
3785;-743172.449999999254942;-1042923.850000001490116;0
6205;-742314.800000000745058;-1043059.416999999433756;0
4252;-742124.022999998182058;-1043390.519000001251698;0
2323;-742622.000000000000000;-1045487.000000000000000;0
4781;-742926.519000001251698;-1042695.502999998629093;0
1623;-742524.000000000000000;-1044319.000000000000000;0
4673;-742811.420000001788139;-1042756.050000000745058;0
6184;-742315.868999999016523;-1043064.326999999582767;0
5689;-743415.442000001668930;-1043633.646000001579523;0
6697;-742363.109999999403954;-1044816.120000001043081;0
264;-743367.000000000000000;-1043732.000000000000000;0
3308;-743813.059999998658895;-1042830.515000000596046;0
5252;-743283.517000000923872;-1043176.197999998927116;0
5640;-743428.425000000745058;-1043686.254000000655651;0
5657;-743429.199999999254942;-1043706.837999999523163;0
6225;-742314.519999999552965;-1043055.927000001072884;0
4507;-742472.469999998807907;-1042720.199999999254942;0
1108;-741261.000000000000000;-1044593.000000000000000;0
1499;-741413.000000000000000;-1044304.000000000000000;0
5966;-742483.469999998807907;-1043066.721999999135733;0
1366;-742109.000000000000000;-1044948.000000000000000;0
6201;-742317.888999998569489;-1043065.035000000149012;0
3802;-743068.190000001341105;-1042879.710000000894070;0
3984;-743314.570000000298023;-1043905.594999998807907;0
6193;-742316.486000001430511;-1043063.991000000387430;0
394;-742405.000000000000000;-1043863.000000000000000;0
