OID_;X;Y;TEMPERATURE
3614;-744984.548999998718500;-1042283.640999998897314;0
110;-744127.000000000000000;-1042724.000000000000000;0
3019;-744463.447999998927116;-1042784.646000001579523;0
3568;-744718.817999999970198;-1042588.614999998360872;0
3692;-744525.876499999314547;-1042540.534000001847744;0
3580;-744924.973999999463558;-1042593.699999999254942;0
2605;-745393.842999998480082;-1042860.796000000089407;0
5975;-745052.346999999135733;-1042674.673000000417233;0
118;-745135.000000000000000;-1042687.000000000000000;0
7911;-743564.839999999850988;-1045408.649999998509884;0
3542;-744575.274000000208616;-1042656.160000000149012;0
1196;-741677.000000000000000;-1043894.000000000000000;0
1584;-742368.000000000000000;-1044717.000000000000000;0
2696;-743477.489999998360872;-1042038.000000000000000;0
3919;-743904.947000000625849;-1043493.929999999701977;0
2520;-741847.000000000000000;-1045324.000000000000000;0
227;-742846.000000000000000;-1043520.000000000000000;0
1197;-741657.000000000000000;-1043865.000000000000000;0
1533;-741832.000000000000000;-1043879.000000000000000;0
6556;-741290.410000000149012;-1044041.471000000834465;0
2050;-743460.000000000000000;-1045072.000000000000000;0
4068;-742917.125000000000000;-1043734.535000000149012;0
7011;-742831.309999998658895;-1044257.245000001043081;0
743;-741682.000000000000000;-1043020.000000000000000;0
4235;-742390.041999999433756;-1043492.094999998807907;0
1760;-741162.000000000000000;-1044101.000000000000000;0
23;-743544.000000000000000;-1042505.000000000000000;0
730;-741948.000000000000000;-1042998.000000000000000;0
1289;-742211.000000000000000;-1044521.000000000000000;0
709;-741861.000000000000000;-1042862.000000000000000;0
4029;-743130.695999998599291;-1043815.427999999374151;0
7780;-743046.243000000715256;-1045844.168999999761581;0
379;-742479.000000000000000;-1043679.000000000000000;0
1542;-742043.000000000000000;-1044057.000000000000000;0
3995;-743393.225000001490116;-1043973.719999998807907;0
397;-742355.000000000000000;-1043861.000000000000000;0
6338;-742247.910000000149012;-1042851.670000001788139;0
2096;-743154.000000000000000;-1044724.000000000000000;0
7258;-742917.370000001043081;-1044865.420000001788139;0
4070;-742925.285000000149012;-1043783.565000001341105;0
1728;-741473.000000000000000;-1045087.000000000000000;0
7721;-742941.157000001519918;-1044215.368000000715256;0
461;-741713.000000000000000;-1043304.000000000000000;0
7215;-742484.320000000298023;-1044546.620000001043081;0
1415;-741623.000000000000000;-1044561.000000000000000;0
509;-741991.000000000000000;-1043143.000000000000000;0
1319;-741788.000000000000000;-1044905.000000000000000;0
1515;-741913.000000000000000;-1044072.000000000000000;0
2386;-742139.000000000000000;-1045460.000000000000000;0
2081;-742551.000000000000000;-1044621.000000000000000;0
3836;-743096.070000000298023;-1042561.879999998956919;0
1697;-741495.000000000000000;-1044664.000000000000000;0
7156;-742944.515000000596046;-1044546.140000000596046;0
1026;-741986.000000000000000;-1044631.000000000000000;0
6946;-742974.765000000596046;-1043929.388000000268221;0
5302;-743090.423999998718500;-1043070.048999998718500;0
7;-743479.000000000000000;-1042567.000000000000000;0
4458;-742245.679999999701977;-1042633.960000000894070;0
4537;-742303.159000001847744;-1042752.293000001460314;0
1229;-742244.000000000000000;-1044253.000000000000000;0
500;-741861.000000000000000;-1043174.000000000000000;0
1368;-741998.000000000000000;-1044779.000000000000000;0
2221;-743076.000000000000000;-1045412.000000000000000;0
2262;-742999.000000000000000;-1045686.000000000000000;0
4559;-742400.530000001192093;-1042503.760000001639128;0
4073;-742939.109999999403954;-1043858.504999998956919;0
5307;-743082.182000000029802;-1043190.162000000476837;0
2756;-743984.276999998837709;-1043475.763000000268221;0
6496;-742290.655999999493361;-1044438.502999998629093;0
2381;-742313.000000000000000;-1045438.000000000000000;0
3758;-743284.129999998956919;-1042964.100000001490116;0
1425;-742080.000000000000000;-1044210.000000000000000;0
2319;-742734.000000000000000;-1045474.000000000000000;0
4131;-742844.625000000000000;-1044059.980000000447035;0
1237;-742144.000000000000000;-1044365.000000000000000;0
1617;-742384.000000000000000;-1044407.000000000000000;0
7024;-743182.745000001043081;-1044052.815000001341105;0
3795;-743173.190000001341105;-1042842.170000001788139;0
2247;-743199.000000000000000;-1045400.000000000000000;0
2495;-741982.000000000000000;-1044140.000000000000000;0
8079;-742021.839999999850988;-1045292.179999999701977;0
2277;-742826.000000000000000;-1045653.000000000000000;0
1308;-741589.000000000000000;-1044811.000000000000000;0
3824;-743038.059999998658895;-1042573.800000000745058;0
339;-742606.000000000000000;-1043916.000000000000000;0
346;-742540.000000000000000;-1043816.000000000000000;0
7015;-742554.570000000298023;-1044360.725000001490116;0
8058;-742263.219999998807907;-1045051.489999998360872;0
3066;-744075.627000000327826;-1042883.837000001221895;0
3206;-743702.239000000059605;-1042499.019000001251698;0
3214;-743628.813000001013279;-1042457.677000001072884;0
4055;-743119.070000000298023;-1043694.109999999403954;0
4935;-742447.241999998688698;-1042699.399000000208616;0
739;-741789.000000000000000;-1043028.000000000000000;0
5136;-742992.278000000864267;-1043472.440000001341105;0
3111;-743727.034000001847744;-1042625.182999998331070;0
3944;-743390.002000000327826;-1043413.532999999821186;0
7514;-742304.866000000387430;-1044375.124000001698732;0
6389;-742141.199999999254942;-1042497.030000001192093;0
6675;-742272.140000000596046;-1044167.469999998807907;0
5258;-743356.739999998360872;-1043230.039999999105930;0
6722;-742357.717000000178814;-1044705.708000000566244;0
6843;-741569.070000000298023;-1044975.261999998241663;0
1971;-743385.000000000000000;-1044881.000000000000000;0
701;-742023.000000000000000;-1042885.000000000000000;0
4212;-742205.245000001043081;-1043548.410000000149012;0
5436;-744076.484000001102686;-1043296.519999999552965;0
941;-742098.000000000000000;-1043132.000000000000000;0
5170;-743246.743000000715256;-1043425.304000001400709;0
1332;-741793.000000000000000;-1044755.000000000000000;0
4660;-742801.596999999135733;-1042487.965999998152256;0
4025;-743202.881000000983477;-1043852.008000001311302;0
4135;-742747.719999998807907;-1044085.660000000149012;0
2315;-742854.000000000000000;-1045460.000000000000000;0
274;-743359.000000000000000;-1043833.000000000000000;68
724;-741987.000000000000000;-1042981.000000000000000;0
177;-743376.000000000000000;-1043232.000000000000000;0
4040;-743224.710000000894070;-1043766.050000000745058;0
2224;-743051.000000000000000;-1045450.000000000000000;0
524;-742255.000000000000000;-1043913.000000000000000;0
618;-742203.000000000000000;-1043272.000000000000000;0
6821;-741256.649999998509884;-1044796.100000001490116;0
3818;-743130.217999998480082;-1042703.293000001460314;0
6713;-742278.905999999493361;-1044887.284000001847744;0
1034;-741964.000000000000000;-1044876.000000000000000;0
6007;-743187.807000000029802;-1043302.019000001251698;0
4669;-742823.199999999254942;-1042658.309999998658895;0
1413;-741631.000000000000000;-1044621.000000000000000;0
1335;-741752.000000000000000;-1044833.000000000000000;0
2514;-742546.000000000000000;-1044431.000000000000000;0
8045;-742173.070000000298023;-1044806.519999999552965;0
3812;-743231.179999999701977;-1042815.199999999254942;0
2524;-742108.000000000000000;-1044191.000000000000000;0
333;-742651.000000000000000;-1043996.000000000000000;0
4153;-742555.934999998658895;-1044073.285000000149012;0
6751;-742426.350000001490116;-1044371.070000000298023;0
6703;-742288.903999999165535;-1044591.625999998301268;0
1878;-743324.000000000000000;-1044249.000000000000000;0
2332;-742899.000000000000000;-1045516.000000000000000;0
2210;-743280.000000000000000;-1045237.000000000000000;0
6589;-741303.679999999701977;-1043901.390000000596046;0
5138;-743030.936000000685453;-1043483.587999999523163;0
2032;-743526.000000000000000;-1044797.000000000000000;0
2133;-743040.000000000000000;-1045127.000000000000000;0
1005;-741944.000000000000000;-1044583.000000000000000;0
318;-742434.000000000000000;-1044213.000000000000000;0
6479;-741969.831000000238419;-1044454.850000001490116;0
4010;-743200.372999999672174;-1044041.177999999374151;0
579;-742006.000000000000000;-1043477.000000000000000;0
1012;-742060.000000000000000;-1044582.000000000000000;0
310;-742696.000000000000000;-1044162.000000000000000;0
1914;-743464.000000000000000;-1044458.000000000000000;0
7246;-742736.730000000447035;-1044825.399999998509884;0
2894;-743960.129000000655651;-1043216.409000001847744;0
2185;-743216.000000000000000;-1045130.000000000000000;0
2146;-742845.000000000000000;-1044968.000000000000000;0
1367;-742137.000000000000000;-1044959.000000000000000;0
1751;-742046.000000000000000;-1045235.000000000000000;0
1503;-741537.000000000000000;-1044272.000000000000000;0
1654;-741387.000000000000000;-1044621.000000000000000;0
6833;-741571.423000000417233;-1044909.473999999463558;0
1483;-741252.000000000000000;-1044224.000000000000000;0
3767;-743033.910000000149012;-1042982.390000000596046;0
5143;-743052.232000000774860;-1043454.120000001043081;0
6974;-743127.620000001043081;-1044518.800000000745058;0
4168;-742423.695000000298023;-1043984.135000001639128;0
1586;-742372.000000000000000;-1044785.000000000000000;0
4931;-742449.300000000745058;-1042791.403000000864267;0
4571;-742345.710000000894070;-1042568.989999998360872;0
1120;-741778.000000000000000;-1044457.000000000000000;0
4174;-742738.230000000447035;-1043763.155000001192093;0
8263;-742151.089999999850988;-1042702.239999998360872;0
6226;-742320.660999998450279;-1043065.366999998688698;0
4246;-742193.159000001847744;-1043412.537000000476837;0
7147;-742827.925000000745058;-1044451.385000001639128;0
6492;-742174.054000001400709;-1044455.534000001847744;0
2103;-743182.000000000000000;-1044931.000000000000000;0
1659;-741420.000000000000000;-1044790.000000000000000;0
4059;-743142.649999998509884;-1043612.730000000447035;0
7152;-742867.331999998539686;-1044547.015999998897314;0
4121;-742721.160000000149012;-1043948.695000000298023;0
722;-742139.000000000000000;-1043009.000000000000000;0
6651;-741697.910000000149012;-1044123.329999998211861;0
1970;-743380.000000000000000;-1044854.000000000000000;0
1419;-741603.000000000000000;-1044410.000000000000000;0
5171;-743266.124000001698732;-1043419.293999999761581;0
7986;-741040.829999998211861;-1044408.250000000000000;0
2457;-741016.000000000000000;-1044542.000000000000000;0
1662;-741451.000000000000000;-1044403.000000000000000;0
2258;-742974.000000000000000;-1045574.000000000000000;0
5221;-743263.820000000298023;-1043556.920000001788139;0
5717;-743422.208999998867512;-1043629.984000001102686;0
1941;-743267.000000000000000;-1044384.000000000000000;0
7043;-743398.899999998509884;-1044106.629999998956919;0
7004;-743069.289999999105930;-1044326.469999998807907;0
1486;-741150.000000000000000;-1044219.000000000000000;0
2254;-743235.000000000000000;-1045290.000000000000000;0
634;-742117.000000000000000;-1043309.000000000000000;0
6689;-742384.449999999254942;-1045033.609999999403954;0
4197;-742179.633999999612570;-1043776.899000000208616;0
571;-742082.000000000000000;-1043581.000000000000000;0
1109;-741204.100000001490116;-1044585.460000000894070;0
3789;-743137.469999998807907;-1042933.670000001788139;0
1396;-741798.000000000000000;-1044263.000000000000000;0
6874;-741789.789999999105930;-1045272.100000001490116;0
1267;-742040.000000000000000;-1044999.000000000000000;0
1932;-743359.000000000000000;-1044408.000000000000000;0
6817;-741052.879000000655651;-1044823.684999998658895;0
5775;-743915.925000000745058;-1042818.550999999046326;0
7281;-742801.859999999403954;-1044705.300000000745058;0
1707;-741196.219999998807907;-1044702.390000000596046;0
2465;-743493.000000000000000;-1044697.000000000000000;0
7137;-742916.074999999254942;-1044400.230000000447035;0
2299;-742592.000000000000000;-1045409.000000000000000;0
3783;-743211.559999998658895;-1042920.120000001043081;0
2189;-743472.000000000000000;-1045183.000000000000000;0
4085;-742812.431000001728535;-1043657.114000000059605;126
3801;-743091.350000001490116;-1042882.719999998807907;0
2888;-744082.749000001698732;-1043174.458999998867512;22
5024;-742588.655000001192093;-1042886.519000001251698;0
2090;-742923.000000000000000;-1044566.000000000000000;0
3170;-743935.190000001341105;-1042595.719999998807907;0
4424;-742225.300000000745058;-1043033.250000000000000;0
7660;-742321.396999999880791;-1045335.578999999910593;0
1952;-743316.000000000000000;-1044495.000000000000000;0
8072;-742148.059999998658895;-1045271.649999998509884;0
5518;-743427.500999998301268;-1043621.975000001490116;0
4622;-742533.901000000536442;-1042569.660000000149012;0
2358;-742370.000000000000000;-1045593.000000000000000;0
3352;-743954.622000001370907;-1043015.732999999076128;0
719;-741705.000000000000000;-1042828.000000000000000;0
5640;-743428.425000000745058;-1043686.254000000655651;0
4005;-743325.977000001817942;-1044053.392999999225140;0
4697;-742675.329999998211861;-1042689.179999999701977;0
1430;-741993.000000000000000;-1044260.000000000000000;0
4804;-743020.045000001788139;-1042704.315999999642372;0
2328;-742459.000000000000000;-1045505.000000000000000;0
2346;-742654.000000000000000;-1045546.000000000000000;0
7203;-742571.300000000745058;-1044963.219999998807907;0
3380;-743794.508000001311302;-1042935.758999999612570;0
7173;-742660.850000001490116;-1044535.730000000447035;0
5087;-742847.622999999672174;-1043250.081000000238419;0
8071;-742174.120000001043081;-1045257.530000001192093;0
2556;-741376.000000000000000;-1044379.000000000000000;0
518;-742194.000000000000000;-1043131.000000000000000;0
2422;-742473.000000000000000;-1045096.000000000000000;0
678;-742421.000000000000000;-1043181.000000000000000;0
6265;-742353.164999999105930;-1043020.054999999701977;0
3960;-743418.563000001013279;-1043583.526000000536442;0
4251;-742136.420000001788139;-1043379.969999998807907;0
4032;-743136.934999998658895;-1043750.375000000000000;0
1992;-743482.000000000000000;-1044954.000000000000000;0
6766;-741193.449999999254942;-1044424.320000000298023;0
1059;-741637.000000000000000;-1045095.000000000000000;0
7187;-742595.019999999552965;-1044739.962000001221895;0
3838;-743113.550000000745058;-1042543.399999998509884;0
2152;-742814.000000000000000;-1045106.000000000000000;0
4330;-742377.440999999642372;-1043332.162999998778105;0
3266;-743585.618999999016523;-1042739.508999999612570;0
3379;-743806.728000000119209;-1042934.574999999254942;0
5727;-743422.451999999582767;-1043637.473000001162291;0
5408;-743696.881000000983477;-1042878.024999998509884;0
6656;-741590.160000000149012;-1044150.480000000447035;0
4465;-742180.250000000000000;-1042584.370000001043081;0
4516;-742588.570000000298023;-1042771.460000000894070;0
880;-741793.000000000000000;-1042834.000000000000000;0
7729;-742623.480999998748302;-1044601.217000000178814;0
6687;-742383.274000000208616;-1044983.381999999284744;0
5410;-742572.837000001221895;-1042981.173999998718500;0
6190;-742318.782999999821186;-1043068.206000000238419;0
4624;-742577.815000001341105;-1042600.907999999821186;0
4322;-742266.414000000804663;-1043213.907999999821186;0
4668;-742810.210000000894070;-1042618.969999998807907;0
4232;-742315.057999998331070;-1043428.918999999761581;0
6218;-742319.947000000625849;-1043065.767999999225140;0
8275;-742087.910000000149012;-1042738.609999999403954;0
5699;-743416.657000001519918;-1043631.932999998331070;0
2470;-742936.000000000000000;-1045241.000000000000000;0
5705;-743417.603000000119209;-1043637.098000001162291;0
691;-742293.000000000000000;-1043097.000000000000000;0
6979;-743081.460000000894070;-1044413.079999998211861;0
7199;-742570.910000000149012;-1044916.410000000149012;0
7197;-742570.949000000953674;-1044895.548999998718500;0
1657;-741399.000000000000000;-1044717.000000000000000;0
181;-743421.000000000000000;-1043350.000000000000000;0
4976;-742494.337000001221895;-1043009.743000000715256;0
2033;-743500.000000000000000;-1044798.000000000000000;0
3141;-744035.420000001788139;-1042680.460000000894070;0
4479;-741782.780000001192093;-1042660.359999999403954;0
1251;-742091.000000000000000;-1044690.000000000000000;0
6276;-742310.815999999642372;-1043016.000999998301268;0
2170;-742897.000000000000000;-1045133.000000000000000;0
3367;-743914.585000000894070;-1043020.743999999016523;0
4783;-742933.866999998688698;-1042668.403000000864267;0
4983;-742587.776000000536442;-1043013.068999998271465;0
794;-741746.000000000000000;-1042595.000000000000000;0
1318;-741838.000000000000000;-1044940.000000000000000;0
7181;-742612.239999998360872;-1044670.160000000149012;0
1097;-741414.000000000000000;-1044558.000000000000000;0
876;-741953.000000000000000;-1042636.000000000000000;0
2563;-741065.000000000000000;-1044421.000000000000000;0
5419;-742434.690000001341105;-1042846.280000001192093;0
5713;-743423.890999998897314;-1043636.899999998509884;0
4859;-742966.710000000894070;-1042996.302999999374151;0
6230;-742317.590999998152256;-1043059.730999998748302;0
2026;-743351.000000000000000;-1045022.000000000000000;0
5723;-743420.903000000864267;-1043631.703999999910593;0
1365;-742125.050000000745058;-1044945.710000000894070;0
2198;-743302.000000000000000;-1045194.000000000000000;0
681;-742383.000000000000000;-1043170.000000000000000;0
4757;-742873.984000001102686;-1042820.212000001221895;0
8260;-742091.730000000447035;-1042690.769999999552965;0
4339;-742459.269000001251698;-1043367.923000000417233;0
1234;-742162.000000000000000;-1044314.000000000000000;0
4694;-742689.272999998182058;-1042626.495999999344349;0
1811;-743175.000000000000000;-1044525.000000000000000;0
5081;-742917.046000000089407;-1043356.515999998897314;0
6503;-741647.706000000238419;-1044996.008999999612570;0
836;-742006.000000000000000;-1042525.000000000000000;0
1960;-743386.000000000000000;-1044623.000000000000000;0
5660;-743425.633999999612570;-1043709.497000001370907;0
1093;-741494.000000000000000;-1044548.000000000000000;0
6785;-741294.269999999552965;-1044465.800000000745058;0
5708;-743418.927999999374151;-1043640.519000001251698;0
1956;-743397.000000000000000;-1044501.000000000000000;0
1268;-742046.000000000000000;-1045021.000000000000000;0
7121;-743339.839999999850988;-1044620.059999998658895;0
3372;-743823.475000001490116;-1043010.432999998331070;0
6153;-742309.583999998867512;-1043058.640999998897314;0
4529;-742762.920000001788139;-1042885.809999998658895;0
4324;-742269.346000000834465;-1043165.410999998450279;0
6777;-741073.500000000000000;-1044491.879999998956919;0
5120;-742868.383999999612570;-1043343.986000001430511;0
1265;-742047.000000000000000;-1044960.000000000000000;0
4023;-743246.635000001639128;-1043864.364999998360872;0
682;-742380.000000000000000;-1043151.000000000000000;0
4659;-742803.311000000685453;-1042470.754999998956919;0
2456;-741013.000000000000000;-1044501.000000000000000;0
516;-742160.000000000000000;-1043135.000000000000000;0
5067;-742813.465999998152256;-1043267.335999999195337;0
671;-742489.000000000000000;-1043245.000000000000000;0
5676;-743406.725999999791384;-1043716.493000000715256;0
4202;-742285.475999999791384;-1043627.734999999403954;0
4078;-742842.960000000894070;-1043832.824999999254942;0
7019;-742585.024999998509884;-1044210.725000001490116;0
6263;-742365.719000000506639;-1043021.282999999821186;0
1499;-741413.000000000000000;-1044304.000000000000000;0
5637;-743428.151000000536442;-1043682.633999999612570;0
4849;-742966.960000000894070;-1042893.583999998867512;0
4578;-742381.817000001668930;-1042594.177999999374151;0
296;-742950.170000001788139;-1044097.429999999701977;0
1450;-741527.000000000000000;-1044632.000000000000000;0
1304;-741810.000000000000000;-1044684.000000000000000;0
3293;-743596.793000001460314;-1042814.440000001341105;0
2577;-742491.000000000000000;-1045513.000000000000000;0
3304;-743786.739000000059605;-1042873.728999998420477;0
5293;-743043.969999998807907;-1043208.554000001400709;0
6232;-742316.034000001847744;-1043057.000000000000000;0
734;-741935.000000000000000;-1043014.000000000000000;0
6004;-742061.723000001162291;-1043300.859999999403954;0
5415;-742954.934000000357628;-1042714.414000000804663;0
3425;-743730.254000000655651;-1043071.712000001221895;0
4797;-743049.140999998897314;-1042689.576999999582767;0
592;-741913.000000000000000;-1043311.000000000000000;0
4641;-742591.151999998837709;-1042559.721000000834465;0
3974;-743140.660000000149012;-1043725.350000001490116;0
6483;-741773.829999998211861;-1044640.969000000506639;0
1441;-741744.000000000000000;-1044392.000000000000000;0
3959;-743417.421999998390675;-1043577.730000000447035;0
6692;-742222.114999998360872;-1044818.673000000417233;0
2143;-742859.000000000000000;-1045086.000000000000000;0
1140;-741475.000000000000000;-1044461.000000000000000;0
6769;-741281.120000001043081;-1044417.780000001192093;0
224;-742904.000000000000000;-1043522.000000000000000;0
7270;-743152.309999998658895;-1044962.469999998807907;0
94;-744054.000000000000000;-1042934.000000000000000;0
7177;-742643.059999998658895;-1044579.679999999701977;0
7641;-742335.304000001400709;-1045451.613000001758337;0
6173;-742316.787000000476837;-1043067.471000000834465;0
6268;-742340.850000001490116;-1043018.881000000983477;0
4981;-742536.340999998152256;-1043014.929999999701977;0
6158;-742313.261999998241663;-1043063.925999999046326;0
6179;-742312.195000000298023;-1043059.041000001132488;0
587;-741944.000000000000000;-1043391.000000000000000;0
5996;-742061.879000000655651;-1043284.276999998837709;0
7808;-741986.629999998956919;-1044440.109999999403954;0
1874;-743379.000000000000000;-1044247.000000000000000;0
1990;-743482.000000000000000;-1044906.000000000000000;0
5590;-743422.570000000298023;-1043679.642000000923872;0
602;-741828.000000000000000;-1043190.000000000000000;0
6511;-741291.670000001788139;-1044319.690000001341105;0
927;-742021.000000000000000;-1043498.000000000000000;0
5718;-743420.888999998569489;-1043629.666999999433756;0
3358;-743952.916999999433756;-1043047.306000001728535;0
1930;-743415.000000000000000;-1044409.000000000000000;0
759;-741659.000000000000000;-1042650.000000000000000;0
4477;-741858.039999999105930;-1042692.129999998956919;0
6352;-741906.920000001788139;-1042710.609999999403954;0
5725;-743422.388000000268221;-1043634.186999998986721;0
5156;-743160.188999999314547;-1043355.291999999433756;0
4875;-742814.660000000149012;-1042937.800000000745058;0
5598;-743412.839999999850988;-1043680.403000000864267;0
2051;-743434.000000000000000;-1045074.000000000000000;0
4702;-742669.300000000745058;-1042747.399999998509884;0
548;-742297.000000000000000;-1043762.000000000000000;0
7958;-741664.710000000894070;-1044289.879999998956919;0
1793;-742166.000000000000000;-1044246.000000000000000;0
6269;-742337.300000000745058;-1043018.486000001430511;0
4975;-742477.829999998211861;-1043016.923000000417233;0
4808;-743110.859999999403954;-1042784.829999998211861;0
4827;-743046.359999999403954;-1042958.140000000596046;0
2501;-742746.000000000000000;-1045430.000000000000000;0
1865;-743458.000000000000000;-1044233.000000000000000;0
7976;-741301.260000001639128;-1044401.750000000000000;0
7355;-743348.309999998658895;-1045148.329999998211861;0
3963;-743372.780000001192093;-1043538.789999999105930;0
3833;-743029.679999999701977;-1042612.300000000745058;0
6176;-742314.491000000387430;-1043063.256000000983477;0
4527;-742728.050000000745058;-1042838.719999998807907;0
1465;-741870.000000000000000;-1044016.000000000000000;0
6654;-741635.289999999105930;-1044140.820000000298023;0
1875;-743367.000000000000000;-1044261.000000000000000;0
4681;-742756.870000001043081;-1042844.710000000894070;0
985;-741823.000000000000000;-1044444.000000000000000;0
1181;-741920.000000000000000;-1044230.000000000000000;0
676;-742442.000000000000000;-1043196.000000000000000;0
1364;-742077.000000000000000;-1044936.000000000000000;0
4619;-742460.010000001639128;-1042480.890000000596046;0
5580;-743409.831000000238419;-1043636.449000000953674;0
3377;-743832.151999998837709;-1042925.721000000834465;0
4735;-742686.059999998658895;-1042669.260000001639128;0
4829;-743051.579999998211861;-1042916.609999999403954;0
4520;-742651.079999998211861;-1042798.449999999254942;0
6613;-741749.640000000596046;-1044032.820000000298023;0
782;-741695.000000000000000;-1042522.000000000000000;0
385;-742436.000000000000000;-1043742.000000000000000;0
4948;-742386.929999999701977;-1042992.239999998360872;0
401;-742324.000000000000000;-1043907.000000000000000;0
6181;-742318.164999999105930;-1043068.541999999433756;0
7646;-742318.263999998569489;-1045391.811000000685453;0
534;-742087.000000000000000;-1043699.000000000000000;0
5711;-743422.837999999523163;-1043640.131000000983477;0
5588;-743425.002000000327826;-1043679.451999999582767;0
4239;-742454.206000000238419;-1043538.927999999374151;0
692;-742292.000000000000000;-1043084.000000000000000;0
4999;-742534.149999998509884;-1042966.892999999225140;0
3292;-743576.905000001192093;-1042781.315000001341105;0
4841;-742989.993999999016523;-1042765.850999999791384;0
5791;-743256.583000000566244;-1043571.184000000357628;0
817;-741937.000000000000000;-1042586.000000000000000;0
392;-742418.000000000000000;-1043843.000000000000000;0
1946;-743281.000000000000000;-1044437.000000000000000;0
6159;-742312.495999999344349;-1043062.521000001579523;0
4848;-742977.940000001341105;-1042862.019999999552965;0
6353;-741893.070000000298023;-1042697.059999998658895;0
884;-741771.000000000000000;-1042776.000000000000000;0
4832;-743039.079999998211861;-1042840.850000001490116;0
1827;-743033.000000000000000;-1044080.000000000000000;0
1511;-741795.000000000000000;-1044159.000000000000000;0
4962;-742387.429999999701977;-1043028.129999998956919;0
4854;-742971.159000001847744;-1042912.429000001400709;0
4889;-742621.425000000745058;-1042831.109999999403954;0
7977;-741271.370000001043081;-1044404.390000000596046;0
3800;-743098.550000000745058;-1042863.019999999552965;0
7165;-742711.789999999105930;-1044504.984999999403954;0
736;-741880.000000000000000;-1043017.000000000000000;0
6256;-742380.723000001162291;-1043035.640000000596046;0
1516;-741928.000000000000000;-1044062.000000000000000;0
1458;-741506.000000000000000;-1044384.000000000000000;0
594;-741896.000000000000000;-1043296.000000000000000;0
679;-742404.000000000000000;-1043185.000000000000000;0
1328;-742037.000000000000000;-1045043.000000000000000;0
6354;-741928.410000000149012;-1042711.350000001490116;0
6142;-742310.477000001817942;-1043061.813000001013279;0
7010;-742857.964999999850988;-1044251.155000001192093;0
1118;-741807.000000000000000;-1044459.000000000000000;0
4592;-742448.190999999642372;-1042642.517999999225140;0
650;-742263.000000000000000;-1043381.000000000000000;0
6219;-742319.168999999761581;-1043064.293999999761581;0
4928;-742444.890000000596046;-1042854.899999998509884;0
6507;-741738.839999999850988;-1044541.820000000298023;0
833;-742050.000000000000000;-1042573.000000000000000;0
6275;-742314.603999998420477;-1043016.407999999821186;0
5648;-743429.164000000804663;-1043695.905999999493361;0
5957;-742962.627000000327826;-1043510.905000001192093;0
4200;-742219.350000001490116;-1043727.980999998748302;0
5715;-743423.747000001370907;-1043633.157999999821186;0
2057;-742787.000000000000000;-1044365.000000000000000;0
5943;-742064.651000000536442;-1043693.136999998241663;0
6112;-742237.710000000894070;-1043370.434999998658895;0
954;-742231.000000000000000;-1043024.000000000000000;0
5209;-743271.947999998927116;-1043361.392000000923872;0
3961;-743419.609999999403954;-1043589.497000001370907;0
1272;-742237.000000000000000;-1044545.000000000000000;0
4792;-743051.280000001192093;-1042654.962999999523163;0
1713;-741207.339999999850988;-1044891.359999999403954;0
5444;-743183.024000000208616;-1043210.600000001490116;0
4951;-742335.579999998211861;-1042934.429999999701977;0
7175;-742651.780000001192093;-1044558.149999998509884;0
1445;-741553.000000000000000;-1044757.000000000000000;0
