OID_;X;Y;TEMPERATURE
3614;-744984.548999998718500;-1042283.640999998897314;0
5790;-743521.019999999552965;-1042064.280000001192093;0
3917;-743967.182999998331070;-1043516.284000001847744;0
2265;-742972.000000000000000;-1045774.000000000000000;0
1532;-741805.000000000000000;-1043858.000000000000000;0
2809;-744090.649999998509884;-1043371.184000000357628;0
3811;-743244.620000001043081;-1042809.420000001788139;0
1310;-741623.000000000000000;-1044829.000000000000000;0
2150;-742812.000000000000000;-1045054.000000000000000;0
4060;-742896.530000001192093;-1043699.219999998807907;0
110;-744127.000000000000000;-1042724.000000000000000;0
2167;-743021.000000000000000;-1045154.000000000000000;0
2270;-742954.000000000000000;-1045592.000000000000000;0
7007;-742923.890000000596046;-1044218.879999998956919;0
2761;-743859.467000000178814;-1043468.017000000923872;0
226;-742879.000000000000000;-1043516.000000000000000;0
1852;-742739.000000000000000;-1044210.000000000000000;0
1760;-741162.000000000000000;-1044101.000000000000000;0
6776;-741098.559999998658895;-1044491.530000001192093;0
3111;-743727.034000001847744;-1042625.182999998331070;0
462;-741707.000000000000000;-1043294.000000000000000;0
4099;-742773.870000001043081;-1043846.135999999940395;0
2885;-744122.791999999433756;-1043190.208000000566244;0
1924;-743359.000000000000000;-1044320.000000000000000;0
2893;-743977.276000000536442;-1043208.923999998718500;0
3752;-743213.949999999254942;-1042902.719999998807907;0
1993;-743483.000000000000000;-1044984.000000000000000;0
524;-742255.000000000000000;-1043913.000000000000000;96
4236;-742406.842999998480082;-1043504.015000000596046;0
7004;-743069.289999999105930;-1044326.469999998807907;0
2075;-743114.000000000000000;-1044772.000000000000000;0
7132;-743262.120000001043081;-1044825.699999999254942;0
6580;-741299.379000000655651;-1044005.879000000655651;0
6870;-741708.260000001639128;-1045321.590999998152256;0
1172;-741869.000000000000000;-1044348.000000000000000;0
1020;-742293.000000000000000;-1044615.000000000000000;0
283;-743026.000000000000000;-1043788.000000000000000;0
7944;-742086.969999998807907;-1044063.079999998211861;0
1654;-741387.000000000000000;-1044621.000000000000000;0
884;-741771.000000000000000;-1042776.000000000000000;0
5309;-743033.405000001192093;-1043187.043999999761581;0
827;-742218.000000000000000;-1042626.000000000000000;0
6;-743464.000000000000000;-1042594.000000000000000;0
4235;-742390.041999999433756;-1043492.094999998807907;0
502;-741901.000000000000000;-1043169.000000000000000;0
3838;-743113.550000000745058;-1042543.399999998509884;0
6728;-742547.451000001281500;-1044392.396000001579523;0
5240;-743364.164000000804663;-1043254.934000000357628;0
6861;-741491.429999999701977;-1045010.300000000745058;0
3291;-743588.212999999523163;-1042790.916999999433756;0
3314;-743758.675999999046326;-1042905.688999999314547;0
3839;-743112.140000000596046;-1042558.280000001192093;0
4006;-743302.763000000268221;-1044052.298999998718500;0
2398;-742150.000000000000000;-1045370.000000000000000;0
1449;-741533.000000000000000;-1044684.000000000000000;0
4024;-743223.734999999403954;-1043859.954999998211861;0
23;-743544.000000000000000;-1042505.000000000000000;0
7409;-743521.629999998956919;-1045356.570000000298023;0
6805;-741109.710000000894070;-1044689.170000001788139;0
710;-741829.000000000000000;-1042878.000000000000000;0
2237;-743368.000000000000000;-1045238.000000000000000;0
3457;-745069.765000000596046;-1042699.907000001519918;0
4170;-742407.245000001043081;-1043945.519999999552965;0
3065;-744092.028999999165535;-1042868.519000001251698;0
7171;-742671.969999998807907;-1044508.219999998807907;0
512;-742063.000000000000000;-1043136.000000000000000;0
3578;-744924.046000000089407;-1042547.359000001102686;0
3540;-744595.842000000178814;-1042655.640999998897314;0
6722;-742357.717000000178814;-1044705.708000000566244;0
7514;-742304.866000000387430;-1044375.124000001698732;0
3019;-744463.447999998927116;-1042784.646000001579523;0
623;-742254.000000000000000;-1043325.000000000000000;0
1930;-743415.000000000000000;-1044409.000000000000000;0
563;-742155.000000000000000;-1043660.000000000000000;0
4063;-742855.079999998211861;-1043654.695000000298023;0
1491;-741057.000000000000000;-1044333.000000000000000;0
6825;-741380.010000001639128;-1044780.089999999850988;0
4220;-742214.344999998807907;-1043580.359999999403954;0
7203;-742571.300000000745058;-1044963.219999998807907;0
1704;-741289.000000000000000;-1044690.000000000000000;0
6818;-741163.460000000894070;-1044806.616999998688698;0
6875;-741808.350000001490116;-1045257.269999999552965;0
3214;-743628.813000001013279;-1042457.677000001072884;0
2193;-743531.000000000000000;-1045204.000000000000000;0
2221;-743076.000000000000000;-1045412.000000000000000;0
1369;-742029.000000000000000;-1044788.000000000000000;0
1555;-741196.000000000000000;-1044374.000000000000000;0
1591;-742378.000000000000000;-1044910.000000000000000;0
4064;-742879.655000001192093;-1043647.420000001788139;0
392;-742418.000000000000000;-1043843.000000000000000;0
7218;-742534.100000001490116;-1044603.559999998658895;0
4332;-742410.359000001102686;-1043282.916000001132488;0
6504;-741755.193999998271465;-1044619.083000000566244;0
3269;-743600.679000001400709;-1042731.660000000149012;0
1614;-742388.000000000000000;-1044432.000000000000000;0
4247;-742154.829999998211861;-1043394.660000000149012;0
2172;-742886.000000000000000;-1045182.000000000000000;0
5112;-742942.920000001788139;-1043441.850000001490116;0
1941;-743267.000000000000000;-1044384.000000000000000;0
556;-742222.000000000000000;-1043702.000000000000000;0
4129;-742890.405000001192093;-1044048.370000001043081;0
1484;-741219.000000000000000;-1044224.000000000000000;0
3568;-744718.817999999970198;-1042588.614999998360872;0
1507;-741673.000000000000000;-1044223.000000000000000;0
3204;-743715.278999999165535;-1042506.118999999016523;0
2092;-742917.000000000000000;-1044617.000000000000000;0
1677;-741109.160000000149012;-1044522.699999999254942;0
6503;-741647.706000000238419;-1044996.008999999612570;0
5086;-742856.307999998331070;-1043239.488000001758337;0
4023;-743246.635000001639128;-1043864.364999998360872;0
1413;-741631.000000000000000;-1044621.000000000000000;0
5284;-743041.022999998182058;-1043277.397999998182058;0
5447;-743129.958999998867512;-1043365.166000001132488;0
7141;-742895.629999998956919;-1044470.910000000149012;0
2403;-742211.000000000000000;-1045436.000000000000000;0
6606;-741654.631999999284744;-1043906.848000001162291;0
2254;-743235.000000000000000;-1045290.000000000000000;0
533;-742137.000000000000000;-1043750.000000000000000;0
1059;-741637.000000000000000;-1045095.000000000000000;0
5069;-742829.063999999314547;-1043280.938000001013279;0
1816;-743070.000000000000000;-1044444.000000000000000;0
1488;-741088.000000000000000;-1044212.000000000000000;0
2300;-742561.000000000000000;-1045413.000000000000000;0
6090;-742012.260000001639128;-1043497.300000000745058;0
5205;-743251.475000001490116;-1043328.679000001400709;0
4010;-743200.372999999672174;-1044041.177999999374151;0
2373;-742469.000000000000000;-1045517.000000000000000;0
6574;-741292.359999999403954;-1044067.620000001043081;0
5242;-743357.030000001192093;-1043419.239999998360872;0
7706;-742313.239999998360872;-1044319.611999999731779;0
2309;-742322.000000000000000;-1045519.000000000000000;0
7018;-742577.747000001370907;-1044239.712999999523163;0
3705;-744508.056000001728535;-1042525.197000000625849;0
5220;-743247.339999999850988;-1043589.050000000745058;0
6227;-742319.839999999850988;-1043063.936000000685453;0
2256;-743156.000000000000000;-1045353.000000000000000;0
7655;-742266.583000000566244;-1045284.133999999612570;0
1039;-741914.000000000000000;-1044595.000000000000000;0
2543;-741788.000000000000000;-1044237.000000000000000;0
1012;-742060.000000000000000;-1044582.000000000000000;0
7270;-743152.309999998658895;-1044962.469999998807907;0
1981;-743406.000000000000000;-1044627.000000000000000;0
6749;-742418.210999999195337;-1044329.190999999642372;0
7089;-743344.149999998509884;-1044558.530000001192093;0
7679;-742498.250000000000000;-1045115.879999998956919;0
740;-741759.000000000000000;-1043031.000000000000000;0
3758;-743284.129999998956919;-1042964.100000001490116;0
7369;-743236.822000000625849;-1045458.699000000953674;0
3418;-743758.105000000447035;-1043107.024999998509884;0
7167;-742771.785999998450279;-1044535.168000001460314;0
1108;-741261.000000000000000;-1044593.000000000000000;0
4903;-742493.579999998211861;-1042816.620000001043081;0
4809;-743081.589999999850988;-1042799.800000000745058;0
5306;-743103.326999999582767;-1043193.129000000655651;0
4117;-742733.614999998360872;-1044043.129999998956919;0
6673;-742244.289999999105930;-1044153.350000001490116;0
8151;-743319.030000001192093;-1043194.940000001341105;0
4519;-742665.160000000149012;-1042790.820000000298023;0
8076;-742050.429999999701977;-1045256.199999999254942;0
6995;-743129.710000000894070;-1044496.579999998211861;0
727;-742001.000000000000000;-1042962.000000000000000;0
3095;-743923.068999998271465;-1042787.789000000804663;87
5956;-742960.690999999642372;-1043513.846999999135733;0
1247;-742104.000000000000000;-1044609.000000000000000;0
2537;-741975.000000000000000;-1044131.000000000000000;0
3955;-743412.653000000864267;-1043555.727000001817942;0
2500;-742743.000000000000000;-1045401.000000000000000;0
7243;-742724.339999999850988;-1044835.870000001043081;0
7033;-743303.864999998360872;-1044132.750000000000000;0
1268;-742046.000000000000000;-1045021.000000000000000;0
2084;-742447.000000000000000;-1044797.000000000000000;0
4665;-742824.410000000149012;-1042592.260000001639128;0
1323;-741859.000000000000000;-1044941.000000000000000;0
1872;-743422.000000000000000;-1044246.000000000000000;0
1839;-742994.469999998807907;-1044185.679999999701977;0
1143;-741415.000000000000000;-1044457.000000000000000;0
1263;-742048.000000000000000;-1044929.000000000000000;0
1552;-741351.000000000000000;-1044295.000000000000000;0
1925;-743331.000000000000000;-1044321.000000000000000;0
7750;-742972.960000000894070;-1044053.329999998211861;0
4069;-742920.684999998658895;-1043755.420000001788139;0
2340;-742764.000000000000000;-1045532.000000000000000;0
4030;-743133.280000001192093;-1043791.552000001072884;0
4877;-742845.760000001639128;-1042956.589999999850988;0
7140;-742921.300000000745058;-1044469.335000000894070;0
6785;-741294.269999999552965;-1044465.800000000745058;0
4705;-742714.100000001490116;-1042599.829999998211861;0
7732;-742611.719000000506639;-1044632.203999999910593;0
3351;-743954.622000001370907;-1043011.489999998360872;0
2491;-742059.000000000000000;-1044251.000000000000000;0
7044;-743400.635000001639128;-1044135.579999998211861;0
4793;-743035.089999999850988;-1042650.028000000864267;0
5230;-743335.399999998509884;-1043517.670000001788139;0
1124;-741715.000000000000000;-1044452.000000000000000;0
5599;-743411.622999999672174;-1043680.499000001698732;0
1255;-742077.000000000000000;-1044770.000000000000000;0
1409;-741634.000000000000000;-1044170.000000000000000;0
2485;-741285.420000001788139;-1044820.140000000596046;0
8046;-742169.109999999403954;-1044835.660000000149012;0
4072;-742934.225000001490116;-1043833.899999998509884;0
4161;-742506.254999998956919;-1044181.925000000745058;0
6299;-741803.309999998658895;-1042718.690000001341105;0
338;-742602.000000000000000;-1043933.000000000000000;0
4724;-742870.089999999850988;-1042658.210000000894070;0
2043;-743471.000000000000000;-1044959.000000000000000;0
1595;-742313.000000000000000;-1045010.000000000000000;0
7808;-741986.629999998956919;-1044440.109999999403954;0
596;-741867.000000000000000;-1043259.000000000000000;0
351;-742509.000000000000000;-1043739.000000000000000;0
506;-741980.000000000000000;-1043158.000000000000000;0
3380;-743794.508000001311302;-1042935.758999999612570;0
1352;-741840.000000000000000;-1044854.000000000000000;0
3994;-743394.864000000059605;-1043949.813999999314547;0
5020;-742572.699999999254942;-1042891.372999999672174;0
4729;-742855.690000001341105;-1042695.640000000596046;0
7185;-742600.515000000596046;-1044717.333999998867512;0
408;-742317.000000000000000;-1044182.000000000000000;0
3353;-743954.399999998509884;-1043021.017999999225140;0
1239;-742138.000000000000000;-1044401.000000000000000;0
7958;-741664.710000000894070;-1044289.879999998956919;0
206;-743179.000000000000000;-1043581.000000000000000;0
4760;-742826.947000000625849;-1042799.914000000804663;0
7293;-742822.780000001192093;-1044833.550000000745058;0
1544;-742236.000000000000000;-1044198.000000000000000;0
4816;-742976.510000001639128;-1042798.309999998658895;0
6000;-741980.750000000000000;-1043285.629999998956919;0
3160;-743959.590999998152256;-1042557.386999998241663;0
5316;-743075.980000000447035;-1043041.059999998658895;0
2277;-742826.000000000000000;-1045653.000000000000000;0
2580;-742501.000000000000000;-1045602.000000000000000;0
6192;-742317.252000000327826;-1043065.394999999552965;0
5757;-743420.747999999672174;-1043633.940999999642372;0
4046;-743205.699999999254942;-1044009.719999998807907;0
8059;-742265.730000000447035;-1045081.309999998658895;0
514;-742119.000000000000000;-1043141.000000000000000;0
6372;-741988.530000001192093;-1042699.339999999850988;0
1501;-741475.000000000000000;-1044292.000000000000000;0
918;-743437.000000000000000;-1043904.000000000000000;0
1224;-742174.000000000000000;-1044253.000000000000000;0
4939;-742448.866999998688698;-1043072.822999998927116;0
1429;-741982.000000000000000;-1044280.000000000000000;0
4334;-742384.170000001788139;-1043468.820000000298023;0
3953;-743407.249000001698732;-1043543.537000000476837;0
547;-742316.910000000149012;-1043790.309999998658895;0
6003;-742038.201000001281500;-1043299.010999999940395;0
1477;-741482.750000000000000;-1044212.480000000447035;0
7649;-742319.399999998509884;-1045429.557000000029802;0
580;-742010.000000000000000;-1043443.000000000000000;0
8259;-742072.089999999850988;-1042687.219999998807907;0
6726;-742476.517999999225140;-1044410.600000001490116;0
618;-742203.000000000000000;-1043272.000000000000000;0
6201;-742317.888999998569489;-1043065.035000000149012;0
4848;-742977.940000001341105;-1042862.019999999552965;0
1238;-742150.000000000000000;-1044384.000000000000000;0
1443;-741727.000000000000000;-1044386.000000000000000;0
1467;-741808.000000000000000;-1044064.000000000000000;0
224;-742904.000000000000000;-1043522.000000000000000;0
700;-742008.000000000000000;-1042895.000000000000000;0
6121;-742069.784000001847744;-1043299.828000001609325;0
1096;-741474.000000000000000;-1044566.000000000000000;0
4794;-743065.828999999910593;-1042673.377000000327826;0
2169;-742902.000000000000000;-1045108.000000000000000;0
1753;-742096.000000000000000;-1045195.000000000000000;0
2024;-743305.000000000000000;-1045000.000000000000000;0
4558;-742373.019999999552965;-1042506.949999999254942;0
4075;-742947.934999998658895;-1043903.649999998509884;0
5638;-743428.245000001043081;-1043683.840999998152256;0
6852;-741571.519999999552965;-1045065.932999998331070;0
6501;-741689.493000000715256;-1044942.905000001192093;0
3127;-743955.348000001162291;-1042668.469000000506639;0
4520;-742651.079999998211861;-1042798.449999999254942;0
594;-741896.000000000000000;-1043296.000000000000000;0
1983;-743474.000000000000000;-1044709.000000000000000;0
3805;-743035.760000001639128;-1042913.550000000745058;0
4640;-742588.572999998927116;-1042544.848999999463558;0
4524;-742683.789999999105930;-1042823.579999998211861;0
1360;-741983.000000000000000;-1044900.000000000000000;0
4632;-742615.638999998569489;-1042624.039999999105930;0
8285;-742232.780000001192093;-1042821.149999998509884;0
4652;-742775.500000000000000;-1042533.997999999672174;0
7199;-742570.910000000149012;-1044916.410000000149012;0
4037;-743205.375000000000000;-1043771.175000000745058;0
7000;-743096.190000001341105;-1044426.870000001043081;0
4137;-742705.739999998360872;-1044094.100000001490116;0
2344;-742691.000000000000000;-1045541.000000000000000;0
5639;-743428.337999999523163;-1043685.046999998390675;0
3767;-743033.910000000149012;-1042982.390000000596046;0
3233;-744152.962999999523163;-1042686.791999999433756;0
4957;-742366.010000001639128;-1043006.059999998658895;0
4899;-742534.420000001788139;-1042820.899999998509884;0
4768;-742862.888000000268221;-1042936.997999999672174;0
4150;-742581.789999999105930;-1044138.429999999701977;0
1995;-743484.000000000000000;-1045036.000000000000000;0
347;-742542.000000000000000;-1043795.000000000000000;0
1628;-742449.000000000000000;-1044494.000000000000000;0
2420;-742431.000000000000000;-1045120.000000000000000;0
6262;-742370.024999998509884;-1043021.666000001132488;0
1499;-741413.000000000000000;-1044304.000000000000000;0
4999;-742534.149999998509884;-1042966.892999999225140;0
8266;-742220.320000000298023;-1042706.760000001639128;0
1303;-741865.000000000000000;-1044692.000000000000000;0
4198;-742192.445000000298023;-1043760.521000001579523;0
5461;-742442.704999998211861;-1043234.515000000596046;0
1562;-743199.000000000000000;-1045122.000000000000000;0
4727;-742869.390000000596046;-1042700.829999998211861;0
5413;-742651.872000001370907;-1042662.627999998629093;0
2234;-743425.000000000000000;-1045221.000000000000000;0
5418;-742434.890000000596046;-1042864.780000001192093;0
4602;-742441.269000001251698;-1042596.320000000298023;0
4593;-742510.820000000298023;-1042652.203999999910593;0
4584;-742417.721999999135733;-1042627.620999999344349;0
736;-741880.000000000000000;-1043017.000000000000000;114
4926;-742452.660000000149012;-1042896.190000001341105;0
376;-742530.000000000000000;-1043680.000000000000000;0
6223;-742316.076000001281500;-1043058.679000001400709;0
7084;-743318.609999999403954;-1044521.789999999105930;0
1137;-741538.000000000000000;-1044442.000000000000000;0
5712;-743423.701000001281500;-1043638.675999999046326;0
6256;-742380.723000001162291;-1043035.640000000596046;0
4250;-742144.109999999403954;-1043367.519999999552965;0
1349;-741824.000000000000000;-1044818.000000000000000;0
873;-741728.000000000000000;-1042672.000000000000000;0
673;-742467.000000000000000;-1043230.000000000000000;0
6106;-742210.445999998599291;-1043112.203000001609325;0
203;-743204.000000000000000;-1043607.000000000000000;0
6247;-742371.447000000625849;-1043053.739000000059605;0
6160;-742311.730999998748302;-1043061.116000000387430;0
6264;-742357.280000001192093;-1043020.445999998599291;0
269;-743248.000000000000000;-1043725.000000000000000;0
6922;-742056.329999998211861;-1045086.679999999701977;0
1000;-741828.000000000000000;-1044502.000000000000000;0
6149;-742312.646000001579523;-1043064.261999998241663;0
5706;-743417.688999999314547;-1043638.852000001817942;0
1113;-741134.809999998658895;-1044594.289999999105930;0
378;-742514.000000000000000;-1043703.000000000000000;0
6713;-742278.905999999493361;-1044887.284000001847744;0
4997;-742492.638000000268221;-1042962.833999998867512;0
1524;-741710.000000000000000;-1043844.000000000000000;0
4767;-742786.899999998509884;-1042835.736000001430511;0
4854;-742971.159000001847744;-1042912.429000001400709;0
4990;-742657.837999999523163;-1043024.199999999254942;0
6137;-742314.326999999582767;-1043068.837000001221895;0
6266;-742349.021000001579523;-1043019.662999998778105;0
820;-742019.000000000000000;-1042600.000000000000000;0
4944;-742430.605999998748302;-1043013.879000000655651;0
6278;-742305.421999998390675;-1043028.918000001460314;0
3282;-743619.890999998897314;-1042841.907000001519918;0
4526;-742696.690000001341105;-1042823.320000000298023;0
522;-742261.000000000000000;-1043122.000000000000000;0
7260;-742953.010000001639128;-1044873.530000001192093;0
6693;-742248.197000000625849;-1044816.127000000327826;0
1514;-741882.000000000000000;-1044096.000000000000000;0
2156;-742796.000000000000000;-1045184.000000000000000;0
881;-741806.000000000000000;-1042815.000000000000000;0
6374;-741977.035000000149012;-1042674.153999999165535;0
5000;-742542.798000000417233;-1042978.486999999731779;0
3783;-743211.559999998658895;-1042920.120000001043081;0
581;-741991.000000000000000;-1043457.000000000000000;0
4156;-742513.734999999403954;-1043978.035000000149012;0
1006;-741930.000000000000000;-1044565.000000000000000;0
5372;-742084.010000001639128;-1043008.550000000745058;0
1510;-741764.000000000000000;-1044180.000000000000000;0
3948;-743409.451999999582767;-1043515.662000000476837;0
3980;-743339.260000001639128;-1043798.940000001341105;0
4696;-742682.817000001668930;-1042658.543999999761581;0
4455;-741714.589000001549721;-1042663.557000000029802;0
553;-742251.000000000000000;-1043741.000000000000000;0
3971;-743206.815000001341105;-1043721.065000001341105;0
1538;-741948.000000000000000;-1043973.000000000000000;0
2034;-743468.000000000000000;-1044800.000000000000000;0
921;-743338.000000000000000;-1043818.000000000000000;0
4775;-742898.375999998301268;-1042802.914000000804663;0
4427;-742190.519999999552965;-1043099.440000001341105;0
844;-742138.000000000000000;-1042519.000000000000000;0
2892;-744005.317000001668930;-1043204.537000000476837;0
4221;-742209.576000001281500;-1043499.238000001758337;0
1379;-742135.000000000000000;-1044975.000000000000000;0
1121;-741765.000000000000000;-1044444.000000000000000;0
4146;-742666.940000001341105;-1043854.829999998211861;0
4828;-743048.579999998211861;-1042941.179999999701977;0
7284;-742811.789999999105930;-1044718.210000000894070;0
1928;-743474.000000000000000;-1044409.000000000000000;0
4895;-742596.936999998986721;-1042829.168000001460314;0
4033;-743319.719999998807907;-1043793.300000000745058;0
6689;-742384.449999999254942;-1045033.609999999403954;0
5758;-743420.897999998182058;-1043635.921999998390675;0
4612;-742515.302000001072884;-1042595.046999998390675;0
6210;-742318.541000001132488;-1043064.662999998778105;0
4142;-742777.425000000745058;-1044013.440000001341105;0
6142;-742310.477000001817942;-1043061.813000001013279;0
756;-741681.000000000000000;-1042695.000000000000000;0
6202;-742317.124000001698732;-1043063.651999998837709;0
1286;-742221.460000000894070;-1044465.969999998807907;0
1395;-741799.000000000000000;-1044291.000000000000000;0
7966;-741489.800000000745058;-1044356.219999998807907;0
4730;-742831.050000000745058;-1042696.600000001490116;0
1446;-741545.000000000000000;-1044774.000000000000000;0
6698;-742304.160999998450279;-1044462.195999998599291;0
1393;-742083.000000000000000;-1045067.000000000000000;0
6199;-742319.442000001668930;-1043067.822999998927116;0
3456;-745096.247000001370907;-1042705.502999998629093;0
5514;-743426.903000000864267;-1043609.252999998629093;0
3182;-743923.576000001281500;-1042554.350000001490116;0
1606;-742437.000000000000000;-1044706.000000000000000;0
3287;-743711.173999998718500;-1042886.515999998897314;0
6207;-742313.287000000476837;-1043056.642000000923872;0
336;-742616.000000000000000;-1043959.000000000000000;0
1085;-741634.000000000000000;-1044530.000000000000000;0
1052;-741761.000000000000000;-1045002.000000000000000;0
6699;-742301.118999999016523;-1044484.282999999821186;0
5509;-743425.144999999552965;-1043637.853000000119209;0
7973;-741347.850000001490116;-1044381.850000001490116;0
2325;-742559.000000000000000;-1045494.000000000000000;0
1949;-743248.000000000000000;-1044491.000000000000000;0
3961;-743419.609999999403954;-1043589.497000001370907;0
4753;-742764.600000001490116;-1042761.899999998509884;0
4978;-742491.822999998927116;-1043028.688000001013279;0
4722;-742878.030000001192093;-1042626.550000000745058;0
5173;-743291.175999999046326;-1043426.754999998956919;0
2473;-743469.000000000000000;-1044899.000000000000000;0
1439;-741772.000000000000000;-1044379.000000000000000;0
7644;-742295.089000001549721;-1045373.164999999105930;0
4615;-742527.811000000685453;-1042658.600999999791384;0
5138;-743030.936000000685453;-1043483.587999999523163;0
4814;-743000.489999998360872;-1042803.920000001788139;0
5323;-743049.401000000536442;-1043038.131000000983477;0
6246;-742370.552999999374151;-1043055.625999998301268;0
6215;-742314.692000001668930;-1043057.682000000029802;0
1342;-741721.000000000000000;-1044783.000000000000000;0
4789;-742979.506000000983477;-1042555.324999999254942;0
4629;-742630.986000001430511;-1042626.096000000834465;0
4898;-742571.280000001192093;-1042840.859999999403954;0
6217;-742320.725999999791384;-1043067.133999999612570;0
2316;-742823.000000000000000;-1045463.000000000000000;0
3834;-743079.190000001341105;-1042579.899999998509884;0
4894;-742610.888999998569489;-1042819.686999998986721;0
4505;-742434.910000000149012;-1042706.170000001788139;0
1469;-741752.000000000000000;-1044100.000000000000000;0
5719;-743419.508999999612570;-1043629.817999999970198;0
1466;-741838.000000000000000;-1044041.000000000000000;0
3692;-744525.876499999314547;-1042540.534000001847744;0
1424;-742134.000000000000000;-1044171.000000000000000;0
4806;-743138.429999999701977;-1042771.350000001490116;0
5703;-743417.385000001639128;-1043633.592000000178814;0
5196;-743199.263000000268221;-1043326.401000000536442;0
3887;-742347.760000001639128;-1042449.881000000983477;0
910;-742219.000000000000000;-1042529.000000000000000;0
4573;-742341.550000000745058;-1042629.699999999254942;0
4248;-742157.039999999105930;-1043376.699999999254942;0
4694;-742689.272999998182058;-1042626.495999999344349;0
4323;-742267.879999998956919;-1043190.035000000149012;0
1322;-741906.000000000000000;-1044975.000000000000000;0
2289;-742915.000000000000000;-1045426.000000000000000;0
8085;-741919.059999998658895;-1045407.820000000298023;0
6293;-742666.339999999850988;-1042695.188999999314547;0
4587;-742482.011999998241663;-1042641.392999999225140;0
3033;-744483.675000000745058;-1042733.627000000327826;0
1045;-741849.000000000000000;-1044775.000000000000000;0
6173;-742316.787000000476837;-1043067.471000000834465;0
6239;-742363.504999998956919;-1043069.298000000417233;0
6648;-741750.510000001639128;-1044080.329999998211861;0
7814;-741769.006999999284744;-1044058.535999998450279;0
1101;-741339.000000000000000;-1044568.000000000000000;0
4228;-742132.969999998807907;-1043331.449999999254942;0
1401;-741723.000000000000000;-1044408.000000000000000;0
5231;-743342.107000000774860;-1043497.627000000327826;0
1963;-743410.000000000000000;-1044689.000000000000000;0
1970;-743380.000000000000000;-1044854.000000000000000;0
5695;-743417.217999998480082;-1043638.749000001698732;0
2186;-743184.000000000000000;-1045146.000000000000000;0
1440;-741782.000000000000000;-1044362.000000000000000;0
2052;-743403.000000000000000;-1045075.000000000000000;0
4714;-742856.359999999403954;-1042618.210000000894070;0
641;-742008.000000000000000;-1043304.000000000000000;0
6133;-742309.820000000298023;-1043062.171999998390675;0
1570;-742291.000000000000000;-1044183.000000000000000;0
4676;-742792.579999998211861;-1042771.519999999552965;0
4619;-742460.010000001639128;-1042480.890000000596046;0
7212;-742559.410000000149012;-1045073.070000000298023;0
7148;-742828.445000000298023;-1044472.094999998807907;0
6245;-742369.682000000029802;-1043057.377000000327826;0
6183;-742316.633999999612570;-1043065.732000000774860;0
4590;-742387.043000001460314;-1042535.971000000834465;0
839;-742021.000000000000000;-1042510.000000000000000;0
1128;-741655.000000000000000;-1044448.000000000000000;0
202;-743240.000000000000000;-1043597.000000000000000;0
5687;-743415.142000000923872;-1043630.285999998450279;0
4025;-743202.881000000983477;-1043852.008000001311302;0
4020;-743160.616000000387430;-1043872.782999999821186;0
4564;-742452.267000000923872;-1042534.980999998748302;0
7641;-742335.304000001400709;-1045451.613000001758337;0
7537;-742722.660000000149012;-1045361.410000000149012;0
5582;-743410.127000000327826;-1043640.197999998927116;0
6320;-741766.848000001162291;-1042614.989999998360872;0
5412;-742582.037000000476837;-1042571.986000001430511;0
4136;-742726.225000001490116;-1044089.829999998211861;0
4847;-742981.100000001490116;-1042831.059999998658895;0
6720;-742286.954999998211861;-1044705.997999999672174;0
5647;-743429.070999998599291;-1043694.699000000953674;0
1586;-742372.000000000000000;-1044785.000000000000000;0
