OID_;X;Y;TEMPERATURE
5995;-744441.440999999642372;-1042779.568999998271465;0
3527;-744805.695999998599291;-1042671.809000000357628;0
3538;-744616.304000001400709;-1042656.734000001102686;0
3585;-744920.065000001341105;-1042522.129999998956919;0
3460;-744993.289000000804663;-1042693.587000001221895;0
3466;-745113.802000001072884;-1042675.725000001490116;0
3612;-744996.545000001788139;-1042292.646000001579523;0
3706;-744567.589999999850988;-1042534.585000000894070;0
3537;-744632.945000000298023;-1042671.657000001519918;0
2758;-743919.949999999254942;-1043488.059999998658895;0
1775;-741246.000000000000000;-1044012.000000000000000;0
2641;-743432.578999999910593;-1042583.418999999761581;0
3211;-743651.409000001847744;-1042483.458999998867512;0
2809;-744090.649999998509884;-1043371.184000000357628;0
3921;-743909.208999998867512;-1043541.574000000953674;0
110;-744127.000000000000000;-1042724.000000000000000;0
350;-742505.000000000000000;-1043757.000000000000000;0
5787;-743470.390000000596046;-1042099.079999998211861;0
4086;-742813.079999998211861;-1043631.730000000447035;0
1492;-741096.000000000000000;-1044331.000000000000000;0
3108;-743768.699999999254942;-1042671.241999998688698;0
1584;-742368.000000000000000;-1044717.000000000000000;0
1524;-741710.000000000000000;-1043844.000000000000000;0
700;-742008.000000000000000;-1042895.000000000000000;0
514;-742119.000000000000000;-1043141.000000000000000;0
7409;-743521.629999998956919;-1045356.570000000298023;0
6944;-742927.063000001013279;-1043928.673000000417233;0
1521;-741808.000000000000000;-1043917.000000000000000;0
7140;-742921.300000000745058;-1044469.335000000894070;0
7011;-742831.309999998658895;-1044257.245000001043081;0
673;-742467.000000000000000;-1043230.000000000000000;0
6339;-742245.460000000894070;-1042835.780000001192093;0
3279;-743638.815999999642372;-1042804.333999998867512;0
4064;-742879.655000001192093;-1043647.420000001788139;0
2167;-743021.000000000000000;-1045154.000000000000000;0
1661;-741426.000000000000000;-1044846.000000000000000;0
4237;-742425.385000001639128;-1043517.421000000089407;0
5066;-742827.379000000655651;-1043252.267999999225140;0
2152;-742814.000000000000000;-1045106.000000000000000;0
5250;-743328.995000001043081;-1043178.495000001043081;0
1248;-742109.000000000000000;-1044631.000000000000000;170
7218;-742534.100000001490116;-1044603.559999998658895;0
7514;-742304.866000000387430;-1044375.124000001698732;0
466;-741743.000000000000000;-1043331.000000000000000;0
3268;-743594.046999998390675;-1042721.412999998778105;0
7170;-742667.579999998211861;-1044492.469999998807907;0
4582;-742390.164999999105930;-1042606.546000000089407;0
1761;-741194.000000000000000;-1044104.000000000000000;0
1213;-742068.000000000000000;-1044387.000000000000000;0
1684;-741136.379999998956919;-1044735.140000000596046;0
1814;-743095.000000000000000;-1044510.000000000000000;0
7276;-742801.670000001788139;-1044613.309999998658895;0
1485;-741184.000000000000000;-1044223.000000000000000;0
4331;-742391.967999998480082;-1043310.539000000804663;0
7017;-742571.059999998658895;-1044267.640000000596046;0
3310;-743829.561999998986721;-1042854.063000001013279;0
7021;-743129.019999999552965;-1044076.230000000447035;331
1693;-741613.000000000000000;-1044649.000000000000000;0
1702;-741348.000000000000000;-1044682.000000000000000;0
4078;-742842.960000000894070;-1043832.824999999254942;0
1983;-743474.000000000000000;-1044709.000000000000000;0
7356;-743331.410000000149012;-1045146.359999999403954;0
5124;-742983.513000000268221;-1043417.271999999880791;0
2093;-742915.000000000000000;-1044642.000000000000000;0
2255;-743181.000000000000000;-1045372.000000000000000;0
222;-742939.000000000000000;-1043526.000000000000000;0
2097;-743143.000000000000000;-1044742.000000000000000;0
1843;-743041.600000001490116;-1044324.489999998360872;0
6313;-743936.949999999254942;-1042594.780000001192093;0
2233;-743461.000000000000000;-1045218.000000000000000;0
2473;-743469.000000000000000;-1044899.000000000000000;0
4151;-742573.039999999105930;-1044109.035000000149012;0
600;-741840.000000000000000;-1043212.000000000000000;0
748;-741671.000000000000000;-1042971.000000000000000;0
6749;-742418.210999999195337;-1044329.190999999642372;0
1;-743520.000000000000000;-1042472.000000000000000;0
725;-741983.000000000000000;-1042939.000000000000000;0
1873;-743410.000000000000000;-1044260.000000000000000;0
1428;-742028.000000000000000;-1044235.000000000000000;0
4218;-742263.436999998986721;-1043615.100999999791384;0
2329;-742432.000000000000000;-1045508.000000000000000;0
4180;-742368.370000001043081;-1044115.471999999135733;0
5295;-743047.995000001043081;-1043185.530000001192093;0
6719;-742371.686999998986721;-1044952.227000001817942;0
2286;-742894.000000000000000;-1045440.000000000000000;0
1034;-741964.000000000000000;-1044876.000000000000000;0
6704;-742282.179999999701977;-1044623.793999999761581;0
7030;-743291.859999999403954;-1044128.440000001341105;0
4525;-742716.719999998807907;-1042823.219999998807907;0
1839;-742994.469999998807907;-1044185.679999999701977;0
7715;-743042.480000000447035;-1045860.798999998718500;0
8046;-742169.109999999403954;-1044835.660000000149012;0
2400;-742087.000000000000000;-1045374.000000000000000;0
1052;-741761.000000000000000;-1045002.000000000000000;0
1748;-741727.000000000000000;-1045047.000000000000000;0
3943;-743413.429000001400709;-1043376.822000000625849;0
7980;-741198.179999999701977;-1044410.339999999850988;0
2103;-743182.000000000000000;-1044931.000000000000000;0
5274;-743012.366000000387430;-1043280.149000000208616;0
5776;-742933.609000001102686;-1043433.765999998897314;0
6830;-741526.739999998360872;-1044761.309000000357628;0
1391;-742117.000000000000000;-1045084.000000000000000;0
226;-742879.000000000000000;-1043516.000000000000000;0
2409;-742363.000000000000000;-1045093.000000000000000;0
177;-743376.000000000000000;-1043232.000000000000000;0
4559;-742400.530000001192093;-1042503.760000001639128;0
7543;-742606.199999999254942;-1045375.109999999403954;0
7259;-742935.280000001192093;-1044869.829999998211861;0
1855;-742642.000000000000000;-1044286.000000000000000;0
4227;-742108.530000001192093;-1043326.289999999105930;0
1229;-742244.000000000000000;-1044253.000000000000000;0
4020;-743160.616000000387430;-1043872.782999999821186;0
1623;-742524.000000000000000;-1044319.000000000000000;0
2230;-742996.000000000000000;-1045551.000000000000000;0
4704;-742680.000000000000000;-1042776.750000000000000;0
590;-741935.000000000000000;-1043331.000000000000000;0
1367;-742137.000000000000000;-1044959.000000000000000;0
2275;-742845.000000000000000;-1045719.000000000000000;0
337;-742621.000000000000000;-1043941.000000000000000;0
4860;-742964.800999999046326;-1043016.107999999076128;0
4008;-743250.114999998360872;-1044043.905999999493361;0
5325;-742997.480000000447035;-1043042.289999999105930;0
3389;-743919.920000001788139;-1043153.510000001639128;0
509;-741991.000000000000000;-1043143.000000000000000;0
403;-742307.000000000000000;-1043931.000000000000000;0
2345;-742636.000000000000000;-1045561.000000000000000;0
1301;-741896.000000000000000;-1044703.000000000000000;0
6357;-741947.870000001043081;-1042701.129999998956919;0
283;-743026.000000000000000;-1043788.000000000000000;0
2505;-742762.000000000000000;-1045562.000000000000000;0
881;-741806.000000000000000;-1042815.000000000000000;0
2243;-743292.000000000000000;-1045310.000000000000000;0
2889;-744074.103999998420477;-1043194.559999998658895;0
3997;-743395.094999998807907;-1044031.109999999403954;24
5738;-743410.412999998778105;-1043691.800000000745058;0
4097;-742806.000000000000000;-1043874.793999999761581;0
4716;-742893.160000000149012;-1042622.780000001192093;0
6162;-742310.199999999254942;-1043058.306000001728535;0
7047;-743395.495000001043081;-1044210.765000000596046;0
4125;-742857.695000000298023;-1044110.460000000894070;0
1314;-741695.000000000000000;-1044866.000000000000000;0
5729;-743420.103000000119209;-1043638.901000000536442;0
6695;-742306.234000001102686;-1044816.138999998569489;0
1423;-742167.000000000000000;-1044150.000000000000000;0
7245;-742748.780000001192093;-1044837.699999999254942;0
4175;-742721.254999998956919;-1043775.890000000596046;0
4135;-742747.719999998807907;-1044085.660000000149012;0
2219;-743094.000000000000000;-1045386.000000000000000;0
4053;-743260.039999999105930;-1043823.480000000447035;0
6832;-741552.254000000655651;-1044899.227000001817942;0
824;-742142.000000000000000;-1042596.000000000000000;0
2108;-743147.000000000000000;-1045086.000000000000000;0
1676;-741033.000000000000000;-1044755.000000000000000;0
7739;-742301.399000000208616;-1045040.431000001728535;0
3370;-743858.489999998360872;-1043011.370999999344349;0
7145;-742812.874000001698732;-1044402.199000000953674;0
5712;-743423.701000001281500;-1043638.675999999046326;0
1541;-742026.000000000000000;-1044034.000000000000000;0
4232;-742315.057999998331070;-1043428.918999999761581;0
878;-741947.000000000000000;-1042573.000000000000000;0
2051;-743434.000000000000000;-1045074.000000000000000;0
6040;-742075.469999998807907;-1043676.809999998658895;0
2142;-742883.000000000000000;-1045078.000000000000000;0
384;-742471.000000000000000;-1043766.000000000000000;0
578;-742023.000000000000000;-1043464.000000000000000;0
2327;-742491.000000000000000;-1045502.000000000000000;0
2490;-742063.000000000000000;-1044273.000000000000000;0
7945;-742063.179999999701977;-1044077.379999998956919;0
4221;-742209.576000001281500;-1043499.238000001758337;0
534;-742087.000000000000000;-1043699.000000000000000;0
6140;-742311.999000001698732;-1043064.638999998569489;0
1586;-742372.000000000000000;-1044785.000000000000000;0
2220;-743075.000000000000000;-1045396.000000000000000;0
4032;-743136.934999998658895;-1043750.375000000000000;0
6492;-742174.054000001400709;-1044455.534000001847744;0
4334;-742384.170000001788139;-1043468.820000000298023;0
1946;-743281.000000000000000;-1044437.000000000000000;0
3750;-743221.379999998956919;-1042925.429999999701977;0
1123;-741734.000000000000000;-1044442.000000000000000;0
4427;-742190.519999999552965;-1043099.440000001341105;0
1890;-743522.000000000000000;-1044402.000000000000000;0
1398;-741753.000000000000000;-1044201.000000000000000;0
3804;-743040.109999999403954;-1042895.410000000149012;0
7939;-741306.171999998390675;-1043955.960000000894070;0
4147;-742649.245000001043081;-1043870.320000000298023;0
1504;-741577.000000000000000;-1044258.000000000000000;0
2039;-743308.000000000000000;-1044808.000000000000000;0
1306;-741783.000000000000000;-1044653.000000000000000;0
6202;-742317.124000001698732;-1043063.651999998837709;0
995;-741906.000000000000000;-1044434.000000000000000;0
6299;-741803.309999998658895;-1042718.690000001341105;0
6224;-742315.320000000298023;-1043057.335000000894070;0
4666;-742808.710000000894070;-1042576.609999999403954;0
1926;-743301.000000000000000;-1044321.000000000000000;0
3810;-743261.510000001639128;-1042802.960000000894070;145
8263;-742151.089999999850988;-1042702.239999998360872;0
7204;-742561.000000000000000;-1044976.910000000149012;0
5146;-743064.554000001400709;-1043452.671999998390675;0
7214;-742470.679999999701977;-1044531.269999999552965;0
1957;-743402.000000000000000;-1044519.000000000000000;0
6673;-742244.289999999105930;-1044153.350000001490116;0
1436;-741869.000000000000000;-1044323.000000000000000;0
1241;-742132.000000000000000;-1044436.000000000000000;0
4058;-743138.765000000596046;-1043625.405000001192093;0
6700;-742298.611000001430511;-1044507.315999999642372;0
2379;-742291.000000000000000;-1045388.000000000000000;0
1353;-741862.000000000000000;-1044843.000000000000000;0
5020;-742572.699999999254942;-1042891.372999999672174;0
6872;-741751.719999998807907;-1045296.679999999701977;0
4051;-743236.329999998211861;-1043889.710000000894070;0
6997;-743109.160000000149012;-1044453.600000001490116;0
3945;-743388.361000001430511;-1043434.486000001430511;0
6164;-742316.155999999493361;-1043067.784000001847744;0
736;-741880.000000000000000;-1043017.000000000000000;114
7009;-742877.537000000476837;-1044242.370000001043081;0
1167;-741836.000000000000000;-1044429.000000000000000;0
629;-742200.000000000000000;-1043289.000000000000000;0
4874;-742795.429999999701977;-1042925.910000000149012;0
839;-742021.000000000000000;-1042510.000000000000000;0
559;-742191.000000000000000;-1043693.000000000000000;0
3803;-743066.289999999105930;-1042896.320000000298023;0
6276;-742310.815999999642372;-1043016.000999998301268;0
5267;-743190.021999999880791;-1043149.807000000029802;0
1503;-741537.000000000000000;-1044272.000000000000000;0
2272;-742922.000000000000000;-1045759.000000000000000;0
3286;-743679.592999998480082;-1042870.787000000476837;0
787;-741714.000000000000000;-1042620.000000000000000;0
1128;-741655.000000000000000;-1044448.000000000000000;0
398;-742372.000000000000000;-1043909.000000000000000;0
1475;-741565.000000000000000;-1044185.000000000000000;0
2383;-742220.000000000000000;-1045517.000000000000000;0
6473;-741931.359999999403954;-1044555.109999999403954;0
249;-743433.000000000000000;-1043775.000000000000000;0
7655;-742266.583000000566244;-1045284.133999999612570;0
4781;-742926.519000001251698;-1042695.502999998629093;0
8084;-741928.710000000894070;-1045393.339999999850988;0
7325;-743032.969999998807907;-1045186.298999998718500;0
1832;-743024.000000000000000;-1044100.000000000000000;0
4257;-742056.467000000178814;-1043503.657999999821186;0
1136;-741520.000000000000000;-1044455.000000000000000;0
4473;-741822.449999999254942;-1042676.699000000953674;0
3439;-743751.594000000506639;-1043080.798999998718500;0
3832;-743029.390000000596046;-1042595.910000000149012;0
2500;-742743.000000000000000;-1045401.000000000000000;0
6771;-741345.015999998897314;-1044413.647999998182058;0
7006;-742995.760000001639128;-1043976.245000001043081;0
1516;-741928.000000000000000;-1044062.000000000000000;0
6284;-742309.677999999374151;-1043054.043999999761581;0
527;-742186.000000000000000;-1043818.000000000000000;0
682;-742380.000000000000000;-1043151.000000000000000;0
3364;-743855.184999998658895;-1043024.940000001341105;0
4707;-742743.519999999552965;-1042600.359999999403954;0
2466;-743460.000000000000000;-1044740.000000000000000;0
917;-742121.000000000000000;-1043008.000000000000000;0
907;-742211.000000000000000;-1042511.000000000000000;0
3066;-744075.627000000327826;-1042883.837000001221895;0
1344;-741750.000000000000000;-1044808.000000000000000;0
6153;-742309.583999998867512;-1043058.640999998897314;0
4054;-743269.304999999701977;-1043797.405000001192093;0
5984;-743985.258000001311302;-1042842.061999998986721;0
4974;-742489.458999998867512;-1043047.024999998509884;0
1152;-741257.000000000000000;-1044489.000000000000000;0
2485;-741285.420000001788139;-1044820.140000000596046;0
7016;-742557.515000000596046;-1044334.074999999254942;0
6249;-742373.554999999701977;-1043049.822000000625849;0
4823;-742936.660000000149012;-1042868.949999999254942;0
3760;-743233.829999998211861;-1042978.739999998360872;0
3998;-743432.704999998211861;-1043914.274999998509884;0
1681;-741125.980000000447035;-1044656.269999999552965;0
1399;-741736.000000000000000;-1044167.000000000000000;0
5323;-743049.401000000536442;-1043038.131000000983477;0
7188;-742583.839999999850988;-1044742.870000001043081;0
4743;-742812.449999999254942;-1042729.609999999403954;0
1554;-741348.000000000000000;-1044238.000000000000000;0
1178;-741952.000000000000000;-1044311.000000000000000;0
5966;-742483.469999998807907;-1043066.721999999135733;0
1155;-741208.000000000000000;-1044484.000000000000000;0
2393;-742054.000000000000000;-1045282.000000000000000;0
6946;-742974.765000000596046;-1043929.388000000268221;0
6855;-741501.394999999552965;-1045027.784000001847744;0
918;-743437.000000000000000;-1043904.000000000000000;0
2456;-741013.000000000000000;-1044501.000000000000000;0
1463;-741933.000000000000000;-1043968.000000000000000;0
3843;-743139.170000001788139;-1042650.050000000745058;86
8275;-742087.910000000149012;-1042738.609999999403954;0
6777;-741073.500000000000000;-1044491.879999998956919;0
6847;-741591.993999999016523;-1044992.927999999374151;0
4807;-743122.570000000298023;-1042767.850000001490116;0
8073;-742120.640000000596046;-1045259.500000000000000;0
6916;-742011.701000001281500;-1045042.927000001072884;0
4744;-742848.129999998956919;-1042759.629999998956919;0
6251;-742377.396999999880791;-1043042.284000001847744;0
7647;-742319.918000001460314;-1045405.197999998927116;0
1180;-741935.000000000000000;-1044283.000000000000000;0
6191;-742318.017000000923872;-1043066.800999999046326;0
6789;-741187.510000001639128;-1044470.660000000149012;0
1263;-742048.000000000000000;-1044929.000000000000000;0
1369;-742029.000000000000000;-1044788.000000000000000;0
4877;-742845.760000001639128;-1042956.589999999850988;0
1617;-742384.000000000000000;-1044407.000000000000000;0
4069;-742920.684999998658895;-1043755.420000001788139;33
7727;-743363.892999999225140;-1044617.146000001579523;0
1041;-741893.000000000000000;-1044653.000000000000000;0
7744;-742941.256999999284744;-1045533.171000000089407;0
1937;-743273.000000000000000;-1044318.000000000000000;0
4611;-742532.804999999701977;-1042593.420000001788139;0
2296;-742678.000000000000000;-1045399.000000000000000;0
262;-743408.000000000000000;-1043731.000000000000000;0
6786;-741269.960000000894070;-1044469.460000000894070;0
1657;-741399.000000000000000;-1044717.000000000000000;0
329;-742675.000000000000000;-1044052.000000000000000;0
7208;-742560.289999999105930;-1045023.789999999105930;0
6768;-741255.769999999552965;-1044419.920000001788139;0
3302;-743795.043999999761581;-1042863.539000000804663;0
4459;-742274.829999998211861;-1042644.269999999552965;0
6603;-741616.600000001490116;-1043854.019999999552965;0
5994;-743358.609999999403954;-1043460.469999998807907;0
6253;-742378.725000001490116;-1043039.690000001341105;0
3838;-743113.550000000745058;-1042543.399999998509884;0
3761;-743202.559999998658895;-1042981.710000000894070;0
6705;-742279.050999999046326;-1044655.923000000417233;0
6196;-742314.190000001341105;-1043059.774999998509884;0
2376;-742411.000000000000000;-1045554.000000000000000;0
1105;-741274.000000000000000;-1044576.000000000000000;0
4498;-741866.120000001043081;-1042718.471000000834465;0
2359;-742348.000000000000000;-1045581.000000000000000;0
4944;-742430.605999998748302;-1043013.879000000655651;0
317;-742464.000000000000000;-1044207.000000000000000;0
4902;-742480.460000000894070;-1042802.989999998360872;0
201;-743229.000000000000000;-1043614.000000000000000;0
6133;-742309.820000000298023;-1043062.171999998390675;0
1214;-742064.000000000000000;-1044358.000000000000000;0
6208;-742320.098000001162291;-1043067.458999998867512;0
2502;-742750.000000000000000;-1045457.000000000000000;0
6179;-742312.195000000298023;-1043059.041000001132488;0
1723;-741611.000000000000000;-1045092.000000000000000;0
7180;-742618.809000000357628;-1044646.109000001102686;0
6702;-742291.596999999135733;-1044564.116999998688698;0
8045;-742173.070000000298023;-1044806.519999999552965;0
4341;-742488.855000000447035;-1043325.412999998778105;0
7171;-742671.969999998807907;-1044508.219999998807907;0
3340;-743960.212999999523163;-1043080.166999999433756;0
3829;-742992.250000000000000;-1042635.140000000596046;0
8283;-742198.600000001490116;-1042801.980000000447035;0
5714;-743423.756000000983477;-1043635.103999998420477;0
6676;-742250.239999998360872;-1044174.719999998807907;0
430;-742185.000000000000000;-1043888.000000000000000;0
8284;-742219.410000000149012;-1042809.500000000000000;0
1815;-743083.000000000000000;-1044478.000000000000000;0
5593;-743418.921000000089407;-1043679.927999999374151;0
1932;-743359.000000000000000;-1044408.000000000000000;0
3238;-744159.147999998182058;-1042638.964000001549721;0
610;-742011.000000000000000;-1043270.000000000000000;0
650;-742263.000000000000000;-1043381.000000000000000;0
3306;-743787.127999998629093;-1042847.872999999672174;0
1196;-741677.000000000000000;-1043894.000000000000000;0
1114;-741151.059999998658895;-1044607.410000000149012;0
6226;-742320.660999998450279;-1043065.366999998688698;0
5125;-742992.826000001281500;-1043402.497999999672174;0
4248;-742157.039999999105930;-1043376.699999999254942;0
5168;-743228.796000000089407;-1043420.092000000178814;0
3228;-744128.969999998807907;-1042651.059000000357628;0
1936;-743293.000000000000000;-1044272.000000000000000;0
708;-741854.000000000000000;-1042881.000000000000000;0
542;-742367.629999998956919;-1043814.379999998956919;0
1159;-741137.000000000000000;-1044493.000000000000000;0
1161;-741106.550000000745058;-1044497.769999999552965;0
6151;-742311.114999998360872;-1043061.451000001281500;0
4678;-742775.910000000149012;-1042839.929999999701977;0
988;-741820.000000000000000;-1044516.000000000000000;0
1450;-741527.000000000000000;-1044632.000000000000000;0
4019;-743157.434999998658895;-1043897.410000000149012;0
1187;-741805.000000000000000;-1044071.000000000000000;0
4812;-743027.170000001788139;-1042810.219999998807907;0
6227;-742319.839999999850988;-1043063.936000000685453;0
5744;-743412.905999999493361;-1043695.221000000834465;0
753;-741692.000000000000000;-1042713.000000000000000;0
1095;-741452.000000000000000;-1044553.000000000000000;0
599;-741837.000000000000000;-1043243.000000000000000;0
8049;-742198.890000000596046;-1044891.600000001490116;0
4629;-742630.986000001430511;-1042626.096000000834465;0
3425;-743730.254000000655651;-1043071.712000001221895;0
4689;-742688.114999998360872;-1042568.859999999403954;0
1449;-741533.000000000000000;-1044684.000000000000000;0
549;-742290.000000000000000;-1043770.000000000000000;0
4510;-742483.149999998509884;-1042738.460000000894070;0
2380;-742308.000000000000000;-1045401.000000000000000;0
7004;-743069.289999999105930;-1044326.469999998807907;0
1285;-742198.000000000000000;-1044467.000000000000000;0
2431;-742498.000000000000000;-1045094.000000000000000;0
4987;-742641.745000001043081;-1043011.309999998658895;0
4320;-742264.149000000208616;-1043259.541999999433756;0
5223;-743283.699999999254942;-1043535.940000001341105;0
4830;-743043.449999999254942;-1042882.359999999403954;0
5062;-742798.513999998569489;-1043227.370999999344349;0
6338;-742247.910000000149012;-1042851.670000001788139;0
209;-743108.000000000000000;-1043583.000000000000000;0
5081;-742917.046000000089407;-1043356.515999998897314;0
5251;-743317.296000000089407;-1043180.037999998778105;0
1311;-741646.000000000000000;-1044831.000000000000000;0
4909;-742383.146000001579523;-1042799.159000001847744;0
4201;-742269.000000000000000;-1043651.563000001013279;0
5504;-743428.977000001817942;-1043686.274000000208616;0
4734;-742762.920000001788139;-1042698.820000000298023;0
7046;-743398.329999998211861;-1044186.289999999105930;0
2526;-741087.000000000000000;-1044616.000000000000000;0
6138;-742313.561999998986721;-1043067.399000000208616;0
4650;-742749.989000000059605;-1042534.539999999105930;0
2523;-742181.000000000000000;-1044140.000000000000000;0
6753;-742485.511999998241663;-1044950.206999998539686;0
7148;-742828.445000000298023;-1044472.094999998807907;0
5207;-743208.434999998658895;-1043365.236999999731779;0
4900;-742508.089999999850988;-1042815.289999999105930;0
2318;-742763.000000000000000;-1045470.000000000000000;0
4727;-742869.390000000596046;-1042700.829999998211861;0
1471;-741711.000000000000000;-1044132.000000000000000;0
5683;-743398.456000000238419;-1043719.557999998331070;0
5517;-743427.287000000476837;-1043618.956999998539686;0
1793;-742166.000000000000000;-1044246.000000000000000;0
1267;-742040.000000000000000;-1044999.000000000000000;0
4983;-742587.776000000536442;-1043013.068999998271465;0
178;-743389.000000000000000;-1043251.000000000000000;0
3958;-743416.328000001609325;-1043572.265999998897314;0
4119;-742717.223999999463558;-1043999.837999999523163;0
464;-741713.000000000000000;-1043286.000000000000000;0
2346;-742654.000000000000000;-1045546.000000000000000;0
3794;-743091.015000000596046;-1042800.471999999135733;0
1907;-743446.000000000000000;-1044345.000000000000000;0
3991;-743363.940000001341105;-1043857.699999999254942;0
4997;-742492.638000000268221;-1042962.833999998867512;0
5143;-743052.232000000774860;-1043454.120000001043081;0
2056;-743436.000000000000000;-1045065.000000000000000;0
3951;-743433.379999998956919;-1043586.600000001490116;0
6200;-742318.653999999165535;-1043066.462000001221895;0
1141;-741454.000000000000000;-1044453.000000000000000;0
1133;-741604.000000000000000;-1044433.000000000000000;0
6255;-742379.991999998688698;-1043037.068999998271465;0
5577;-743409.385999999940395;-1043630.826999999582767;0
1538;-741948.000000000000000;-1043973.000000000000000;0
5270;-742989.153999999165535;-1043210.684999998658895;0
1319;-741788.000000000000000;-1044905.000000000000000;0
171;-743448.000000000000000;-1043399.000000000000000;0
5997;-742040.579999998211861;-1043282.651999998837709;0
5636;-743427.432000000029802;-1043681.359999999403954;0
4503;-742402.579999998211861;-1042702.839999999850988;0
4142;-742777.425000000745058;-1044013.440000001341105;0
616;-742153.000000000000000;-1043272.000000000000000;0
6569;-741287.850000001490116;-1044136.660000000149012;0
620;-742253.000000000000000;-1043281.000000000000000;0
6130;-742312.136999998241663;-1043066.344000000506639;0
4966;-742377.289999999105930;-1043071.030000001192093;0
2419;-742418.000000000000000;-1045101.000000000000000;0
723;-741990.000000000000000;-1043024.000000000000000;0
3887;-742347.760000001639128;-1042449.881000000983477;0
5015;-742575.741000000387430;-1043008.607999999076128;0
4762;-742854.192000001668930;-1042825.931000001728535;0
5578;-743409.534000001847744;-1043632.701000001281500;0
7149;-742823.379000000655651;-1044496.758000001311302;0
4888;-742649.925999999046326;-1042830.767000000923872;0
4834;-742972.708000000566244;-1042657.809000000357628;0
5294;-743056.328999999910593;-1043196.096999999135733;0
169;-743433.000000000000000;-1043334.000000000000000;0
8266;-742220.320000000298023;-1042706.760000001639128;0
5360;-742453.188999999314547;-1042938.521999999880791;0
6352;-741906.920000001788139;-1042710.609999999403954;0
1127;-741700.000000000000000;-1044440.000000000000000;0
4954;-742405.539999999105930;-1043024.640000000596046;0
1952;-743316.000000000000000;-1044495.000000000000000;0
7318;-742578.910000000149012;-1045033.530000001192093;0
8152;-743293.600000001490116;-1043190.510000001639128;0
5686;-743394.912000000476837;-1043720.872000001370907;0
2137;-742971.000000000000000;-1045111.000000000000000;0
4508;-742449.140000000596046;-1042725.980000000447035;0
4586;-742464.175000000745058;-1042636.333999998867512;0
2123;-743299.000000000000000;-1045010.000000000000000;0
1501;-741475.000000000000000;-1044292.000000000000000;0
1408;-741647.000000000000000;-1044201.000000000000000;0
7705;-742283.471999999135733;-1044316.339999999850988;0
4771;-742890.828000001609325;-1042889.975000001490116;0
1005;-741944.000000000000000;-1044583.000000000000000;0
2216;-743108.000000000000000;-1045349.000000000000000;0
4774;-742900.078999999910593;-1042854.859000001102686;0
4958;-742349.620000001043081;-1043004.539999999105930;0
2211;-743248.000000000000000;-1045258.000000000000000;0
1340;-741695.000000000000000;-1044759.000000000000000;0
5227;-743318.199999999254942;-1043537.510000001639128;0
4077;-742849.614999998360872;-1043858.745000001043081;0
577;-742038.000000000000000;-1043521.000000000000000;0
4937;-742461.982000000774860;-1042671.942000001668930;0
4989;-742648.756000000983477;-1043019.318999998271465;0
3100;-743941.234000001102686;-1042742.857999999076128;0
6247;-742371.447000000625849;-1043053.739000000059605;0
3109;-743754.403999999165535;-1042652.872000001370907;0
1357;-741935.000000000000000;-1044871.000000000000000;0
2432;-742549.000000000000000;-1045078.000000000000000;0
4513;-742579.030000001192093;-1042753.609999999403954;0
4673;-742811.420000001788139;-1042756.050000000745058;0
5157;-743178.671999998390675;-1043354.681000001728535;0
1366;-742109.000000000000000;-1044948.000000000000000;0
7362;-743205.807000000029802;-1045156.089999999850988;0
