OID_;X;Y;TEMPERATURE
7;-743479.000000000000000;-1042567.000000000000000;0
3063;-744133.098999999463558;-1042851.478999998420477;0
2255;-743181.000000000000000;-1045372.000000000000000;0
2760;-743863.331000000238419;-1043483.304000001400709;0
2891;-744029.914000000804663;-1043200.478000000119209;0
1608;-742391.000000000000000;-1044383.000000000000000;0
3916;-743964.037999998778105;-1043492.932999998331070;0
1561;-743186.000000000000000;-1045098.000000000000000;0
2262;-742999.000000000000000;-1045686.000000000000000;0
7260;-742953.010000001639128;-1044873.530000001192093;0
2189;-743472.000000000000000;-1045183.000000000000000;0
2641;-743432.578999999910593;-1042583.418999999761581;0
6873;-741769.339999999850988;-1045285.489999998360872;0
7704;-742256.021000001579523;-1044313.592999998480082;0
7409;-743521.629999998956919;-1045356.570000000298023;0
7746;-742234.789999999105930;-1045549.890000000596046;0
5308;-743062.039999999105930;-1043186.831999998539686;0
80;-744067.000000000000000;-1043330.000000000000000;0
2330;-742403.000000000000000;-1045511.000000000000000;0
651;-742490.000000000000000;-1043564.000000000000000;0
3542;-744575.274000000208616;-1042656.160000000149012;0
461;-741713.000000000000000;-1043304.000000000000000;0
2081;-742551.000000000000000;-1044621.000000000000000;0
3470;-745024.565000001341105;-1042295.905000001192093;0
7721;-742941.157000001519918;-1044215.368000000715256;0
3578;-744924.046000000089407;-1042547.359000001102686;0
1521;-741808.000000000000000;-1043917.000000000000000;3
1873;-743410.000000000000000;-1044260.000000000000000;0
671;-742489.000000000000000;-1043245.000000000000000;0
1674;-741099.000000000000000;-1044736.000000000000000;0
7147;-742827.925000000745058;-1044451.385000001639128;0
5068;-742837.162999998778105;-1043263.965999998152256;0
280;-743053.000000000000000;-1043875.000000000000000;0
7995;-741545.920000001788139;-1045160.100000001490116;0
2222;-743058.000000000000000;-1045420.000000000000000;0
7276;-742801.670000001788139;-1044613.309999998658895;0
2399;-742121.000000000000000;-1045372.000000000000000;0
514;-742119.000000000000000;-1043141.000000000000000;0
826;-742191.000000000000000;-1042616.000000000000000;0
1015;-742126.000000000000000;-1044599.000000000000000;0
735;-741910.000000000000000;-1043014.000000000000000;0
528;-742187.000000000000000;-1043838.000000000000000;0
2276;-742865.000000000000000;-1045649.000000000000000;0
1461;-741473.000000000000000;-1044266.000000000000000;0
3752;-743213.949999999254942;-1042902.719999998807907;0
3701;-744582.008000001311302;-1042507.443999998271465;0
7146;-742819.425000000745058;-1044426.225000001490116;0
4004;-743345.877000000327826;-1044053.135999999940395;0
283;-743026.000000000000000;-1043788.000000000000000;0
403;-742307.000000000000000;-1043931.000000000000000;0
1523;-741679.000000000000000;-1043865.000000000000000;0
2149;-742819.000000000000000;-1045024.000000000000000;0
4082;-742825.565000001341105;-1043737.364999998360872;0
3273;-743642.442999999970198;-1042796.677999999374151;0
1450;-741527.000000000000000;-1044632.000000000000000;0
5116;-742947.859000001102686;-1043386.767000000923872;0
2235;-743401.000000000000000;-1045221.000000000000000;0
839;-742021.000000000000000;-1042510.000000000000000;0
3812;-743231.179999999701977;-1042815.199999999254942;0
681;-742383.000000000000000;-1043170.000000000000000;0
3838;-743113.550000000745058;-1042543.399999998509884;0
505;-741917.000000000000000;-1043153.000000000000000;0
4428;-742206.750000000000000;-1043097.800000000745058;0
6997;-743109.160000000149012;-1044453.600000001490116;0
7248;-742757.960000000894070;-1044826.929999999701977;0
1592;-742378.000000000000000;-1044936.000000000000000;0
1473;-741642.000000000000000;-1044158.000000000000000;0
2158;-742781.000000000000000;-1045197.000000000000000;0
4205;-742325.267999999225140;-1043571.951000001281500;0
227;-742846.000000000000000;-1043520.000000000000000;0
4244;-742179.410000000149012;-1043422.000000000000000;0
4047;-743210.230000000447035;-1043992.289999999105930;0
2050;-743460.000000000000000;-1045072.000000000000000;0
4144;-742704.414999999105930;-1043822.484999999403954;0
1669;-741077.000000000000000;-1044092.000000000000000;0
1971;-743385.000000000000000;-1044881.000000000000000;0
1179;-741934.000000000000000;-1044251.000000000000000;0
1446;-741545.000000000000000;-1044774.000000000000000;0
2075;-743114.000000000000000;-1044772.000000000000000;0
7185;-742600.515000000596046;-1044717.333999998867512;0
4140;-742831.635999999940395;-1044004.828999999910593;0
4085;-742812.431000001728535;-1043657.114000000059605;0
1514;-741882.000000000000000;-1044096.000000000000000;0
1584;-742368.000000000000000;-1044717.000000000000000;0
1214;-742064.000000000000000;-1044358.000000000000000;0
2420;-742431.000000000000000;-1045120.000000000000000;0
1628;-742449.000000000000000;-1044494.000000000000000;0
4236;-742406.842999998480082;-1043504.015000000596046;0
6726;-742476.517999999225140;-1044410.600000001490116;0
2085;-742426.000000000000000;-1044797.000000000000000;0
2008;-743242.000000000000000;-1044759.000000000000000;0
4744;-742848.129999998956919;-1042759.629999998956919;0
4159;-742455.734999999403954;-1043898.035000000149012;0
1932;-743359.000000000000000;-1044408.000000000000000;0
7200;-742561.710999999195337;-1044911.469999998807907;0
4161;-742506.254999998956919;-1044181.925000000745058;0
2562;-741090.000000000000000;-1044404.000000000000000;0
382;-742481.000000000000000;-1043751.000000000000000;0
6709;-742264.587999999523163;-1044776.254999998956919;0
1318;-741838.000000000000000;-1044940.000000000000000;0
1039;-741914.000000000000000;-1044595.000000000000000;0
6981;-743063.800000000745058;-1044366.239999998360872;0
1128;-741655.000000000000000;-1044448.000000000000000;0
4039;-743159.070000000298023;-1043772.795000001788139;0
734;-741935.000000000000000;-1043014.000000000000000;0
4832;-743039.079999998211861;-1042840.850000001490116;0
7654;-742242.081000000238419;-1045273.263999998569489;0
1422;-742199.000000000000000;-1044127.000000000000000;0
6096;-742098.760000001639128;-1043615.589999999850988;0
7928;-743542.539999999105930;-1044784.769999999552965;0
5209;-743271.947999998927116;-1043361.392000000923872;0
2225;-743041.000000000000000;-1045477.000000000000000;0
3457;-745069.765000000596046;-1042699.907000001519918;0
3479;-745209.144000001251698;-1042773.556000001728535;0
5421;-742337.905999999493361;-1042777.837999999523163;0
3791;-743144.839999999850988;-1042881.120000001043081;0
4608;-742555.160999998450279;-1042637.633999999612570;0
4482;-741768.079999998211861;-1042606.449999999254942;0
2043;-743471.000000000000000;-1044959.000000000000000;0
3146;-744012.745000001043081;-1042642.118000000715256;0
1548;-742220.000000000000000;-1044216.000000000000000;0
3957;-743415.125000000000000;-1043567.214999999850988;0
4098;-742789.157000001519918;-1043861.918999999761581;0
1718;-741366.219999998807907;-1044870.989999998360872;0
601;-741823.000000000000000;-1043224.000000000000000;0
5317;-743063.690000001341105;-1043053.769999999552965;0
5410;-742572.837000001221895;-1042981.173999998718500;0
608;-741955.000000000000000;-1043274.000000000000000;0
1402;-741699.000000000000000;-1044419.000000000000000;0
3289;-743584.761999998241663;-1042769.188000001013279;0
5001;-742560.092999998480082;-1042966.206999998539686;0
7945;-742063.179999999701977;-1044077.379999998956919;0
3562;-744682.454999998211861;-1042610.877000000327826;0
3983;-743317.089999999850988;-1043883.160000000149012;0
3109;-743754.403999999165535;-1042652.872000001370907;0
203;-743204.000000000000000;-1043607.000000000000000;0
2136;-742993.000000000000000;-1045103.000000000000000;0
4115;-742757.210000000894070;-1044109.620000001043081;0
6192;-742317.252000000327826;-1043065.394999999552965;0
1854;-742675.000000000000000;-1044271.000000000000000;0
1453;-741525.000000000000000;-1044529.000000000000000;0
4890;-742605.287000000476837;-1042838.535000000149012;0
4331;-742391.967999998480082;-1043310.539000000804663;0
1878;-743324.000000000000000;-1044249.000000000000000;0
7176;-742630.820000000298023;-1044585.809999998658895;0
4253;-742109.368000000715256;-1043416.399999998509884;0
881;-741806.000000000000000;-1042815.000000000000000;0
725;-741983.000000000000000;-1042939.000000000000000;0
4875;-742814.660000000149012;-1042937.800000000745058;0
6922;-742056.329999998211861;-1045086.679999999701977;0
1518;-741994.000000000000000;-1044011.000000000000000;0
6704;-742282.179999999701977;-1044623.793999999761581;0
509;-741991.000000000000000;-1043143.000000000000000;0
209;-743108.000000000000000;-1043583.000000000000000;0
1036;-741961.000000000000000;-1044922.000000000000000;0
330;-742659.000000000000000;-1044043.000000000000000;0
5738;-743410.412999998778105;-1043691.800000000745058;0
4591;-742426.813000001013279;-1042640.035000000149012;0
7021;-743129.019999999552965;-1044076.230000000447035;0
6946;-742974.765000000596046;-1043929.388000000268221;0
5691;-743415.714000001549721;-1043637.241000000387430;0
5756;-743426.113000001758337;-1043680.102000001817942;0
7083;-743309.980000000447035;-1044509.500000000000000;0
297;-742938.000000000000000;-1044069.000000000000000;0
7012;-742805.839999999850988;-1044263.870000001043081;0
3342;-743922.624000001698732;-1043077.261999998241663;0
4006;-743302.763000000268221;-1044052.298999998718500;0
3528;-744791.905999999493361;-1042674.936000000685453;0
574;-742068.000000000000000;-1043538.000000000000000;0
3844;-743184.170000001788139;-1042586.949999999254942;0
582;-741994.000000000000000;-1043417.000000000000000;0
4249;-742151.910000000149012;-1043354.719999998807907;0
1839;-742994.469999998807907;-1044185.679999999701977;0
5786;-743456.410000000149012;-1042105.250000000000000;0
1468;-741778.000000000000000;-1044082.000000000000000;0
1924;-743359.000000000000000;-1044320.000000000000000;0
7537;-742722.660000000149012;-1045361.410000000149012;0
2494;-741985.000000000000000;-1044165.000000000000000;0
4945;-742422.162999998778105;-1043009.861000001430511;0
7153;-742889.646999999880791;-1044547.438000001013279;0
3091;-743924.489000000059605;-1042816.170000001788139;0
1762;-741227.000000000000000;-1044108.000000000000000;0
4221;-742209.576000001281500;-1043499.238000001758337;0
8280;-742150.949999999254942;-1042770.420000001788139;0
555;-742230.000000000000000;-1043726.000000000000000;0
223;-742920.000000000000000;-1043542.000000000000000;0
3759;-743267.609999999403954;-1042971.300000000745058;0
1682;-741129.769999999552965;-1044685.559999998658895;0
406;-742366.000000000000000;-1044171.000000000000000;99
1224;-742174.000000000000000;-1044253.000000000000000;0
641;-742008.000000000000000;-1043304.000000000000000;0
1933;-743329.000000000000000;-1044407.000000000000000;0
1719;-741406.760000001639128;-1044866.039999999105930;0
3302;-743795.043999999761581;-1042863.539000000804663;0
6039;-742085.370000001043081;-1043669.620999999344349;0
1218;-742120.000000000000000;-1044309.000000000000000;0
1307;-741803.000000000000000;-1044663.000000000000000;0
1101;-741339.000000000000000;-1044568.000000000000000;0
2093;-742915.000000000000000;-1044642.000000000000000;0
1286;-742221.460000000894070;-1044465.969999998807907;0
3794;-743091.015000000596046;-1042800.471999999135733;0
995;-741906.000000000000000;-1044434.000000000000000;0
6368;-741940.324999999254942;-1042660.324000000953674;0
4018;-743153.285000000149012;-1043925.850000001490116;0
4222;-742187.096999999135733;-1043485.890000000596046;0
2019;-743264.000000000000000;-1044921.000000000000000;0
3832;-743029.390000000596046;-1042595.910000000149012;0
6974;-743127.620000001043081;-1044518.800000000745058;0
5275;-743019.763000000268221;-1043300.774999998509884;0
8018;-741974.039999999105930;-1044442.870000001043081;0
6845;-741527.188000001013279;-1044989.557000000029802;0
5722;-743419.659000001847744;-1043631.798000000417233;0
1095;-741452.000000000000000;-1044553.000000000000000;0
5251;-743317.296000000089407;-1043180.037999998778105;0
3870;-742381.989999998360872;-1042417.679999999701977;0
5681;-743400.820000000298023;-1043718.682000000029802;0
2060;-742659.000000000000000;-1044472.000000000000000;35
4806;-743138.429999999701977;-1042771.350000001490116;0
1133;-741604.000000000000000;-1044433.000000000000000;0
3417;-743776.002999998629093;-1043098.853000000119209;0
4427;-742190.519999999552965;-1043099.440000001341105;0
1557;-741193.000000000000000;-1044306.000000000000000;0
824;-742142.000000000000000;-1042596.000000000000000;0
1706;-741225.800000000745058;-1044698.800000000745058;0
7019;-742585.024999998509884;-1044210.725000001490116;0
4729;-742855.690000001341105;-1042695.640000000596046;0
2284;-742901.000000000000000;-1045502.000000000000000;0
1558;-741192.000000000000000;-1044273.000000000000000;0
1700;-741406.000000000000000;-1044677.000000000000000;0
720;-741671.000000000000000;-1042815.000000000000000;0
4647;-742705.322999998927116;-1042525.425000000745058;0
4777;-742910.034000001847744;-1042759.350999999791384;0
6415;-743180.657999999821186;-1043208.993999999016523;0
1340;-741695.000000000000000;-1044759.000000000000000;0
756;-741681.000000000000000;-1042695.000000000000000;0
6369;-741962.675000000745058;-1042665.013999998569489;0
7088;-743335.559999998658895;-1044546.359999999403954;0
4606;-742512.769000001251698;-1042608.333000000566244;0
4965;-742383.620000001043081;-1043057.500000000000000;0
3830;-743013.879999998956919;-1042612.359999999403954;0
907;-742211.000000000000000;-1042511.000000000000000;0
550;-742276.000000000000000;-1043746.000000000000000;0
1124;-741715.000000000000000;-1044452.000000000000000;0
1562;-743199.000000000000000;-1045122.000000000000000;0
1107;-741239.260000001639128;-1044580.940000001341105;0
5591;-743421.353999998420477;-1043679.738000001758337;0
2885;-744122.791999999433756;-1043190.208000000566244;0
7206;-742559.920000001788139;-1045003.190000001341105;0
2389;-742076.000000000000000;-1045396.000000000000000;0
7091;-743361.839999999850988;-1044584.039999999105930;0
6840;-741746.993999999016523;-1044999.993999999016523;0
3337;-743968.771999999880791;-1043021.756999999284744;0
3212;-743646.699000000953674;-1042469.458999998867512;0
3181;-743898.234999999403954;-1042567.133000001311302;0
3357;-743953.732000000774860;-1043042.298999998718500;0
2300;-742561.000000000000000;-1045413.000000000000000;0
4607;-742508.469999998807907;-1042623.089000001549721;0
3235;-744146.118000000715256;-1042659.438999999314547;0
1288;-742189.000000000000000;-1044543.000000000000000;0
2582;-741030.372999999672174;-1044607.635000001639128;0
4704;-742680.000000000000000;-1042776.750000000000000;0
7660;-742321.396999999880791;-1045335.578999999910593;0
2373;-742469.000000000000000;-1045517.000000000000000;0
5302;-743090.423999998718500;-1043070.048999998718500;0
169;-743433.000000000000000;-1043334.000000000000000;0
5163;-743163.861999999731779;-1043392.113000001758337;0
5194;-743205.761999998241663;-1043310.581999998539686;0
8057;-742238.839999999850988;-1045047.489999998360872;0
6116;-742963.905999999493361;-1042886.313000001013279;0
7047;-743395.495000001043081;-1044210.765000000596046;0
6292;-743660.304999999701977;-1042964.543999999761581;0
5292;-743055.866000000387430;-1043215.710999999195337;0
4558;-742373.019999999552965;-1042506.949999999254942;0
921;-743338.000000000000000;-1043818.000000000000000;0
1058;-741667.000000000000000;-1045072.000000000000000;0
180;-743414.000000000000000;-1043320.000000000000000;0
5232;-743347.087000001221895;-1043476.425000000745058;0
7962;-741640.190000001341105;-1044316.800000000745058;0
7040;-743356.140000000596046;-1044164.359999999403954;0
1598;-742351.000000000000000;-1045090.000000000000000;0
5224;-743293.449999999254942;-1043542.160000000149012;0
4699;-742676.469999998807907;-1042731.760000001639128;0
1247;-742104.000000000000000;-1044609.000000000000000;0
4999;-742534.149999998509884;-1042966.892999999225140;0
6373;-741992.809999998658895;-1042677.000000000000000;0
3389;-743919.920000001788139;-1043153.510000001639128;0
5414;-742582.574999999254942;-1042677.478999998420477;0
5118;-742835.168000001460314;-1043315.074000000953674;0
4678;-742775.910000000149012;-1042839.929999999701977;0
6114;-742234.250000000000000;-1043361.324999999254942;0
1151;-741279.000000000000000;-1044475.000000000000000;0
2466;-743460.000000000000000;-1044740.000000000000000;0
1375;-742151.000000000000000;-1044887.000000000000000;0
4465;-742180.250000000000000;-1042584.370000001043081;0
4123;-742742.956000000238419;-1043901.826000001281500;0
2503;-742753.000000000000000;-1045484.000000000000000;0
696;-742077.000000000000000;-1042913.000000000000000;0
6663;-741457.949999999254942;-1044194.329999998211861;0
1353;-741862.000000000000000;-1044843.000000000000000;0
4583;-742401.482999999076128;-1042625.886999998241663;0
2556;-741376.000000000000000;-1044379.000000000000000;0
7939;-741306.171999998390675;-1043955.960000000894070;0
8273;-742057.820000000298023;-1042728.760000001639128;0
7653;-742255.225000001490116;-1045513.048000000417233;0
8285;-742232.780000001192093;-1042821.149999998509884;0
6308;-741823.129999998956919;-1042770.370000001043081;0
679;-742404.000000000000000;-1043185.000000000000000;0
5293;-743043.969999998807907;-1043208.554000001400709;0
350;-742505.000000000000000;-1043757.000000000000000;0
6228;-742319.103999998420477;-1043062.592000000178814;0
6273;-742321.806000001728535;-1043017.085000000894070;0
1467;-741808.000000000000000;-1044064.000000000000000;0
1447;-741541.000000000000000;-1044744.000000000000000;0
1364;-742077.000000000000000;-1044936.000000000000000;0
1526;-741644.000000000000000;-1043787.000000000000000;0
3348;-743960.361000001430511;-1043015.629999998956919;0
4858;-742955.339999999850988;-1042963.960000000894070;0
2516;-742500.000000000000000;-1044414.000000000000000;0
4168;-742423.695000000298023;-1043984.135000001639128;0
6395;-742057.429999999701977;-1042500.809999998658895;0
6907;-741728.850000001490116;-1045105.190000001341105;0
6785;-741294.269999999552965;-1044465.800000000745058;0
4702;-742669.300000000745058;-1042747.399999998509884;0
5143;-743052.232000000774860;-1043454.120000001043081;0
4650;-742749.989000000059605;-1042534.539999999105930;0
3786;-743150.480000000447035;-1042925.960000000894070;0
1928;-743474.000000000000000;-1044409.000000000000000;0
4822;-742945.579999998211861;-1042879.910000000149012;0
1713;-741207.339999999850988;-1044891.359999999403954;0
1027;-741984.000000000000000;-1044660.000000000000000;0
5271;-742995.381999999284744;-1043229.673000000417233;0
1441;-741744.000000000000000;-1044392.000000000000000;0
6266;-742349.021000001579523;-1043019.662999998778105;0
5125;-742992.826000001281500;-1043402.497999999672174;0
1254;-742090.000000000000000;-1044750.000000000000000;96
5698;-743416.785999998450279;-1043633.638000000268221;0
4959;-742331.289999999105930;-1043002.690000001341105;0
8052;-742218.929999999701977;-1044953.719999998807907;0
6696;-742332.717000000178814;-1044815.649999998509884;0
1750;-742045.000000000000000;-1045215.000000000000000;0
518;-742194.000000000000000;-1043131.000000000000000;0
4731;-742802.002999998629093;-1042654.546000000089407;0
5637;-743428.151000000536442;-1043682.633999999612570;0
4709;-742775.800000000745058;-1042600.690000001341105;0
7961;-741602.260000001639128;-1044314.350000001490116;0
4903;-742493.579999998211861;-1042816.620000001043081;0
2431;-742498.000000000000000;-1045094.000000000000000;0
4948;-742386.929999999701977;-1042992.239999998360872;0
7677;-742383.142000000923872;-1045124.221000000834465;0
4054;-743269.304999999701977;-1043797.405000001192093;0
1615;-742367.000000000000000;-1044434.000000000000000;0
2286;-742894.000000000000000;-1045440.000000000000000;0
4072;-742934.225000001490116;-1043833.899999998509884;0
2053;-743404.000000000000000;-1044986.000000000000000;0
2346;-742654.000000000000000;-1045546.000000000000000;0
1620;-742439.000000000000000;-1044323.000000000000000;0
2470;-742936.000000000000000;-1045241.000000000000000;0
1406;-741663.000000000000000;-1044277.000000000000000;0
2542;-741813.000000000000000;-1044224.000000000000000;0
5580;-743409.831000000238419;-1043636.449000000953674;0
4928;-742444.890000000596046;-1042854.899999998509884;0
2316;-742823.000000000000000;-1045463.000000000000000;0
4141;-742804.644999999552965;-1044008.964999999850988;0
2473;-743469.000000000000000;-1044899.000000000000000;0
5144;-743052.642000000923872;-1043488.940000001341105;0
1460;-741482.000000000000000;-1044302.000000000000000;0
4902;-742480.460000000894070;-1042802.989999998360872;0
1054;-741734.000000000000000;-1045021.000000000000000;0
692;-742292.000000000000000;-1043084.000000000000000;0
1164;-741055.000000000000000;-1044515.000000000000000;0
5444;-743183.024000000208616;-1043210.600000001490116;0
5755;-743415.670000001788139;-1043702.254000000655651;0
6151;-742311.114999998360872;-1043061.451000001281500;0
6857;-741503.982999999076128;-1044930.340999998152256;0
5243;-743357.622000001370907;-1043407.258999999612570;0
4732;-742777.550000000745058;-1042653.539999999105930;0
1300;-741917.410000000149012;-1044719.769999999552965;0
7182;-742597.789999999105930;-1044678.260000001639128;0
4635;-742575.561999998986721;-1042702.701000001281500;0
4951;-742335.579999998211861;-1042934.429999999701977;0
1748;-741727.000000000000000;-1045047.000000000000000;0
5112;-742942.920000001788139;-1043441.850000001490116;0
6219;-742319.168999999761581;-1043064.293999999761581;0
396;-742388.000000000000000;-1043886.000000000000000;0
4151;-742573.039999999105930;-1044109.035000000149012;0
4080;-742832.480000000447035;-1043782.030000001192093;0
1377;-742146.969999998807907;-1044922.489999998360872;0
823;-742110.000000000000000;-1042596.000000000000000;0
6701;-742295.142000000923872;-1044533.372000001370907;0
5325;-742997.480000000447035;-1043042.289999999105930;0
3760;-743233.829999998211861;-1042978.739999998360872;0
1026;-741986.000000000000000;-1044631.000000000000000;0
5736;-743414.859999999403954;-1043691.462999999523163;0
4321;-742265.214999999850988;-1043235.418999999761581;0
529;-742162.000000000000000;-1043803.000000000000000;0
6113;-742229.061000000685453;-1043368.359000001102686;0
2382;-742242.000000000000000;-1045524.000000000000000;0
7160;-743028.010999999940395;-1044543.267999999225140;0
585;-741960.000000000000000;-1043413.000000000000000;0
2243;-743292.000000000000000;-1045310.000000000000000;0
305;-742837.000000000000000;-1044130.000000000000000;0
5717;-743422.208999998867512;-1043629.984000001102686;0
7347;-742557.690000001341105;-1045177.440000001341105;0
577;-742038.000000000000000;-1043521.000000000000000;0
4526;-742696.690000001341105;-1042823.320000000298023;0
3421;-743743.348000001162291;-1043104.984999999403954;0
5382;-744377.920000001788139;-1042814.201000001281500;0
541;-742258.000000000000000;-1043678.000000000000000;0
5371;-742052.149999998509884;-1043011.940000001341105;0
6234;-742324.105000000447035;-1043076.613000001758337;0
5195;-743232.432999998331070;-1043297.890999998897314;0
4844;-742977.256000000983477;-1042754.953000001609325;0
5147;-743077.127000000327826;-1043433.221999999135733;0
8075;-742072.149999998509884;-1045261.399999998509884;0
4939;-742448.866999998688698;-1043072.822999998927116;0
4150;-742581.789999999105930;-1044138.429999999701977;0
4166;-742448.504999998956919;-1044046.885000001639128;0
5198;-743259.600999999791384;-1043302.061000000685453;0
2223;-743053.000000000000000;-1045437.000000000000000;0
7647;-742319.918000001460314;-1045405.197999998927116;0
3991;-743363.940000001341105;-1043857.699999999254942;0
6158;-742313.261999998241663;-1043063.925999999046326;0
1604;-742552.000000000000000;-1044918.000000000000000;0
6784;-741318.109999999403954;-1044460.920000001788139;0
3730;-744714.653000000864267;-1042576.567999999970198;0
6205;-742314.800000000745058;-1043059.416999999433756;0
993;-741977.000000000000000;-1044436.000000000000000;0
3354;-743954.250999998301268;-1043026.024999998509884;0
5109;-742850.925999999046326;-1043483.024999998509884;0
2171;-742893.000000000000000;-1045151.000000000000000;0
7177;-742643.059999998658895;-1044579.679999999701977;0
1329;-742062.000000000000000;-1045046.000000000000000;0
1213;-742068.000000000000000;-1044387.000000000000000;0
1814;-743095.000000000000000;-1044510.000000000000000;0
3700;-744597.480999998748302;-1042518.239999998360872;0
6216;-742313.892000000923872;-1043056.272999998182058;0
1766;-741257.000000000000000;-1044204.000000000000000;0
4037;-743205.375000000000000;-1043771.175000000745058;0
4938;-742469.324999999254942;-1042658.263000000268221;0
636;-742160.000000000000000;-1043325.000000000000000;0
6778;-741060.820000000298023;-1044484.339999999850988;0
4812;-743027.170000001788139;-1042810.219999998807907;0
7617;-742345.934000000357628;-1045300.958999998867512;0
6178;-742312.960000000894070;-1043060.445999998599291;0
3960;-743418.563000001013279;-1043583.526000000536442;0
1545;-742236.000000000000000;-1044234.000000000000000;0
6170;-742311.548000000417233;-1043059.381000000983477;0
4747;-742866.289999999105930;-1042753.390000000596046;0
606;-741906.000000000000000;-1043273.000000000000000;0
5678;-743404.363000001758337;-1043717.368999999016523;0
701;-742023.000000000000000;-1042885.000000000000000;0
2086;-742404.000000000000000;-1044796.000000000000000;0
4897;-742560.320000000298023;-1042829.359999999403954;0
1694;-741582.000000000000000;-1044653.000000000000000;0
1330;-741817.000000000000000;-1044709.000000000000000;0
1500;-741441.000000000000000;-1044299.000000000000000;0
4532;-742760.140000000596046;-1042899.600000001490116;0
4688;-742676.179000001400709;-1042555.322999998927116;0
8151;-743319.030000001192093;-1043194.940000001341105;0
1312;-741659.000000000000000;-1044848.000000000000000;0
3240;-744173.991999998688698;-1042639.695000000298023;0
2631;-743269.129999998956919;-1042334.879000000655651;0
1376;-742165.000000000000000;-1044873.000000000000000;0
281;-743045.000000000000000;-1043848.000000000000000;0
4736;-742701.269999999552965;-1042690.000000000000000;0
4207;-742354.105999998748302;-1043530.157999999821186;0
748;-741671.000000000000000;-1042971.000000000000000;0
1444;-741559.000000000000000;-1044786.000000000000000;0
6144;-742308.925000000745058;-1043059.002000000327826;0
1403;-741702.000000000000000;-1044386.000000000000000;0
3990;-743339.489999998360872;-1043987.234999999403954;0
6191;-742318.017000000923872;-1043066.800999999046326;0
5416;-742963.127999998629093;-1042713.598000001162291;0
2249;-743211.000000000000000;-1045443.000000000000000;0
4459;-742274.829999998211861;-1042644.269999999552965;0
4145;-742687.109999999403954;-1043837.125000000000000;0
5511;-743426.401000000536442;-1043599.129999998956919;0
1475;-741565.000000000000000;-1044185.000000000000000;0
4954;-742405.539999999105930;-1043024.640000000596046;0
4748;-742895.730000000447035;-1042781.289999999105930;0
1852;-742739.000000000000000;-1044210.000000000000000;0
339;-742606.000000000000000;-1043916.000000000000000;0
5415;-742954.934000000357628;-1042714.414000000804663;0
5258;-743356.739999998360872;-1043230.039999999105930;0
3831;-743005.140000000596046;-1042638.440000001341105;0
873;-741728.000000000000000;-1042672.000000000000000;0
2336;-742837.000000000000000;-1045523.000000000000000;0
1097;-741414.000000000000000;-1044558.000000000000000;0
572;-742083.000000000000000;-1043561.000000000000000;0
3998;-743432.704999998211861;-1043914.274999998509884;0
2537;-741975.000000000000000;-1044131.000000000000000;0
7520;-742808.589999999850988;-1045680.519999999552965;0
6367;-741928.510000001639128;-1042645.149999998509884;0
6688;-742383.146999999880791;-1045009.361000001430511;0
8019;-741972.039999999105930;-1044557.089999999850988;0
334;-742631.000000000000000;-1043987.000000000000000;0
1596;-742323.000000000000000;-1045037.000000000000000;0
1136;-741520.000000000000000;-1044455.000000000000000;0
6715;-742291.912999998778105;-1044948.105999998748302;0
4733;-742767.890000000596046;-1042671.010000001639128;0
