OID_;X;Y;TEMPERATURE
5786;-743456.410000000149012;-1042105.250000000000000;0
3702;-744567.984999999403954;-1042510.802000001072884;0
7911;-743564.839999999850988;-1045408.649999998509884;0
7;-743479.000000000000000;-1042567.000000000000000;155
7777;-743079.782999999821186;-1045794.026000000536442;0
2473;-743469.000000000000000;-1044899.000000000000000;0
2016;-743230.000000000000000;-1044873.000000000000000;0
7277;-742796.870000001043081;-1044653.429999999701977;0
344;-742557.000000000000000;-1043847.000000000000000;0
2083;-742588.000000000000000;-1044663.000000000000000;0
7147;-742827.925000000745058;-1044451.385000001639128;0
7182;-742597.789999999105930;-1044678.260000001639128;0
4073;-742939.109999999403954;-1043858.504999998956919;0
4098;-742789.157000001519918;-1043861.918999999761581;0
540;-742144.000000000000000;-1043804.000000000000000;0
2496;-741953.000000000000000;-1044102.000000000000000;0
5996;-742061.879000000655651;-1043284.276999998837709;0
599;-741837.000000000000000;-1043243.000000000000000;0
1932;-743359.000000000000000;-1044408.000000000000000;0
7515;-742273.021999999880791;-1044371.543999999761581;0
2240;-743343.000000000000000;-1045290.000000000000000;0
7022;-743155.660000000149012;-1044074.410000000149012;0
6993;-743172.409000001847744;-1044501.339000001549721;0
510;-742048.000000000000000;-1043150.000000000000000;0
2256;-743156.000000000000000;-1045353.000000000000000;0
7354;-743365.449000000953674;-1045150.535999998450279;0
2809;-744090.649999998509884;-1043371.184000000357628;0
3537;-744632.945000000298023;-1042671.657000001519918;0
745;-741649.000000000000000;-1042968.000000000000000;0
2128;-743170.000000000000000;-1045080.000000000000000;0
376;-742530.000000000000000;-1043680.000000000000000;0
2097;-743143.000000000000000;-1044742.000000000000000;0
4004;-743345.877000000327826;-1044053.135999999940395;11
3919;-743904.947000000625849;-1043493.929999999701977;0
1247;-742104.000000000000000;-1044609.000000000000000;0
2189;-743472.000000000000000;-1045183.000000000000000;0
1586;-742372.000000000000000;-1044785.000000000000000;0
3579;-744924.442999999970198;-1042569.135000001639128;0
4237;-742425.385000001639128;-1043517.421000000089407;0
737;-741849.000000000000000;-1043021.000000000000000;37
285;-743021.000000000000000;-1043730.000000000000000;0
2482;-741262.739999998360872;-1044725.530000001192093;0
3209;-743668.293999999761581;-1042492.478999998420477;0
2314;-742884.000000000000000;-1045456.000000000000000;0
4085;-742812.431000001728535;-1043657.114000000059605;0
5124;-742983.513000000268221;-1043417.271999999880791;0
3393;-743910.969999998807907;-1043143.960000000894070;0
2321;-742679.000000000000000;-1045480.000000000000000;0
2328;-742459.000000000000000;-1045505.000000000000000;0
2889;-744074.103999998420477;-1043194.559999998658895;0
4029;-743130.695999998599291;-1043815.427999999374151;0
4131;-742844.625000000000000;-1044059.980000000447035;0
7519;-742850.620000001043081;-1045673.670000001788139;0
6660;-741490.809999998658895;-1044176.750000000000000;0
2159;-742822.000000000000000;-1045141.000000000000000;0
7002;-743079.250000000000000;-1044377.170000001788139;124
2142;-742883.000000000000000;-1045078.000000000000000;0
7157;-742964.840999998152256;-1044545.681000001728535;0
1020;-742293.000000000000000;-1044615.000000000000000;0
2301;-742533.000000000000000;-1045416.000000000000000;0
5405;-744043.826000001281500;-1042674.686000000685453;0
7247;-742774.480000000447035;-1044839.850000001490116;0
6574;-741292.359999999403954;-1044067.620000001043081;0
3985;-743312.765000000596046;-1043928.164999999105930;0
4826;-743043.850000001490116;-1042979.600000001490116;0
6040;-742075.469999998807907;-1043676.809999998658895;0
7822;-743543.072000000625849;-1045082.980000000447035;0
1875;-743367.000000000000000;-1044261.000000000000000;0
4590;-742387.043000001460314;-1042535.971000000834465;0
1571;-742239.000000000000000;-1044186.000000000000000;0
797;-741796.000000000000000;-1042574.000000000000000;0
6833;-741571.423000000417233;-1044909.473999999463558;0
2024;-743305.000000000000000;-1045000.000000000000000;0
6307;-741835.620000001043081;-1042765.149999998509884;0
2388;-742096.000000000000000;-1045422.000000000000000;0
3842;-743141.300000000745058;-1042637.030000001192093;0
3148;-744008.699000000953674;-1042624.668999999761581;0
4333;-742428.420000001788139;-1043255.609999999403954;0
6697;-742363.109999999403954;-1044816.120000001043081;0
4243;-742194.050000000745058;-1043431.899999998509884;0
1349;-741824.000000000000000;-1044818.000000000000000;0
6114;-742234.250000000000000;-1043361.324999999254942;0
1257;-742070.000000000000000;-1044815.000000000000000;0
1961;-743397.000000000000000;-1044642.000000000000000;0
6706;-742275.234999999403954;-1044689.607999999076128;0
1432;-741958.000000000000000;-1044285.000000000000000;0
5775;-743915.925000000745058;-1042818.550999999046326;0
8283;-742198.600000001490116;-1042801.980000000447035;0
1693;-741613.000000000000000;-1044649.000000000000000;0
4461;-742218.370000001043081;-1042583.800000000745058;0
6103;-742213.102000001817942;-1043103.528999999165535;0
6100;-741950.760000001639128;-1043408.109999999403954;0
4220;-742214.344999998807907;-1043580.359999999403954;0
6479;-741969.831000000238419;-1044454.850000001490116;0
3886;-742385.100000001490116;-1042445.500000000000000;0
6870;-741708.260000001639128;-1045321.590999998152256;0
2535;-742042.000000000000000;-1044071.000000000000000;0
2260;-743019.000000000000000;-1045622.000000000000000;0
3752;-743213.949999999254942;-1042902.719999998807907;0
7025;-743199.914999999105930;-1044070.515000000596046;0
1557;-741193.000000000000000;-1044306.000000000000000;0
296;-742950.170000001788139;-1044097.429999999701977;0
7704;-742256.021000001579523;-1044313.592999998480082;0
177;-743376.000000000000000;-1043232.000000000000000;0
1345;-741741.000000000000000;-1044789.000000000000000;0
635;-742143.000000000000000;-1043317.000000000000000;0
2053;-743404.000000000000000;-1044986.000000000000000;0
7617;-742345.934000000357628;-1045300.958999998867512;0
4051;-743236.329999998211861;-1043889.710000000894070;0
4036;-743246.920000001788139;-1043771.574999999254942;0
465;-741728.000000000000000;-1043309.000000000000000;0
504;-741937.000000000000000;-1043164.000000000000000;0
336;-742616.000000000000000;-1043959.000000000000000;0
1325;-741894.000000000000000;-1044959.000000000000000;0
7148;-742828.445000000298023;-1044472.094999998807907;0
733;-741963.000000000000000;-1043018.000000000000000;0
1260;-742070.000000000000000;-1044876.000000000000000;0
6817;-741052.879000000655651;-1044823.684999998658895;0
3096;-743906.309999998658895;-1042750.539999999105930;0
3838;-743113.550000000745058;-1042543.399999998509884;0
4530;-742732.859999999403954;-1042860.920000001788139;0
1389;-742281.250000000000000;-1044962.859999999403954;0
1854;-742675.000000000000000;-1044271.000000000000000;0
2061;-742681.000000000000000;-1044491.000000000000000;0
1427;-742017.000000000000000;-1044256.000000000000000;0
5692;-743415.782999999821186;-1043638.765000000596046;0
1593;-742192.000000000000000;-1044826.000000000000000;0
1237;-742144.000000000000000;-1044365.000000000000000;0
4723;-742883.429999999701977;-1042644.829999998211861;0
4811;-743040.379999998956919;-1042799.609999999403954;0
1453;-741525.000000000000000;-1044529.000000000000000;0
4837;-742979.105999998748302;-1042672.627999998629093;0
2136;-742993.000000000000000;-1045103.000000000000000;0
1912;-743461.000000000000000;-1044430.000000000000000;0
1535;-741873.000000000000000;-1043913.000000000000000;0
2172;-742886.000000000000000;-1045182.000000000000000;0
207;-743142.000000000000000;-1043590.000000000000000;0
6580;-741299.379000000655651;-1044005.879000000655651;0
1551;-741353.000000000000000;-1044326.000000000000000;0
6724;-742590.385000001639128;-1044428.910000000149012;0
1468;-741778.000000000000000;-1044082.000000000000000;0
4995;-742476.986000001430511;-1042961.239000000059605;0
7038;-743316.394999999552965;-1044240.155000001192093;0
4951;-742335.579999998211861;-1042934.429999999701977;0
1103;-741306.000000000000000;-1044572.000000000000000;0
4178;-742382.640000000596046;-1044160.138000000268221;0
6090;-742012.260000001639128;-1043497.300000000745058;0
3019;-744463.447999998927116;-1042784.646000001579523;0
6837;-741677.875999998301268;-1044964.791999999433756;0
1338;-741629.000000000000000;-1045045.000000000000000;0
7010;-742857.964999999850988;-1044251.155000001192093;0
6960;-743030.260000001639128;-1044242.870000001043081;0
387;-742421.000000000000000;-1043763.000000000000000;0
550;-742276.000000000000000;-1043746.000000000000000;0
1253;-742084.000000000000000;-1044730.000000000000000;0
4330;-742377.440999999642372;-1043332.162999998778105;0
4105;-742678.771999999880791;-1043769.206000000238419;0
7801;-742459.168999999761581;-1044490.660000000149012;0
3718;-744739.026999998837709;-1042368.383000001311302;0
2039;-743308.000000000000000;-1044808.000000000000000;0
2224;-743051.000000000000000;-1045450.000000000000000;0
2402;-742236.000000000000000;-1045408.000000000000000;0
6296;-742543.019999999552965;-1042643.350000001490116;0
1196;-741677.000000000000000;-1043894.000000000000000;0
226;-742879.000000000000000;-1043516.000000000000000;0
5409;-743745.201000001281500;-1042902.750000000000000;0
1795;-742155.000000000000000;-1044231.000000000000000;0
6276;-742310.815999999642372;-1043016.000999998301268;0
4824;-742918.673000000417233;-1042871.875000000000000;0
6302;-741814.370000001043081;-1042743.910000000149012;0
4873;-742775.690000001341105;-1042931.829999998211861;0
5993;-743947.829999998211861;-1042646.350000001490116;0
1598;-742351.000000000000000;-1045090.000000000000000;0
4745;-742840.800000000745058;-1042742.120000001043081;0
5454;-742806.100999999791384;-1043305.197999998927116;0
392;-742418.000000000000000;-1043843.000000000000000;0
1729;-741449.000000000000000;-1045068.000000000000000;0
1412;-741635.760000001639128;-1044654.449999999254942;0
3800;-743098.550000000745058;-1042863.019999999552965;0
1815;-743083.000000000000000;-1044478.000000000000000;0
5065;-742796.800999999046326;-1043254.010000001639128;0
1934;-743294.000000000000000;-1044407.000000000000000;0
4738;-742733.910000000149012;-1042704.890000000596046;0
4253;-742109.368000000715256;-1043416.399999998509884;0
1764;-741163.000000000000000;-1044144.000000000000000;0
5170;-743246.743000000715256;-1043425.304000001400709;0
5324;-743025.329999998211861;-1043045.789999999105930;0
1676;-741033.000000000000000;-1044755.000000000000000;0
4838;-742981.304999999701977;-1042697.471000000834465;0
3558;-744735.368000000715256;-1042614.524000000208616;0
5241;-743365.063000001013279;-1043245.954999998211861;0
2454;-741003.000000000000000;-1044441.000000000000000;0
4136;-742726.225000001490116;-1044089.829999998211861;0
403;-742307.000000000000000;-1043931.000000000000000;0
1985;-743478.000000000000000;-1044769.000000000000000;0
6769;-741281.120000001043081;-1044417.780000001192093;0
1305;-741826.000000000000000;-1044678.000000000000000;0
3280;-743624.243999999016523;-1042811.839999999850988;0
2227;-743029.000000000000000;-1045506.000000000000000;0
7351;-742529.339999999850988;-1045181.269999999552965;0
1465;-741870.000000000000000;-1044016.000000000000000;0
1034;-741964.000000000000000;-1044876.000000000000000;0
4538;-742291.464000001549721;-1042734.344000000506639;0
7746;-742234.789999999105930;-1045549.890000000596046;0
5223;-743283.699999999254942;-1043535.940000001341105;0
6747;-742410.170000001788139;-1044287.228000000119209;0
2253;-743250.000000000000000;-1045314.000000000000000;0
343;-742575.000000000000000;-1043857.000000000000000;0
1114;-741151.059999998658895;-1044607.410000000149012;0
1449;-741533.000000000000000;-1044684.000000000000000;0
4925;-742455.502000000327826;-1042923.307000000029802;0
1457;-741510.000000000000000;-1044411.000000000000000;0
783;-741695.000000000000000;-1042663.000000000000000;0
570;-742098.000000000000000;-1043582.000000000000000;0
1820;-743006.000000000000000;-1044272.000000000000000;0
6499;-741707.811000000685453;-1044907.068999998271465;0
5238;-743360.410000000149012;-1043296.723999999463558;0
147;-744724.000000000000000;-1042391.000000000000000;0
6111;-742241.054000001400709;-1043365.475999999791384;0
1041;-741893.000000000000000;-1044653.000000000000000;0
2404;-742179.000000000000000;-1045467.000000000000000;0
7538;-742701.420000001788139;-1045364.109999999403954;0
6653;-741657.920000001788139;-1044136.789999999105930;0
5003;-742589.811999998986721;-1042974.888999998569489;0
3943;-743413.429000001400709;-1043376.822000000625849;0
4698;-742673.530000001192093;-1042715.780000001192093;0
5011;-742644.307999998331070;-1042994.813999999314547;0
4557;-742381.019999999552965;-1042528.550000000745058;0
5158;-743148.138999998569489;-1043320.254999998956919;0
7201;-742571.190000001341105;-1044939.320000000298023;0
676;-742442.000000000000000;-1043196.000000000000000;0
314;-742585.000000000000000;-1044184.000000000000000;0
3966;-743363.859999999403954;-1043530.829999998211861;0
952;-742274.000000000000000;-1043018.000000000000000;0
7175;-742651.780000001192093;-1044558.149999998509884;0
4238;-742440.263000000268221;-1043528.236000001430511;0
4752;-742774.460000000894070;-1042743.280000001192093;0
6231;-742316.769000001251698;-1043058.344000000506639;0
3238;-744159.147999998182058;-1042638.964000001549721;0
7259;-742935.280000001192093;-1044869.829999998211861;0
1533;-741832.000000000000000;-1043879.000000000000000;0
3954;-743409.050999999046326;-1043550.699999999254942;0
1383;-742077.000000000000000;-1045046.000000000000000;0
5647;-743429.070999998599291;-1043694.699000000953674;0
3832;-743029.390000000596046;-1042595.910000000149012;0
2042;-743505.000000000000000;-1044958.000000000000000;0
1865;-743458.000000000000000;-1044233.000000000000000;0
6823;-741313.910000000149012;-1044788.510000001639128;0
6232;-742316.034000001847744;-1043057.000000000000000;0
4518;-742623.960000000894070;-1042786.719999998807907;0
8069;-742226.440000001341105;-1045255.949999999254942;0
2356;-742409.000000000000000;-1045589.000000000000000;0
1026;-741986.000000000000000;-1044631.000000000000000;0
7049;-743420.177000001072884;-1044168.629999998956919;0
6829;-741498.170000001788139;-1044764.809999998658895;0
719;-741705.000000000000000;-1042828.000000000000000;0
2431;-742498.000000000000000;-1045094.000000000000000;0
5690;-743415.532999999821186;-1043635.447000000625849;0
4527;-742728.050000000745058;-1042838.719999998807907;0
6369;-741962.675000000745058;-1042665.013999998569489;0
2250;-743234.000000000000000;-1045435.000000000000000;0
4747;-742866.289999999105930;-1042753.390000000596046;0
208;-743146.000000000000000;-1043573.000000000000000;0
7958;-741664.710000000894070;-1044289.879999998956919;0
7005;-742998.190000001341105;-1043944.824999999254942;33
3811;-743244.620000001043081;-1042809.420000001788139;0
2084;-742447.000000000000000;-1044797.000000000000000;0
5171;-743266.124000001698732;-1043419.293999999761581;0
596;-741867.000000000000000;-1043259.000000000000000;0
8078;-742024.710000000894070;-1045262.460000000894070;0
341;-742592.000000000000000;-1043889.000000000000000;0
4741;-742787.859999999403954;-1042715.800000000745058;0
1554;-741348.000000000000000;-1044238.000000000000000;0
1756;-742165.000000000000000;-1045209.000000000000000;0
728;-741997.000000000000000;-1042918.000000000000000;0
1509;-741741.000000000000000;-1044196.000000000000000;0
3365;-743840.598999999463558;-1043023.565000001341105;0
4506;-742419.730000000447035;-1042717.019999999552965;0
1093;-741494.000000000000000;-1044548.000000000000000;0
1296;-742100.000000000000000;-1044473.000000000000000;0
4595;-742574.953000001609325;-1042659.344000000506639;0
5306;-743103.326999999582767;-1043193.129000000655651;0
5118;-742835.168000001460314;-1043315.074000000953674;0
4964;-742390.059999998658895;-1043044.839999999850988;0
984;-741917.000000000000000;-1044411.000000000000000;0
3063;-744133.098999999463558;-1042851.478999998420477;0
7276;-742801.670000001788139;-1044613.309999998658895;0
4860;-742964.800999999046326;-1043016.107999999076128;0
5956;-742960.690999999642372;-1043513.846999999135733;0
1620;-742439.000000000000000;-1044323.000000000000000;0
6510;-741721.960000000894070;-1044461.815000001341105;0
5135;-742979.611000001430511;-1043468.912999998778105;0
1413;-741631.000000000000000;-1044621.000000000000000;0
4891;-742595.048999998718500;-1042857.274999998509884;0
3960;-743418.563000001013279;-1043583.526000000536442;0
6389;-742141.199999999254942;-1042497.030000001192093;0
3353;-743954.399999998509884;-1043021.017999999225140;0
8271;-742030.649999998509884;-1042720.129999998956919;0
5062;-742798.513999998569489;-1043227.370999999344349;0
6279;-742306.210000000894070;-1043033.421999998390675;0
4025;-743202.881000000983477;-1043852.008000001311302;0
7035;-743299.831999998539686;-1044176.241999998688698;0
4637;-742572.578000001609325;-1042742.510999999940395;0
4701;-742687.780000001192093;-1042761.660000000149012;0
616;-742153.000000000000000;-1043272.000000000000000;0
4740;-742757.410000000149012;-1042715.589999999850988;0
541;-742258.000000000000000;-1043678.000000000000000;0
8281;-742164.160000000149012;-1042778.140000000596046;0
2512;-743070.000000000000000;-1044052.000000000000000;0
876;-741953.000000000000000;-1042636.000000000000000;0
1286;-742221.460000000894070;-1044465.969999998807907;0
1674;-741099.000000000000000;-1044736.000000000000000;0
4651;-742756.375000000000000;-1042524.938000001013279;0
1954;-743372.000000000000000;-1044497.000000000000000;0
917;-742121.000000000000000;-1043008.000000000000000;0
3808;-742987.050000000745058;-1042925.350000001490116;0
6244;-742368.587000001221895;-1043059.245999999344349;0
5235;-743350.096000000834465;-1043388.881000000983477;0
6827;-741437.300000000745058;-1044772.629999998956919;0
1726;-741516.000000000000000;-1045120.000000000000000;0
5243;-743357.622000001370907;-1043407.258999999612570;0
235;-743467.000000000000000;-1043745.000000000000000;0
3371;-743840.392999999225140;-1043010.835000000894070;0
1346;-741769.000000000000000;-1044817.000000000000000;0
6395;-742057.429999999701977;-1042500.809999998658895;0
6293;-742666.339999999850988;-1042695.188999999314547;0
4232;-742315.057999998331070;-1043428.918999999761581;0
5212;-743283.975000001490116;-1043373.589999999850988;0
610;-742011.000000000000000;-1043270.000000000000000;0
1570;-742291.000000000000000;-1044183.000000000000000;0
4159;-742455.734999999403954;-1043898.035000000149012;0
4762;-742854.192000001668930;-1042825.931000001728535;0
1500;-741441.000000000000000;-1044299.000000000000000;0
4633;-742625.931000001728535;-1042639.918999999761581;0
1495;-741215.000000000000000;-1044324.000000000000000;0
2755;-744003.879000000655651;-1043471.734000001102686;0
2186;-743184.000000000000000;-1045146.000000000000000;0
6786;-741269.960000000894070;-1044469.460000000894070;0
4893;-742637.320000000298023;-1042818.600999999791384;0
5589;-743423.785999998450279;-1043679.548000000417233;0
6857;-741503.982999999076128;-1044930.340999998152256;0
3844;-743184.170000001788139;-1042586.949999999254942;0
4322;-742266.414000000804663;-1043213.907999999821186;0
325;-742700.000000000000000;-1044114.000000000000000;0
1680;-741122.809999998658895;-1044628.710000000894070;0
4024;-743223.734999999403954;-1043859.954999998211861;0
8278;-742119.929999999701977;-1042758.710000000894070;0
4815;-742992.210000000894070;-1042788.359999999403954;0
6701;-742295.142000000923872;-1044533.372000001370907;0
4173;-742756.320000000298023;-1043749.629999998956919;0
908;-742211.000000000000000;-1042501.000000000000000;0
1591;-742378.000000000000000;-1044910.000000000000000;0
464;-741713.000000000000000;-1043286.000000000000000;0
1150;-741290.000000000000000;-1044485.000000000000000;0
4692;-742681.477000001817942;-1042600.622000001370907;0
545;-742337.000000000000000;-1043805.000000000000000;0
3357;-743953.732000000774860;-1043042.298999998718500;0
6696;-742332.717000000178814;-1044815.649999998509884;0
1614;-742388.000000000000000;-1044432.000000000000000;0
4221;-742209.576000001281500;-1043499.238000001758337;0
2417;-742421.000000000000000;-1045135.000000000000000;0
6104;-742208.646999999880791;-1043103.999000001698732;0
1442;-741753.000000000000000;-1044375.000000000000000;0
5236;-743352.302000001072884;-1043362.752000000327826;0
7261;-742970.839999999850988;-1044878.739999998360872;0
6142;-742310.477000001817942;-1043061.813000001013279;0
6121;-742069.784000001847744;-1043299.828000001609325;0
1136;-741520.000000000000000;-1044455.000000000000000;0
450;-741705.000000000000000;-1043312.000000000000000;0
4730;-742831.050000000745058;-1042696.600000001490116;0
5446;-743190.850000001490116;-1043337.008999999612570;0
4071;-742929.394999999552965;-1043807.585000000894070;0
4424;-742225.300000000745058;-1043033.250000000000000;0
1459;-741491.000000000000000;-1044340.000000000000000;0
4519;-742665.160000000149012;-1042790.820000000298023;0
4531;-742746.070000000298023;-1042885.980000000447035;0
7211;-742570.070000000298023;-1045065.679999999701977;0
7959;-741699.170000001788139;-1044292.620000001043081;0
729;-741986.000000000000000;-1042998.000000000000000;0
3761;-743202.559999998658895;-1042981.710000000894070;0
5653;-743429.589999999850988;-1043701.940999999642372;0
5648;-743429.164000000804663;-1043695.905999999493361;0
1163;-741072.820000000298023;-1044501.940000001341105;0
5696;-743417.096000000834465;-1043637.135999999940395;0
8265;-742197.820000000298023;-1042704.260000001639128;0
6486;-741772.072999998927116;-1044516.256000000983477;0
1424;-742134.000000000000000;-1044171.000000000000000;0
6166;-742314.649999998509884;-1043065.006999999284744;0
7681;-742501.629999998956919;-1045152.870000001043081;0
1101;-741339.000000000000000;-1044568.000000000000000;0
3262;-743572.423999998718500;-1042699.197000000625849;0
1722;-741672.000000000000000;-1045029.000000000000000;0
941;-742098.000000000000000;-1043132.000000000000000;0
4897;-742560.320000000298023;-1042829.359999999403954;0
3456;-745096.247000001370907;-1042705.502999998629093;0
669;-742510.000000000000000;-1043260.000000000000000;0
90;-744040.000000000000000;-1043095.000000000000000;0
4170;-742407.245000001043081;-1043945.519999999552965;0
568;-742116.000000000000000;-1043604.000000000000000;0
5112;-742942.920000001788139;-1043441.850000001490116;0
5456;-742761.041000001132488;-1043254.350999999791384;0
8044;-742176.640000000596046;-1044778.420000001788139;0
6771;-741345.015999998897314;-1044413.647999998182058;0
7647;-742319.918000001460314;-1045405.197999998927116;0
6663;-741457.949999999254942;-1044194.329999998211861;0
4167;-742438.315000001341105;-1044021.960000000894070;0
6263;-742365.719000000506639;-1043021.282999999821186;0
6751;-742426.350000001490116;-1044371.070000000298023;0
1387;-742155.000000000000000;-1044999.000000000000000;0
5284;-743041.022999998182058;-1043277.397999998182058;0
5172;-743274.383999999612570;-1043432.322999998927116;0
2317;-742792.000000000000000;-1045467.000000000000000;0
264;-743367.000000000000000;-1043732.000000000000000;0
4962;-742387.429999999701977;-1043028.129999998956919;0
3134;-743932.910999998450279;-1042615.767999999225140;0
5923;-742953.765000000596046;-1043015.067999999970198;0
5002;-742561.190000001341105;-1042977.401999998837709;0
4729;-742855.690000001341105;-1042695.640000000596046;0
7177;-742643.059999998658895;-1044579.679999999701977;0
1123;-741734.000000000000000;-1044442.000000000000000;0
1903;-743445.000000000000000;-1044281.000000000000000;0
1291;-742205.000000000000000;-1044568.000000000000000;0
8065;-742275.859999999403954;-1045204.550000000745058;0
1994;-743483.000000000000000;-1045010.000000000000000;0
5650;-743429.348999999463558;-1043698.318999998271465;0
2307;-742371.000000000000000;-1045477.000000000000000;0
6650;-741714.296999998390675;-1044110.177000001072884;0
4067;-742913.594999998807907;-1043714.640000000596046;0
1213;-742068.000000000000000;-1044387.000000000000000;0
283;-743026.000000000000000;-1043788.000000000000000;0
6961;-743023.579999998211861;-1044221.129999998956919;0
4526;-742696.690000001341105;-1042823.320000000298023;0
5163;-743163.861999999731779;-1043392.113000001758337;0
1606;-742437.000000000000000;-1044706.000000000000000;0
621;-742285.000000000000000;-1043282.000000000000000;0
6280;-742306.918999999761581;-1043038.083000000566244;0
276;-743382.000000000000000;-1043905.000000000000000;0
4584;-742417.721999999135733;-1042627.620999999344349;0
4331;-742391.967999998480082;-1043310.539000000804663;0
3292;-743576.905000001192093;-1042781.315000001341105;0
8261;-742108.039999999105930;-1042693.769999999552965;0
7356;-743331.410000000149012;-1045146.359999999403954;0
5307;-743082.182000000029802;-1043190.162000000476837;0
2511;-743050.000000000000000;-1044050.000000000000000;0
5957;-742962.627000000327826;-1043510.905000001192093;0
4247;-742154.829999998211861;-1043394.660000000149012;0
3233;-744152.962999999523163;-1042686.791999999433756;0
4754;-742745.359999999403954;-1042759.160000000149012;0
5214;-743307.671999998390675;-1043376.414000000804663;0
2547;-741724.000000000000000;-1044282.000000000000000;0
1129;-741672.000000000000000;-1044438.000000000000000;0
6712;-742273.328000001609325;-1044860.912000000476837;0
679;-742404.000000000000000;-1043185.000000000000000;0
1881;-743269.000000000000000;-1044266.000000000000000;0
6727;-742522.868000000715256;-1044395.879999998956919;0
2566;-741010.000000000000000;-1044427.000000000000000;0
690;-742306.000000000000000;-1043081.000000000000000;0
6314;-743939.670000001788139;-1042606.239999998360872;0
1588;-742390.000000000000000;-1044837.000000000000000;0
1662;-741451.000000000000000;-1044403.000000000000000;0
4339;-742459.269000001251698;-1043367.923000000417233;0
6209;-742319.320000000298023;-1043066.114999998360872;0
111;-745351.000000000000000;-1042795.000000000000000;0
516;-742160.000000000000000;-1043135.000000000000000;0
3418;-743758.105000000447035;-1043107.024999998509884;0
614;-742111.000000000000000;-1043271.000000000000000;0
4983;-742587.776000000536442;-1043013.068999998271465;0
6836;-741643.532000001519918;-1044947.486999999731779;0
7027;-743237.269999999552965;-1044095.524999998509884;0
708;-741854.000000000000000;-1042881.000000000000000;0
3793;-743101.820000000298023;-1042826.379999998956919;0
4910;-742367.789000000804663;-1042795.280999999493361;0
5165;-743191.168000001460314;-1043398.304000001400709;0
6557;-741291.730000000447035;-1044031.710000000894070;0
7295;-743165.010000001639128;-1044947.170000001788139;0
4634;-742635.980000000447035;-1042656.144999999552965;0
7950;-741950.460000000894070;-1044150.710000000894070;0
6504;-741755.193999998271465;-1044619.083000000566244;0
4749;-742884.420000001788139;-1042760.329999998211861;0
1651;-741374.000000000000000;-1044519.000000000000000;0
2447;-742772.000000000000000;-1044159.000000000000000;0
4621;-742536.945999998599291;-1042552.296000000089407;0
4249;-742151.910000000149012;-1043354.719999998807907;0
6224;-742315.320000000298023;-1043057.335000000894070;0
3915;-744021.765999998897314;-1043098.603999998420477;0
4675;-742805.809999998658895;-1042785.070000000298023;0
2137;-742971.000000000000000;-1045111.000000000000000;0
1297;-742120.000000000000000;-1044453.000000000000000;0
4161;-742506.254999998956919;-1044181.925000000745058;0
673;-742467.000000000000000;-1043230.000000000000000;0
1840;-742984.379999998956919;-1044155.149999998509884;0
6821;-741256.649999998509884;-1044796.100000001490116;0
4718;-742933.730000000447035;-1042628.039999999105930;0
4627;-742601.138999998569489;-1042606.791000001132488;0
3287;-743711.173999998718500;-1042886.515999998897314;0
6008;-743902.607000000774860;-1042749.771000001579523;0
4250;-742144.109999999403954;-1043367.519999999552965;0
2433;-742514.000000000000000;-1045081.000000000000000;0
4525;-742716.719999998807907;-1042823.219999998807907;0
4707;-742743.519999999552965;-1042600.359999999403954;0
