OID_;X;Y;TEMPERATURE
3752;-743213.949999999254942;-1042902.719999998807907;0
3614;-744984.548999998718500;-1042283.640999998897314;0
5790;-743521.019999999552965;-1042064.280000001192093;0
1486;-741150.000000000000000;-1044219.000000000000000;0
3233;-744152.962999999523163;-1042686.791999999433756;0
7410;-743525.730000000447035;-1045377.420000001788139;0
3923;-743845.660000000149012;-1043512.260000001639128;0
3917;-743967.182999998331070;-1043516.284000001847744;0
2059;-742625.000000000000000;-1044459.000000000000000;0
2194;-743448.000000000000000;-1045193.000000000000000;0
6870;-741708.260000001639128;-1045321.590999998152256;0
3310;-743829.561999998986721;-1042854.063000001013279;0
7018;-742577.747000001370907;-1044239.712999999523163;0
2072;-743043.000000000000000;-1044743.000000000000000;0
2049;-743499.000000000000000;-1045071.000000000000000;0
6699;-742301.118999999016523;-1044484.282999999821186;0
3018;-744443.368000000715256;-1042805.962000001221895;0
1628;-742449.000000000000000;-1044494.000000000000000;0
3033;-744483.675000000745058;-1042733.627000000327826;0
1524;-741710.000000000000000;-1043844.000000000000000;0
7216;-742500.129999998956919;-1044564.390000000596046;0
1622;-742495.000000000000000;-1044321.000000000000000;0
6568;-741292.100000001490116;-1044161.670000001788139;0
7260;-742953.010000001639128;-1044873.530000001192093;0
23;-743544.000000000000000;-1042505.000000000000000;0
2265;-742972.000000000000000;-1045774.000000000000000;0
4175;-742721.254999998956919;-1043775.890000000596046;0
7153;-742889.646999999880791;-1044547.438000001013279;0
2085;-742426.000000000000000;-1044797.000000000000000;0
3207;-743687.458999998867512;-1042502.859000001102686;0
502;-741901.000000000000000;-1043169.000000000000000;0
2007;-743231.000000000000000;-1044741.000000000000000;0
1518;-741994.000000000000000;-1044011.000000000000000;0
3537;-744632.945000000298023;-1042671.657000001519918;0
4238;-742440.263000000268221;-1043528.236000001430511;0
2149;-742819.000000000000000;-1045024.000000000000000;0
600;-741840.000000000000000;-1043212.000000000000000;0
2043;-743471.000000000000000;-1044959.000000000000000;0
4071;-742929.394999999552965;-1043807.585000000894070;0
6855;-741501.394999999552965;-1045027.784000001847744;0
731;-741925.000000000000000;-1042997.000000000000000;0
1404;-741692.000000000000000;-1044355.000000000000000;0
4085;-742812.431000001728535;-1043657.114000000059605;0
1229;-742244.000000000000000;-1044253.000000000000000;0
1532;-741805.000000000000000;-1043858.000000000000000;0
3746;-743261.420000001788139;-1042982.839999999850988;0
7146;-742819.425000000745058;-1044426.225000001490116;0
7159;-743013.767000000923872;-1044544.160999998450279;0
3326;-744036.002000000327826;-1042922.574999999254942;0
533;-742137.000000000000000;-1043750.000000000000000;0
4052;-743252.954999998211861;-1043843.585000000894070;0
351;-742509.000000000000000;-1043739.000000000000000;0
1062;-741560.000000000000000;-1045151.000000000000000;0
6001;-742006.079999998211861;-1043292.300000000745058;0
5292;-743055.866000000387430;-1043215.710999999195337;0
3598;-744894.750000000000000;-1042560.583999998867512;0
5274;-743012.366000000387430;-1043280.149000000208616;0
7012;-742805.839999999850988;-1044263.870000001043081;0
5455;-742823.936000000685453;-1043283.644999999552965;0
277;-743398.000000000000000;-1043928.000000000000000;0
1809;-743160.000000000000000;-1044541.000000000000000;0
1760;-741162.000000000000000;-1044101.000000000000000;0
6580;-741299.379000000655651;-1044005.879000000655651;0
280;-743053.000000000000000;-1043875.000000000000000;0
2371;-742463.000000000000000;-1045461.000000000000000;0
1517;-741964.000000000000000;-1044034.000000000000000;0
1240;-742145.000000000000000;-1044418.000000000000000;0
5063;-742783.370000001043081;-1043241.048999998718500;0
4560;-742427.079999998211861;-1042500.829999998211861;0
339;-742606.000000000000000;-1043916.000000000000000;0
1469;-741752.000000000000000;-1044100.000000000000000;0
4163;-742487.695000000298023;-1044138.535000000149012;0
5109;-742850.925999999046326;-1043483.024999998509884;0
2342;-742726.000000000000000;-1045537.000000000000000;0
6720;-742286.954999998211861;-1044705.997999999672174;0
1003;-741913.000000000000000;-1044580.000000000000000;0
5081;-742917.046000000089407;-1043356.515999998897314;0
4064;-742879.655000001192093;-1043647.420000001788139;0
1181;-741920.000000000000000;-1044230.000000000000000;0
6693;-742248.197000000625849;-1044816.127000000327826;0
1619;-742426.000000000000000;-1044401.000000000000000;0
512;-742063.000000000000000;-1043136.000000000000000;0
3273;-743642.442999999970198;-1042796.677999999374151;0
3782;-743285.429999999701977;-1042842.460000000894070;0
1914;-743464.000000000000000;-1044458.000000000000000;0
1429;-741982.000000000000000;-1044280.000000000000000;0
2016;-743230.000000000000000;-1044873.000000000000000;0
2140;-742924.000000000000000;-1045088.000000000000000;0
7171;-742671.969999998807907;-1044508.219999998807907;0
401;-742324.000000000000000;-1043907.000000000000000;0
1171;-741882.000000000000000;-1044375.000000000000000;0
884;-741771.000000000000000;-1042776.000000000000000;0
307;-742781.000000000000000;-1044143.000000000000000;0
5110;-742876.271999999880791;-1043449.013000000268221;0
7026;-743217.644999999552965;-1044082.329999998211861;0
1822;-742986.199999999254942;-1044211.969999998807907;0
707;-741897.000000000000000;-1042863.000000000000000;0
5326;-742969.850000001490116;-1043038.800000000745058;0
736;-741880.000000000000000;-1043017.000000000000000;0
8080;-741989.600000001490116;-1045310.420000001788139;0
1795;-742155.000000000000000;-1044231.000000000000000;0
4213;-742218.094999998807907;-1043529.954999998211861;238
7138;-742917.554999999701977;-1044421.774999998509884;0
1982;-743408.000000000000000;-1044646.000000000000000;0
480;-741764.000000000000000;-1043342.000000000000000;0
1514;-741882.000000000000000;-1044096.000000000000000;0
4099;-742773.870000001043081;-1043846.135999999940395;0
1293;-742037.000000000000000;-1044462.000000000000000;0
1732;-741840.000000000000000;-1045226.000000000000000;0
5147;-743077.127000000327826;-1043433.221999999135733;0
1291;-742205.000000000000000;-1044568.000000000000000;0
4237;-742425.385000001639128;-1043517.421000000089407;0
1196;-741677.000000000000000;-1043894.000000000000000;0
3438;-743746.833000000566244;-1043057.962000001221895;0
6432;-742029.997999999672174;-1043511.272999998182058;0
2221;-743076.000000000000000;-1045412.000000000000000;0
272;-743396.000000000000000;-1043809.000000000000000;0
4093;-742889.967999998480082;-1043954.530000001192093;0
1602;-742507.000000000000000;-1044924.000000000000000;0
793;-741697.000000000000000;-1042588.000000000000000;0
2809;-744090.649999998509884;-1043371.184000000357628;0
513;-742083.000000000000000;-1043145.000000000000000;0
7657;-742317.228999998420477;-1045306.000999998301268;0
302;-742925.000000000000000;-1044109.000000000000000;0
1584;-742368.000000000000000;-1044717.000000000000000;0
1125;-741728.000000000000000;-1044435.000000000000000;0
6823;-741313.910000000149012;-1044788.510000001639128;0
5408;-743696.881000000983477;-1042878.024999998509884;0
4951;-742335.579999998211861;-1042934.429999999701977;0
6830;-741526.739999998360872;-1044761.309000000357628;0
7541;-742644.280000001192093;-1045370.789999999105930;0
3173;-743915.519000001251698;-1042609.598999999463558;0
2889;-744074.103999998420477;-1043194.559999998658895;0
4649;-742732.228999998420477;-1042525.100000001490116;0
4205;-742325.267999999225140;-1043571.951000001281500;0
4068;-742917.125000000000000;-1043734.535000000149012;0
5444;-743183.024000000208616;-1043210.600000001490116;0
7276;-742801.670000001788139;-1044613.309999998658895;0
7083;-743309.980000000447035;-1044509.500000000000000;0
7516;-742248.390000000596046;-1044368.907999999821186;0
6995;-743129.710000000894070;-1044496.579999998211861;0
705;-741929.000000000000000;-1042865.000000000000000;0
1923;-743395.000000000000000;-1044274.000000000000000;0
4590;-742387.043000001460314;-1042535.971000000834465;0
1300;-741917.410000000149012;-1044719.769999999552965;0
524;-742255.000000000000000;-1043913.000000000000000;0
1508;-741705.000000000000000;-1044210.000000000000000;0
1791;-742157.000000000000000;-1044163.000000000000000;0
4786;-742953.361000001430511;-1042655.886999998241663;0
6827;-741437.300000000745058;-1044772.629999998956919;0
407;-742340.000000000000000;-1044177.000000000000000;0
4463;-742198.989999998360872;-1042569.030000001192093;0
7965;-741515.510000001639128;-1044348.350000001490116;0
1253;-742084.000000000000000;-1044730.000000000000000;0
4003;-743371.839999999850988;-1044053.258999999612570;0
1364;-742077.000000000000000;-1044936.000000000000000;0
1038;-741956.000000000000000;-1044977.000000000000000;0
1479;-741407.000000000000000;-1044225.000000000000000;0
8282;-742183.519999999552965;-1042790.890000000596046;0
4246;-742193.159000001847744;-1043412.537000000476837;0
5035;-742658.587999999523163;-1043006.899000000208616;0
5024;-742588.655000001192093;-1042886.519000001251698;0
6980;-743071.769999999552965;-1044387.548999998718500;0
788;-741637.000000000000000;-1042607.000000000000000;0
7291;-742809.960000000894070;-1044827.300000000745058;0
6714;-742287.171000000089407;-1044923.995999999344349;0
2347;-742597.000000000000000;-1045567.000000000000000;0
5372;-742084.010000001639128;-1043008.550000000745058;0
7234;-742594.870000001043081;-1044815.140000000596046;0
3837;-743093.699999999254942;-1042577.890000000596046;0
4039;-743159.070000000298023;-1043772.795000001788139;0
519;-742239.000000000000000;-1043113.000000000000000;0
1312;-741659.000000000000000;-1044848.000000000000000;0
879;-741947.000000000000000;-1042541.000000000000000;0
1047;-741816.000000000000000;-1044867.000000000000000;0
5205;-743251.475000001490116;-1043328.679000001400709;0
6821;-741256.649999998509884;-1044796.100000001490116;0
3674;-744609.826999999582767;-1042523.997999999672174;0
2277;-742826.000000000000000;-1045653.000000000000000;0
5957;-742962.627000000327826;-1043510.905000001192093;0
4136;-742726.225000001490116;-1044089.829999998211861;0
4491;-741872.890000000596046;-1042643.989999998360872;0
3569;-744704.920000001788139;-1042585.679999999701977;0
5;-743466.000000000000000;-1042616.000000000000000;27
1942;-743283.000000000000000;-1044370.000000000000000;0
3109;-743754.403999999165535;-1042652.872000001370907;0
1305;-741826.000000000000000;-1044678.000000000000000;0
7037;-743316.085000000894070;-1044222.170000001788139;0
8272;-742042.399999998509884;-1042732.559999998658895;0
1693;-741613.000000000000000;-1044649.000000000000000;0
2466;-743460.000000000000000;-1044740.000000000000000;0
1843;-743041.600000001490116;-1044324.489999998360872;0
1004;-741898.000000000000000;-1044565.000000000000000;0
3521;-744869.699000000953674;-1042677.925999999046326;0
6150;-742311.879999998956919;-1043062.857000000774860;0
6687;-742383.274000000208616;-1044983.381999999284744;0
3846;-743149.390000000596046;-1042549.600000001490116;0
2334;-742872.000000000000000;-1045519.000000000000000;0
627;-742223.000000000000000;-1043335.000000000000000;0
1968;-743397.000000000000000;-1044793.000000000000000;0
383;-742450.000000000000000;-1043722.000000000000000;0
4047;-743210.230000000447035;-1043992.289999999105930;0
6321;-745084.927999999374151;-1042675.171000000089407;0
4708;-742755.420000001788139;-1042611.309999998658895;0
4119;-742717.223999999463558;-1043999.837999999523163;0
1910;-743460.000000000000000;-1044391.000000000000000;0
3819;-743120.250000000000000;-1042679.620000001043081;0
4669;-742823.199999999254942;-1042658.309999998658895;0
2028;-743371.000000000000000;-1045054.000000000000000;0
3393;-743910.969999998807907;-1043143.960000000894070;0
6307;-741835.620000001043081;-1042765.149999998509884;0
4625;-742594.258000001311302;-1042576.114000000059605;0
1028;-741981.000000000000000;-1044692.000000000000000;0
4807;-743122.570000000298023;-1042767.850000001490116;0
7355;-743348.309999998658895;-1045148.329999998211861;0
1388;-742152.000000000000000;-1045026.000000000000000;0
1728;-741473.000000000000000;-1045087.000000000000000;0
1218;-742120.000000000000000;-1044309.000000000000000;0
6952;-743044.730999998748302;-1044106.129999998956919;0
7050;-743438.070999998599291;-1044185.932000000029802;0
4877;-742845.760000001639128;-1042956.589999999850988;0
6806;-741090.381000000983477;-1044706.675999999046326;0
4780;-742928.596000000834465;-1042747.480000000447035;0
5258;-743356.739999998360872;-1043230.039999999105930;0
4501;-742368.980000000447035;-1042705.100000001490116;0
5250;-743328.995000001043081;-1043178.495000001043081;0
2155;-742797.000000000000000;-1045124.000000000000000;0
3762;-743173.489999998360872;-1042984.559999998658895;0
6389;-742141.199999999254942;-1042497.030000001192093;0
1373;-742143.000000000000000;-1044822.000000000000000;0
888;-741994.000000000000000;-1042797.000000000000000;0
1163;-741072.820000000298023;-1044501.940000001341105;0
4630;-742646.271999999880791;-1042652.089999999850988;0
1247;-742104.000000000000000;-1044609.000000000000000;0
261;-743429.000000000000000;-1043723.000000000000000;0
5695;-743417.217999998480082;-1043638.749000001698732;0
1933;-743329.000000000000000;-1044407.000000000000000;0
7979;-741161.500000000000000;-1044398.210000000894070;0
6215;-742314.692000001668930;-1043057.682000000029802;0
5707;-743417.815000001341105;-1043640.510999999940395;0
1110;-741220.730000000447035;-1044598.480000000447035;0
8073;-742120.640000000596046;-1045259.500000000000000;0
3803;-743066.289999999105930;-1042896.320000000298023;0
6008;-743902.607000000774860;-1042749.771000001579523;0
8278;-742119.929999999701977;-1042758.710000000894070;0
5662;-743423.271000001579523;-1043710.372000001370907;0
3141;-744035.420000001788139;-1042680.460000000894070;0
7350;-742556.390000000596046;-1045185.980000000447035;0
6134;-742309.011999998241663;-1043060.703000001609325;0
3370;-743858.489999998360872;-1043011.370999999344349;0
5140;-743035.789999999105930;-1043514.489999998360872;0
6161;-742310.964999999850988;-1043059.710999999195337;0
3958;-743416.328000001609325;-1043572.265999998897314;0
3463;-745044.640999998897314;-1042675.910999998450279;0
699;-742067.000000000000000;-1042896.000000000000000;0
3360;-743950.688000001013279;-1042982.188000001013279;0
6143;-742309.690999999642372;-1043060.385000001639128;0
5729;-743420.103000000119209;-1043638.901000000536442;0
7741;-742302.225999999791384;-1045079.842999998480082;0
4824;-742918.673000000417233;-1042871.875000000000000;0
8280;-742150.949999999254942;-1042770.420000001788139;0
5411;-742776.079999998211861;-1042905.300000000745058;0
1335;-741752.000000000000000;-1044833.000000000000000;0
7209;-742570.339999999850988;-1045040.429999999701977;0
2533;-743542.000000000000000;-1044816.000000000000000;0
2353;-742484.000000000000000;-1045580.000000000000000;0
3957;-743415.125000000000000;-1043567.214999999850988;0
3361;-743933.616000000387430;-1042980.793000001460314;0
4782;-742938.315999999642372;-1042714.212000001221895;0
6486;-741772.072999998927116;-1044516.256000000983477;0
6206;-742314.043000001460314;-1043058.028999999165535;0
2511;-743050.000000000000000;-1044050.000000000000000;0
7956;-741777.379999998956919;-1044260.170000001788139;0
4995;-742476.986000001430511;-1042961.239000000059605;0
1676;-741033.000000000000000;-1044755.000000000000000;0
7706;-742313.239999998360872;-1044319.611999999731779;0
8067;-742257.760000001639128;-1045240.980000000447035;0
608;-741955.000000000000000;-1043274.000000000000000;0
4619;-742460.010000001639128;-1042480.890000000596046;0
6189;-742312.041999999433756;-1043057.302000001072884;0
5157;-743178.671999998390675;-1043354.681000001728535;0
1249;-742097.000000000000000;-1044649.000000000000000;0
676;-742442.000000000000000;-1043196.000000000000000;0
5704;-743417.484999999403954;-1043635.530999999493361;0
4977;-742489.451000001281500;-1042992.394000001251698;0
4796;-743054.247999999672174;-1042682.918000001460314;0
4947;-742399.918000001460314;-1042993.458000000566244;0
6908;-741713.539999999105930;-1045085.160000000149012;0
5961;-742431.225000001490116;-1044003.574999999254942;0
3830;-743013.879999998956919;-1042612.359999999403954;0
6242;-742366.677999999374151;-1043062.949000000953674;0
2039;-743308.000000000000000;-1044808.000000000000000;0
7746;-742234.789999999105930;-1045549.890000000596046;0
629;-742200.000000000000000;-1043289.000000000000000;0
5669;-743414.997999999672174;-1043713.431000001728535;0
4830;-743043.449999999254942;-1042882.359999999403954;0
4001;-743418.500000000000000;-1044051.739000000059605;0
7736;-742342.260000001639128;-1045113.918000001460314;0
542;-742367.629999998956919;-1043814.379999998956919;0
6767;-741223.949999999254942;-1044422.059999998658895;0
1963;-743410.000000000000000;-1044689.000000000000000;0
6190;-742318.782999999821186;-1043068.206000000238419;0
2262;-742999.000000000000000;-1045686.000000000000000;0
1470;-741728.000000000000000;-1044116.000000000000000;0
7641;-742335.304000001400709;-1045451.613000001758337;0
4228;-742132.969999998807907;-1043331.449999999254942;0
3303;-743810.967999998480082;-1042865.596000000834465;0
3976;-743088.861000001430511;-1043707.728000000119209;0
4074;-742943.350000001490116;-1043880.304999999701977;0
1416;-741628.000000000000000;-1044523.000000000000000;0
2128;-743170.000000000000000;-1045080.000000000000000;0
1270;-742242.000000000000000;-1044491.000000000000000;0
6096;-742098.760000001639128;-1043615.589999999850988;0
2254;-743235.000000000000000;-1045290.000000000000000;0
555;-742230.000000000000000;-1043726.000000000000000;0
4341;-742488.855000000447035;-1043325.412999998778105;0
284;-743022.000000000000000;-1043758.000000000000000;0
838;-742043.000000000000000;-1042524.000000000000000;0
678;-742421.000000000000000;-1043181.000000000000000;0
386;-742457.000000000000000;-1043786.000000000000000;0
6230;-742317.590999998152256;-1043059.730999998748302;0
4910;-742367.789000000804663;-1042795.280999999493361;0
690;-742306.000000000000000;-1043081.000000000000000;0
4900;-742508.089999999850988;-1042815.289999999105930;0
6128;-742313.668999999761581;-1043069.186000000685453;0
2088;-742428.000000000000000;-1044838.000000000000000;0
4511;-742539.859999999403954;-1042744.070000000298023;0
7678;-742388.550999999046326;-1045109.184000000357628;0
5322;-743060.379999998956919;-1043029.589999999850988;0
917;-742121.000000000000000;-1043008.000000000000000;0
1426;-742056.000000000000000;-1044228.000000000000000;0
4525;-742716.719999998807907;-1042823.219999998807907;0
1091;-741531.480000000447035;-1044543.440000001341105;0
518;-742194.000000000000000;-1043131.000000000000000;0
4333;-742428.420000001788139;-1043255.609999999403954;0
7977;-741271.370000001043081;-1044404.390000000596046;0
4820;-742927.769999999552965;-1042786.710000000894070;0
4896;-742589.649999998509884;-1042838.989999998360872;0
1662;-741451.000000000000000;-1044403.000000000000000;0
4201;-742269.000000000000000;-1043651.563000001013279;0
6356;-741962.699999999254942;-1042712.320000000298023;0
5187;-743086.927000001072884;-1043435.230999998748302;0
6192;-742317.252000000327826;-1043065.394999999552965;0
5681;-743400.820000000298023;-1043718.682000000029802;0
1650;-741371.000000000000000;-1044490.000000000000000;0
6142;-742310.477000001817942;-1043061.813000001013279;0
910;-742219.000000000000000;-1042529.000000000000000;0
2377;-742390.000000000000000;-1045527.000000000000000;0
4747;-742866.289999999105930;-1042753.390000000596046;0
1353;-741862.000000000000000;-1044843.000000000000000;0
6139;-742312.807000000029802;-1043066.006000000983477;0
1358;-741950.000000000000000;-1044887.000000000000000;0
2516;-742500.000000000000000;-1044414.000000000000000;0
5170;-743246.743000000715256;-1043425.304000001400709;0
4620;-742539.574000000953674;-1042537.307999998331070;0
2227;-743029.000000000000000;-1045506.000000000000000;0
1108;-741261.000000000000000;-1044593.000000000000000;0
2238;-743372.000000000000000;-1045261.000000000000000;0
5589;-743423.785999998450279;-1043679.548000000417233;0
2310;-742301.000000000000000;-1045537.000000000000000;0
1413;-741631.000000000000000;-1044621.000000000000000;0
4573;-742341.550000000745058;-1042629.699999999254942;0
4129;-742890.405000001192093;-1044048.370000001043081;0
2133;-743040.000000000000000;-1045127.000000000000000;0
6723;-742592.894999999552965;-1044408.905000001192093;0
2138;-742958.000000000000000;-1045095.000000000000000;0
5186;-743270.949999999254942;-1043526.039999999105930;0
1700;-741406.000000000000000;-1044677.000000000000000;0
4733;-742767.890000000596046;-1042671.010000001639128;0
5598;-743412.839999999850988;-1043680.403000000864267;0
8078;-742024.710000000894070;-1045262.460000000894070;0
4524;-742683.789999999105930;-1042823.579999998211861;0
7385;-743182.811000000685453;-1045457.984000001102686;0
1750;-742045.000000000000000;-1045215.000000000000000;0
5294;-743056.328999999910593;-1043196.096999999135733;0
2179;-742953.000000000000000;-1045258.000000000000000;0
4694;-742689.272999998182058;-1042626.495999999344349;0
6665;-741433.260000001639128;-1044189.760000001639128;0
1599;-742237.000000000000000;-1044977.000000000000000;0
182;-743429.000000000000000;-1043385.000000000000000;0
184;-743445.000000000000000;-1043450.000000000000000;0
4604;-742463.967999998480082;-1042613.381999999284744;0
4716;-742893.160000000149012;-1042622.780000001192093;0
785;-741702.000000000000000;-1042622.000000000000000;0
6841;-741583.443999998271465;-1044946.208000000566244;0
4033;-743319.719999998807907;-1043793.300000000745058;0
4701;-742687.780000001192093;-1042761.660000000149012;0
2398;-742150.000000000000000;-1045370.000000000000000;0
6360;-742004.925000000745058;-1042692.804000001400709;0
3261;-743581.445999998599291;-1042690.379999998956919;0
6267;-742344.767999999225140;-1043019.272999998182058;0
748;-741671.000000000000000;-1042971.000000000000000;0
5215;-743342.890000000596046;-1043380.368000000715256;0
1087;-741605.000000000000000;-1044533.000000000000000;0
6479;-741969.831000000238419;-1044454.850000001490116;0
1156;-741191.980000000447035;-1044497.850000001490116;0
6140;-742311.999000001698732;-1043064.638999998569489;0
7187;-742595.019999999552965;-1044739.962000001221895;0
6266;-742349.021000001579523;-1043019.662999998778105;0
8259;-742072.089999999850988;-1042687.219999998807907;0
6658;-741538.879999998956919;-1044165.440000001341105;0
6228;-742319.103999998420477;-1043062.592000000178814;0
4309;-742042.329999998211861;-1043492.329999998211861;0
5168;-743228.796000000089407;-1043420.092000000178814;0
4326;-742319.855000000447035;-1043419.918999999761581;0
4987;-742641.745000001043081;-1043011.309999998658895;0
3985;-743312.765000000596046;-1043928.164999999105930;0
6186;-742314.337999999523163;-1043061.517000000923872;0
633;-742100.000000000000000;-1043296.000000000000000;0
837;-741990.000000000000000;-1042511.000000000000000;0
6260;-742377.692999999970198;-1043022.434000000357628;0
1328;-742037.000000000000000;-1045043.000000000000000;0
759;-741659.000000000000000;-1042650.000000000000000;0
4973;-742480.098000001162291;-1043031.443999998271465;0
7015;-742554.570000000298023;-1044360.725000001490116;0
6121;-742069.784000001847744;-1043299.828000001609325;0
1559;-741190.000000000000000;-1044242.000000000000000;0
3783;-743211.559999998658895;-1042920.120000001043081;0
7218;-742534.100000001490116;-1044603.559999998658895;0
679;-742404.000000000000000;-1043185.000000000000000;0
5227;-743318.199999999254942;-1043537.510000001639128;0
6717;-742311.105999998748302;-1044960.396999999880791;0
820;-742019.000000000000000;-1042600.000000000000000;0
5221;-743263.820000000298023;-1043556.920000001788139;0
7223;-742409.149999998509884;-1044822.649999998509884;0
6794;-741124.372999999672174;-1044792.221000000834465;0
4920;-742444.449999999254942;-1042928.980000000447035;0
2249;-743211.000000000000000;-1045443.000000000000000;0
578;-742023.000000000000000;-1043464.000000000000000;0
6157;-742314.026999998837709;-1043065.331000000238419;0
348;-742525.000000000000000;-1043787.000000000000000;0
3283;-743632.767000000923872;-1042846.004000000655651;0
6239;-742363.504999998956919;-1043069.298000000417233;0
282;-743034.000000000000000;-1043819.000000000000000;0
2368;-742507.000000000000000;-1045456.000000000000000;0
4838;-742981.304999999701977;-1042697.471000000834465;0
3342;-743922.624000001698732;-1043077.261999998241663;0
4582;-742390.164999999105930;-1042606.546000000089407;0
5758;-743420.897999998182058;-1043635.921999998390675;0
6716;-742256.467000000178814;-1044966.368000000715256;0
1160;-741114.859999999403954;-1044508.120000001043081;0
1376;-742165.000000000000000;-1044873.000000000000000;0
1490;-741023.000000000000000;-1044335.000000000000000;0
6227;-742319.839999999850988;-1043063.936000000685453;0
848;-741973.000000000000000;-1042526.000000000000000;0
5597;-743414.056000001728535;-1043680.309000000357628;0
501;-741836.000000000000000;-1043163.000000000000000;0
6207;-742313.287000000476837;-1043056.642000000923872;0
6763;-741117.219999998807907;-1044428.989999998360872;0
5680;-743402.000000000000000;-1043718.245000001043081;0
4703;-742697.859000001102686;-1042783.011999998241663;0
6270;-742333.412999998778105;-1043018.204999998211861;0
6401;-741992.449999999254942;-1042503.609999999403954;0
2395;-742244.000000000000000;-1045363.000000000000000;0
6829;-741498.170000001788139;-1044764.809999998658895;0
1509;-741741.000000000000000;-1044196.000000000000000;0
4058;-743138.765000000596046;-1043625.405000001192093;0
5595;-743416.488000001758337;-1043680.118999999016523;0
2501;-742746.000000000000000;-1045430.000000000000000;0
621;-742285.000000000000000;-1043282.000000000000000;0
3833;-743029.679999999701977;-1042612.300000000745058;0
2379;-742291.000000000000000;-1045388.000000000000000;0
7242;-742691.750000000000000;-1044821.769999999552965;0
943;-742292.000000000000000;-1043017.000000000000000;0
1051;-741775.000000000000000;-1044980.000000000000000;0
4197;-742179.633999999612570;-1043776.899000000208616;0
3176;-743891.085999999195337;-1042631.991999998688698;0
4079;-742836.170000001788139;-1043800.960000000894070;0
4858;-742955.339999999850988;-1042963.960000000894070;0
3309;-743830.328000001609325;-1042834.535000000149012;0
449;-741726.000000000000000;-1043342.000000000000000;0
2344;-742691.000000000000000;-1045541.000000000000000;0
6848;-741619.096999999135733;-1045007.451999999582767;0
6981;-743063.800000000745058;-1044366.239999998360872;0
1461;-741473.000000000000000;-1044266.000000000000000;0
1097;-741414.000000000000000;-1044558.000000000000000;0
5232;-743347.087000001221895;-1043476.425000000745058;0
3889;-742335.008999999612570;-1042489.949000000953674;0
5162;-743180.460999999195337;-1043323.660000000149012;0
8263;-742151.089999999850988;-1042702.239999998360872;0
3983;-743317.089999999850988;-1043883.160000000149012;0
672;-742484.000000000000000;-1043226.000000000000000;0
7677;-742383.142000000923872;-1045124.221000000834465;0
2157;-742789.000000000000000;-1045161.000000000000000;0
376;-742530.000000000000000;-1043680.000000000000000;0
6439;-741765.070999998599291;-1042636.877999998629093;0
4505;-742434.910000000149012;-1042706.170000001788139;0
2563;-741065.000000000000000;-1044421.000000000000000;0
1317;-741748.000000000000000;-1044884.000000000000000;0
8245;-742642.489999998360872;-1045210.670000001788139;0
516;-742160.000000000000000;-1043135.000000000000000;0
4765;-742822.897999998182058;-1042850.499000001698732;0
4320;-742264.149000000208616;-1043259.541999999433756;0
5583;-743410.274999998509884;-1043642.072000000625849;0
1334;-741769.000000000000000;-1044799.000000000000000;0
7982;-741163.039999999105930;-1044413.210000000894070;0
4841;-742989.993999999016523;-1042765.850999999791384;0
4845;-742978.655999999493361;-1042776.048000000417233;0
6276;-742310.815999999642372;-1043016.000999998301268;0
1126;-741684.000000000000000;-1044450.000000000000000;0
