OID_;X;Y;TEMPERATURE
2261;-743009.000000000000000;-1045657.000000000000000;0
5382;-744377.920000001788139;-1042814.201000001281500;0
7782;-743012.350000001490116;-1045871.938999999314547;0
510;-742048.000000000000000;-1043150.000000000000000;0
1524;-741710.000000000000000;-1043844.000000000000000;0
3919;-743904.947000000625849;-1043493.929999999701977;0
2277;-742826.000000000000000;-1045653.000000000000000;0
3387;-743960.368000000715256;-1043194.717000000178814;0
3752;-743213.949999999254942;-1042902.719999998807907;0
6820;-741224.105999998748302;-1044799.311999998986721;0
1486;-741150.000000000000000;-1044219.000000000000000;0
1759;-741128.000000000000000;-1044097.000000000000000;0
7147;-742827.925000000745058;-1044451.385000001639128;0
4079;-742836.170000001788139;-1043800.960000000894070;0
7732;-742611.719000000506639;-1044632.203999999910593;0
7259;-742935.280000001192093;-1044869.829999998211861;0
525;-742233.000000000000000;-1043884.000000000000000;247
4122;-742732.074999999254942;-1043923.995000001043081;0
5240;-743364.164000000804663;-1043254.934000000357628;0
7829;-743509.649999998509884;-1045166.399999998509884;0
1154;-741228.719999998807907;-1044493.440000001341105;0
6993;-743172.409000001847744;-1044501.339000001549721;0
2222;-743058.000000000000000;-1045420.000000000000000;0
4074;-742943.350000001490116;-1043880.304999999701977;5
281;-743045.000000000000000;-1043848.000000000000000;0
1187;-741805.000000000000000;-1044071.000000000000000;0
2150;-742812.000000000000000;-1045054.000000000000000;0
7911;-743564.839999999850988;-1045408.649999998509884;0
882;-741825.000000000000000;-1042788.000000000000000;0
2237;-743368.000000000000000;-1045238.000000000000000;0
548;-742297.000000000000000;-1043762.000000000000000;0
6746;-742405.083999998867512;-1044259.199999999254942;0
6503;-741647.706000000238419;-1044996.008999999612570;0
3522;-744830.425000000745058;-1042686.690000001341105;0
5792;-743363.984999999403954;-1043442.513999998569489;0
3585;-744920.065000001341105;-1042522.129999998956919;0
7939;-741306.171999998390675;-1043955.960000000894070;0
2154;-742805.000000000000000;-1045147.000000000000000;0
7025;-743199.914999999105930;-1044070.515000000596046;0
6574;-741292.359999999403954;-1044067.620000001043081;0
3109;-743754.403999999165535;-1042652.872000001370907;0
1659;-741420.000000000000000;-1044790.000000000000000;0
1994;-743483.000000000000000;-1045010.000000000000000;0
2343;-742674.000000000000000;-1045557.000000000000000;0
1450;-741527.000000000000000;-1044632.000000000000000;0
873;-741728.000000000000000;-1042672.000000000000000;0
2083;-742588.000000000000000;-1044663.000000000000000;0
4809;-743081.589999999850988;-1042799.800000000745058;0
1924;-743359.000000000000000;-1044320.000000000000000;0
7233;-742606.750000000000000;-1044827.379999998956919;0
1369;-742029.000000000000000;-1044788.000000000000000;0
2357;-742388.000000000000000;-1045577.000000000000000;0
4025;-743202.881000000983477;-1043852.008000001311302;0
6875;-741808.350000001490116;-1045257.269999999552965;0
4086;-742813.079999998211861;-1043631.730000000447035;0
1463;-741933.000000000000000;-1043968.000000000000000;0
7655;-742266.583000000566244;-1045284.133999999612570;0
4148;-742631.269999999552965;-1043885.870000001043081;0
1004;-741898.000000000000000;-1044565.000000000000000;0
6119;-743582.679999999701977;-1042696.969999998807907;0
1519;-741754.000000000000000;-1043956.000000000000000;0
1495;-741215.000000000000000;-1044324.000000000000000;0
1344;-741750.000000000000000;-1044808.000000000000000;0
382;-742481.000000000000000;-1043751.000000000000000;0
4064;-742879.655000001192093;-1043647.420000001788139;0
6721;-742321.052999999374151;-1044705.548000000417233;0
2886;-744104.953999999910593;-1043172.171999998390675;0
1693;-741613.000000000000000;-1044649.000000000000000;0
5785;-743436.010000001639128;-1042105.550000000745058;0
31;-743485.000000000000000;-1042645.000000000000000;0
9;-743512.000000000000000;-1042512.000000000000000;133
1394;-741822.000000000000000;-1044310.000000000000000;0
7139;-742919.179999999701977;-1044444.434999998658895;0
1131;-741643.000000000000000;-1044433.000000000000000;0
1135;-741572.000000000000000;-1044437.000000000000000;0
5067;-742813.465999998152256;-1043267.335999999195337;0
982;-741992.000000000000000;-1044416.000000000000000;0
1407;-741650.000000000000000;-1044242.000000000000000;0
5129;-743046.677000001072884;-1043376.409000001847744;0
628;-742217.370000001043081;-1043308.559999998658895;0
2028;-743371.000000000000000;-1045054.000000000000000;0
4461;-742218.370000001043081;-1042583.800000000745058;0
4168;-742423.695000000298023;-1043984.135000001639128;0
4582;-742390.164999999105930;-1042606.546000000089407;0
2079;-742688.000000000000000;-1044428.000000000000000;0
7291;-742809.960000000894070;-1044827.300000000745058;0
5316;-743075.980000000447035;-1043041.059999998658895;0
3209;-743668.293999999761581;-1042492.478999998420477;0
4240;-742471.613000001758337;-1043552.366000000387430;0
2424;-742476.000000000000000;-1045132.000000000000000;0
1272;-742237.000000000000000;-1044545.000000000000000;0
2400;-742087.000000000000000;-1045374.000000000000000;0
1337;-741723.000000000000000;-1044886.000000000000000;0
3769;-742978.969999998807907;-1042975.300000000745058;0
1795;-742155.000000000000000;-1044231.000000000000000;0
6726;-742476.517999999225140;-1044410.600000001490116;0
3614;-744984.548999998718500;-1042283.640999998897314;0
6832;-741552.254000000655651;-1044899.227000001817942;0
7950;-741950.460000000894070;-1044150.710000000894070;0
1264;-742059.000000000000000;-1044942.000000000000000;0
6662;-741466.800000000745058;-1044192.359999999403954;0
1144;-741402.000000000000000;-1044470.000000000000000;0
4335;-742398.230000000447035;-1043445.760000001639128;0
1570;-742291.000000000000000;-1044183.000000000000000;0
1954;-743372.000000000000000;-1044497.000000000000000;0
5295;-743047.995000001043081;-1043185.530000001192093;0
7975;-741349.339999999850988;-1044397.800000000745058;0
4956;-742383.579999998211861;-1043007.739999998360872;0
4606;-742512.769000001251698;-1042608.333000000566244;0
2245;-743239.000000000000000;-1045356.000000000000000;0
8075;-742072.149999998509884;-1045261.399999998509884;0
205;-743173.000000000000000;-1043599.000000000000000;0
2451;-742884.000000000000000;-1044134.000000000000000;0
1130;-741624.000000000000000;-1044446.000000000000000;0
4737;-742718.399999998509884;-1042684.079999998211861;0
3032;-744506.962000001221895;-1042717.704999998211861;0
1765;-741159.000000000000000;-1044178.000000000000000;0
1602;-742507.000000000000000;-1044924.000000000000000;0
4877;-742845.760000001639128;-1042956.589999999850988;0
2467;-743434.000000000000000;-1044742.000000000000000;0
3281;-743629.340999998152256;-1042825.692000001668930;0
5456;-742761.041000001132488;-1043254.350999999791384;0
1040;-741904.000000000000000;-1044623.000000000000000;0
535;-742111.000000000000000;-1043714.000000000000000;0
1118;-741807.000000000000000;-1044459.000000000000000;0
1012;-742060.000000000000000;-1044582.000000000000000;0
3846;-743149.390000000596046;-1042549.600000001490116;0
1368;-741998.000000000000000;-1044779.000000000000000;0
1588;-742390.000000000000000;-1044837.000000000000000;0
3561;-744699.155999999493361;-1042614.903999999165535;0
725;-741983.000000000000000;-1042939.000000000000000;0
6338;-742247.910000000149012;-1042851.670000001788139;0
577;-742038.000000000000000;-1043521.000000000000000;146
3981;-743341.517000000923872;-1043837.353999998420477;0
5680;-743402.000000000000000;-1043718.245000001043081;0
3704;-744530.350000001490116;-1042519.798999998718500;0
6362;-742039.230999998748302;-1042680.660000000149012;0
612;-742064.000000000000000;-1043270.000000000000000;0
80;-744067.000000000000000;-1043330.000000000000000;0
164;-743392.000000000000000;-1043230.000000000000000;0
3785;-743172.449999999254942;-1042923.850000001490116;0
500;-741861.000000000000000;-1043174.000000000000000;0
464;-741713.000000000000000;-1043286.000000000000000;0
4130;-742868.460000000894070;-1044055.510000001639128;0
4558;-742373.019999999552965;-1042506.949999999254942;0
1036;-741961.000000000000000;-1044922.000000000000000;0
669;-742510.000000000000000;-1043260.000000000000000;0
385;-742436.000000000000000;-1043742.000000000000000;0
2403;-742211.000000000000000;-1045436.000000000000000;0
4076;-742855.589999999850988;-1043882.670000001788139;0
331;-742664.000000000000000;-1044024.000000000000000;0
1461;-741473.000000000000000;-1044266.000000000000000;0
5779;-742907.197999998927116;-1043414.096999999135733;0
4329;-742363.315000001341105;-1043352.173999998718500;0
2314;-742884.000000000000000;-1045456.000000000000000;0
3063;-744133.098999999463558;-1042851.478999998420477;0
2381;-742313.000000000000000;-1045438.000000000000000;0
5231;-743342.107000000774860;-1043497.627000000327826;0
6100;-741950.760000001639128;-1043408.109999999403954;0
6722;-742357.717000000178814;-1044705.708000000566244;0
560;-742181.000000000000000;-1043665.000000000000000;0
5204;-743246.423999998718500;-1043308.298999998718500;0
4479;-741782.780000001192093;-1042660.359999999403954;0
2510;-743015.000000000000000;-1044050.000000000000000;0
926;-741894.000000000000000;-1042999.000000000000000;0
4105;-742678.771999999880791;-1043769.206000000238419;0
1286;-742221.460000000894070;-1044465.969999998807907;0
5777;-742926.357000000774860;-1043427.357999999076128;0
597;-741855.000000000000000;-1043268.000000000000000;0
914;-741715.000000000000000;-1042583.000000000000000;0
5996;-742061.879000000655651;-1043284.276999998837709;0
4007;-743275.230999998748302;-1044049.184999998658895;0
7721;-742941.157000001519918;-1044215.368000000715256;0
3758;-743284.129999998956919;-1042964.100000001490116;0
4776;-742909.276000000536442;-1042820.587000001221895;0
6188;-742312.807999998331070;-1043058.706999998539686;0
5459;-742368.519000001251698;-1043474.221999999135733;0
5292;-743055.866000000387430;-1043215.710999999195337;0
7360;-743228.008000001311302;-1045144.625999998301268;0
4052;-743252.954999998211861;-1043843.585000000894070;0
1766;-741257.000000000000000;-1044204.000000000000000;0
3241;-744178.436999998986721;-1042649.513999998569489;0
1909;-743446.000000000000000;-1044375.000000000000000;0
6367;-741928.510000001639128;-1042645.149999998509884;0
6961;-743023.579999998211861;-1044221.129999998956919;0
1816;-743070.000000000000000;-1044444.000000000000000;0
5957;-742962.627000000327826;-1043510.905000001192093;0
6979;-743081.460000000894070;-1044413.079999998211861;0
5167;-743219.324999999254942;-1043405.249000001698732;0
3417;-743776.002999998629093;-1043098.853000000119209;0
4668;-742810.210000000894070;-1042618.969999998807907;0
5194;-743205.761999998241663;-1043310.581999998539686;0
1432;-741958.000000000000000;-1044285.000000000000000;0
1229;-742244.000000000000000;-1044253.000000000000000;0
7269;-743143.410000000149012;-1044948.879999998956919;0
2072;-743043.000000000000000;-1044743.000000000000000;0
1593;-742192.000000000000000;-1044826.000000000000000;0
394;-742405.000000000000000;-1043863.000000000000000;127
7956;-741777.379999998956919;-1044260.170000001788139;0
5197;-743222.513000000268221;-1043313.989999998360872;0
2490;-742063.000000000000000;-1044273.000000000000000;0
1792;-742165.000000000000000;-1044209.000000000000000;0
2059;-742625.000000000000000;-1044459.000000000000000;0
1472;-741677.000000000000000;-1044145.000000000000000;0
4999;-742534.149999998509884;-1042966.892999999225140;0
3370;-743858.489999998360872;-1043011.370999999344349;0
6215;-742314.692000001668930;-1043057.682000000029802;0
5968;-742288.989000000059605;-1044168.456999998539686;0
7542;-742623.890000000596046;-1045372.899999998509884;0
7215;-742484.320000000298023;-1044546.620000001043081;0
2132;-743058.000000000000000;-1045118.000000000000000;0
3997;-743395.094999998807907;-1044031.109999999403954;0
6715;-742291.912999998778105;-1044948.105999998748302;0
1613;-742408.000000000000000;-1044428.000000000000000;0
2020;-743260.000000000000000;-1044941.000000000000000;0
1323;-741859.000000000000000;-1044941.000000000000000;0
1655;-741391.000000000000000;-1044651.000000000000000;0
4326;-742319.855000000447035;-1043419.918999999761581;0
844;-742138.000000000000000;-1042519.000000000000000;0
3343;-743911.989000000059605;-1043070.489000000059605;0
2296;-742678.000000000000000;-1045399.000000000000000;0
5284;-743041.022999998182058;-1043277.397999998182058;0
1383;-742077.000000000000000;-1045046.000000000000000;0
5691;-743415.714000001549721;-1043637.241000000387430;0
4934;-742433.807000000029802;-1042730.874000001698732;0
680;-742402.109999999403954;-1043166.679999999701977;0
2205;-743136.000000000000000;-1045304.000000000000000;0
4832;-743039.079999998211861;-1042840.850000001490116;0
7206;-742559.920000001788139;-1045003.190000001341105;0
1855;-742642.000000000000000;-1044286.000000000000000;0
3465;-745090.089999999850988;-1042676.664999999105930;0
4055;-743119.070000000298023;-1043694.109999999403954;0
1926;-743301.000000000000000;-1044321.000000000000000;0
910;-742219.000000000000000;-1042529.000000000000000;0
4126;-742851.335000000894070;-1044085.449999999254942;0
6128;-742313.668999999761581;-1043069.186000000685453;0
6123;-743427.453000001609325;-1043603.083000000566244;0
3850;-743037.969999998807907;-1042473.780000001192093;0
4097;-742806.000000000000000;-1043874.793999999761581;0
4600;-742647.000000000000000;-1042709.000000000000000;0
6401;-741992.449999999254942;-1042503.609999999403954;0
1060;-741610.000000000000000;-1045115.000000000000000;0
5126;-743012.193999998271465;-1043403.521000001579523;0
4826;-743043.850000001490116;-1042979.600000001490116;0
3812;-743231.179999999701977;-1042815.199999999254942;0
4660;-742801.596999999135733;-1042487.965999998152256;0
7214;-742470.679999999701977;-1044531.269999999552965;0
8267;-742240.420000001788139;-1042709.160000000149012;0
7349;-742516.719999998807907;-1045170.359999999403954;0
6855;-741501.394999999552965;-1045027.784000001847744;0
5508;-743426.105999998748302;-1043645.960999999195337;0
2447;-742772.000000000000000;-1044159.000000000000000;0
2449;-742825.000000000000000;-1044147.000000000000000;0
7112;-743517.839999999850988;-1044667.420000001788139;0
7928;-743542.539999999105930;-1044784.769999999552965;0
821;-742048.000000000000000;-1042601.000000000000000;0
620;-742253.000000000000000;-1043281.000000000000000;0
1905;-743446.000000000000000;-1044312.000000000000000;0
3090;-743913.418999999761581;-1042804.416999999433756;0
7041;-743381.004999998956919;-1044158.699999999254942;0
3134;-743932.910999998450279;-1042615.767999999225140;0
4083;-742820.771999999880791;-1043708.657000001519918;0
7277;-742796.870000001043081;-1044653.429999999701977;0
7000;-743096.190000001341105;-1044426.870000001043081;0
743;-741682.000000000000000;-1043020.000000000000000;0
5143;-743052.232000000774860;-1043454.120000001043081;0
3820;-743111.699999999254942;-1042659.320000000298023;0
3306;-743787.127999998629093;-1042847.872999999672174;0
3168;-743928.910000000149012;-1042570.219999998807907;0
5639;-743428.337999999523163;-1043685.046999998390675;0
2504;-742757.000000000000000;-1045516.000000000000000;0
2193;-743531.000000000000000;-1045204.000000000000000;0
4781;-742926.519000001251698;-1042695.502999998629093;0
5692;-743415.782999999821186;-1043638.765000000596046;0
4799;-743008.011999998241663;-1042697.245999999344349;0
2334;-742872.000000000000000;-1045519.000000000000000;0
4653;-742788.747999999672174;-1042524.557000000029802;0
4508;-742449.140000000596046;-1042725.980000000447035;0
709;-741861.000000000000000;-1042862.000000000000000;0
4059;-743142.649999998509884;-1043612.730000000447035;0
345;-742559.000000000000000;-1043826.000000000000000;0
3987;-743311.475000001490116;-1043983.175000000745058;0
3128;-743948.160000000149012;-1042657.320000000298023;0
4214;-742229.274999998509884;-1043511.745000001043081;0
6505;-741746.570000000298023;-1044600.429999999701977;0
190;-743443.000000000000000;-1043597.000000000000000;0
7933;-743544.570000000298023;-1044950.370000001043081;0
4224;-742139.756000000983477;-1043462.488000001758337;0
4926;-742452.660000000149012;-1042896.190000001341105;0
8244;-742617.899999998509884;-1045206.480000000447035;0
8270;-742019.480000000447035;-1042725.870000001043081;0
6171;-742310.780999999493361;-1043057.971000000834465;0
888;-741994.000000000000000;-1042797.000000000000000;0
8076;-742050.429999999701977;-1045256.199999999254942;0
4523;-742703.960000000894070;-1042805.670000001788139;0
2398;-742150.000000000000000;-1045370.000000000000000;0
6862;-741438.085999999195337;-1045031.583999998867512;0
4250;-742144.109999999403954;-1043367.519999999552965;0
3323;-743934.361999999731779;-1042945.002999998629093;0
4212;-742205.245000001043081;-1043548.410000000149012;0
4948;-742386.929999999701977;-1042992.239999998360872;0
4989;-742648.756000000983477;-1043019.318999998271465;0
2163;-742944.000000000000000;-1045168.000000000000000;0
8049;-742198.890000000596046;-1044891.600000001490116;0
6251;-742377.396999999880791;-1043042.284000001847744;0
7143;-742850.414999999105930;-1044473.449999999254942;0
7947;-742030.969999998807907;-1044096.679999999701977;0
5504;-743428.977000001817942;-1043686.274000000208616;0
1164;-741055.000000000000000;-1044515.000000000000000;0
622;-742271.000000000000000;-1043302.000000000000000;0
6806;-741090.381000000983477;-1044706.675999999046326;0
4566;-742473.846000000834465;-1042545.780000001192093;0
4426;-742197.589999999850988;-1043031.679999999701977;0
4649;-742732.228999998420477;-1042525.100000001490116;0
700;-742008.000000000000000;-1042895.000000000000000;0
5135;-742979.611000001430511;-1043468.912999998778105;0
7740;-742301.949999999254942;-1045061.239000000059605;0
7160;-743028.010999999940395;-1044543.267999999225140;0
7345;-742613.339999999850988;-1045185.250000000000000;0
6013;-743372.780000001192093;-1043377.921999998390675;0
651;-742490.000000000000000;-1043564.000000000000000;0
5580;-743409.831000000238419;-1043636.449000000953674;0
5411;-742776.079999998211861;-1042905.300000000745058;0
984;-741917.000000000000000;-1044411.000000000000000;0
7155;-742920.776999998837709;-1044546.934000000357628;0
4036;-743246.920000001788139;-1043771.574999999254942;0
518;-742194.000000000000000;-1043131.000000000000000;0
4698;-742673.530000001192093;-1042715.780000001192093;0
4709;-742775.800000000745058;-1042600.690000001341105;0
2319;-742734.000000000000000;-1045474.000000000000000;0
4837;-742979.105999998748302;-1042672.627999998629093;0
5294;-743056.328999999910593;-1043196.096999999135733;0
4738;-742733.910000000149012;-1042704.890000000596046;0
4890;-742605.287000000476837;-1042838.535000000149012;0
1387;-742155.000000000000000;-1044999.000000000000000;0
4031;-743135.774000000208616;-1043769.622000001370907;0
6175;-742315.256999999284744;-1043064.660999998450279;0
1827;-743033.000000000000000;-1044080.000000000000000;0
8277;-742111.260000001639128;-1042746.399999998509884;0
5001;-742560.092999998480082;-1042966.206999998539686;0
4984;-742580.537999998778105;-1043025.210999999195337;0
5738;-743410.412999998778105;-1043691.800000000745058;0
5729;-743420.103000000119209;-1043638.901000000536442;0
191;-743424.000000000000000;-1043599.000000000000000;0
8261;-742108.039999999105930;-1042693.769999999552965;0
2408;-742369.000000000000000;-1045125.000000000000000;0
4836;-742984.245999999344349;-1042653.127999998629093;0
1559;-741190.000000000000000;-1044242.000000000000000;0
4640;-742588.572999998927116;-1042544.848999999463558;0
6214;-742315.447999998927116;-1043059.026000000536442;0
1939;-743269.000000000000000;-1044355.000000000000000;0
1951;-743289.000000000000000;-1044491.000000000000000;0
7957;-741692.839999999850988;-1044277.559999998658895;0
1046;-741838.000000000000000;-1044805.000000000000000;0
727;-742001.000000000000000;-1042962.000000000000000;0
6295;-742653.399999998509884;-1042696.070000000298023;0
1000;-741828.000000000000000;-1044502.000000000000000;0
7387;-743066.739999998360872;-1045487.570000000298023;0
6245;-742369.682000000029802;-1043057.377000000327826;0
4755;-742734.960000000894070;-1042778.019999999552965;0
4796;-743054.247999999672174;-1042682.918000001460314;0
6105;-742213.883000001311302;-1043111.734000001102686;0
1539;-741977.000000000000000;-1043997.000000000000000;0
272;-743396.000000000000000;-1043809.000000000000000;0
4150;-742581.789999999105930;-1044138.429999999701977;0
1523;-741679.000000000000000;-1043865.000000000000000;0
7049;-743420.177000001072884;-1044168.629999998956919;0
587;-741944.000000000000000;-1043391.000000000000000;0
6830;-741526.739999998360872;-1044761.309000000357628;0
1350;-741814.000000000000000;-1044844.000000000000000;0
1665;-741012.000000000000000;-1044351.000000000000000;0
506;-741980.000000000000000;-1043158.000000000000000;0
8045;-742173.070000000298023;-1044806.519999999552965;0
4332;-742410.359000001102686;-1043282.916000001132488;0
7038;-743316.394999999552965;-1044240.155000001192093;0
509;-741991.000000000000000;-1043143.000000000000000;0
275;-743361.000000000000000;-1043904.000000000000000;0
2513;-742574.000000000000000;-1044441.000000000000000;0
1322;-741906.000000000000000;-1044975.000000000000000;0
4032;-743136.934999998658895;-1043750.375000000000000;0
5737;-743412.636999998241663;-1043691.631000000983477;0
4677;-742787.309999998658895;-1042797.899999998509884;0
4229;-742146.929000001400709;-1043334.585000000894070;0
559;-742191.000000000000000;-1043693.000000000000000;0
678;-742421.000000000000000;-1043181.000000000000000;0
2304;-742442.000000000000000;-1045429.000000000000000;0
2481;-741255.609999999403954;-1044671.179999999701977;0
6181;-742318.164999999105930;-1043068.541999999433756;0
3966;-743363.859999999403954;-1043530.829999998211861;0
2098;-743134.000000000000000;-1044763.000000000000000;0
6283;-742308.969000000506639;-1043049.539999999105930;0
4154;-742544.524999998509884;-1044048.190000001341105;0
7656;-742290.328000001609325;-1045294.499000001698732;0
2292;-742819.000000000000000;-1045388.000000000000000;0
7399;-742999.699999999254942;-1045733.309999998658895;0
5396;-744557.436000000685453;-1042656.633000001311302;0
3886;-742385.100000001490116;-1042445.500000000000000;0
1045;-741849.000000000000000;-1044775.000000000000000;0
1155;-741208.000000000000000;-1044484.000000000000000;0
3292;-743576.905000001192093;-1042781.315000001341105;0
1972;-743389.000000000000000;-1044907.000000000000000;0
6168;-742313.092999998480082;-1043062.208999998867512;0
3868;-742432.381000000983477;-1042412.094000000506639;0
6270;-742333.412999998778105;-1043018.204999998211861;0
4825;-742908.839999999850988;-1042860.670000001788139;0
276;-743382.000000000000000;-1043905.000000000000000;0
4710;-742796.730000000447035;-1042611.769999999552965;0
7035;-743299.831999998539686;-1044176.241999998688698;0
7095;-743370.940000001341105;-1044597.230000000447035;0
8019;-741972.039999999105930;-1044557.089999999850988;0
5515;-743426.960000000894070;-1043612.083999998867512;0
7224;-742399.359999999403954;-1044829.829999998211861;0
1061;-741586.000000000000000;-1045133.000000000000000;0
5997;-742040.579999998211861;-1043282.651999998837709;0
5215;-743342.890000000596046;-1043380.368000000715256;0
6222;-742316.855000000447035;-1043060.109999999403954;0
6458;-743360.644999999552965;-1043919.311999998986721;0
541;-742258.000000000000000;-1043678.000000000000000;0
4946;-742411.739000000059605;-1043002.199999999254942;0
7028;-743257.254999998956919;-1044104.574999999254942;0
4827;-743046.359999999403954;-1042958.140000000596046;0
3310;-743829.561999998986721;-1042854.063000001013279;0
1255;-742077.000000000000000;-1044770.000000000000000;0
7973;-741347.850000001490116;-1044381.850000001490116;0
3157;-743935.576000001281500;-1042567.035000000149012;0
5651;-743429.440999999642372;-1043699.524999998509884;0
6698;-742304.160999998450279;-1044462.195999998599291;0
1751;-742046.000000000000000;-1045235.000000000000000;0
6414;-743703.410999998450279;-1042881.958000000566244;0
4641;-742591.151999998837709;-1042559.721000000834465;0
5451;-743276.109000001102686;-1043331.000999998301268;0
4242;-742214.469999998807907;-1043415.800000000745058;0
325;-742700.000000000000000;-1044114.000000000000000;0
1134;-741558.000000000000000;-1044450.000000000000000;0
4936;-742454.684000000357628;-1042685.620999999344349;0
2576;-742487.000000000000000;-1045483.000000000000000;0
5212;-743283.975000001490116;-1043373.589999999850988;0
6836;-741643.532000001519918;-1044947.486999999731779;0
3176;-743891.085999999195337;-1042631.991999998688698;0
1931;-743388.000000000000000;-1044409.000000000000000;0
6809;-741079.942999999970198;-1044626.942000001668930;0
6788;-741212.809999998658895;-1044473.129999998956919;0
1220;-742147.000000000000000;-1044283.000000000000000;0
6160;-742311.730999998748302;-1043061.116000000387430;0
6370;-741968.780000001192093;-1042685.250000000000000;0
5701;-743417.076999999582767;-1043630.140000000596046;0
5235;-743350.096000000834465;-1043388.881000000983477;0
4897;-742560.320000000298023;-1042829.359999999403954;0
7515;-742273.021999999880791;-1044371.543999999761581;0
1970;-743380.000000000000000;-1044854.000000000000000;0
1382;-742096.000000000000000;-1045023.000000000000000;0
1096;-741474.000000000000000;-1044566.000000000000000;0
3792;-743110.019999999552965;-1042846.530000001192093;0
6112;-742237.710000000894070;-1043370.434999998658895;0
1622;-742495.000000000000000;-1044321.000000000000000;0
1811;-743175.000000000000000;-1044525.000000000000000;0
5206;-743189.870999999344349;-1043360.936000000685453;0
6491;-742157.708000000566244;-1044457.421999998390675;0
8082;-741958.629999998956919;-1045352.690000001341105;0
4500;-742315.239999998360872;-1042719.460000000894070;0
6265;-742353.164999999105930;-1043020.054999999701977;0
169;-743433.000000000000000;-1043334.000000000000000;0
2338;-742797.000000000000000;-1045528.000000000000000;0
1447;-741541.000000000000000;-1044744.000000000000000;0
4995;-742476.986000001430511;-1042961.239000000059605;0
6705;-742279.050999999046326;-1044655.923000000417233;0
8284;-742219.410000000149012;-1042809.500000000000000;0
4753;-742764.600000001490116;-1042761.899999998509884;0
2039;-743308.000000000000000;-1044808.000000000000000;0
8259;-742072.089999999850988;-1042687.219999998807907;0
4596;-742597.181000001728535;-1042670.653000000864267;0
5296;-743058.934999998658895;-1043177.035000000149012;0
2061;-742681.000000000000000;-1044491.000000000000000;0
296;-742950.170000001788139;-1044097.429999999701977;0
4983;-742587.776000000536442;-1043013.068999998271465;0
4333;-742428.420000001788139;-1043255.609999999403954;0
3818;-743130.217999998480082;-1042703.293000001460314;0
6810;-741106.350999999791384;-1044631.888999998569489;0
7350;-742556.390000000596046;-1045185.980000000447035;0
3471;-745015.947000000625849;-1042270.480000000447035;0
4531;-742746.070000000298023;-1042885.980000000447035;0
3537;-744632.945000000298023;-1042671.657000001519918;0
1140;-741475.000000000000000;-1044461.000000000000000;0
1612;-742429.000000000000000;-1044425.000000000000000;0
3396;-743905.006000000983477;-1043084.449999999254942;0
8081;-741974.019999999552965;-1045331.530000001192093;0
1242;-742137.000000000000000;-1044481.000000000000000;0
7282;-742809.410000000149012;-1044693.629999998956919;0
5324;-743025.329999998211861;-1043045.789999999105930;0
1237;-742144.000000000000000;-1044365.000000000000000;0
7681;-742501.629999998956919;-1045152.870000001043081;0
1148;-741324.000000000000000;-1044481.000000000000000;0
4933;-742437.605000000447035;-1042750.853000000119209;0
1029;-741978.000000000000000;-1044721.000000000000000;0
8282;-742183.519999999552965;-1042790.890000000596046;0
5693;-743415.905000001192093;-1043640.377000000327826;0
4763;-742847.094000000506639;-1042842.671000000089407;0
2550;-741576.000000000000000;-1044342.000000000000000;0
1434;-741931.000000000000000;-1044293.000000000000000;0
5408;-743696.881000000983477;-1042878.024999998509884;0
