OID_;X;Y;TEMPERATURE
3614;-744984.548999998718500;-1042283.640999998897314;0
3019;-744463.447999998927116;-1042784.646000001579523;0
3568;-744718.817999999970198;-1042588.614999998360872;0
3692;-744525.876499999314547;-1042540.534000001847744;0
3580;-744924.973999999463558;-1042593.699999999254942;0
2605;-745393.842999998480082;-1042860.796000000089407;0
5975;-745052.346999999135733;-1042674.673000000417233;0
118;-745135.000000000000000;-1042687.000000000000000;0
3542;-744575.274000000208616;-1042656.160000000149012;0
2696;-743477.489999998360872;-1042038.000000000000000;0
2520;-741847.000000000000000;-1045324.000000000000000;0
6872;-741751.719999998807907;-1045296.679999999701977;0
2760;-743863.331000000238419;-1043483.304000001400709;0
2755;-744003.879000000655651;-1043471.734000001102686;0
2404;-742179.000000000000000;-1045467.000000000000000;0
3919;-743904.947000000625849;-1043493.929999999701977;0
3107;-743778.888000000268221;-1042682.131999999284744;0
2740;-744042.611999999731779;-1043335.940000001341105;0
6705;-742279.050999999046326;-1044655.923000000417233;0
6833;-741571.423000000417233;-1044909.473999999463558;0
1486;-741150.000000000000000;-1044219.000000000000000;0
1445;-741553.000000000000000;-1044757.000000000000000;0
1524;-741710.000000000000000;-1043844.000000000000000;0
1727;-741495.000000000000000;-1045103.000000000000000;0
1723;-741611.000000000000000;-1045092.000000000000000;0
1053;-741768.000000000000000;-1045023.000000000000000;0
1411;-741639.480000000447035;-1044683.019999999552965;0
6828;-741465.309999998658895;-1044768.940000001341105;0
7411;-743529.510000001639128;-1045393.140000000596046;0
3413;-743776.791000001132488;-1043071.675000000745058;0
2079;-742688.000000000000000;-1044428.000000000000000;0
6845;-741527.188000001013279;-1044989.557000000029802;0
385;-742436.000000000000000;-1043742.000000000000000;0
7143;-742850.414999999105930;-1044473.449999999254942;0
8079;-742021.839999999850988;-1045292.179999999701977;0
2070;-742993.000000000000000;-1044723.000000000000000;0
2097;-743143.000000000000000;-1044742.000000000000000;0
4156;-742513.734999999403954;-1043978.035000000149012;0
7263;-743009.559999998658895;-1044894.379999998956919;0
383;-742450.000000000000000;-1043722.000000000000000;0
4238;-742440.263000000268221;-1043528.236000001430511;0
7654;-742242.081000000238419;-1045273.263999998569489;0
7008;-742899.559999998658895;-1044224.074999999254942;0
2394;-742273.000000000000000;-1045360.000000000000000;0
2329;-742432.000000000000000;-1045508.000000000000000;0
2160;-742849.000000000000000;-1045147.000000000000000;0
2161;-742876.000000000000000;-1045153.000000000000000;0
8073;-742120.640000000596046;-1045259.500000000000000;0
7652;-742275.046999998390675;-1045497.052000001072884;0
2378;-742372.000000000000000;-1045503.000000000000000;0
7141;-742895.629999998956919;-1044470.910000000149012;0
4075;-742947.934999998658895;-1043903.649999998509884;0
7243;-742724.339999999850988;-1044835.870000001043081;0
4074;-742943.350000001490116;-1043880.304999999701977;0
282;-743034.000000000000000;-1043819.000000000000000;0
7282;-742809.410000000149012;-1044693.629999998956919;0
1814;-743095.000000000000000;-1044510.000000000000000;0
5409;-743745.201000001281500;-1042902.750000000000000;0
4029;-743130.695999998599291;-1043815.427999999374151;0
7947;-742030.969999998807907;-1044096.679999999701977;0
524;-742255.000000000000000;-1043913.000000000000000;0
2296;-742678.000000000000000;-1045399.000000000000000;0
2326;-742523.000000000000000;-1045498.000000000000000;0
2323;-742622.000000000000000;-1045487.000000000000000;0
1780;-741214.000000000000000;-1043934.000000000000000;0
738;-741818.000000000000000;-1043024.000000000000000;0
1942;-743283.000000000000000;-1044370.000000000000000;0
1983;-743474.000000000000000;-1044709.000000000000000;0
1300;-741917.410000000149012;-1044719.769999999552965;0
1519;-741754.000000000000000;-1043956.000000000000000;0
748;-741671.000000000000000;-1042971.000000000000000;0
110;-744127.000000000000000;-1042724.000000000000000;0
7721;-742941.157000001519918;-1044215.368000000715256;0
7022;-743155.660000000149012;-1044074.410000000149012;0
1764;-741163.000000000000000;-1044144.000000000000000;0
7015;-742554.570000000298023;-1044360.725000001490116;0
735;-741910.000000000000000;-1043014.000000000000000;0
4220;-742214.344999998807907;-1043580.359999999403954;0
1287;-742217.000000000000000;-1044486.000000000000000;0
1345;-741741.000000000000000;-1044789.000000000000000;0
6339;-742245.460000000894070;-1042835.780000001192093;0
3975;-743112.984999999403954;-1043716.375999998301268;0
2319;-742734.000000000000000;-1045474.000000000000000;0
3310;-743829.561999998986721;-1042854.063000001013279;0
4046;-743205.699999999254942;-1044009.719999998807907;0
514;-742119.000000000000000;-1043141.000000000000000;0
510;-742048.000000000000000;-1043150.000000000000000;0
343;-742575.000000000000000;-1043857.000000000000000;0
6728;-742547.451000001281500;-1044392.396000001579523;0
4223;-742161.556000001728535;-1043473.138999998569489;0
4067;-742913.594999998807907;-1043714.640000000596046;0
7185;-742600.515000000596046;-1044717.333999998867512;0
3993;-743345.100000001490116;-1043930.980000000447035;0
847;-742155.000000000000000;-1042504.000000000000000;0
824;-742142.000000000000000;-1042596.000000000000000;0
817;-741937.000000000000000;-1042586.000000000000000;0
2050;-743460.000000000000000;-1045072.000000000000000;0
827;-742218.000000000000000;-1042626.000000000000000;0
834;-742049.000000000000000;-1042541.000000000000000;0
2008;-743242.000000000000000;-1044759.000000000000000;0
2018;-743244.000000000000000;-1044909.000000000000000;0
4170;-742407.245000001043081;-1043945.519999999552965;0
394;-742405.000000000000000;-1043863.000000000000000;0
1675;-741059.000000000000000;-1044754.000000000000000;0
7148;-742828.445000000298023;-1044472.094999998807907;0
6722;-742357.717000000178814;-1044705.708000000566244;0
2020;-743260.000000000000000;-1044941.000000000000000;0
1561;-743186.000000000000000;-1045098.000000000000000;0
547;-742316.910000000149012;-1043790.309999998658895;0
1251;-742091.000000000000000;-1044690.000000000000000;0
7;-743479.000000000000000;-1042567.000000000000000;0
6820;-741224.105999998748302;-1044799.311999998986721;0
4106;-742664.475000001490116;-1043755.761999998241663;0
3838;-743113.550000000745058;-1042543.399999998509884;0
533;-742137.000000000000000;-1043750.000000000000000;0
17;-743587.000000000000000;-1042394.000000000000000;0
1855;-742642.000000000000000;-1044286.000000000000000;0
5303;-743164.818999998271465;-1043211.078000001609325;0
1492;-741096.000000000000000;-1044331.000000000000000;0
4332;-742410.359000001102686;-1043282.916000001132488;0
5369;-742583.364999998360872;-1042976.820999998599291;0
3886;-742385.100000001490116;-1042445.500000000000000;0
4124;-742751.265000000596046;-1043878.414999999105930;0
3204;-743715.278999999165535;-1042506.118999999016523;0
620;-742253.000000000000000;-1043281.000000000000000;0
6;-743464.000000000000000;-1042594.000000000000000;0
1769;-741260.000000000000000;-1044112.000000000000000;0
2133;-743040.000000000000000;-1045127.000000000000000;0
4235;-742390.041999999433756;-1043492.094999998807907;0
5294;-743056.328999999910593;-1043196.096999999135733;0
5270;-742989.153999999165535;-1043210.684999998658895;0
2151;-742827.000000000000000;-1045047.000000000000000;0
2166;-743016.000000000000000;-1045179.000000000000000;0
7324;-742833.980000000447035;-1044949.109999999403954;0
224;-742904.000000000000000;-1043522.000000000000000;0
4162;-742497.193999998271465;-1044160.030000001192093;0
4002;-743397.818999998271465;-1044054.317999999970198;0
4173;-742756.320000000298023;-1043749.629999998956919;0
6746;-742405.083999998867512;-1044259.199999999254942;0
4234;-742349.850000001490116;-1043459.410000000149012;0
1766;-741257.000000000000000;-1044204.000000000000000;0
7973;-741347.850000001490116;-1044381.850000001490116;0
2277;-742826.000000000000000;-1045653.000000000000000;0
333;-742651.000000000000000;-1043996.000000000000000;0
4333;-742428.420000001788139;-1043255.609999999403954;0
1470;-741728.000000000000000;-1044116.000000000000000;0
1192;-741801.000000000000000;-1044083.000000000000000;0
1515;-741913.000000000000000;-1044072.000000000000000;0
2447;-742772.000000000000000;-1044159.000000000000000;0
7086;-743333.149999998509884;-1044527.250000000000000;0
7216;-742500.129999998956919;-1044564.390000000596046;0
1718;-741366.219999998807907;-1044870.989999998360872;0
2081;-742551.000000000000000;-1044621.000000000000000;0
1701;-741378.000000000000000;-1044678.000000000000000;0
558;-742200.000000000000000;-1043683.000000000000000;0
2546;-741750.000000000000000;-1044271.000000000000000;0
6700;-742298.611000001430511;-1044507.315999999642372;0
1038;-741956.000000000000000;-1044977.000000000000000;0
1371;-742089.000000000000000;-1044807.000000000000000;0
7031;-743301.824999999254942;-1044080.774999998509884;0
526;-742209.000000000000000;-1043849.000000000000000;0
210;-743112.000000000000000;-1043566.000000000000000;0
2235;-743401.000000000000000;-1045221.000000000000000;0
203;-743204.000000000000000;-1043607.000000000000000;0
884;-741771.000000000000000;-1042776.000000000000000;0
1013;-742076.000000000000000;-1044595.000000000000000;0
1432;-741958.000000000000000;-1044285.000000000000000;0
7983;-741127.800000000745058;-1044416.199999999254942;0
2189;-743472.000000000000000;-1045183.000000000000000;0
4024;-743223.734999999403954;-1043859.954999998211861;0
4150;-742581.789999999105930;-1044138.429999999701977;0
5968;-742288.989000000059605;-1044168.456999998539686;0
727;-742001.000000000000000;-1042962.000000000000000;0
1091;-741531.480000000447035;-1044543.440000001341105;0
4036;-743246.920000001788139;-1043771.574999999254942;0
5210;-743253.673999998718500;-1043370.440999999642372;0
3982;-743325.135000001639128;-1043857.684999998658895;0
5015;-742575.741000000387430;-1043008.607999999076128;0
280;-743053.000000000000000;-1043875.000000000000000;0
308;-742754.000000000000000;-1044149.000000000000000;0
6311;-743930.489999998360872;-1042569.390000000596046;0
728;-741997.000000000000000;-1042918.000000000000000;0
3154;-743984.818999998271465;-1042573.844999998807907;0
2318;-742763.000000000000000;-1045470.000000000000000;0
1982;-743408.000000000000000;-1044646.000000000000000;0
1832;-743024.000000000000000;-1044100.000000000000000;0
2453;-742941.000000000000000;-1044121.000000000000000;0
1518;-741994.000000000000000;-1044011.000000000000000;0
4139;-742859.625999998301268;-1044000.574999999254942;0
1879;-743302.000000000000000;-1044264.000000000000000;0
1477;-741482.750000000000000;-1044212.480000000447035;0
3101;-743922.754999998956919;-1042745.195000000298023;0
3264;-743565.725000001490116;-1042729.024999998509884;0
696;-742077.000000000000000;-1042913.000000000000000;0
5128;-743040.467000000178814;-1043389.765999998897314;0
1264;-742059.000000000000000;-1044942.000000000000000;0
1424;-742134.000000000000000;-1044171.000000000000000;0
1214;-742064.000000000000000;-1044358.000000000000000;0
5447;-743129.958999998867512;-1043365.166000001132488;0
2212;-743217.000000000000000;-1045279.000000000000000;0
3326;-744036.002000000327826;-1042922.574999999254942;0
1455;-741517.000000000000000;-1044468.000000000000000;0
1123;-741734.000000000000000;-1044442.000000000000000;0
2565;-741043.000000000000000;-1044424.000000000000000;0
5122;-742902.166999999433756;-1043373.543999999761581;0
711;-741828.000000000000000;-1042860.000000000000000;0
2226;-743057.000000000000000;-1045470.000000000000000;0
8242;-742568.629999998956919;-1045197.829999998211861;0
2494;-741985.000000000000000;-1044165.000000000000000;0
1433;-741895.000000000000000;-1044328.000000000000000;0
301;-742613.000000000000000;-1043903.000000000000000;0
4538;-742291.464000001549721;-1042734.344000000506639;0
4651;-742756.375000000000000;-1042524.938000001013279;0
6103;-742213.102000001817942;-1043103.528999999165535;0
578;-742023.000000000000000;-1043464.000000000000000;0
7962;-741640.190000001341105;-1044316.800000000745058;0
7745;-742933.037000000476837;-1045523.714999999850988;0
5203;-743386.346000000834465;-1043274.958000000566244;0
4342;-742506.473000001162291;-1043301.100000001490116;0
4583;-742401.482999999076128;-1042625.886999998241663;0
1475;-741565.000000000000000;-1044185.000000000000000;0
4705;-742714.100000001490116;-1042599.829999998211861;0
4119;-742717.223999999463558;-1043999.837999999523163;0
504;-741937.000000000000000;-1043164.000000000000000;0
6982;-743055.109999999403954;-1044342.629999998956919;0
982;-741992.000000000000000;-1044416.000000000000000;0
1242;-742137.000000000000000;-1044481.000000000000000;0
995;-741906.000000000000000;-1044434.000000000000000;0
2043;-743471.000000000000000;-1044959.000000000000000;0
1996;-743484.000000000000000;-1045063.000000000000000;0
596;-741867.000000000000000;-1043259.000000000000000;0
503;-741879.000000000000000;-1043158.000000000000000;0
4424;-742225.300000000745058;-1043033.250000000000000;0
7048;-743392.429999999701977;-1044236.170000001788139;0
1041;-741893.000000000000000;-1044653.000000000000000;0
1112;-741189.050000000745058;-1044602.469999998807907;0
1695;-741550.000000000000000;-1044656.000000000000000;0
1118;-741807.000000000000000;-1044459.000000000000000;0
7045;-743400.745000001043081;-1044160.004999998956919;0
4770;-742872.535000000149012;-1042899.679000001400709;0
2888;-744082.749000001698732;-1043174.458999998867512;22
3292;-743576.905000001192093;-1042781.315000001341105;0
1602;-742507.000000000000000;-1044924.000000000000000;0
1126;-741684.000000000000000;-1044450.000000000000000;0
1920;-743384.000000000000000;-1044363.000000000000000;0
3285;-743661.519999999552965;-1042862.697000000625849;0
2482;-741262.739999998360872;-1044725.530000001192093;0
7807;-742647.802999999374151;-1044543.524000000208616;0
1532;-741805.000000000000000;-1043858.000000000000000;0
7966;-741489.800000000745058;-1044356.219999998807907;0
1222;-742157.000000000000000;-1044266.000000000000000;0
2262;-742999.000000000000000;-1045686.000000000000000;0
1928;-743474.000000000000000;-1044409.000000000000000;0
6256;-742380.723000001162291;-1043035.640000000596046;0
7976;-741301.260000001639128;-1044401.750000000000000;0
1817;-743058.000000000000000;-1044411.000000000000000;0
6753;-742485.511999998241663;-1044950.206999998539686;0
3752;-743213.949999999254942;-1042902.719999998807907;0
590;-741935.000000000000000;-1043331.000000000000000;0
3811;-743244.620000001043081;-1042809.420000001788139;0
6278;-742305.421999998390675;-1043028.918000001460314;0
5767;-742424.269999999552965;-1042581.609000001102686;0
6167;-742313.859999999403954;-1043063.607000000774860;0
6997;-743109.160000000149012;-1044453.600000001490116;0
3964;-743352.359999999403954;-1043540.780000001192093;0
5144;-743052.642000000923872;-1043488.940000001341105;0
6488;-741718.210000000894070;-1044532.489999998360872;0
2459;-741022.000000000000000;-1044591.000000000000000;0
5211;-743299.236000001430511;-1043364.945000000298023;0
4833;-743036.859999999403954;-1042820.050000000745058;0
1378;-742161.000000000000000;-1044904.000000000000000;0
1611;-742400.000000000000000;-1044442.000000000000000;0
7212;-742559.410000000149012;-1045073.070000000298023;0
1943;-743264.000000000000000;-1044421.000000000000000;0
4088;-742812.114999998360872;-1043580.475000001490116;0
3841;-743159.929999999701977;-1042641.120000001043081;0
5062;-742798.513999998569489;-1043227.370999999344349;0
8149;-743305.579999998211861;-1043204.070000000298023;0
2209;-743309.000000000000000;-1045217.000000000000000;0
1607;-742414.000000000000000;-1044379.000000000000000;0
6775;-741122.870000001043081;-1044483.239999998360872;0
3824;-743038.059999998658895;-1042573.800000000745058;0
1044;-741861.000000000000000;-1044743.000000000000000;0
7681;-742501.629999998956919;-1045152.870000001043081;0
1991;-743482.000000000000000;-1044929.000000000000000;0
8277;-742111.260000001639128;-1042746.399999998509884;0
5085;-742867.414000000804663;-1043226.135000001639128;0
1388;-742152.000000000000000;-1045026.000000000000000;0
4068;-742917.125000000000000;-1043734.535000000149012;0
5503;-743427.870000001043081;-1043698.647999998182058;0
1970;-743380.000000000000000;-1044854.000000000000000;0
1381;-742115.000000000000000;-1044999.000000000000000;0
4780;-742928.596000000834465;-1042747.480000000447035;0
6128;-742313.668999999761581;-1043069.186000000685453;0
5117;-742816.081999998539686;-1043298.302999999374151;0
5411;-742776.079999998211861;-1042905.300000000745058;0
1987;-743480.000000000000000;-1044820.000000000000000;0
1594;-742304.000000000000000;-1044977.000000000000000;0
227;-742846.000000000000000;-1043520.000000000000000;0
1302;-741842.000000000000000;-1044693.000000000000000;0
6218;-742319.947000000625849;-1043065.767999999225140;0
2091;-742920.000000000000000;-1044593.000000000000000;0
3804;-743040.109999999403954;-1042895.410000000149012;0
6726;-742476.517999999225140;-1044410.600000001490116;0
6122;-742071.870000001043081;-1043283.660000000149012;0
3818;-743130.217999998480082;-1042703.293000001460314;0
2084;-742447.000000000000000;-1044797.000000000000000;0
4666;-742808.710000000894070;-1042576.609999999403954;0
5326;-742969.850000001490116;-1043038.800000000745058;0
3889;-742335.008999999612570;-1042489.949000000953674;0
3802;-743068.190000001341105;-1042879.710000000894070;0
7152;-742867.331999998539686;-1044547.015999998897314;0
3387;-743960.368000000715256;-1043194.717000000178814;0
5698;-743416.785999998450279;-1043633.638000000268221;0
1573;-742358.000000000000000;-1044452.000000000000000;0
890;-742007.000000000000000;-1042740.000000000000000;0
1917;-743374.000000000000000;-1044458.000000000000000;0
1507;-741673.000000000000000;-1044223.000000000000000;0
4625;-742594.258000001311302;-1042576.114000000059605;0
2255;-743181.000000000000000;-1045372.000000000000000;0
5737;-743412.636999998241663;-1043691.631000000983477;0
181;-743421.000000000000000;-1043350.000000000000000;0
4481;-741766.089999999850988;-1042627.859999999403954;0
5591;-743421.353999998420477;-1043679.738000001758337;0
5322;-743060.379999998956919;-1043029.589999999850988;0
4952;-742318.899999998509884;-1042915.589999999850988;0
466;-741743.000000000000000;-1043331.000000000000000;0
4457;-741664.109999999403954;-1042615.550000000745058;0
4904;-742460.050000000745058;-1042796.739999998360872;0
1228;-742220.539999999105930;-1044250.829999998211861;0
7515;-742273.021999999880791;-1044371.543999999761581;0
5735;-743414.589999999850988;-1043687.874000001698732;0
8054;-742230.239999998360872;-1044988.530000001192093;0
3756;-743319.230000000447035;-1042949.019999999552965;0
952;-742274.000000000000000;-1043018.000000000000000;0
6363;-742027.344999998807907;-1042665.324000000953674;0
5998;-742019.482000000774860;-1043283.164000000804663;0
4472;-741816.140000000596046;-1042675.499000001698732;0
6220;-742318.432999998331070;-1043062.949999999254942;0
4767;-742786.899999998509884;-1042835.736000001430511;0
5695;-743417.217999998480082;-1043638.749000001698732;0
8049;-742198.890000000596046;-1044891.600000001490116;0
6650;-741714.296999998390675;-1044110.177000001072884;0
6144;-742308.925000000745058;-1043059.002000000327826;0
4171;-742796.910000000149012;-1043722.629999998956919;0
1652;-741379.000000000000000;-1044550.000000000000000;0
1598;-742351.000000000000000;-1045090.000000000000000;0
6272;-742325.379000000655651;-1043017.383000001311302;0
5223;-743283.699999999254942;-1043535.940000001341105;0
6306;-741842.129999998956919;-1042752.739999998360872;0
6214;-742315.447999998927116;-1043059.026000000536442;0
7220;-742418.820000000298023;-1044813.199999999254942;0
692;-742292.000000000000000;-1043084.000000000000000;0
6192;-742317.252000000327826;-1043065.394999999552965;0
4532;-742760.140000000596046;-1042899.600000001490116;0
6142;-742310.477000001817942;-1043061.813000001013279;0
6714;-742287.171000000089407;-1044923.995999999344349;0
520;-742225.000000000000000;-1043127.000000000000000;0
4783;-742933.866999998688698;-1042668.403000000864267;0
1337;-741723.000000000000000;-1044886.000000000000000;0
5416;-742963.127999998629093;-1042713.598000001162291;0
4827;-743046.359999999403954;-1042958.140000000596046;0
3942;-743420.800000000745058;-1043492.339999999850988;0
6473;-741931.359999999403954;-1044555.109999999403954;0
6159;-742312.495999999344349;-1043062.521000001579523;0
4996;-742488.458999998867512;-1042974.723999999463558;0
6200;-742318.653999999165535;-1043066.462000001221895;0
7728;-743360.581999998539686;-1044610.631000000983477;0
2256;-743156.000000000000000;-1045353.000000000000000;0
5691;-743415.714000001549721;-1043637.241000000387430;0
629;-742200.000000000000000;-1043289.000000000000000;0
6682;-742329.804000001400709;-1044319.611999999731779;0
5026;-742631.168999999761581;-1042903.938999999314547;0
6268;-742340.850000001490116;-1043018.881000000983477;0
3233;-744152.962999999523163;-1042686.791999999433756;0
4242;-742214.469999998807907;-1043415.800000000745058;0
4250;-742144.109999999403954;-1043367.519999999552965;0
7781;-743030.026999998837709;-1045857.486000001430511;0
683;-742362.000000000000000;-1043155.000000000000000;0
6240;-742364.495999999344349;-1043067.289999999105930;0
4947;-742399.918000001460314;-1042993.458000000566244;0
6172;-742317.552999999374151;-1043068.875999998301268;0
4633;-742625.931000001728535;-1042639.918999999761581;0
1034;-741964.000000000000000;-1044876.000000000000000;0
3747;-743250.879999998956919;-1042956.620000001043081;0
5502;-743427.894999999552965;-1043706.885000001639128;0
6251;-742377.396999999880791;-1043042.284000001847744;0
4975;-742477.829999998211861;-1043016.923000000417233;0
190;-743443.000000000000000;-1043597.000000000000000;0
1218;-742120.000000000000000;-1044309.000000000000000;0
5600;-743410.407000001519918;-1043680.594000000506639;0
266;-743321.000000000000000;-1043735.000000000000000;0
4961;-742309.460000000894070;-1043010.730000000447035;0
5577;-743409.385999999940395;-1043630.826999999582767;0
4755;-742734.960000000894070;-1042778.019999999552965;0
6695;-742306.234000001102686;-1044816.138999998569489;0
913;-741742.000000000000000;-1042579.000000000000000;0
5645;-743428.886999998241663;-1043692.285999998450279;0
621;-742285.000000000000000;-1043282.000000000000000;0
649;-742233.000000000000000;-1043382.000000000000000;0
6147;-742314.177000001072884;-1043067.070999998599291;0
6276;-742310.815999999642372;-1043016.000999998301268;0
6239;-742363.504999998956919;-1043069.298000000417233;0
6849;-741635.855999998748302;-1045019.947999998927116;0
5588;-743425.002000000327826;-1043679.451999999582767;0
4702;-742669.300000000745058;-1042747.399999998509884;0
4474;-741831.079999998211861;-1042685.068999998271465;0
6273;-742321.806000001728535;-1043017.085000000894070;0
4854;-742971.159000001847744;-1042912.429000001400709;0
3955;-743412.653000000864267;-1043555.727000001817942;0
7741;-742302.225999999791384;-1045079.842999998480082;0
5660;-743425.633999999612570;-1043709.497000001370907;0
7699;-742381.114000000059605;-1044818.644000001251698;0
581;-741991.000000000000000;-1043457.000000000000000;0
5596;-743415.271999999880791;-1043680.212999999523163;0
690;-742306.000000000000000;-1043081.000000000000000;0
464;-741713.000000000000000;-1043286.000000000000000;0
4677;-742787.309999998658895;-1042797.899999998509884;0
6165;-742315.407000001519918;-1043066.436000000685453;0
6211;-742317.785000000149012;-1043063.318999998271465;0
6281;-742307.629000000655651;-1043042.113000001758337;0
1350;-741814.000000000000000;-1044844.000000000000000;0
4741;-742787.859999999403954;-1042715.800000000745058;0
1148;-741324.000000000000000;-1044481.000000000000000;0
679;-742404.000000000000000;-1043185.000000000000000;0
7168;-742792.969999998807907;-1044547.879999998956919;0
4894;-742610.888999998569489;-1042819.686999998986721;0
5676;-743406.725999999791384;-1043716.493000000715256;0
6245;-742369.682000000029802;-1043057.377000000327826;0
5515;-743426.960000000894070;-1043612.083999998867512;0
3366;-743913.831000000238419;-1043002.796999998390675;0
3352;-743954.622000001370907;-1043015.732999999076128;0
6190;-742318.782999999821186;-1043068.206000000238419;0
4902;-742480.460000000894070;-1042802.989999998360872;0
570;-742098.000000000000000;-1043582.000000000000000;0
216;-743023.000000000000000;-1043539.000000000000000;0
4774;-742900.078999999910593;-1042854.859000001102686;0
6199;-742319.442000001668930;-1043067.822999998927116;0
4800;-742990.043000001460314;-1042700.708000000566244;0
709;-741861.000000000000000;-1042862.000000000000000;0
7180;-742618.809000000357628;-1044646.109000001102686;0
4950;-742354.289999999105930;-1042955.670000001788139;0
2227;-743029.000000000000000;-1045506.000000000000000;0
3336;-743972.239999998360872;-1043004.743000000715256;0
6246;-742370.552999999374151;-1043055.625999998301268;0
4129;-742890.405000001192093;-1044048.370000001043081;0
1918;-743377.000000000000000;-1044428.000000000000000;0
1052;-741761.000000000000000;-1045002.000000000000000;0
6603;-741616.600000001490116;-1043854.019999999552965;0
3763;-743140.420000001788139;-1042987.649999998509884;0
7198;-742561.769999999552965;-1044881.949999999254942;0
1129;-741672.000000000000000;-1044438.000000000000000;0
4132;-742818.859999999403954;-1044067.969999998807907;0
6171;-742310.780999999493361;-1043057.971000000834465;0
5170;-743246.743000000715256;-1043425.304000001400709;0
4524;-742683.789999999105930;-1042823.579999998211861;0
4938;-742469.324999999254942;-1042658.263000000268221;0
7777;-743079.782999999821186;-1045794.026000000536442;0
6198;-742312.659000001847744;-1043056.964999999850988;0
4506;-742419.730000000447035;-1042717.019999999552965;0
1792;-742165.000000000000000;-1044209.000000000000000;0
5705;-743417.603000000119209;-1043637.098000001162291;0
988;-741820.000000000000000;-1044516.000000000000000;0
3789;-743137.469999998807907;-1042933.670000001788139;0
1503;-741537.000000000000000;-1044272.000000000000000;0
4765;-742822.897999998182058;-1042850.499000001698732;0
5665;-743419.725000001490116;-1043711.682000000029802;0
6186;-742314.337999999523163;-1043061.517000000923872;0
5730;-743418.855999998748302;-1043638.949000000953674;0
6210;-742318.541000001132488;-1043064.662999998778105;0
5216;-743284.217999998480082;-1043325.638999998569489;0
4737;-742718.399999998509884;-1042684.079999998211861;0
5650;-743429.348999999463558;-1043698.318999998271465;0
5703;-743417.385000001639128;-1043633.592000000178814;0
4745;-742840.800000000745058;-1042742.120000001043081;0
6040;-742075.469999998807907;-1043676.809999998658895;0
408;-742317.000000000000000;-1044182.000000000000000;0
5706;-743417.688999999314547;-1043638.852000001817942;0
6152;-742310.348999999463558;-1043060.046999998390675;0
6806;-741090.381000000983477;-1044706.675999999046326;0
219;-742979.000000000000000;-1043549.000000000000000;0
4784;-742945.712999999523163;-1042685.611999999731779;0
3760;-743233.829999998211861;-1042978.739999998360872;0
4839;-742984.162000000476837;-1042715.425000000745058;0
6196;-742314.190000001341105;-1043059.774999998509884;0
2284;-742901.000000000000000;-1045502.000000000000000;0
576;-742054.000000000000000;-1043517.000000000000000;0
6282;-742308.337999999523163;-1043045.984000001102686;0
5647;-743429.070999998599291;-1043694.699000000953674;0
3367;-743914.585000000894070;-1043020.743999999016523;0
6154;-742316.324000000953674;-1043069.546000000089407;0
6161;-742310.964999999850988;-1043059.710999999195337;0
8280;-742150.949999999254942;-1042770.420000001788139;0
3322;-743927.326000001281500;-1042934.425999999046326;0
4740;-742757.410000000149012;-1042715.589999999850988;0
2503;-742753.000000000000000;-1045484.000000000000000;0
4580;-742393.905000001192093;-1042551.807000000029802;0
3324;-743935.892000000923872;-1042963.829999998211861;0
5643;-743428.701999999582767;-1043689.872999999672174;0
1149;-741311.000000000000000;-1044471.000000000000000;0
