OID_;X;Y;TEMPERATURE
3614;-744984.548999998718500;-1042283.640999998897314;0
110;-744127.000000000000000;-1042724.000000000000000;0
3019;-744463.447999998927116;-1042784.646000001579523;0
3568;-744718.817999999970198;-1042588.614999998360872;0
3692;-744525.876499999314547;-1042540.534000001847744;0
3580;-744924.973999999463558;-1042593.699999999254942;0
2605;-745393.842999998480082;-1042860.796000000089407;0
5975;-745052.346999999135733;-1042674.673000000417233;0
118;-745135.000000000000000;-1042687.000000000000000;0
3542;-744575.274000000208616;-1042656.160000000149012;0
2696;-743477.489999998360872;-1042038.000000000000000;0
2520;-741847.000000000000000;-1045324.000000000000000;0
696;-742077.000000000000000;-1042913.000000000000000;0
7259;-742935.280000001192093;-1044869.829999998211861;0
1524;-741710.000000000000000;-1043844.000000000000000;0
7;-743479.000000000000000;-1042567.000000000000000;0
2070;-742993.000000000000000;-1044723.000000000000000;0
1521;-741808.000000000000000;-1043917.000000000000000;0
3066;-744075.627000000327826;-1042883.837000001221895;0
3752;-743213.949999999254942;-1042902.719999998807907;0
725;-741983.000000000000000;-1042939.000000000000000;0
2149;-742819.000000000000000;-1045024.000000000000000;0
6;-743464.000000000000000;-1042594.000000000000000;0
3216;-743615.890999998897314;-1042451.129999998956919;0
8077;-742038.989999998360872;-1045265.309999998658895;0
2154;-742805.000000000000000;-1045147.000000000000000;0
465;-741728.000000000000000;-1043309.000000000000000;0
1540;-742005.000000000000000;-1044009.000000000000000;0
4047;-743210.230000000447035;-1043992.289999999105930;0
744;-741666.000000000000000;-1042994.000000000000000;0
509;-741991.000000000000000;-1043143.000000000000000;0
7142;-742872.445000000298023;-1044472.239999998360872;0
1780;-741214.000000000000000;-1043934.000000000000000;0
7147;-742827.925000000745058;-1044451.385000001639128;0
2103;-743182.000000000000000;-1044931.000000000000000;0
7278;-742803.899999998509884;-1044636.800000000745058;0
2091;-742920.000000000000000;-1044593.000000000000000;0
1272;-742237.000000000000000;-1044545.000000000000000;0
2212;-743217.000000000000000;-1045279.000000000000000;0
1797;-743098.000000000000000;-1044099.000000000000000;0
283;-743026.000000000000000;-1043788.000000000000000;0
4331;-742391.967999998480082;-1043310.539000000804663;0
6962;-743011.489999998360872;-1044196.070000000298023;0
7162;-743075.840999998152256;-1044541.596000000834465;0
7003;-743074.140000000596046;-1044350.280000001192093;0
6977;-743098.949999999254942;-1044459.879999998956919;0
7000;-743096.190000001341105;-1044426.870000001043081;0
7410;-743525.730000000447035;-1045377.420000001788139;0
1822;-742986.199999999254942;-1044211.969999998807907;0
6701;-742295.142000000923872;-1044533.372000001370907;0
651;-742490.000000000000000;-1043564.000000000000000;0
2185;-743216.000000000000000;-1045130.000000000000000;0
8284;-742219.410000000149012;-1042809.500000000000000;0
2193;-743531.000000000000000;-1045204.000000000000000;0
6946;-742974.765000000596046;-1043929.388000000268221;0
4060;-742896.530000001192093;-1043699.219999998807907;0
6556;-741290.410000000149012;-1044041.471000000834465;0
3974;-743140.660000000149012;-1043725.350000001490116;0
6826;-741405.300000000745058;-1044777.199999999254942;0
4098;-742789.157000001519918;-1043861.918999999761581;0
3092;-743909.377999998629093;-1042780.322999998927116;0
3995;-743393.225000001490116;-1043973.719999998807907;0
6945;-742955.907000001519918;-1043932.182999998331070;0
2226;-743057.000000000000000;-1045470.000000000000000;0
2237;-743368.000000000000000;-1045238.000000000000000;0
4071;-742929.394999999552965;-1043807.585000000894070;0
3211;-743651.409000001847744;-1042483.458999998867512;0
2321;-742679.000000000000000;-1045480.000000000000000;0
4208;-742372.416999999433756;-1043503.423000000417233;0
1421;-741587.000000000000000;-1044356.000000000000000;0
1515;-741913.000000000000000;-1044072.000000000000000;0
7946;-742007.769999999552965;-1044091.789999999105930;0
7207;-742570.620000001043081;-1045016.149999998509884;0
7716;-743023.190999999642372;-1045843.241999998688698;0
738;-741818.000000000000000;-1043024.000000000000000;0
6872;-741751.719999998807907;-1045296.679999999701977;0
7397;-743021.859999999403954;-1045682.989999998360872;0
2247;-743199.000000000000000;-1045400.000000000000000;0
733;-741963.000000000000000;-1043018.000000000000000;0
1756;-742165.000000000000000;-1045209.000000000000000;0
2275;-742845.000000000000000;-1045719.000000000000000;0
4080;-742832.480000000447035;-1043782.030000001192093;0
7656;-742290.328000001609325;-1045294.499000001698732;0
1014;-742097.000000000000000;-1044586.000000000000000;0
4326;-742319.855000000447035;-1043419.918999999761581;0
2397;-742181.000000000000000;-1045368.000000000000000;0
7744;-742941.256999999284744;-1045533.171000000089407;0
8262;-742129.620000001043081;-1042698.079999998211861;0
2760;-743863.331000000238419;-1043483.304000001400709;0
2562;-741090.000000000000000;-1044404.000000000000000;0
596;-741867.000000000000000;-1043259.000000000000000;0
1697;-741495.000000000000000;-1044664.000000000000000;0
6727;-742522.868000000715256;-1044395.879999998956919;0
7347;-742557.690000001341105;-1045177.440000001341105;0
4340;-742473.662000000476837;-1043349.048999998718500;0
2095;-743178.000000000000000;-1044734.000000000000000;0
4500;-742315.239999998360872;-1042719.460000000894070;0
2061;-742681.000000000000000;-1044491.000000000000000;0
1112;-741189.050000000745058;-1044602.469999998807907;0
1487;-741117.000000000000000;-1044216.000000000000000;0
5272;-743000.013999998569489;-1043245.364000000059605;0
2755;-744003.879000000655651;-1043471.734000001102686;0
8049;-742198.890000000596046;-1044891.600000001490116;0
2316;-742823.000000000000000;-1045463.000000000000000;0
2334;-742872.000000000000000;-1045519.000000000000000;0
2008;-743242.000000000000000;-1044759.000000000000000;0
3366;-743913.831000000238419;-1043002.796999998390675;0
6096;-742098.760000001639128;-1043615.589999999850988;0
1584;-742368.000000000000000;-1044717.000000000000000;0
2218;-743091.000000000000000;-1045372.000000000000000;0
6448;-744017.179999999701977;-1043123.899999998509884;0
1614;-742388.000000000000000;-1044432.000000000000000;0
2404;-742179.000000000000000;-1045467.000000000000000;0
350;-742505.000000000000000;-1043757.000000000000000;0
503;-741879.000000000000000;-1043158.000000000000000;32
6806;-741090.381000000983477;-1044706.675999999046326;0
2274;-742870.000000000000000;-1045732.000000000000000;0
2130;-743095.000000000000000;-1045126.000000000000000;0
2741;-744016.675000000745058;-1043336.642999999225140;0
79;-744062.000000000000000;-1043257.000000000000000;0
2021;-743281.000000000000000;-1044948.000000000000000;0
4257;-742056.467000000178814;-1043503.657999999821186;0
2044;-743445.000000000000000;-1044960.000000000000000;0
1994;-743483.000000000000000;-1045010.000000000000000;0
512;-742063.000000000000000;-1043136.000000000000000;0
2418;-742410.000000000000000;-1045109.000000000000000;0
3365;-743840.598999999463558;-1043023.565000001341105;0
4025;-743202.881000000983477;-1043852.008000001311302;0
3919;-743904.947000000625849;-1043493.929999999701977;0
1971;-743385.000000000000000;-1044881.000000000000000;0
4033;-743319.719999998807907;-1043793.300000000745058;0
3309;-743830.328000001609325;-1042834.535000000149012;0
2892;-744005.317000001668930;-1043204.537000000476837;0
3373;-743814.043000001460314;-1043018.168000001460314;0
4169;-742414.420000001788139;-1043962.329999998211861;0
1686;-741143.910000000149012;-1044795.120000001043081;0
516;-742160.000000000000000;-1043135.000000000000000;0
1600;-742418.000000000000000;-1044944.000000000000000;0
591;-741912.000000000000000;-1043346.000000000000000;0
4089;-742812.844999998807907;-1043560.114999998360872;0
5322;-743060.379999998956919;-1043029.589999999850988;0
1444;-741559.000000000000000;-1044786.000000000000000;0
2457;-741016.000000000000000;-1044542.000000000000000;0
1949;-743248.000000000000000;-1044491.000000000000000;0
2049;-743499.000000000000000;-1045071.000000000000000;0
827;-742218.000000000000000;-1042626.000000000000000;0
7118;-743468.750000000000000;-1044677.690000001341105;0
4174;-742738.230000000447035;-1043763.155000001192093;0
1319;-741788.000000000000000;-1044905.000000000000000;0
397;-742355.000000000000000;-1043861.000000000000000;0
1618;-742405.000000000000000;-1044404.000000000000000;0
8270;-742019.480000000447035;-1042725.870000001043081;0
1587;-742372.000000000000000;-1044806.000000000000000;0
7706;-742313.239999998360872;-1044319.611999999731779;0
7652;-742275.046999998390675;-1045497.052000001072884;0
1436;-741869.000000000000000;-1044323.000000000000000;0
1293;-742037.000000000000000;-1044462.000000000000000;0
1382;-742096.000000000000000;-1045023.000000000000000;0
3871;-742356.649999998509884;-1042420.543999999761581;0
7740;-742301.949999999254942;-1045061.239000000059605;0
6861;-741491.429999999701977;-1045010.300000000745058;0
1267;-742040.000000000000000;-1044999.000000000000000;0
5303;-743164.818999998271465;-1043211.078000001609325;0
5296;-743058.934999998658895;-1043177.035000000149012;0
7732;-742611.719000000506639;-1044632.203999999910593;0
7995;-741545.920000001788139;-1045160.100000001490116;0
6002;-742018.502000000327826;-1043294.918999999761581;0
4059;-743142.649999998509884;-1043612.730000000447035;0
675;-742446.000000000000000;-1043215.000000000000000;0
2236;-743391.000000000000000;-1045242.000000000000000;0
7189;-742588.486999999731779;-1044766.690999999642372;0
3760;-743233.829999998211861;-1042978.739999998360872;0
2329;-742432.000000000000000;-1045508.000000000000000;0
5317;-743063.690000001341105;-1043053.769999999552965;0
8150;-743304.219999998807907;-1043217.539999999105930;0
1957;-743402.000000000000000;-1044519.000000000000000;0
1313;-741681.000000000000000;-1044849.000000000000000;0
1005;-741944.000000000000000;-1044583.000000000000000;0
6716;-742256.467000000178814;-1044966.368000000715256;0
7027;-743237.269999999552965;-1044095.524999998509884;0
2394;-742273.000000000000000;-1045360.000000000000000;0
1767;-741261.000000000000000;-1044168.000000000000000;0
224;-742904.000000000000000;-1043522.000000000000000;0
6746;-742405.083999998867512;-1044259.199999999254942;0
6686;-742381.967000000178814;-1044961.747000001370907;0
5112;-742942.920000001788139;-1043441.850000001490116;0
7977;-741271.370000001043081;-1044404.390000000596046;0
1791;-742157.000000000000000;-1044163.000000000000000;0
6843;-741569.070000000298023;-1044975.261999998241663;0
4512;-742515.339999999850988;-1042750.230000000447035;0
1760;-741162.000000000000000;-1044101.000000000000000;0
2576;-742487.000000000000000;-1045483.000000000000000;0
5969;-742284.809999998658895;-1044169.578000001609325;0
1919;-743381.000000000000000;-1044393.000000000000000;0
2060;-742659.000000000000000;-1044472.000000000000000;0
7245;-742748.780000001192093;-1044837.699999999254942;0
527;-742186.000000000000000;-1043818.000000000000000;0
2081;-742551.000000000000000;-1044621.000000000000000;0
6706;-742275.234999999403954;-1044689.607999999076128;0
6014;-742844.000000000000000;-1043239.482999999076128;0
1036;-741961.000000000000000;-1044922.000000000000000;0
7016;-742557.515000000596046;-1044334.074999999254942;0
4933;-742437.605000000447035;-1042750.853000000119209;0
7019;-742585.024999998509884;-1044210.725000001490116;0
5706;-743417.688999999314547;-1043638.852000001817942;0
4578;-742381.817000001668930;-1042594.177999999374151;0
1650;-741371.000000000000000;-1044490.000000000000000;0
6660;-741490.809999998658895;-1044176.750000000000000;0
307;-742781.000000000000000;-1044143.000000000000000;0
3128;-743948.160000000149012;-1042657.320000000298023;0
7928;-743542.539999999105930;-1044784.769999999552965;0
568;-742116.000000000000000;-1043604.000000000000000;0
6195;-742314.956000000238419;-1043061.181000001728535;0
4921;-742444.739999998360872;-1042908.420000001788139;0
5117;-742816.081999998539686;-1043298.302999999374151;0
1454;-741521.000000000000000;-1044499.000000000000000;0
1500;-741441.000000000000000;-1044299.000000000000000;0
5155;-743140.712999999523163;-1043357.901999998837709;0
6177;-742313.717999998480082;-1043061.859999999403954;0
6823;-741313.910000000149012;-1044788.510000001639128;0
207;-743142.000000000000000;-1043590.000000000000000;0
524;-742255.000000000000000;-1043913.000000000000000;0
1087;-741605.000000000000000;-1044533.000000000000000;0
1964;-743412.000000000000000;-1044708.000000000000000;0
5239;-743361.096000000834465;-1043279.333999998867512;0
2162;-742917.000000000000000;-1045162.000000000000000;0
4675;-742805.809999998658895;-1042785.070000000298023;0
3987;-743311.475000001490116;-1043983.175000000745058;0
1554;-741348.000000000000000;-1044238.000000000000000;0
5229;-743327.379999998956919;-1043528.620000001043081;0
3837;-743093.699999999254942;-1042577.890000000596046;0
4623;-742533.778999999165535;-1042585.824000000953674;0
6314;-743939.670000001788139;-1042606.239999998360872;0
1258;-742076.000000000000000;-1044837.000000000000000;0
4972;-742479.962999999523163;-1043052.368999999016523;0
1144;-741402.000000000000000;-1044470.000000000000000;0
578;-742023.000000000000000;-1043464.000000000000000;0
7012;-742805.839999999850988;-1044263.870000001043081;0
4795;-743049.835000000894070;-1042669.013000000268221;0
5120;-742868.383999999612570;-1043343.986000001430511;0
4002;-743397.818999998271465;-1044054.317999999970198;0
4664;-742806.739999998360872;-1042547.980000000447035;0
3314;-743758.675999999046326;-1042905.688999999314547;0
1122;-741749.000000000000000;-1044455.000000000000000;0
249;-743433.000000000000000;-1043775.000000000000000;0
1252;-742096.000000000000000;-1044711.000000000000000;103
7202;-742561.410000000149012;-1044949.640000000596046;0
1107;-741239.260000001639128;-1044580.940000001341105;0
1119;-741791.000000000000000;-1044446.000000000000000;0
302;-742925.000000000000000;-1044109.000000000000000;0
553;-742251.000000000000000;-1043741.000000000000000;0
6365;-741979.230000000447035;-1042656.230000000447035;0
5211;-743299.236000001430511;-1043364.945000000298023;0
1867;-743474.000000000000000;-1044257.000000000000000;0
4132;-742818.859999999403954;-1044067.969999998807907;0
1936;-743293.000000000000000;-1044272.000000000000000;0
785;-741702.000000000000000;-1042622.000000000000000;0
1026;-741986.000000000000000;-1044631.000000000000000;0
5016;-742572.212000001221895;-1042955.526999998837709;0
6240;-742364.495999999344349;-1043067.289999999105930;0
6270;-742333.412999998778105;-1043018.204999998211861;0
4772;-742879.881999999284744;-1042872.157000001519918;0
1045;-741849.000000000000000;-1044775.000000000000000;0
5022;-742578.440000001341105;-1042849.350000001490116;0
6291;-743672.399000000208616;-1042955.638000000268221;0
4199;-742205.142999999225140;-1043745.868000000715256;0
168;-743427.000000000000000;-1043311.000000000000000;0
184;-743445.000000000000000;-1043450.000000000000000;0
5148;-743071.477000001817942;-1043411.539999999105930;0
6188;-742312.807999998331070;-1043058.706999998539686;0
4744;-742848.129999998956919;-1042759.629999998956919;0
7083;-743309.980000000447035;-1044509.500000000000000;0
4741;-742787.859999999403954;-1042715.800000000745058;0
6692;-742222.114999998360872;-1044818.673000000417233;0
4983;-742587.776000000536442;-1043013.068999998271465;0
384;-742471.000000000000000;-1043766.000000000000000;0
4724;-742870.089999999850988;-1042658.210000000894070;0
263;-743389.000000000000000;-1043725.000000000000000;0
4667;-742823.039999999105930;-1042631.620000001043081;0
6252;-742378.052000001072884;-1043040.958000000566244;0
4951;-742335.579999998211861;-1042934.429999999701977;0
1628;-742449.000000000000000;-1044494.000000000000000;0
5645;-743428.886999998241663;-1043692.285999998450279;0
1355;-741899.000000000000000;-1044858.000000000000000;0
1892;-743525.000000000000000;-1044425.000000000000000;0
1425;-742080.000000000000000;-1044210.000000000000000;0
3781;-743273.059999998658895;-1042814.050000000745058;0
5689;-743415.442000001668930;-1043633.646000001579523;0
708;-741854.000000000000000;-1042881.000000000000000;0
5668;-743416.179999999701977;-1043712.995000001043081;0
4603;-742442.480000000447035;-1042617.250000000000000;0
679;-742404.000000000000000;-1043185.000000000000000;0
4920;-742444.449999999254942;-1042928.980000000447035;0
1341;-741687.000000000000000;-1044742.000000000000000;0
6161;-742310.964999999850988;-1043059.710999999195337;0
1299;-741943.000000000000000;-1044719.000000000000000;0
3791;-743144.839999999850988;-1042881.120000001043081;0
6278;-742305.421999998390675;-1043028.918000001460314;0
4826;-743043.850000001490116;-1042979.600000001490116;0
3794;-743091.015000000596046;-1042800.471999999135733;0
4850;-742956.164000000804663;-1042923.403000000864267;0
4636;-742576.870999999344349;-1042687.116999998688698;0
4253;-742109.368000000715256;-1043416.399999998509884;0
4729;-742855.690000001341105;-1042695.640000000596046;0
4122;-742732.074999999254942;-1043923.995000001043081;0
7325;-743032.969999998807907;-1045186.298999998718500;0
3107;-743778.888000000268221;-1042682.131999999284744;0
4948;-742386.929999999701977;-1042992.239999998360872;0
1318;-741838.000000000000000;-1044940.000000000000000;0
1189;-741786.000000000000000;-1044043.000000000000000;0
2577;-742491.000000000000000;-1045513.000000000000000;0
6395;-742057.429999999701977;-1042500.809999998658895;0
4823;-742936.660000000149012;-1042868.949999999254942;0
993;-741977.000000000000000;-1044436.000000000000000;0
4152;-742564.589999999850988;-1044089.934999998658895;0
3269;-743600.679000001400709;-1042731.660000000149012;0
730;-741948.000000000000000;-1042998.000000000000000;0
6151;-742311.114999998360872;-1043061.451000001281500;0
4748;-742895.730000000447035;-1042781.289999999105930;0
5956;-742960.690999999642372;-1043513.846999999135733;0
1974;-743398.000000000000000;-1044958.000000000000000;0
4676;-742792.579999998211861;-1042771.519999999552965;0
798;-741797.000000000000000;-1042590.000000000000000;0
3265;-743560.760000001639128;-1042741.429000001400709;0
5598;-743412.839999999850988;-1043680.403000000864267;0
3295;-743595.543000001460314;-1042827.322000000625849;0
6159;-742312.495999999344349;-1043062.521000001579523;0
1655;-741391.000000000000000;-1044651.000000000000000;0
2322;-742651.000000000000000;-1045483.000000000000000;0
4145;-742687.109999999403954;-1043837.125000000000000;0
5640;-743428.425000000745058;-1043686.254000000655651;0
1013;-742076.000000000000000;-1044595.000000000000000;0
3839;-743112.140000000596046;-1042558.280000001192093;0
1297;-742120.000000000000000;-1044453.000000000000000;0
4606;-742512.769000001251698;-1042608.333000000566244;0
1916;-743371.000000000000000;-1044484.000000000000000;0
1058;-741667.000000000000000;-1045072.000000000000000;0
4430;-742235.070000000298023;-1043092.839999999850988;0
348;-742525.000000000000000;-1043787.000000000000000;0
1509;-741741.000000000000000;-1044196.000000000000000;0
6104;-742208.646999999880791;-1043103.999000001698732;0
1946;-743281.000000000000000;-1044437.000000000000000;0
6952;-743044.730999998748302;-1044106.129999998956919;0
7982;-741163.039999999105930;-1044413.210000000894070;0
1307;-741803.000000000000000;-1044663.000000000000000;0
6172;-742317.552999999374151;-1043068.875999998301268;0
4223;-742161.556000001728535;-1043473.138999998569489;0
1708;-741170.820000000298023;-1044705.589999999850988;0
2488;-742083.000000000000000;-1044303.000000000000000;0
5025;-742609.543000001460314;-1042894.629000000655651;0
4562;-742471.000000000000000;-1042510.920000001788139;0
6227;-742319.839999999850988;-1043063.936000000685453;0
333;-742651.000000000000000;-1043996.000000000000000;0
3961;-743419.609999999403954;-1043589.497000001370907;0
3287;-743711.173999998718500;-1042886.515999998897314;0
329;-742675.000000000000000;-1044052.000000000000000;0
5235;-743350.096000000834465;-1043388.881000000983477;0
4853;-742981.855000000447035;-1042884.537000000476837;0
633;-742100.000000000000000;-1043296.000000000000000;0
628;-742217.370000001043081;-1043308.559999998658895;0
5579;-743409.682999998331070;-1043634.574999999254942;0
1698;-741464.000000000000000;-1044668.000000000000000;0
6265;-742353.164999999105930;-1043020.054999999701977;0
3976;-743088.861000001430511;-1043707.728000000119209;0
3832;-743029.390000000596046;-1042595.910000000149012;0
5679;-743403.182000000029802;-1043717.807000000029802;0
4325;-742270.679000001400709;-1043141.787999998778105;0
2369;-742503.000000000000000;-1045427.000000000000000;0
1411;-741639.480000000447035;-1044683.019999999552965;0
885;-741739.000000000000000;-1042777.000000000000000;0
6353;-741893.070000000298023;-1042697.059999998658895;0
6503;-741647.706000000238419;-1044996.008999999612570;0
1873;-743410.000000000000000;-1044260.000000000000000;0
305;-742837.000000000000000;-1044130.000000000000000;0
4699;-742676.469999998807907;-1042731.760000001639128;0
4835;-742967.660000000149012;-1042677.690000001341105;0
6648;-741750.510000001639128;-1044080.329999998211861;0
7026;-743217.644999999552965;-1044082.329999998211861;0
3233;-744152.962999999523163;-1042686.791999999433756;0
1419;-741603.000000000000000;-1044410.000000000000000;0
5171;-743266.124000001698732;-1043419.293999999761581;0
626;-742236.000000000000000;-1043317.000000000000000;0
3869;-742407.539999999105930;-1042414.850000001490116;0
1718;-741366.219999998807907;-1044870.989999998360872;0
4966;-742377.289999999105930;-1043071.030000001192093;0
1301;-741896.000000000000000;-1044703.000000000000000;0
1178;-741952.000000000000000;-1044311.000000000000000;0
4825;-742908.839999999850988;-1042860.670000001788139;0
4034;-743295.410000000149012;-1043786.070000000298023;0
705;-741929.000000000000000;-1042865.000000000000000;0
1860;-743472.000000000000000;-1044155.000000000000000;0
4220;-742214.344999998807907;-1043580.359999999403954;0
4791;-743022.245000001043081;-1042633.714000001549721;0
4841;-742989.993999999016523;-1042765.850999999791384;0
6179;-742312.195000000298023;-1043059.041000001132488;0
1396;-741798.000000000000000;-1044263.000000000000000;0
6239;-742363.504999998956919;-1043069.298000000417233;0
4873;-742775.690000001341105;-1042931.829999998211861;0
1235;-742150.000000000000000;-1044330.000000000000000;0
5212;-743283.975000001490116;-1043373.589999999850988;0
4764;-742839.835999999195337;-1042859.412999998778105;0
678;-742421.000000000000000;-1043181.000000000000000;0
4652;-742775.500000000000000;-1042533.997999999672174;0
4246;-742193.159000001847744;-1043412.537000000476837;0
1514;-741882.000000000000000;-1044096.000000000000000;0
4322;-742266.414000000804663;-1043213.907999999821186;0
236;-743459.000000000000000;-1043775.000000000000000;0
845;-742126.000000000000000;-1042505.000000000000000;0
2299;-742592.000000000000000;-1045409.000000000000000;0
2192;-743499.000000000000000;-1045199.000000000000000;0
630;-742179.000000000000000;-1043289.000000000000000;0
2142;-742883.000000000000000;-1045078.000000000000000;0
4689;-742688.114999998360872;-1042568.859999999403954;0
5213;-743326.385999999940395;-1043368.675999999046326;0
754;-741676.000000000000000;-1042727.000000000000000;0
4746;-742867.769999999552965;-1042768.570000000298023;0
836;-742006.000000000000000;-1042525.000000000000000;0
1321;-741825.000000000000000;-1044923.000000000000000;0
6389;-742141.199999999254942;-1042497.030000001192093;0
1215;-742091.000000000000000;-1044365.000000000000000;0
1412;-741635.760000001639128;-1044654.449999999254942;0
7957;-741692.839999999850988;-1044277.559999998658895;0
5370;-742580.300999999046326;-1042977.140999998897314;0
5718;-743420.888999998569489;-1043629.666999999433756;0
6152;-742310.348999999463558;-1043060.046999998390675;0
7539;-742682.600000001490116;-1045366.339999999850988;0
4702;-742669.300000000745058;-1042747.399999998509884;0
4925;-742455.502000000327826;-1042923.307000000029802;0
7040;-743356.140000000596046;-1044164.359999999403954;0
647;-742216.000000000000000;-1043375.000000000000000;0
4834;-742972.708000000566244;-1042657.809000000357628;0
7949;-741953.559999998658895;-1044123.660000000149012;0
5580;-743409.831000000238419;-1043636.449000000953674;0
6157;-742314.026999998837709;-1043065.331000000238419;0
6657;-741565.760000001639128;-1044156.980000000447035;0
191;-743424.000000000000000;-1043599.000000000000000;0
1153;-741245.000000000000000;-1044480.000000000000000;0
6782;-741303.329999998211861;-1044447.660000000149012;0
6391;-742109.269999999552965;-1042498.320000000298023;0
5685;-743396.092999998480082;-1043720.434000000357628;0
4723;-742883.429999999701977;-1042644.829999998211861;0
6133;-742309.820000000298023;-1043062.171999998390675;0
6194;-742315.721000000834465;-1043062.585999999195337;0
680;-742402.109999999403954;-1043166.679999999701977;0
8047;-742167.649999998509884;-1044854.320000000298023;0
5726;-743422.414000000804663;-1043635.760999999940395;0
6231;-742316.769000001251698;-1043058.344000000506639;0
4775;-742898.375999998301268;-1042802.914000000804663;0
5698;-743416.785999998450279;-1043633.638000000268221;0
4647;-742705.322999998927116;-1042525.425000000745058;0
5597;-743414.056000001728535;-1043680.309000000357628;0
340;-742588.000000000000000;-1043906.000000000000000;0
6191;-742318.017000000923872;-1043066.800999999046326;0
5728;-743421.517999999225140;-1043638.609000001102686;0
1111;-741167.030000001192093;-1044590.170000001788139;0
6320;-741766.848000001162291;-1042614.989999998360872;0
5144;-743052.642000000923872;-1043488.940000001341105;0
6131;-742311.329999998211861;-1043064.982999999076128;0
5687;-743415.142000000923872;-1043630.285999998450279;0
4897;-742560.320000000298023;-1042829.359999999403954;0
216;-743023.000000000000000;-1043539.000000000000000;0
1285;-742198.000000000000000;-1044467.000000000000000;0
4057;-743132.184999998658895;-1043648.719999998807907;0
1935;-743276.000000000000000;-1044289.000000000000000;0
6682;-742329.804000001400709;-1044319.611999999731779;0
1910;-743460.000000000000000;-1044391.000000000000000;0
4756;-742712.579999998211861;-1042776.829999998211861;0
1241;-742132.000000000000000;-1044436.000000000000000;0
5693;-743415.905000001192093;-1043640.377000000327826;0
824;-742142.000000000000000;-1042596.000000000000000;0
4520;-742651.079999998211861;-1042798.449999999254942;0
6140;-742311.999000001698732;-1043064.638999998569489;0
555;-742230.000000000000000;-1043726.000000000000000;0
4678;-742775.910000000149012;-1042839.929999999701977;0
6652;-741678.190000001341105;-1044132.780000001192093;0
4156;-742513.734999999403954;-1043978.035000000149012;0
4820;-742927.769999999552965;-1042786.710000000894070;0
4334;-742384.170000001788139;-1043468.820000000298023;0
3838;-743113.550000000745058;-1042543.399999998509884;0
513;-742083.000000000000000;-1043145.000000000000000;0
4739;-742751.690000001341105;-1042699.230000000447035;0
2524;-742108.000000000000000;-1044191.000000000000000;0
1243;-742122.000000000000000;-1044502.000000000000000;0
6257;-742381.556000001728535;-1043033.991000000387430;0
1090;-741581.000000000000000;-1044552.000000000000000;0
5224;-743293.449999999254942;-1043542.160000000149012;0
6213;-742316.227000001817942;-1043060.478999998420477;0
629;-742200.000000000000000;-1043289.000000000000000;0
6149;-742312.646000001579523;-1043064.261999998241663;0
5720;-743418.223000001162291;-1043629.960999999195337;0
4997;-742492.638000000268221;-1042962.833999998867512;0
3294;-743583.046999998390675;-1042805.258000001311302;0
6277;-742304.633999999612570;-1043024.256000000983477;0
4742;-742822.300000000745058;-1042747.920000001788139;0
327;-742687.000000000000000;-1044082.000000000000000;0
4810;-743058.420000001788139;-1042810.050000000745058;0
522;-742261.000000000000000;-1043122.000000000000000;0
6846;-741505.875000000000000;-1044995.949000000953674;0
3956;-743414.039999999105930;-1043561.081999998539686;0
795;-741770.000000000000000;-1042577.000000000000000;0
