OID_;X;Y;TEMPERATURE
3614;-744984.548999998718500;-1042283.640999998897314;0
5790;-743521.019999999552965;-1042064.280000001192093;0
3917;-743967.182999998331070;-1043516.284000001847744;0
2194;-743448.000000000000000;-1045193.000000000000000;0
3018;-744443.368000000715256;-1042805.962000001221895;0
23;-743544.000000000000000;-1042505.000000000000000;0
2265;-742972.000000000000000;-1045774.000000000000000;0
1532;-741805.000000000000000;-1043858.000000000000000;0
1809;-743160.000000000000000;-1044541.000000000000000;0
2809;-744090.649999998509884;-1043371.184000000357628;0
2277;-742826.000000000000000;-1045653.000000000000000;0
748;-741671.000000000000000;-1042971.000000000000000;0
728;-741997.000000000000000;-1042918.000000000000000;0
3811;-743244.620000001043081;-1042809.420000001788139;0
2246;-743218.000000000000000;-1045379.000000000000000;0
1561;-743186.000000000000000;-1045098.000000000000000;0
1310;-741623.000000000000000;-1044829.000000000000000;0
2020;-743260.000000000000000;-1044941.000000000000000;0
5293;-743043.969999998807907;-1043208.554000001400709;0
1584;-742368.000000000000000;-1044717.000000000000000;0
2150;-742812.000000000000000;-1045054.000000000000000;0
7652;-742275.046999998390675;-1045497.052000001072884;0
2466;-743460.000000000000000;-1044740.000000000000000;0
4087;-742811.609999999403954;-1043604.190000001341105;0
4239;-742454.206000000238419;-1043538.927999999374151;0
2210;-743280.000000000000000;-1045237.000000000000000;0
2316;-742823.000000000000000;-1045463.000000000000000;0
1751;-742046.000000000000000;-1045235.000000000000000;0
4060;-742896.530000001192093;-1043699.219999998807907;0
110;-744127.000000000000000;-1042724.000000000000000;3
2167;-743021.000000000000000;-1045154.000000000000000;0
5068;-742837.162999998778105;-1043263.965999998152256;0
1247;-742104.000000000000000;-1044609.000000000000000;0
2270;-742954.000000000000000;-1045592.000000000000000;0
7007;-742923.890000000596046;-1044218.879999998956919;0
281;-743045.000000000000000;-1043848.000000000000000;0
2399;-742121.000000000000000;-1045372.000000000000000;0
1062;-741560.000000000000000;-1045151.000000000000000;0
6824;-741347.350000001490116;-1044784.280000001192093;0
2761;-743859.467000000178814;-1043468.017000000923872;0
3262;-743572.423999998718500;-1042699.197000000625849;0
6846;-741505.875000000000000;-1044995.949000000953674;0
226;-742879.000000000000000;-1043516.000000000000000;0
2055;-743425.000000000000000;-1045038.000000000000000;0
1852;-742739.000000000000000;-1044210.000000000000000;0
2158;-742781.000000000000000;-1045197.000000000000000;0
2289;-742915.000000000000000;-1045426.000000000000000;0
7143;-742850.414999999105930;-1044473.449999999254942;0
8054;-742230.239999998360872;-1044988.530000001192093;0
4047;-743210.230000000447035;-1043992.289999999105930;0
734;-741935.000000000000000;-1043014.000000000000000;0
7138;-742917.554999999701977;-1044421.774999998509884;0
5111;-742892.337999999523163;-1043424.370999999344349;0
7017;-742571.059999998658895;-1044267.640000000596046;0
1760;-741162.000000000000000;-1044101.000000000000000;0
993;-741977.000000000000000;-1044436.000000000000000;0
7157;-742964.840999998152256;-1044545.681000001728535;0
1040;-741904.000000000000000;-1044623.000000000000000;0
2085;-742426.000000000000000;-1044797.000000000000000;0
6726;-742476.517999999225140;-1044410.600000001490116;0
722;-742139.000000000000000;-1043009.000000000000000;0
2520;-741847.000000000000000;-1045324.000000000000000;0
6686;-742381.967000000178814;-1044961.747000001370907;0
2059;-742625.000000000000000;-1044459.000000000000000;0
6776;-741098.559999998658895;-1044491.530000001192093;0
3702;-744567.984999999403954;-1042510.802000001072884;0
7077;-743564.359000001102686;-1045385.210000000894070;0
1298;-741964.000000000000000;-1044736.000000000000000;0
5149;-743072.195999998599291;-1043377.370999999344349;0
1254;-742090.000000000000000;-1044750.000000000000000;0
3111;-743727.034000001847744;-1042625.182999998331070;0
1136;-741520.000000000000000;-1044455.000000000000000;0
4331;-742391.967999998480082;-1043310.539000000804663;0
6827;-741437.300000000745058;-1044772.629999998956919;0
6493;-742196.574000000953674;-1044452.076999999582767;0
732;-741860.000000000000000;-1043003.000000000000000;0
350;-742505.000000000000000;-1043757.000000000000000;0
4233;-742334.782000001519918;-1043445.793000001460314;0
4852;-742992.449999999254942;-1042849.890000000596046;0
2526;-741087.000000000000000;-1044616.000000000000000;0
4141;-742804.644999999552965;-1044008.964999999850988;0
2343;-742674.000000000000000;-1045557.000000000000000;0
6749;-742418.210999999195337;-1044329.190999999642372;0
462;-741707.000000000000000;-1043294.000000000000000;0
1486;-741150.000000000000000;-1044219.000000000000000;0
568;-742116.000000000000000;-1043604.000000000000000;0
328;-742670.000000000000000;-1044072.000000000000000;0
4099;-742773.870000001043081;-1043846.135999999940395;0
582;-741994.000000000000000;-1043417.000000000000000;0
408;-742317.000000000000000;-1044182.000000000000000;0
336;-742616.000000000000000;-1043959.000000000000000;0
1939;-743269.000000000000000;-1044355.000000000000000;0
512;-742063.000000000000000;-1043136.000000000000000;0
2885;-744122.791999999433756;-1043190.208000000566244;0
6506;-741743.019999999552965;-1044571.050000000745058;0
3990;-743339.489999998360872;-1043987.234999999403954;0
1924;-743359.000000000000000;-1044320.000000000000000;0
2401;-742253.000000000000000;-1045390.000000000000000;0
599;-741837.000000000000000;-1043243.000000000000000;0
1450;-741527.000000000000000;-1044632.000000000000000;0
2893;-743977.276000000536442;-1043208.923999998718500;0
3998;-743432.704999998211861;-1043914.274999998509884;0
3542;-744575.274000000208616;-1042656.160000000149012;0
1674;-741099.000000000000000;-1044736.000000000000000;0
7801;-742459.168999999761581;-1044490.660000000149012;0
3279;-743638.815999999642372;-1042804.333999998867512;0
4168;-742423.695000000298023;-1043984.135000001639128;0
4144;-742704.414999999105930;-1043822.484999999403954;0
1703;-741320.000000000000000;-1044686.000000000000000;0
3752;-743213.949999999254942;-1042902.719999998807907;0
1490;-741023.000000000000000;-1044335.000000000000000;0
510;-742048.000000000000000;-1043150.000000000000000;0
3839;-743112.140000000596046;-1042558.280000001192093;0
3762;-743173.489999998360872;-1042984.559999998658895;0
1411;-741639.480000000447035;-1044683.019999999552965;0
6979;-743081.460000000894070;-1044413.079999998211861;0
8072;-742148.059999998658895;-1045271.649999998509884;0
1993;-743483.000000000000000;-1044984.000000000000000;0
524;-742255.000000000000000;-1043913.000000000000000;0
8266;-742220.320000000298023;-1042706.760000001639128;0
4876;-742826.449999999254942;-1042944.910000000149012;0
542;-742367.629999998956919;-1043814.379999998956919;0
3363;-743887.679000001400709;-1043023.973000001162291;0
4130;-742868.460000000894070;-1044055.510000001639128;0
4786;-742953.361000001430511;-1042655.886999998241663;0
1933;-743329.000000000000000;-1044407.000000000000000;0
3956;-743414.039999999105930;-1043561.081999998539686;0
7679;-742498.250000000000000;-1045115.879999998956919;0
2081;-742551.000000000000000;-1044621.000000000000000;0
3564;-744648.296999998390675;-1042605.850999999791384;0
7087;-743339.940000001341105;-1044536.690000001341105;0
1810;-743136.000000000000000;-1044544.000000000000000;0
94;-744054.000000000000000;-1042934.000000000000000;0
3465;-745090.089999999850988;-1042676.664999999105930;0
4236;-742406.842999998480082;-1043504.015000000596046;0
1824;-742963.809999998658895;-1044143.929999999701977;0
4904;-742460.050000000745058;-1042796.739999998360872;0
943;-742292.000000000000000;-1043017.000000000000000;0
2409;-742363.000000000000000;-1045093.000000000000000;0
7004;-743069.289999999105930;-1044326.469999998807907;0
2075;-743114.000000000000000;-1044772.000000000000000;0
7259;-742935.280000001192093;-1044869.829999998211861;0
2512;-743070.000000000000000;-1044052.000000000000000;0
3757;-743300.960000000894070;-1042956.699999999254942;0
4200;-742219.350000001490116;-1043727.980999998748302;0
4991;-742675.414999999105930;-1043031.236000001430511;0
8065;-742275.859999999403954;-1045204.550000000745058;0
4204;-742312.750999998301268;-1043589.962999999523163;0
1128;-741655.000000000000000;-1044448.000000000000000;0
210;-743112.000000000000000;-1043566.000000000000000;0
7807;-742647.802999999374151;-1044543.524000000208616;0
8044;-742176.640000000596046;-1044778.420000001788139;0
1330;-741817.000000000000000;-1044709.000000000000000;0
4074;-742943.350000001490116;-1043880.304999999701977;0
4032;-743136.934999998658895;-1043750.375000000000000;0
570;-742098.000000000000000;-1043582.000000000000000;0
707;-741897.000000000000000;-1042863.000000000000000;0
382;-742481.000000000000000;-1043751.000000000000000;0
1181;-741920.000000000000000;-1044230.000000000000000;0
2467;-743434.000000000000000;-1044742.000000000000000;0
7132;-743262.120000001043081;-1044825.699999999254942;0
4323;-742267.879999998956919;-1043190.035000000149012;0
5292;-743055.866000000387430;-1043215.710999999195337;0
6488;-741718.210000000894070;-1044532.489999998360872;0
4579;-742378.747999999672174;-1042626.699999999254942;0
6580;-741299.379000000655651;-1044005.879000000655651;0
2299;-742592.000000000000000;-1045409.000000000000000;0
892;-742946.000000000000000;-1042607.000000000000000;0
3819;-743120.250000000000000;-1042679.620000001043081;254
6870;-741708.260000001639128;-1045321.590999998152256;0
2523;-742181.000000000000000;-1044140.000000000000000;0
8149;-743305.579999998211861;-1043204.070000000298023;0
2232;-743488.000000000000000;-1045234.000000000000000;0
701;-742023.000000000000000;-1042885.000000000000000;0
1628;-742449.000000000000000;-1044494.000000000000000;0
31;-743485.000000000000000;-1042645.000000000000000;0
1604;-742552.000000000000000;-1044918.000000000000000;0
583;-741975.000000000000000;-1043434.000000000000000;0
7044;-743400.635000001639128;-1044135.579999998211861;0
7091;-743361.839999999850988;-1044584.039999999105930;0
3527;-744805.695999998599291;-1042671.809000000357628;0
500;-741861.000000000000000;-1043174.000000000000000;0
1890;-743522.000000000000000;-1044402.000000000000000;0
3885;-742418.339999999850988;-1042442.059999998658895;0
6415;-743180.657999999821186;-1043208.993999999016523;0
908;-742211.000000000000000;-1042501.000000000000000;0
4051;-743236.329999998211861;-1043889.710000000894070;0
7515;-742273.021999999880791;-1044371.543999999761581;0
7516;-742248.390000000596046;-1044368.907999999821186;0
1903;-743445.000000000000000;-1044281.000000000000000;0
1548;-742220.000000000000000;-1044216.000000000000000;0
913;-741742.000000000000000;-1042579.000000000000000;0
5369;-742583.364999998360872;-1042976.820999998599291;0
2036;-743404.000000000000000;-1044803.000000000000000;0
6254;-742379.344000000506639;-1043038.363000001758337;0
6385;-742179.530000001192093;-1042495.359999999403954;0
3213;-743635.473999999463558;-1042474.741999998688698;0
1991;-743482.000000000000000;-1044929.000000000000000;0
5325;-742997.480000000447035;-1043042.289999999105930;0
4653;-742788.747999999672174;-1042524.557000000029802;0
520;-742225.000000000000000;-1043127.000000000000000;0
6197;-742313.425000000745058;-1043058.370999999344349;0
2169;-742902.000000000000000;-1045108.000000000000000;0
3794;-743091.015000000596046;-1042800.471999999135733;0
8260;-742091.730000000447035;-1042690.769999999552965;0
5135;-742979.611000001430511;-1043468.912999998778105;0
7387;-743066.739999998360872;-1045487.570000000298023;0
6649;-741731.100000001490116;-1044094.850000001490116;0
7033;-743303.864999998360872;-1044132.750000000000000;0
7151;-742842.649000000208616;-1044545.307000000029802;0
5447;-743129.958999998867512;-1043365.166000001132488;0
2206;-743125.000000000000000;-1045327.000000000000000;0
1172;-741869.000000000000000;-1044348.000000000000000;110
6700;-742298.611000001430511;-1044507.315999999642372;0
5696;-743417.096000000834465;-1043637.135999999940395;0
3364;-743855.184999998658895;-1043024.940000001341105;0
1352;-741840.000000000000000;-1044854.000000000000000;0
4874;-742795.429999999701977;-1042925.910000000149012;0
3971;-743206.815000001341105;-1043721.065000001341105;0
5316;-743075.980000000447035;-1043041.059999998658895;0
4849;-742966.960000000894070;-1042893.583999998867512;0
6338;-742247.910000000149012;-1042851.670000001788139;0
6658;-741538.879999998956919;-1044165.440000001341105;0
635;-742143.000000000000000;-1043317.000000000000000;0
5923;-742953.765000000596046;-1043015.067999999970198;0
4638;-742553.631999999284744;-1042542.028000000864267;0
4716;-742893.160000000149012;-1042622.780000001192093;0
1165;-741037.420000001788139;-1044506.500000000000000;0
6004;-742061.723000001162291;-1043300.859999999403954;0
755;-741668.000000000000000;-1042700.000000000000000;0
671;-742489.000000000000000;-1043245.000000000000000;0
7282;-742809.410000000149012;-1044693.629999998956919;0
2380;-742308.000000000000000;-1045401.000000000000000;0
3308;-743813.059999998658895;-1042830.515000000596046;0
6104;-742208.646999999880791;-1043103.999000001698732;0
6147;-742314.177000001072884;-1043067.070999998599291;0
5228;-743334.289999999105930;-1043545.039999999105930;0
1219;-742137.000000000000000;-1044315.000000000000000;0
4161;-742506.254999998956919;-1044181.925000000745058;0
6675;-742272.140000000596046;-1044167.469999998807907;0
1016;-742147.000000000000000;-1044590.000000000000000;0
4210;-742178.550000000745058;-1043586.035000000149012;0
1020;-742293.000000000000000;-1044615.000000000000000;0
1035;-741963.000000000000000;-1044896.000000000000000;0
1428;-742028.000000000000000;-1044235.000000000000000;0
613;-742089.000000000000000;-1043271.000000000000000;0
283;-743026.000000000000000;-1043788.000000000000000;0
6306;-741842.129999998956919;-1042752.739999998360872;0
7943;-742063.449999999254942;-1044055.260000001639128;0
6785;-741294.269999999552965;-1044465.800000000745058;0
1319;-741788.000000000000000;-1044905.000000000000000;0
2503;-742753.000000000000000;-1045484.000000000000000;0
5198;-743259.600999999791384;-1043302.061000000685453;0
2370;-742460.000000000000000;-1045433.000000000000000;0
5455;-742823.936000000685453;-1043283.644999999552965;0
3793;-743101.820000000298023;-1042826.379999998956919;0
1519;-741754.000000000000000;-1043956.000000000000000;0
5444;-743183.024000000208616;-1043210.600000001490116;0
1364;-742077.000000000000000;-1044936.000000000000000;0
1271;-742240.000000000000000;-1044521.000000000000000;0
6156;-742314.791999999433756;-1043066.736000001430511;0
6263;-742365.719000000506639;-1043021.282999999821186;0
1881;-743269.000000000000000;-1044266.000000000000000;0
6206;-742314.043000001460314;-1043058.028999999165535;0
1320;-741870.000000000000000;-1044957.000000000000000;0
4892;-742663.079999998211861;-1042817.344999998807907;0
838;-742043.000000000000000;-1042524.000000000000000;0
1390;-742129.000000000000000;-1045069.000000000000000;0
8150;-743304.219999998807907;-1043217.539999999105930;0
8078;-742024.710000000894070;-1045262.460000000894070;0
5230;-743335.399999998509884;-1043517.670000001788139;0
4578;-742381.817000001668930;-1042594.177999999374151;0
4736;-742701.269999999552965;-1042690.000000000000000;0
1349;-741824.000000000000000;-1044818.000000000000000;0
5702;-743417.206000000238419;-1043631.844999998807907;0
4068;-742917.125000000000000;-1043734.535000000149012;0
7959;-741699.170000001788139;-1044292.620000001043081;0
7180;-742618.809000000357628;-1044646.109000001102686;0
4748;-742895.730000000447035;-1042781.289999999105930;0
3963;-743372.780000001192093;-1043538.789999999105930;0
6662;-741466.800000000745058;-1044192.359999999403954;0
1927;-743501.000000000000000;-1044407.000000000000000;0
1722;-741672.000000000000000;-1045029.000000000000000;0
6393;-742076.660000000149012;-1042499.879999998956919;0
4768;-742862.888000000268221;-1042936.997999999672174;0
221;-742951.000000000000000;-1043544.000000000000000;0
7979;-741161.500000000000000;-1044398.210000000894070;0
4500;-742315.239999998360872;-1042719.460000000894070;0
5176;-743321.252999998629093;-1043447.495000001043081;0
7184;-742592.399999998509884;-1044704.010000001639128;0
2494;-741985.000000000000000;-1044165.000000000000000;0
7001;-743085.660000000149012;-1044400.420000001788139;0
1397;-741771.000000000000000;-1044236.000000000000000;0
1694;-741582.000000000000000;-1044653.000000000000000;0
602;-741828.000000000000000;-1043190.000000000000000;0
6233;-742319.057000000029802;-1043072.162999998778105;0
2145;-742825.000000000000000;-1045079.000000000000000;0
4937;-742461.982000000774860;-1042671.942000001668930;0
6834;-741594.763000000268221;-1044922.236000001430511;0
6269;-742337.300000000745058;-1043018.486000001430511;0
6277;-742304.633999999612570;-1043024.256000000983477;0
5166;-743202.493000000715256;-1043412.614999998360872;0
314;-742585.000000000000000;-1044184.000000000000000;0
7968;-741473.980000000447035;-1044379.839999999850988;0
1441;-741744.000000000000000;-1044392.000000000000000;0
1103;-741306.000000000000000;-1044572.000000000000000;0
2497;-741932.000000000000000;-1044075.000000000000000;0
1867;-743474.000000000000000;-1044257.000000000000000;0
2548;-741672.000000000000000;-1044304.000000000000000;0
6166;-742314.649999998509884;-1043065.006999999284744;0
591;-741912.000000000000000;-1043346.000000000000000;0
1238;-742150.000000000000000;-1044384.000000000000000;0
3837;-743093.699999999254942;-1042577.890000000596046;0
6371;-741972.725000001490116;-1042696.274000000208616;0
617;-742179.000000000000000;-1043272.000000000000000;0
3984;-743314.570000000298023;-1043905.594999998807907;0
1147;-741346.000000000000000;-1044466.000000000000000;0
342;-742573.000000000000000;-1043878.000000000000000;0
4073;-742939.109999999403954;-1043858.504999998956919;0
4342;-742506.473000001162291;-1043301.100000001490116;0
1213;-742068.000000000000000;-1044387.000000000000000;0
1139;-741487.000000000000000;-1044447.000000000000000;0
618;-742203.000000000000000;-1043272.000000000000000;0
6257;-742381.556000001728535;-1043033.991000000387430;0
7212;-742559.410000000149012;-1045073.070000000298023;0
1713;-741207.339999999850988;-1044891.359999999403954;0
4525;-742716.719999998807907;-1042823.219999998807907;0
2375;-742438.000000000000000;-1045570.000000000000000;0
800;-741822.000000000000000;-1042588.000000000000000;0
883;-741802.000000000000000;-1042773.000000000000000;0
6249;-742373.554999999701977;-1043049.822000000625849;0
1524;-741710.000000000000000;-1043844.000000000000000;0
3127;-743955.348000001162291;-1042668.469000000506639;0
3952;-743407.521999999880791;-1043538.500999998301268;0
4751;-742791.629999998956919;-1042751.460000000894070;0
5000;-742542.798000000417233;-1042978.486999999731779;0
1318;-741838.000000000000000;-1044940.000000000000000;0
4521;-742681.440000001341105;-1042792.960000000894070;0
3584;-744914.094999998807907;-1042552.403999999165535;0
6145;-742315.708000000566244;-1043069.881999999284744;0
4948;-742386.929999999701977;-1042992.239999998360872;0
5641;-743428.517000000923872;-1043687.460000000894070;0
6009;-743896.859000001102686;-1042750.497000001370907;0
2558;-741286.000000000000000;-1044387.000000000000000;0
5020;-742572.699999999254942;-1042891.372999999672174;0
5679;-743403.182000000029802;-1043717.807000000029802;0
7641;-742335.304000001400709;-1045451.613000001758337;0
4732;-742777.550000000745058;-1042653.539999999105930;0
6100;-741950.760000001639128;-1043408.109999999403954;0
4459;-742274.829999998211861;-1042644.269999999552965;0
636;-742160.000000000000000;-1043325.000000000000000;0
1008;-741962.000000000000000;-1044568.000000000000000;0
1472;-741677.000000000000000;-1044145.000000000000000;0
8259;-742072.089999999850988;-1042687.219999998807907;0
1617;-742384.000000000000000;-1044407.000000000000000;0
4197;-742179.633999999612570;-1043776.899000000208616;0
4891;-742595.048999998718500;-1042857.274999998509884;0
6125;-743428.124000001698732;-1043615.223999999463558;0
3412;-743772.947000000625849;-1043053.557999998331070;0
2440;-742596.000000000000000;-1044193.000000000000000;0
4920;-742444.449999999254942;-1042928.980000000447035;0
4946;-742411.739000000059605;-1043002.199999999254942;0
4652;-742775.500000000000000;-1042533.997999999672174;0
7035;-743299.831999998539686;-1044176.241999998688698;0
1765;-741159.000000000000000;-1044178.000000000000000;0
147;-744724.000000000000000;-1042391.000000000000000;0
5719;-743419.508999999612570;-1043629.817999999970198;0
2499;-741884.000000000000000;-1044011.000000000000000;0
3170;-743935.190000001341105;-1042595.719999998807907;0
818;-741961.000000000000000;-1042598.000000000000000;0
1389;-742281.250000000000000;-1044962.859999999403954;0
6353;-741893.070000000298023;-1042697.059999998658895;0
6565;-741325.239999998360872;-1044209.190000001341105;0
2632;-743260.298999998718500;-1042362.980000000447035;0
2049;-743499.000000000000000;-1045071.000000000000000;0
4817;-742967.460000000894070;-1042782.559999998658895;0
1594;-742304.000000000000000;-1044977.000000000000000;0
6656;-741590.160000000149012;-1044150.480000000447035;0
4739;-742751.690000001341105;-1042699.230000000447035;0
8051;-742213.199999999254942;-1044935.890000000596046;0
7944;-742086.969999998807907;-1044063.079999998211861;0
2296;-742678.000000000000000;-1045399.000000000000000;0
4519;-742665.160000000149012;-1042790.820000000298023;0
3948;-743409.451999999582767;-1043515.662000000476837;0
4755;-742734.960000000894070;-1042778.019999999552965;0
207;-743142.000000000000000;-1043590.000000000000000;0
6123;-743427.453000001609325;-1043603.083000000566244;0
688;-742284.000000000000000;-1043125.000000000000000;0
4934;-742433.807000000029802;-1042730.874000001698732;0
4670;-742810.120000001043081;-1042644.289999999105930;0
1685;-741140.120000001043081;-1044765.980000000447035;0
6013;-743372.780000001192093;-1043377.921999998390675;0
7252;-742775.109999999403954;-1044855.940000001341105;0
6140;-742311.999000001698732;-1043064.638999998569489;0
4501;-742368.980000000447035;-1042705.100000001490116;0
7276;-742801.670000001788139;-1044613.309999998658895;0
6294;-742653.550000000745058;-1042686.140000000596046;0
7965;-741515.510000001639128;-1044348.350000001490116;0
3979;-743340.934999998658895;-1043779.414999999105930;0
1654;-741387.000000000000000;-1044621.000000000000000;0
5701;-743417.076999999582767;-1043630.140000000596046;0
4324;-742269.346000000834465;-1043165.410999998450279;0
1118;-741807.000000000000000;-1044459.000000000000000;0
4083;-742820.771999999880791;-1043708.657000001519918;0
6692;-742222.114999998360872;-1044818.673000000417233;0
8067;-742257.760000001639128;-1045240.980000000447035;0
757;-741673.000000000000000;-1042678.000000000000000;0
4502;-742349.309999998658895;-1042718.199999999254942;0
6216;-742313.892000000923872;-1043056.272999998182058;0
5668;-743416.179999999701977;-1043712.995000001043081;0
1328;-742037.000000000000000;-1045043.000000000000000;0
553;-742251.000000000000000;-1043741.000000000000000;0
1916;-743371.000000000000000;-1044484.000000000000000;0
4046;-743205.699999999254942;-1044009.719999998807907;0
6810;-741106.350999999791384;-1044631.888999998569489;0
5598;-743412.839999999850988;-1043680.403000000864267;0
4225;-742115.607999999076128;-1043452.125000000000000;0
6561;-741307.890000000596046;-1043937.809999998658895;0
4667;-742823.039999999105930;-1042631.620000001043081;0
4624;-742577.815000001341105;-1042600.907999999821186;0
2355;-742465.000000000000000;-1045568.000000000000000;0
2216;-743108.000000000000000;-1045349.000000000000000;0
684;-742358.000000000000000;-1043136.000000000000000;0
4054;-743269.304999999701977;-1043797.405000001192093;0
6210;-742318.541000001132488;-1043064.662999998778105;0
3174;-743908.859000001102686;-1042618.815999999642372;0
6127;-742314.456000000238419;-1043070.548999998718500;0
7699;-742381.114000000059605;-1044818.644000001251698;0
4241;-742225.929999999701977;-1043394.530000001192093;0
615;-742129.000000000000000;-1043271.000000000000000;0
1525;-741738.000000000000000;-1043823.000000000000000;0
6391;-742109.269999999552965;-1042498.320000000298023;0
1906;-743459.000000000000000;-1044325.000000000000000;0
558;-742200.000000000000000;-1043683.000000000000000;0
4901;-742520.120000001043081;-1042823.960000000894070;0
683;-742362.000000000000000;-1043155.000000000000000;0
2310;-742301.000000000000000;-1045537.000000000000000;0
1122;-741749.000000000000000;-1044455.000000000000000;0
4910;-742367.789000000804663;-1042795.280999999493361;0
5233;-743347.210000000894070;-1043435.807000000029802;0
673;-742467.000000000000000;-1043230.000000000000000;0
6204;-742315.578999999910593;-1043060.826000001281500;0
6142;-742310.477000001817942;-1043061.813000001013279;0
1189;-741786.000000000000000;-1044043.000000000000000;0
7120;-743351.160000000149012;-1044618.460000000894070;0
1739;-741831.780000001192093;-1045213.809999998658895;0
1151;-741279.000000000000000;-1044475.000000000000000;0
5242;-743357.030000001192093;-1043419.239999998360872;0
1303;-741865.000000000000000;-1044692.000000000000000;0
3098;-743918.111000001430511;-1042753.629000000655651;0
4950;-742354.289999999105930;-1042955.670000001788139;0
6945;-742955.907000001519918;-1043932.182999998331070;0
3717;-744716.670000001788139;-1042410.361999999731779;0
5694;-743417.339999999850988;-1043640.361000001430511;0
1962;-743406.000000000000000;-1044664.000000000000000;0
4232;-742315.057999998331070;-1043428.918999999761581;0
5235;-743350.096000000834465;-1043388.881000000983477;0
5507;-743426.703000001609325;-1043656.230999998748302;0
1327;-742001.000000000000000;-1045024.000000000000000;0
4257;-742056.467000000178814;-1043503.657999999821186;0
1506;-741642.000000000000000;-1044236.000000000000000;0
1111;-741167.030000001192093;-1044590.170000001788139;0
1255;-742077.000000000000000;-1044770.000000000000000;0
4926;-742452.660000000149012;-1042896.190000001341105;0
3324;-743935.892000000923872;-1042963.829999998211861;0
4821;-742966.550000000745058;-1042877.969999998807907;0
6783;-741340.728000000119209;-1044457.412000000476837;0
4688;-742676.179000001400709;-1042555.322999998927116;0
6365;-741979.230000000447035;-1042656.230000000447035;0
3063;-744133.098999999463558;-1042851.478999998420477;0
4799;-743008.011999998241663;-1042697.245999999344349;0
4588;-742421.668999999761581;-1042556.124000001698732;0
4320;-742264.149000000208616;-1043259.541999999433756;0
1471;-741711.000000000000000;-1044132.000000000000000;0
395;-742369.000000000000000;-1043840.000000000000000;0
172;-743456.000000000000000;-1043433.000000000000000;0
1265;-742047.000000000000000;-1044960.000000000000000;0
6478;-741931.429999999701977;-1044453.500000000000000;0
1243;-742122.000000000000000;-1044502.000000000000000;0
519;-742239.000000000000000;-1043113.000000000000000;0
4822;-742945.579999998211861;-1042879.910000000149012;0
525;-742233.000000000000000;-1043884.000000000000000;0
4889;-742621.425000000745058;-1042831.109999999403954;0
4749;-742884.420000001788139;-1042760.329999998211861;0
4121;-742721.160000000149012;-1043948.695000000298023;0
3377;-743832.151999998837709;-1042925.721000000834465;0
6130;-742312.136999998241663;-1043066.344000000506639;0
6248;-742372.506000000983477;-1043051.769999999552965;0
4725;-742875.100000001490116;-1042678.230000000447035;0
3169;-743932.120000001043081;-1042582.179999999701977;0
1503;-741537.000000000000000;-1044272.000000000000000;0
5582;-743410.127000000327826;-1043640.197999998927116;0
4586;-742464.175000000745058;-1042636.333999998867512;0
1343;-741714.000000000000000;-1044765.000000000000000;0
4005;-743325.977000001817942;-1044053.392999999225140;0
6297;-742506.859999999403954;-1042634.250000000000000;0
3357;-743953.732000000774860;-1043042.298999998718500;0
4132;-742818.859999999403954;-1044067.969999998807907;0
4616;-742545.416999999433756;-1042662.541999999433756;0
1193;-741740.000000000000000;-1043981.000000000000000;0
