OID_;X;Y;TEMPERATURE
2260;-743019.000000000000000;-1045622.000000000000000;0
596;-741867.000000000000000;-1043259.000000000000000;0
1524;-741710.000000000000000;-1043844.000000000000000;0
6746;-742405.083999998867512;-1044259.199999999254942;0
4047;-743210.230000000447035;-1043992.289999999105930;0
2149;-742819.000000000000000;-1045024.000000000000000;0
1732;-741840.000000000000000;-1045226.000000000000000;0
2886;-744104.953999999910593;-1043172.171999998390675;0
3981;-743341.517000000923872;-1043837.353999998420477;0
2752;-743983.471000000834465;-1043454.780000001192093;0
284;-743022.000000000000000;-1043758.000000000000000;0
7171;-742671.969999998807907;-1044508.219999998807907;0
2081;-742551.000000000000000;-1044621.000000000000000;0
4068;-742917.125000000000000;-1043734.535000000149012;0
6698;-742304.160999998450279;-1044462.195999998599291;0
4135;-742747.719999998807907;-1044085.660000000149012;0
2466;-743460.000000000000000;-1044740.000000000000000;0
2330;-742403.000000000000000;-1045511.000000000000000;0
6704;-742282.179999999701977;-1044623.793999999761581;0
525;-742233.000000000000000;-1043884.000000000000000;0
1303;-741865.000000000000000;-1044692.000000000000000;0
6722;-742357.717000000178814;-1044705.708000000566244;0
6689;-742384.449999999254942;-1045033.609999999403954;0
2046;-743382.000000000000000;-1044968.000000000000000;0
2241;-743319.000000000000000;-1045289.000000000000000;0
110;-744127.000000000000000;-1042724.000000000000000;0
1654;-741387.000000000000000;-1044621.000000000000000;0
532;-742114.000000000000000;-1043737.000000000000000;0
5068;-742837.162999998778105;-1043263.965999998152256;0
1360;-741983.000000000000000;-1044900.000000000000000;0
1287;-742217.000000000000000;-1044486.000000000000000;0
6;-743464.000000000000000;-1042594.000000000000000;57
3782;-743285.429999999701977;-1042842.460000000894070;0
7739;-742301.399000000208616;-1045040.431000001728535;0
7246;-742736.730000000447035;-1044825.399999998509884;0
398;-742372.000000000000000;-1043909.000000000000000;0
227;-742846.000000000000000;-1043520.000000000000000;0
4721;-742883.219999998807907;-1042605.010000001639128;0
6308;-741823.129999998956919;-1042770.370000001043081;0
5295;-743047.995000001043081;-1043185.530000001192093;0
512;-742063.000000000000000;-1043136.000000000000000;61
5222;-743271.000000000000000;-1043543.149999998509884;0
725;-741983.000000000000000;-1042939.000000000000000;0
1772;-741277.000000000000000;-1044012.000000000000000;0
1110;-741220.730000000447035;-1044598.480000000447035;0
6565;-741325.239999998360872;-1044209.190000001341105;0
6726;-742476.517999999225140;-1044410.600000001490116;0
7018;-742577.747000001370907;-1044239.712999999523163;0
3966;-743363.859999999403954;-1043530.829999998211861;0
1520;-741777.000000000000000;-1043939.000000000000000;0
7280;-742806.989999998360872;-1044667.600000001490116;0
2456;-741013.000000000000000;-1044501.000000000000000;0
1042;-741883.000000000000000;-1044682.000000000000000;0
7146;-742819.425000000745058;-1044426.225000001490116;0
615;-742129.000000000000000;-1043271.000000000000000;0
7801;-742459.168999999761581;-1044490.660000000149012;0
5280;-743058.660000000149012;-1043362.201999999582767;0
506;-741980.000000000000000;-1043158.000000000000000;0
1467;-741808.000000000000000;-1044064.000000000000000;0
8018;-741974.039999999105930;-1044442.870000001043081;31
885;-741739.000000000000000;-1042777.000000000000000;0
3460;-744993.289000000804663;-1042693.587000001221895;0
7700;-742371.105999998748302;-1044818.445000000298023;0
602;-741828.000000000000000;-1043190.000000000000000;0
3846;-743149.390000000596046;-1042549.600000001490116;0
7518;-742829.780000001192093;-1045693.210000000894070;0
2386;-742139.000000000000000;-1045460.000000000000000;0
554;-742238.000000000000000;-1043717.000000000000000;0
5786;-743456.410000000149012;-1042105.250000000000000;0
2475;-743411.000000000000000;-1044901.000000000000000;0
1839;-742994.469999998807907;-1044185.679999999701977;0
269;-743248.000000000000000;-1043725.000000000000000;0
5456;-742761.041000001132488;-1043254.350999999791384;0
741;-741730.000000000000000;-1043035.000000000000000;0
4767;-742786.899999998509884;-1042835.736000001430511;0
3464;-745066.756000000983477;-1042677.120999999344349;0
3111;-743727.034000001847744;-1042625.182999998331070;0
1765;-741159.000000000000000;-1044178.000000000000000;0
1910;-743460.000000000000000;-1044391.000000000000000;0
4811;-743040.379999998956919;-1042799.609999999403954;0
3291;-743588.212999999523163;-1042790.916999999433756;0
1012;-742060.000000000000000;-1044582.000000000000000;0
7047;-743395.495000001043081;-1044210.765000000596046;0
2017;-743247.000000000000000;-1044884.000000000000000;0
2512;-743070.000000000000000;-1044052.000000000000000;0
3019;-744463.447999998927116;-1042784.646000001579523;0
1843;-743041.600000001490116;-1044324.489999998360872;0
824;-742142.000000000000000;-1042596.000000000000000;0
1941;-743267.000000000000000;-1044384.000000000000000;0
80;-744067.000000000000000;-1043330.000000000000000;0
4074;-742943.350000001490116;-1043880.304999999701977;0
6137;-742314.326999999582767;-1043068.837000001221895;0
2368;-742507.000000000000000;-1045456.000000000000000;0
3294;-743583.046999998390675;-1042805.258000001311302;0
6144;-742308.925000000745058;-1043059.002000000327826;0
4086;-742813.079999998211861;-1043631.730000000447035;0
4213;-742218.094999998807907;-1043529.954999998211861;0
3214;-743628.813000001013279;-1042457.677000001072884;0
1474;-741604.000000000000000;-1044172.000000000000000;0
4676;-742792.579999998211861;-1042771.519999999552965;0
2285;-742897.000000000000000;-1045467.000000000000000;0
6104;-742208.646999999880791;-1043103.999000001698732;0
2255;-743181.000000000000000;-1045372.000000000000000;0
8267;-742240.420000001788139;-1042709.160000000149012;0
846;-742175.000000000000000;-1042517.000000000000000;0
7008;-742899.559999998658895;-1044224.074999999254942;0
1414;-741627.000000000000000;-1044593.000000000000000;0
2263;-742989.000000000000000;-1045714.000000000000000;0
2165;-742994.000000000000000;-1045179.000000000000000;0
8283;-742198.600000001490116;-1042801.980000000447035;0
4531;-742746.070000000298023;-1042885.980000000447035;0
3786;-743150.480000000447035;-1042925.960000000894070;0
4693;-742691.399999998509884;-1042612.399999998509884;0
8278;-742119.929999999701977;-1042758.710000000894070;0
3417;-743776.002999998629093;-1043098.853000000119209;0
2308;-742345.000000000000000;-1045499.000000000000000;0
1060;-741610.000000000000000;-1045115.000000000000000;0
3356;-743953.732000000774860;-1043037.083000000566244;0
1428;-742028.000000000000000;-1044235.000000000000000;0
4082;-742825.565000001341105;-1043737.364999998360872;0
2289;-742915.000000000000000;-1045426.000000000000000;0
2505;-742762.000000000000000;-1045562.000000000000000;0
408;-742317.000000000000000;-1044182.000000000000000;0
4577;-742376.686000000685453;-1042590.309999998658895;0
5246;-743373.739999998360872;-1043268.899999998509884;0
4175;-742721.254999998956919;-1043775.890000000596046;0
4673;-742811.420000001788139;-1042756.050000000745058;0
2130;-743095.000000000000000;-1045126.000000000000000;0
7038;-743316.394999999552965;-1044240.155000001192093;0
7947;-742030.969999998807907;-1044096.679999999701977;0
1347;-741791.000000000000000;-1044816.000000000000000;0
5776;-742933.609000001102686;-1043433.765999998897314;0
1960;-743386.000000000000000;-1044623.000000000000000;0
5116;-742947.859000001102686;-1043386.767000000923872;0
4991;-742675.414999999105930;-1043031.236000001430511;0
544;-742343.910000000149012;-1043796.500000000000000;0
5233;-743347.210000000894070;-1043435.807000000029802;0
3352;-743954.622000001370907;-1043015.732999999076128;0
2222;-743058.000000000000000;-1045420.000000000000000;0
4073;-742939.109999999403954;-1043858.504999998956919;0
6008;-743902.607000000774860;-1042749.771000001579523;0
6788;-741212.809999998658895;-1044473.129999998956919;0
5733;-743410.142999999225140;-1043688.210999999195337;0
2759;-743890.965999998152256;-1043486.399000000208616;0
3987;-743311.475000001490116;-1043983.175000000745058;0
1419;-741603.000000000000000;-1044410.000000000000000;0
1236;-742156.000000000000000;-1044348.000000000000000;0
3885;-742418.339999999850988;-1042442.059999998658895;0
4324;-742269.346000000834465;-1043165.410999998450279;0
819;-741987.000000000000000;-1042599.000000000000000;0
7269;-743143.410000000149012;-1044948.879999998956919;0
1855;-742642.000000000000000;-1044286.000000000000000;0
3820;-743111.699999999254942;-1042659.320000000298023;0
1762;-741227.000000000000000;-1044108.000000000000000;0
3752;-743213.949999999254942;-1042902.719999998807907;0
249;-743433.000000000000000;-1043775.000000000000000;0
1229;-742244.000000000000000;-1044253.000000000000000;0
2477;-741238.370000001043081;-1044535.289999999105930;0
4897;-742560.320000000298023;-1042829.359999999403954;0
4004;-743345.877000000327826;-1044053.135999999940395;0
1370;-742061.000000000000000;-1044797.000000000000000;0
1371;-742089.000000000000000;-1044807.000000000000000;0
1434;-741931.000000000000000;-1044293.000000000000000;0
4710;-742796.730000000447035;-1042611.769999999552965;0
1309;-741611.000000000000000;-1044813.000000000000000;0
4749;-742884.420000001788139;-1042760.329999998211861;0
1084;-741698.000000000000000;-1044537.000000000000000;0
4204;-742312.750999998301268;-1043589.962999999523163;0
2296;-742678.000000000000000;-1045399.000000000000000;0
8075;-742072.149999998509884;-1045261.399999998509884;0
2422;-742473.000000000000000;-1045096.000000000000000;0
872;-741698.000000000000000;-1042669.000000000000000;0
4341;-742488.855000000447035;-1043325.412999998778105;257
1379;-742135.000000000000000;-1044975.000000000000000;0
1956;-743397.000000000000000;-1044501.000000000000000;75
4756;-742712.579999998211861;-1042776.829999998211861;0
4227;-742108.530000001192093;-1043326.289999999105930;0
1055;-741747.000000000000000;-1045038.000000000000000;0
4663;-742820.800000000745058;-1042560.039999999105930;0
3358;-743952.916999999433756;-1043047.306000001728535;0
693;-742284.000000000000000;-1043062.000000000000000;0
1439;-741772.000000000000000;-1044379.000000000000000;0
5734;-743412.366999998688698;-1043688.041999999433756;0
7139;-742919.179999999701977;-1044444.434999998658895;0
3326;-744036.002000000327826;-1042922.574999999254942;0
7154;-742908.467000000178814;-1044547.784000001847744;0
4019;-743157.434999998658895;-1043897.410000000149012;0
5726;-743422.414000000804663;-1043635.760999999940395;0
3393;-743910.969999998807907;-1043143.960000000894070;0
2399;-742121.000000000000000;-1045372.000000000000000;0
3973;-743161.204999998211861;-1043723.574999999254942;0
4107;-742652.458999998867512;-1043744.934000000357628;0
2321;-742679.000000000000000;-1045480.000000000000000;0
6692;-742222.114999998360872;-1044818.673000000417233;0
5418;-742434.890000000596046;-1042864.780000001192093;0
6092;-742001.309999998658895;-1043482.089999999850988;0
4123;-742742.956000000238419;-1043901.826000001281500;0
701;-742023.000000000000000;-1042885.000000000000000;0
2232;-743488.000000000000000;-1045234.000000000000000;0
6264;-742357.280000001192093;-1043020.445999998599291;0
1728;-741473.000000000000000;-1045087.000000000000000;0
6242;-742366.677999999374151;-1043062.949000000953674;0
730;-741948.000000000000000;-1042998.000000000000000;0
4328;-742347.322000000625849;-1043375.796999998390675;0
5690;-743415.532999999821186;-1043635.447000000625849;0
3312;-743789.184999998658895;-1042904.234000001102686;0
4821;-742966.550000000745058;-1042877.969999998807907;0
2097;-743143.000000000000000;-1044742.000000000000000;0
378;-742514.000000000000000;-1043703.000000000000000;0
1395;-741799.000000000000000;-1044291.000000000000000;0
1045;-741849.000000000000000;-1044775.000000000000000;0
4170;-742407.245000001043081;-1043945.519999999552965;0
4614;-742493.800000000745058;-1042636.896000001579523;0
2556;-741376.000000000000000;-1044379.000000000000000;0
4026;-743178.984999999403954;-1043847.989999998360872;0
571;-742082.000000000000000;-1043581.000000000000000;0
723;-741990.000000000000000;-1043024.000000000000000;0
3466;-745113.802000001072884;-1042675.725000001490116;0
676;-742442.000000000000000;-1043196.000000000000000;0
1422;-742199.000000000000000;-1044127.000000000000000;0
795;-741770.000000000000000;-1042577.000000000000000;0
2544;-741753.000000000000000;-1044252.000000000000000;0
4131;-742844.625000000000000;-1044059.980000000447035;0
1168;-741825.000000000000000;-1044403.000000000000000;0
3155;-743969.353000000119209;-1042568.828000001609325;0
5664;-743420.907000001519918;-1043711.245999999344349;0
4334;-742384.170000001788139;-1043468.820000000298023;0
7163;-743099.541999999433756;-1044532.261999998241663;0
6997;-743109.160000000149012;-1044453.600000001490116;0
3567;-744730.736999999731779;-1042588.842999998480082;0
301;-742613.000000000000000;-1043903.000000000000000;0
3538;-744616.304000001400709;-1042656.734000001102686;0
1824;-742963.809999998658895;-1044143.929999999701977;0
4716;-742893.160000000149012;-1042622.780000001192093;0
3577;-744932.802000001072884;-1042529.300000000745058;0
5205;-743251.475000001490116;-1043328.679000001400709;0
3090;-743913.418999999761581;-1042804.416999999433756;0
6660;-741490.809999998658895;-1044176.750000000000000;0
4659;-742803.311000000685453;-1042470.754999998956919;0
1516;-741928.000000000000000;-1044062.000000000000000;0
3426;-743729.493999999016523;-1043061.420000001788139;0
1136;-741520.000000000000000;-1044455.000000000000000;0
7168;-742792.969999998807907;-1044547.879999998956919;0
6822;-741283.870000001043081;-1044793.059999998658895;0
5998;-742019.482000000774860;-1043283.164000000804663;0
1757;-742189.000000000000000;-1045219.000000000000000;0
6168;-742313.092999998480082;-1043062.208999998867512;0
1572;-742265.000000000000000;-1044184.000000000000000;0
1245;-742114.000000000000000;-1044548.000000000000000;0
4152;-742564.589999999850988;-1044089.934999998658895;0
4532;-742760.140000000596046;-1042899.600000001490116;0
3483;-745211.359999999403954;-1042783.331000000238419;0
3158;-744000.453999999910593;-1042558.089000001549721;0
7107;-743425.260000001639128;-1044646.199999999254942;0
1449;-741533.000000000000000;-1044684.000000000000000;0
449;-741726.000000000000000;-1043342.000000000000000;0
4896;-742589.649999998509884;-1042838.989999998360872;0
4501;-742368.980000000447035;-1042705.100000001490116;0
4652;-742775.500000000000000;-1042533.997999999672174;0
1295;-742082.000000000000000;-1044456.000000000000000;0
4508;-742449.140000000596046;-1042725.980000000447035;0
1867;-743474.000000000000000;-1044257.000000000000000;0
5003;-742589.811999998986721;-1042974.888999998569489;0
2367;-742510.000000000000000;-1045483.000000000000000;0
5213;-743326.385999999940395;-1043368.675999999046326;0
5700;-743416.574000000953674;-1043630.223999999463558;0
5207;-743208.434999998658895;-1043365.236999999731779;0
6211;-742317.785000000149012;-1043063.318999998271465;0
1058;-741667.000000000000000;-1045072.000000000000000;0
2400;-742087.000000000000000;-1045374.000000000000000;0
7278;-742803.899999998509884;-1044636.800000000745058;0
5238;-743360.410000000149012;-1043296.723999999463558;0
1194;-741721.000000000000000;-1043955.000000000000000;0
5066;-742827.379000000655651;-1043252.267999999225140;0
1659;-741420.000000000000000;-1044790.000000000000000;0
1013;-742076.000000000000000;-1044595.000000000000000;0
4627;-742601.138999998569489;-1042606.791000001132488;0
6228;-742319.103999998420477;-1043062.592000000178814;0
879;-741947.000000000000000;-1042541.000000000000000;0
1557;-741193.000000000000000;-1044306.000000000000000;0
3951;-743433.379999998956919;-1043586.600000001490116;0
339;-742606.000000000000000;-1043916.000000000000000;0
1114;-741151.059999998658895;-1044607.410000000149012;0
4764;-742839.835999999195337;-1042859.412999998778105;0
3798;-743131.500000000000000;-1042848.730000000447035;0
1148;-741324.000000000000000;-1044481.000000000000000;0
6844;-741545.278999999165535;-1044985.256999999284744;0
5306;-743103.326999999582767;-1043193.129000000655651;0
7205;-742570.679999999701977;-1044988.579999998211861;0
2421;-742464.000000000000000;-1045117.000000000000000;0
5302;-743090.423999998718500;-1043070.048999998718500;0
7305;-742795.050000000745058;-1045069.809999998658895;0
218;-743006.000000000000000;-1043537.000000000000000;0
4757;-742873.984000001102686;-1042820.212000001221895;0
4479;-741782.780000001192093;-1042660.359999999403954;0
974;-741933.000000000000000;-1044544.000000000000000;0
6766;-741193.449999999254942;-1044424.320000000298023;0
3361;-743933.616000000387430;-1042980.793000001460314;0
8068;-742254.309999998658895;-1045265.969999998807907;0
4944;-742430.605999998748302;-1043013.879000000655651;0
6153;-742309.583999998867512;-1043058.640999998897314;0
3824;-743038.059999998658895;-1042573.800000000745058;0
7261;-742970.839999999850988;-1044878.739999998360872;0
5435;-744041.557000000029802;-1043128.000999998301268;0
3678;-744586.715999998152256;-1042494.697000000625849;0
169;-743433.000000000000000;-1043334.000000000000000;0
917;-742121.000000000000000;-1043008.000000000000000;0
7186;-742587.609999999403954;-1044726.000000000000000;0
235;-743467.000000000000000;-1043745.000000000000000;0
5738;-743410.412999998778105;-1043691.800000000745058;0
1944;-743280.000000000000000;-1044400.000000000000000;0
7778;-743070.728000000119209;-1045812.342000000178814;0
4680;-742759.370000001043081;-1042864.140000000596046;0
6775;-741122.870000001043081;-1044483.239999998360872;0
4099;-742773.870000001043081;-1043846.135999999940395;0
5016;-742572.212000001221895;-1042955.526999998837709;0
6219;-742319.168999999761581;-1043064.293999999761581;0
3463;-745044.640999998897314;-1042675.910999998450279;0
1618;-742405.000000000000000;-1044404.000000000000000;0
4701;-742687.780000001192093;-1042761.660000000149012;0
613;-742089.000000000000000;-1043271.000000000000000;0
7189;-742588.486999999731779;-1044766.690999999642372;0
4326;-742319.855000000447035;-1043419.918999999761581;0
4772;-742879.881999999284744;-1042872.157000001519918;0
7935;-743156.000000000000000;-1045071.149999998509884;0
4904;-742460.050000000745058;-1042796.739999998360872;0
7681;-742501.629999998956919;-1045152.870000001043081;0
709;-741861.000000000000000;-1042862.000000000000000;0
6241;-742365.649999998509884;-1043065.059999998658895;0
4775;-742898.375999998301268;-1042802.914000000804663;0
6510;-741721.960000000894070;-1044461.815000001341105;0
6352;-741906.920000001788139;-1042710.609999999403954;0
6650;-741714.296999998390675;-1044110.177000001072884;0
4538;-742291.464000001549721;-1042734.344000000506639;0
6275;-742314.603999998420477;-1043016.407999999821186;0
1461;-741473.000000000000000;-1044266.000000000000000;0
8282;-742183.519999999552965;-1042790.890000000596046;0
7986;-741040.829999998211861;-1044408.250000000000000;0
5372;-742084.010000001639128;-1043008.550000000745058;0
1223;-742190.000000000000000;-1044277.000000000000000;0
6874;-741789.789999999105930;-1045272.100000001490116;0
2162;-742917.000000000000000;-1045162.000000000000000;0
5640;-743428.425000000745058;-1043686.254000000655651;0
5579;-743409.682999998331070;-1043634.574999999254942;0
3348;-743960.361000001430511;-1043015.629999998956919;0
1307;-741803.000000000000000;-1044663.000000000000000;0
4555;-742337.140000000596046;-1042512.379999998956919;0
6818;-741163.460000000894070;-1044806.616999998688698;0
4774;-742900.078999999910593;-1042854.859000001102686;0
5161;-743160.846999999135733;-1043333.914999999105930;0
3412;-743772.947000000625849;-1043053.557999998331070;0
8280;-742150.949999999254942;-1042770.420000001788139;0
388;-742441.000000000000000;-1043809.000000000000000;0
4513;-742579.030000001192093;-1042753.609999999403954;0
3757;-743300.960000000894070;-1042956.699999999254942;0
6000;-741980.750000000000000;-1043285.629999998956919;0
2050;-743460.000000000000000;-1045072.000000000000000;0
4124;-742751.265000000596046;-1043878.414999999105930;0
4609;-742557.414000000804663;-1042621.583999998867512;0
6190;-742318.782999999821186;-1043068.206000000238419;0
4963;-742396.510000001639128;-1043031.829999998211861;0
7021;-743129.019999999552965;-1044076.230000000447035;0
205;-743173.000000000000000;-1043599.000000000000000;0
745;-741649.000000000000000;-1042968.000000000000000;0
4843;-742975.057000000029802;-1042729.682000000029802;0
7244;-742713.559999998658895;-1044823.719999998807907;0
3701;-744582.008000001311302;-1042507.443999998271465;0
4234;-742349.850000001490116;-1043459.410000000149012;0
4674;-742806.475999999791384;-1042703.594999998807907;0
1135;-741572.000000000000000;-1044437.000000000000000;0
2256;-743156.000000000000000;-1045353.000000000000000;0
3802;-743068.190000001341105;-1042879.710000000894070;0
707;-741897.000000000000000;-1042863.000000000000000;0
502;-741901.000000000000000;-1043169.000000000000000;0
651;-742490.000000000000000;-1043564.000000000000000;0
626;-742236.000000000000000;-1043317.000000000000000;0
2055;-743425.000000000000000;-1045038.000000000000000;0
6201;-742317.888999998569489;-1043065.035000000149012;0
309;-742721.000000000000000;-1044157.000000000000000;0
3787;-743130.989999998360872;-1042979.320000000298023;0
4807;-743122.570000000298023;-1042767.850000001490116;0
3596;-744892.267999999225140;-1042497.289000000804663;0
7179;-742625.429000001400709;-1044622.710000000894070;0
632;-742130.000000000000000;-1043287.000000000000000;0
3566;-744732.028000000864267;-1042600.848000001162291;0
5451;-743276.109000001102686;-1043331.000999998301268;0
4461;-742218.370000001043081;-1042583.800000000745058;0
223;-742920.000000000000000;-1043542.000000000000000;0
3868;-742432.381000000983477;-1042412.094000000506639;0
4527;-742728.050000000745058;-1042838.719999998807907;0
6260;-742377.692999999970198;-1043022.434000000357628;0
1735;-741709.000000000000000;-1045434.000000000000000;0
4898;-742571.280000001192093;-1042840.859999999403954;0
4145;-742687.109999999403954;-1043837.125000000000000;0
3992;-743365.899999998509884;-1043881.385000001639128;0
1890;-743522.000000000000000;-1044402.000000000000000;0
4524;-742683.789999999105930;-1042823.579999998211861;0
4783;-742933.866999998688698;-1042668.403000000864267;0
5058;-742837.528999999165535;-1043170.686000000685453;0
724;-741987.000000000000000;-1042981.000000000000000;0
1035;-741963.000000000000000;-1044896.000000000000000;0
576;-742054.000000000000000;-1043517.000000000000000;0
3768;-743006.370000001043081;-1042978.829999998211861;0
6225;-742314.519999999552965;-1043055.927000001072884;0
1592;-742378.000000000000000;-1044936.000000000000000;0
5322;-743060.379999998956919;-1043029.589999999850988;0
391;-742395.000000000000000;-1043802.000000000000000;0
1393;-742083.000000000000000;-1045067.000000000000000;0
3785;-743172.449999999254942;-1042923.850000001490116;0
5133;-742976.300000000745058;-1043502.951999999582767;0
7148;-742828.445000000298023;-1044472.094999998807907;0
3265;-743560.760000001639128;-1042741.429000001400709;0
1014;-742097.000000000000000;-1044586.000000000000000;0
1450;-741527.000000000000000;-1044632.000000000000000;0
5011;-742644.307999998331070;-1042994.813999999314547;0
1697;-741495.000000000000000;-1044664.000000000000000;0
5244;-743361.021000001579523;-1043374.999000001698732;0
7933;-743544.570000000298023;-1044950.370000001043081;0
4037;-743205.375000000000000;-1043771.175000000745058;0
1322;-741906.000000000000000;-1044975.000000000000000;0
3092;-743909.377999998629093;-1042780.322999998927116;0
6306;-741842.129999998956919;-1042752.739999998360872;0
1337;-741723.000000000000000;-1044886.000000000000000;0
2332;-742899.000000000000000;-1045516.000000000000000;0
5779;-742907.197999998927116;-1043414.096999999135733;0
684;-742358.000000000000000;-1043136.000000000000000;0
1367;-742137.000000000000000;-1044959.000000000000000;0
817;-741937.000000000000000;-1042586.000000000000000;0
5127;-743019.265000000596046;-1043389.644999999552965;0
4672;-742811.831999998539686;-1042675.907999999821186;0
4430;-742235.070000000298023;-1043092.839999999850988;0
4114;-742764.195000000298023;-1044131.760000001639128;0
4773;-742888.429000001400709;-1042839.530000001192093;0
1517;-741964.000000000000000;-1044034.000000000000000;0
7160;-743028.010999999940395;-1044543.267999999225140;0
4668;-742810.210000000894070;-1042618.969999998807907;0
5042;-742731.719000000506639;-1042890.517000000923872;0
5176;-743321.252999998629093;-1043447.495000001043081;0
1535;-741873.000000000000000;-1043913.000000000000000;0
4608;-742555.160999998450279;-1042637.633999999612570;0
8271;-742030.649999998509884;-1042720.129999998956919;0
7641;-742335.304000001400709;-1045451.613000001758337;0
1987;-743480.000000000000000;-1044820.000000000000000;0
6195;-742314.956000000238419;-1043061.181000001728535;0
3737;-745024.934999998658895;-1042390.932000000029802;0
1838;-743004.480000000447035;-1044216.030000001192093;0
529;-742162.000000000000000;-1043803.000000000000000;0
5250;-743328.995000001043081;-1043178.495000001043081;0
6279;-742306.210000000894070;-1043033.421999998390675;0
3309;-743830.328000001609325;-1042834.535000000149012;0
6829;-741498.170000001788139;-1044764.809999998658895;0
6167;-742313.859999999403954;-1043063.607000000774860;0
4475;-741839.219000000506639;-1042687.409000001847744;0
4244;-742179.410000000149012;-1043422.000000000000000;0
5736;-743414.859999999403954;-1043691.462999999523163;0
8284;-742219.410000000149012;-1042809.500000000000000;0
3998;-743432.704999998211861;-1043914.274999998509884;0
6114;-742234.250000000000000;-1043361.324999999254942;0
1584;-742368.000000000000000;-1044717.000000000000000;0
4620;-742539.574000000953674;-1042537.307999998331070;0
3990;-743339.489999998360872;-1043987.234999999403954;0
5220;-743247.339999999850988;-1043589.050000000745058;0
6506;-741743.019999999552965;-1044571.050000000745058;0
1033;-741968.000000000000000;-1044843.000000000000000;0
4975;-742477.829999998211861;-1043016.923000000417233;0
6278;-742305.421999998390675;-1043028.918000001460314;0
379;-742479.000000000000000;-1043679.000000000000000;0
4746;-742867.769999999552965;-1042768.570000000298023;0
845;-742126.000000000000000;-1042505.000000000000000;0
705;-741929.000000000000000;-1042865.000000000000000;0
3237;-744143.304999999701977;-1042651.339999999850988;0
5650;-743429.348999999463558;-1043698.318999998271465;0
282;-743034.000000000000000;-1043819.000000000000000;0
1537;-741924.000000000000000;-1043954.000000000000000;0
1720;-741436.000000000000000;-1044862.000000000000000;0
2072;-743043.000000000000000;-1044743.000000000000000;0
3976;-743088.861000001430511;-1043707.728000000119209;0
5113;-742946.795000001788139;-1043444.427999999374151;0
3517;-744882.524000000208616;-1042691.002000000327826;0
1373;-742143.000000000000000;-1044822.000000000000000;0
5025;-742609.543000001460314;-1042894.629000000655651;0
729;-741986.000000000000000;-1042998.000000000000000;0
5239;-743361.096000000834465;-1043279.333999998867512;0
5235;-743350.096000000834465;-1043388.881000000983477;0
4229;-742146.929000001400709;-1043334.585000000894070;0
4177;-742387.940999999642372;-1044182.254999998956919;0
1038;-741956.000000000000000;-1044977.000000000000000;0
1723;-741611.000000000000000;-1045092.000000000000000;0
4892;-742663.079999998211861;-1042817.344999998807907;0
1272;-742237.000000000000000;-1044545.000000000000000;0
2095;-743178.000000000000000;-1044734.000000000000000;0
6613;-741749.640000000596046;-1044032.820000000298023;0
3979;-743340.934999998658895;-1043779.414999999105930;0
1940;-743286.000000000000000;-1044339.000000000000000;0
4144;-742704.414999999105930;-1043822.484999999403954;0
4628;-742619.598000001162291;-1042609.989999998360872;0
1297;-742120.000000000000000;-1044453.000000000000000;0
1444;-741559.000000000000000;-1044786.000000000000000;0
1020;-742293.000000000000000;-1044615.000000000000000;0
1185;-741822.000000000000000;-1044095.000000000000000;0
