OID_;X;Y;TEMPERATURE
3614;-744984.548999998718500;-1042283.640999998897314;0
3019;-744463.447999998927116;-1042784.646000001579523;0
3568;-744718.817999999970198;-1042588.614999998360872;0
3692;-744525.876499999314547;-1042540.534000001847744;0
3580;-744924.973999999463558;-1042593.699999999254942;0
2605;-745393.842999998480082;-1042860.796000000089407;0
5975;-745052.346999999135733;-1042674.673000000417233;0
118;-745135.000000000000000;-1042687.000000000000000;0
3542;-744575.274000000208616;-1042656.160000000149012;0
2696;-743477.489999998360872;-1042038.000000000000000;0
2520;-741847.000000000000000;-1045324.000000000000000;0
6872;-741751.719999998807907;-1045296.679999999701977;0
2760;-743863.331000000238419;-1043483.304000001400709;0
2755;-744003.879000000655651;-1043471.734000001102686;0
2404;-742179.000000000000000;-1045467.000000000000000;0
3919;-743904.947000000625849;-1043493.929999999701977;0
3107;-743778.888000000268221;-1042682.131999999284744;0
2740;-744042.611999999731779;-1043335.940000001341105;0
1486;-741150.000000000000000;-1044219.000000000000000;0
6828;-741465.309999998658895;-1044768.940000001341105;0
7411;-743529.510000001639128;-1045393.140000000596046;0
8079;-742021.839999999850988;-1045292.179999999701977;0
2070;-742993.000000000000000;-1044723.000000000000000;0
2097;-743143.000000000000000;-1044742.000000000000000;0
7263;-743009.559999998658895;-1044894.379999998956919;0
4238;-742440.263000000268221;-1043528.236000001430511;0
7654;-742242.081000000238419;-1045273.263999998569489;0
2394;-742273.000000000000000;-1045360.000000000000000;0
2160;-742849.000000000000000;-1045147.000000000000000;0
2161;-742876.000000000000000;-1045153.000000000000000;0
8073;-742120.640000000596046;-1045259.500000000000000;0
4075;-742947.934999998658895;-1043903.649999998509884;0
7947;-742030.969999998807907;-1044096.679999999701977;0
524;-742255.000000000000000;-1043913.000000000000000;0
1780;-741214.000000000000000;-1043934.000000000000000;0
738;-741818.000000000000000;-1043024.000000000000000;0
1983;-743474.000000000000000;-1044709.000000000000000;0
748;-741671.000000000000000;-1042971.000000000000000;0
110;-744127.000000000000000;-1042724.000000000000000;0
1764;-741163.000000000000000;-1044144.000000000000000;0
735;-741910.000000000000000;-1043014.000000000000000;0
2050;-743460.000000000000000;-1045072.000000000000000;0
2008;-743242.000000000000000;-1044759.000000000000000;0
6722;-742357.717000000178814;-1044705.708000000566244;0
1561;-743186.000000000000000;-1045098.000000000000000;0
1251;-742091.000000000000000;-1044690.000000000000000;0
7;-743479.000000000000000;-1042567.000000000000000;0
17;-743587.000000000000000;-1042394.000000000000000;0
5303;-743164.818999998271465;-1043211.078000001609325;0
1492;-741096.000000000000000;-1044331.000000000000000;0
4332;-742410.359000001102686;-1043282.916000001132488;0
3204;-743715.278999999165535;-1042506.118999999016523;0
6;-743464.000000000000000;-1042594.000000000000000;0
2133;-743040.000000000000000;-1045127.000000000000000;0
2151;-742827.000000000000000;-1045047.000000000000000;0
2166;-743016.000000000000000;-1045179.000000000000000;0
7324;-742833.980000000447035;-1044949.109999999403954;0
4162;-742497.193999998271465;-1044160.030000001192093;0
6746;-742405.083999998867512;-1044259.199999999254942;0
1515;-741913.000000000000000;-1044072.000000000000000;0
1371;-742089.000000000000000;-1044807.000000000000000;0
884;-741771.000000000000000;-1042776.000000000000000;0
1013;-742076.000000000000000;-1044595.000000000000000;0
2189;-743472.000000000000000;-1045183.000000000000000;0
727;-742001.000000000000000;-1042962.000000000000000;0
1091;-741531.480000000447035;-1044543.440000001341105;0
728;-741997.000000000000000;-1042918.000000000000000;0
696;-742077.000000000000000;-1042913.000000000000000;0
3326;-744036.002000000327826;-1042922.574999999254942;0
2226;-743057.000000000000000;-1045470.000000000000000;0
5062;-742798.513999998569489;-1043227.370999999344349;0
1970;-743380.000000000000000;-1044854.000000000000000;0
1987;-743480.000000000000000;-1044820.000000000000000;0
3387;-743960.368000000715256;-1043194.717000000178814;0
2256;-743156.000000000000000;-1045353.000000000000000;0
3233;-744152.962999999523163;-1042686.791999999433756;0
7776;-743089.784000001847744;-1045773.409000001847744;0
4232;-742315.057999998331070;-1043428.918999999761581;0
1915;-743468.000000000000000;-1044494.000000000000000;0
5119;-742850.592999998480082;-1043328.484999999403954;0
7520;-742808.589999999850988;-1045680.519999999552965;0
7087;-743339.940000001341105;-1044536.690000001341105;0
7350;-742556.390000000596046;-1045185.980000000447035;0
1945;-743270.000000000000000;-1044454.000000000000000;0
1058;-741667.000000000000000;-1045072.000000000000000;0
6791;-741047.329999998211861;-1044765.467999998480082;0
1875;-743367.000000000000000;-1044261.000000000000000;0
2262;-742999.000000000000000;-1045686.000000000000000;0
1926;-743301.000000000000000;-1044321.000000000000000;0
5292;-743055.866000000387430;-1043215.710999999195337;0
5272;-743000.013999998569489;-1043245.364000000059605;0
4070;-742925.285000000149012;-1043783.565000001341105;0
4342;-742506.473000001162291;-1043301.100000001490116;0
7651;-742295.381000000983477;-1045479.861999999731779;0
1238;-742150.000000000000000;-1044384.000000000000000;0
1243;-742122.000000000000000;-1044502.000000000000000;0
2491;-742059.000000000000000;-1044251.000000000000000;0
7217;-742516.318999998271465;-1044582.890000000596046;0
910;-742219.000000000000000;-1042529.000000000000000;0
1171;-741882.000000000000000;-1044375.000000000000000;0
6943;-742902.013999998569489;-1043932.647999998182058;0
6825;-741380.010000001639128;-1044780.089999999850988;0
281;-743045.000000000000000;-1043848.000000000000000;0
8018;-741974.039999999105930;-1044442.870000001043081;0
1138;-741500.000000000000000;-1044458.000000000000000;0
4236;-742406.842999998480082;-1043504.015000000596046;0
6095;-742082.920000001788139;-1043614.710000000894070;0
1865;-743458.000000000000000;-1044233.000000000000000;0
3781;-743273.059999998658895;-1042814.050000000745058;0
3752;-743213.949999999254942;-1042902.719999998807907;0
7218;-742534.100000001490116;-1044603.559999998658895;0
1656;-741395.000000000000000;-1044688.000000000000000;0
1922;-743390.000000000000000;-1044308.000000000000000;0
1920;-743384.000000000000000;-1044363.000000000000000;0
1905;-743446.000000000000000;-1044312.000000000000000;0
2513;-742574.000000000000000;-1044441.000000000000000;0
7044;-743400.635000001639128;-1044135.579999998211861;0
7104;-743423.739999998360872;-1044624.530000001192093;0
6313;-743936.949999999254942;-1042594.780000001192093;0
3155;-743969.353000000119209;-1042568.828000001609325;0
4026;-743178.984999999403954;-1043847.989999998360872;0
6821;-741256.649999998509884;-1044796.100000001490116;0
1101;-741339.000000000000000;-1044568.000000000000000;0
4023;-743246.635000001639128;-1043864.364999998360872;0
2300;-742561.000000000000000;-1045413.000000000000000;0
1693;-741613.000000000000000;-1044649.000000000000000;0
713;-741800.000000000000000;-1042859.000000000000000;0
3976;-743088.861000001430511;-1043707.728000000119209;0
881;-741806.000000000000000;-1042815.000000000000000;0
1611;-742400.000000000000000;-1044442.000000000000000;0
6700;-742298.611000001430511;-1044507.315999999642372;0
6703;-742288.903999999165535;-1044591.625999998301268;0
7010;-742857.964999999850988;-1044251.155000001192093;0
4058;-743138.765000000596046;-1043625.405000001192093;0
4057;-743132.184999998658895;-1043648.719999998807907;0
1310;-741623.000000000000000;-1044829.000000000000000;0
6718;-742339.493000000715256;-1044956.921999998390675;0
1692;-741125.000000000000000;-1044816.000000000000000;0
6662;-741466.800000000745058;-1044192.359999999403954;0
2016;-743230.000000000000000;-1044873.000000000000000;0
2575;-742484.000000000000000;-1045453.000000000000000;0
1387;-742155.000000000000000;-1044999.000000000000000;0
2375;-742438.000000000000000;-1045570.000000000000000;0
2309;-742322.000000000000000;-1045519.000000000000000;0
2329;-742432.000000000000000;-1045508.000000000000000;0
6842;-741574.894000001251698;-1044962.013999998569489;0
1590;-742377.000000000000000;-1044885.000000000000000;0
4064;-742879.655000001192093;-1043647.420000001788139;0
1993;-743483.000000000000000;-1044984.000000000000000;0
2041;-743531.000000000000000;-1044957.000000000000000;0
1269;-742246.000000000000000;-1044462.000000000000000;0
6573;-741294.089999999850988;-1044091.679999999701977;0
4036;-743246.920000001788139;-1043771.574999999254942;0
3766;-743053.532999999821186;-1042996.631000000983477;0
2017;-743247.000000000000000;-1044884.000000000000000;0
6726;-742476.517999999225140;-1044410.600000001490116;0
2028;-743371.000000000000000;-1045054.000000000000000;0
1604;-742552.000000000000000;-1044918.000000000000000;0
5241;-743365.063000001013279;-1043245.954999998211861;0
7152;-742867.331999998539686;-1044547.015999998897314;0
5258;-743356.739999998360872;-1043230.039999999105930;0
7156;-742944.515000000596046;-1044546.140000000596046;0
1553;-741350.000000000000000;-1044268.000000000000000;0
1126;-741684.000000000000000;-1044450.000000000000000;0
1459;-741491.000000000000000;-1044340.000000000000000;0
3995;-743393.225000001490116;-1043973.719999998807907;0
2247;-743199.000000000000000;-1045400.000000000000000;0
3287;-743711.173999998718500;-1042886.515999998897314;0
7141;-742895.629999998956919;-1044470.910000000149012;0
1518;-741994.000000000000000;-1044011.000000000000000;0
4990;-742657.837999999523163;-1043024.199999999254942;0
1619;-742426.000000000000000;-1044401.000000000000000;0
4062;-742830.460000000894070;-1043654.920000001788139;0
7017;-742571.059999998658895;-1044267.640000000596046;0
3413;-743776.791000001132488;-1043071.675000000745058;0
3747;-743250.879999998956919;-1042956.620000001043081;0
2238;-743372.000000000000000;-1045261.000000000000000;0
2232;-743488.000000000000000;-1045234.000000000000000;0
1849;-742732.000000000000000;-1044228.000000000000000;0
4079;-742836.170000001788139;-1043800.960000000894070;0
1061;-741586.000000000000000;-1045133.000000000000000;0
2891;-744029.914000000804663;-1043200.478000000119209;0
2888;-744082.749000001698732;-1043174.458999998867512;0
3266;-743585.618999999016523;-1042739.508999999612570;0
3289;-743584.761999998241663;-1042769.188000001013279;0
2213;-743188.000000000000000;-1045298.000000000000000;0
2241;-743319.000000000000000;-1045289.000000000000000;0
2526;-741087.000000000000000;-1044616.000000000000000;0
1435;-741903.000000000000000;-1044306.000000000000000;0
4198;-742192.445000000298023;-1043760.521000001579523;0
4505;-742434.910000000149012;-1042706.170000001788139;0
7146;-742819.425000000745058;-1044426.225000001490116;0
2487;-742101.000000000000000;-1044308.000000000000000;0
4500;-742315.239999998360872;-1042719.460000000894070;0
7958;-741664.710000000894070;-1044289.879999998956919;0
1455;-741517.000000000000000;-1044468.000000000000000;0
1164;-741055.000000000000000;-1044515.000000000000000;0
5323;-743049.401000000536442;-1043038.131000000983477;0
1531;-741782.000000000000000;-1043838.000000000000000;0
1520;-741777.000000000000000;-1043939.000000000000000;0
560;-742181.000000000000000;-1043665.000000000000000;0
4981;-742536.340999998152256;-1043014.929999999701977;0
6854;-741522.427999999374151;-1045038.967999998480082;0
1839;-742994.469999998807907;-1044185.679999999701977;0
574;-742068.000000000000000;-1043538.000000000000000;0
3095;-743923.068999998271465;-1042787.789000000804663;0
3101;-743922.754999998956919;-1042745.195000000298023;0
4925;-742455.502000000327826;-1042923.307000000029802;0
334;-742631.000000000000000;-1043987.000000000000000;0
581;-741991.000000000000000;-1043457.000000000000000;0
5961;-742431.225000001490116;-1044003.574999999254942;0
408;-742317.000000000000000;-1044182.000000000000000;0
591;-741912.000000000000000;-1043346.000000000000000;0
1328;-742037.000000000000000;-1045043.000000000000000;0
346;-742540.000000000000000;-1043816.000000000000000;0
1261;-742057.000000000000000;-1044894.000000000000000;0
2321;-742679.000000000000000;-1045480.000000000000000;0
1008;-741962.000000000000000;-1044568.000000000000000;0
1005;-741944.000000000000000;-1044583.000000000000000;0
826;-742191.000000000000000;-1042616.000000000000000;0
6391;-742109.269999999552965;-1042498.320000000298023;0
7147;-742827.925000000745058;-1044451.385000001639128;0
401;-742324.000000000000000;-1043907.000000000000000;0
224;-742904.000000000000000;-1043522.000000000000000;0
6656;-741590.160000000149012;-1044150.480000000447035;0
2501;-742746.000000000000000;-1045430.000000000000000;0
8281;-742164.160000000149012;-1042778.140000000596046;0
8283;-742198.600000001490116;-1042801.980000000447035;0
2084;-742447.000000000000000;-1044797.000000000000000;0
3886;-742385.100000001490116;-1042445.500000000000000;0
1705;-741257.219999998807907;-1044695.690000001341105;0
2079;-742688.000000000000000;-1044428.000000000000000;0
5419;-742434.690000001341105;-1042846.280000001192093;0
555;-742230.000000000000000;-1043726.000000000000000;0
7175;-742651.780000001192093;-1044558.149999998509884;0
2082;-742569.000000000000000;-1044642.000000000000000;0
3769;-742978.969999998807907;-1042975.300000000745058;0
2320;-742707.000000000000000;-1045477.000000000000000;0
5020;-742572.699999999254942;-1042891.372999999672174;0
6509;-741724.809999998658895;-1044485.162000000476837;0
1824;-742963.809999998658895;-1044143.929999999701977;0
7190;-742577.989999998360872;-1044771.690000001341105;0
6705;-742279.050999999046326;-1044655.923000000417233;0
6604;-741636.960000000894070;-1043867.217999998480082;0
4033;-743319.719999998807907;-1043793.300000000745058;0
6783;-741340.728000000119209;-1044457.412000000476837;0
3794;-743091.015000000596046;-1042800.471999999135733;0
4510;-742483.149999998509884;-1042738.460000000894070;0
1109;-741204.100000001490116;-1044585.460000000894070;0
6693;-742248.197000000625849;-1044816.127000000327826;0
5996;-742061.879000000655651;-1043284.276999998837709;0
6002;-742018.502000000327826;-1043294.918999999761581;0
1529;-741727.000000000000000;-1043794.000000000000000;0
7233;-742606.750000000000000;-1044827.379999998956919;0
4229;-742146.929000001400709;-1043334.585000000894070;0
2334;-742872.000000000000000;-1045519.000000000000000;0
551;-742269.000000000000000;-1043755.000000000000000;0
392;-742418.000000000000000;-1043843.000000000000000;0
399;-742339.000000000000000;-1043884.000000000000000;0
6839;-741723.412000000476837;-1044988.993000000715256;0
3992;-743365.899999998509884;-1043881.385000001639128;0
3797;-743147.989999998360872;-1042854.129999998956919;0
6836;-741643.532000001519918;-1044947.486999999731779;0
381;-742465.000000000000000;-1043700.000000000000000;0
378;-742514.000000000000000;-1043703.000000000000000;0
1323;-741859.000000000000000;-1044941.000000000000000;0
793;-741697.000000000000000;-1042588.000000000000000;0
6711;-742266.486000001430511;-1044832.896000001579523;0
4105;-742678.771999999880791;-1043769.206000000238419;0
4821;-742966.550000000745058;-1042877.969999998807907;0
2270;-742954.000000000000000;-1045592.000000000000000;0
6789;-741187.510000001639128;-1044470.660000000149012;0
5167;-743219.324999999254942;-1043405.249000001698732;0
1495;-741215.000000000000000;-1044324.000000000000000;0
4944;-742430.605999998748302;-1043013.879000000655651;0
600;-741840.000000000000000;-1043212.000000000000000;0
7022;-743155.660000000149012;-1044074.410000000149012;0
2557;-741318.000000000000000;-1044384.000000000000000;0
7736;-742342.260000001639128;-1045113.918000001460314;0
1167;-741836.000000000000000;-1044429.000000000000000;0
3989;-743307.815000001341105;-1044034.914999999105930;0
5156;-743160.188999999314547;-1043355.291999999433756;0
5242;-743357.030000001192093;-1043419.239999998360872;0
7026;-743217.644999999552965;-1044082.329999998211861;0
4794;-743065.828999999910593;-1042673.377000000327826;0
7740;-742301.949999999254942;-1045061.239000000059605;0
512;-742063.000000000000000;-1043136.000000000000000;0
3306;-743787.127999998629093;-1042847.872999999672174;0
1344;-741750.000000000000000;-1044808.000000000000000;0
4774;-742900.078999999910593;-1042854.859000001102686;0
3305;-743801.410000000149012;-1042874.962999999523163;0
4425;-742208.820000000298023;-1043035.230000000447035;0
516;-742160.000000000000000;-1043135.000000000000000;0
5142;-743039.870000001043081;-1043473.929999999701977;0
506;-741980.000000000000000;-1043158.000000000000000;0
5138;-743030.936000000685453;-1043483.587999999523163;0
227;-742846.000000000000000;-1043520.000000000000000;0
5186;-743270.949999999254942;-1043526.039999999105930;0
4791;-743022.245000001043081;-1042633.714000001549721;0
7515;-742273.021999999880791;-1044371.543999999761581;0
7681;-742501.629999998956919;-1045152.870000001043081;0
7706;-742313.239999998360872;-1044319.611999999731779;0
4946;-742411.739000000059605;-1043002.199999999254942;0
1467;-741808.000000000000000;-1044064.000000000000000;0
1440;-741782.000000000000000;-1044362.000000000000000;0
1035;-741963.000000000000000;-1044896.000000000000000;0
4558;-742373.019999999552965;-1042506.949999999254942;0
3964;-743352.359999999403954;-1043540.780000001192093;0
3418;-743758.105000000447035;-1043107.024999998509884;0
4224;-742139.756000000983477;-1043462.488000001758337;0
1790;-742152.000000000000000;-1044138.000000000000000;0
5197;-743222.513000000268221;-1043313.989999998360872;0
619;-742229.000000000000000;-1043277.000000000000000;0
5146;-743064.554000001400709;-1043452.671999998390675;0
505;-741917.000000000000000;-1043153.000000000000000;0
4481;-741766.089999999850988;-1042627.859999999403954;0
1827;-743033.000000000000000;-1044080.000000000000000;0
4127;-742837.324999999254942;-1044032.670000001788139;0
4574;-742339.980000000447035;-1042661.570000000298023;0
1843;-743041.600000001490116;-1044324.489999998360872;0
3786;-743150.480000000447035;-1042925.960000000894070;0
7287;-742809.579999998211861;-1044785.789999999105930;0
4143;-742750.925000000745058;-1044017.960000000894070;0
4786;-742953.361000001430511;-1042655.886999998241663;0
4213;-742218.094999998807907;-1043529.954999998211861;0
6611;-741711.614000000059605;-1043979.263999998569489;0
7031;-743301.824999999254942;-1044080.774999998509884;0
1468;-741778.000000000000000;-1044082.000000000000000;0
2546;-741750.000000000000000;-1044271.000000000000000;0
1030;-741975.000000000000000;-1044753.000000000000000;0
2286;-742894.000000000000000;-1045440.000000000000000;0
1399;-741736.000000000000000;-1044167.000000000000000;0
3947;-743403.787999998778105;-1043488.118999999016523;0
1795;-742155.000000000000000;-1044231.000000000000000;0
1042;-741883.000000000000000;-1044682.000000000000000;0
6300;-741836.949999999254942;-1042698.329999998211861;0
4756;-742712.579999998211861;-1042776.829999998211861;0
4875;-742814.660000000149012;-1042937.800000000745058;0
1032;-741970.000000000000000;-1044813.000000000000000;0
5658;-743428.059999998658895;-1043708.153000000864267;0
4656;-742827.763000000268221;-1042494.379999998956919;0
3962;-743407.190000001341105;-1043535.730000000447035;0
5656;-743429.752999998629093;-1043705.570000000298023;0
821;-742048.000000000000000;-1042601.000000000000000;0
1386;-742158.000000000000000;-1044976.000000000000000;0
674;-742463.000000000000000;-1043211.000000000000000;0
169;-743433.000000000000000;-1043334.000000000000000;0
5695;-743417.217999998480082;-1043638.749000001698732;0
5663;-743422.087999999523163;-1043710.807999998331070;0
5158;-743148.138999998569489;-1043320.254999998956919;0
684;-742358.000000000000000;-1043136.000000000000000;0
4874;-742795.429999999701977;-1042925.910000000149012;0
4815;-742992.210000000894070;-1042788.359999999403954;0
3360;-743950.688000001013279;-1042982.188000001013279;0
5591;-743421.353999998420477;-1043679.738000001758337;0
1407;-741650.000000000000000;-1044242.000000000000000;0
6165;-742315.407000001519918;-1043066.436000000685453;0
3350;-743955.140999998897314;-1043006.692000001668930;0
876;-741953.000000000000000;-1042636.000000000000000;0
4097;-742806.000000000000000;-1043874.793999999761581;0
5685;-743396.092999998480082;-1043720.434000000357628;0
5664;-743420.907000001519918;-1043711.245999999344349;0
6161;-742310.964999999850988;-1043059.710999999195337;0
3837;-743093.699999999254942;-1042577.890000000596046;0
4677;-742787.309999998658895;-1042797.899999998509884;0
5643;-743428.701999999582767;-1043689.872999999672174;0
6974;-743127.620000001043081;-1044518.800000000745058;0
6997;-743109.160000000149012;-1044453.600000001490116;0
1047;-741816.000000000000000;-1044867.000000000000000;0
6181;-742318.164999999105930;-1043068.541999999433756;0
943;-742292.000000000000000;-1043017.000000000000000;0
4620;-742539.574000000953674;-1042537.307999998331070;0
6401;-741992.449999999254942;-1042503.609999999403954;0
3365;-743840.598999999463558;-1043023.565000001341105;0
462;-741707.000000000000000;-1043294.000000000000000;0
5729;-743420.103000000119209;-1043638.901000000536442;0
3839;-743112.140000000596046;-1042558.280000001192093;0
6169;-742312.320000000298023;-1043060.791999999433756;0
2447;-742772.000000000000000;-1044159.000000000000000;0
650;-742263.000000000000000;-1043381.000000000000000;0
6153;-742309.583999998867512;-1043058.640999998897314;0
4098;-742789.157000001519918;-1043861.918999999761581;0
6261;-742373.956999998539686;-1043022.041999999433756;0
4958;-742349.620000001043081;-1043004.539999999105930;0
5646;-743428.978999998420477;-1043693.493000000715256;0
6128;-742313.668999999761581;-1043069.186000000685453;0
6267;-742344.767999999225140;-1043019.272999998182058;0
6262;-742370.024999998509884;-1043021.666000001132488;0
4784;-742945.712999999523163;-1042685.611999999731779;0
1571;-742239.000000000000000;-1044186.000000000000000;0
326;-742682.000000000000000;-1044102.000000000000000;0
6763;-741117.219999998807907;-1044428.989999998360872;0
4596;-742597.181000001728535;-1042670.653000000864267;0
6137;-742314.326999999582767;-1043068.837000001221895;0
7985;-741091.269999999552965;-1044419.039999999105930;0
6253;-742378.725000001490116;-1043039.690000001341105;0
5694;-743417.339999999850988;-1043640.361000001430511;0
7277;-742796.870000001043081;-1044653.429999999701977;0
6372;-741988.530000001192093;-1042699.339999999850988;0
6126;-743428.385999999940395;-1043621.800000000745058;0
6293;-742666.339999999850988;-1042695.188999999314547;0
848;-741973.000000000000000;-1042526.000000000000000;0
756;-741681.000000000000000;-1042695.000000000000000;0
2289;-742915.000000000000000;-1045426.000000000000000;0
7283;-742804.480000000447035;-1044732.769999999552965;0
5595;-743416.488000001758337;-1043680.118999999016523;0
4646;-742694.853000000119209;-1042535.625999998301268;0
3848;-743094.383999999612570;-1042505.245000001043081;0
6208;-742320.098000001162291;-1043067.458999998867512;0
5668;-743416.179999999701977;-1043712.995000001043081;0
339;-742606.000000000000000;-1043916.000000000000000;0
5515;-743426.960000000894070;-1043612.083999998867512;0
4653;-742788.747999999672174;-1042524.557000000029802;0
4604;-742463.967999998480082;-1042613.381999999284744;0
5679;-743403.182000000029802;-1043717.807000000029802;0
3761;-743202.559999998658895;-1042981.710000000894070;0
6276;-742310.815999999642372;-1043016.000999998301268;0
1351;-741850.000000000000000;-1044830.000000000000000;0
337;-742621.000000000000000;-1043941.000000000000000;0
4742;-742822.300000000745058;-1042747.920000001788139;0
4241;-742225.929999999701977;-1043394.530000001192093;0
4675;-742805.809999998658895;-1042785.070000000298023;0
6193;-742316.486000001430511;-1043063.991000000387430;0
4668;-742810.210000000894070;-1042618.969999998807907;0
6175;-742315.256999999284744;-1043064.660999998450279;0
5693;-743415.905000001192093;-1043640.377000000327826;0
7210;-742559.789999999105930;-1045047.809999998658895;0
7206;-742559.920000001788139;-1045003.190000001341105;0
694;-742280.000000000000000;-1043043.000000000000000;0
4625;-742594.258000001311302;-1042576.114000000059605;0
3844;-743184.170000001788139;-1042586.949999999254942;0
4877;-742845.760000001639128;-1042956.589999999850988;0
4698;-742673.530000001192093;-1042715.780000001192093;0
693;-742284.000000000000000;-1043062.000000000000000;0
673;-742467.000000000000000;-1043230.000000000000000;0
1506;-741642.000000000000000;-1044236.000000000000000;0
6189;-742312.041999999433756;-1043057.302000001072884;0
4323;-742267.879999998956919;-1043190.035000000149012;0
1817;-743058.000000000000000;-1044411.000000000000000;0
465;-741728.000000000000000;-1043309.000000000000000;0
5698;-743416.785999998450279;-1043633.638000000268221;0
1599;-742237.000000000000000;-1044977.000000000000000;0
5723;-743420.903000000864267;-1043631.703999999910593;0
7004;-743069.289999999105930;-1044326.469999998807907;0
4634;-742635.980000000447035;-1042656.144999999552965;0
500;-741861.000000000000000;-1043174.000000000000000;0
6106;-742210.445999998599291;-1043112.203000001609325;0
324;-742694.000000000000000;-1044132.000000000000000;0
340;-742588.000000000000000;-1043906.000000000000000;0
5689;-743415.442000001668930;-1043633.646000001579523;0
6257;-742381.556000001728535;-1043033.991000000387430;0
4585;-742437.502000000327826;-1042630.243999999016523;0
5683;-743398.456000000238419;-1043719.557999998331070;0
4674;-742806.475999999791384;-1042703.594999998807907;0
4890;-742605.287000000476837;-1042838.535000000149012;0
6154;-742316.324000000953674;-1043069.546000000089407;0
1304;-741810.000000000000000;-1044684.000000000000000;0
6160;-742311.730999998748302;-1043061.116000000387430;0
5042;-742731.719000000506639;-1042890.517000000923872;0
6250;-742374.638999998569489;-1043047.576999999582767;0
6152;-742310.348999999463558;-1043060.046999998390675;0
5122;-742902.166999999433756;-1043373.543999999761581;0
8271;-742030.649999998509884;-1042720.129999998956919;0
624;-742241.000000000000000;-1043343.000000000000000;0
5508;-743426.105999998748302;-1043645.960999999195337;0
4845;-742978.655999999493361;-1042776.048000000417233;0
5969;-742284.809999998658895;-1044169.578000001609325;0
6217;-742320.725999999791384;-1043067.133999999612570;0
6215;-742314.692000001668930;-1043057.682000000029802;0
1330;-741817.000000000000000;-1044709.000000000000000;0
3838;-743113.550000000745058;-1042543.399999998509884;0
6149;-742312.646000001579523;-1043064.261999998241663;0
6168;-742313.092999998480082;-1043062.208999998867512;0
1447;-741541.000000000000000;-1044744.000000000000000;0
5688;-743415.267000000923872;-1043631.945000000298023;0
6184;-742315.868999999016523;-1043064.326999999582767;0
7034;-743299.725999999791384;-1044153.140000000596046;0
309;-742721.000000000000000;-1044157.000000000000000;0
5776;-742933.609000001102686;-1043433.765999998897314;0
4736;-742701.269999999552965;-1042690.000000000000000;0
8272;-742042.399999998509884;-1042732.559999998658895;0
6151;-742311.114999998360872;-1043061.451000001281500;0
5661;-743424.451999999582767;-1043709.932999998331070;0
4888;-742649.925999999046326;-1042830.767000000923872;0
4732;-742777.550000000745058;-1042653.539999999105930;0
1389;-742281.250000000000000;-1044962.859999999403954;0
4664;-742806.739999998360872;-1042547.980000000447035;0
6132;-742310.590999998152256;-1043063.552999999374151;0
785;-741702.000000000000000;-1042622.000000000000000;0
1696;-741529.000000000000000;-1044660.000000000000000;0
4739;-742751.690000001341105;-1042699.230000000447035;0
6214;-742315.447999998927116;-1043059.026000000536442;0
4526;-742696.690000001341105;-1042823.320000000298023;0
6228;-742319.103999998420477;-1043062.592000000178814;0
4219;-742243.045000001788139;-1043600.660000000149012;0
450;-741705.000000000000000;-1043312.000000000000000;0
3957;-743415.125000000000000;-1043567.214999999850988;0
541;-742258.000000000000000;-1043678.000000000000000;0
6180;-742311.429000001400709;-1043057.635999999940395;0
6213;-742316.227000001817942;-1043060.478999998420477;0
