OID_;X;Y;TEMPERATURE
2265;-742972.000000000000000;-1045774.000000000000000;0
1765;-741159.000000000000000;-1044178.000000000000000;0
727;-742001.000000000000000;-1042962.000000000000000;0
4239;-742454.206000000238419;-1043538.927999999374151;0
509;-741991.000000000000000;-1043143.000000000000000;0
1521;-741808.000000000000000;-1043917.000000000000000;3
3752;-743213.949999999254942;-1042902.719999998807907;0
402;-742342.000000000000000;-1043952.000000000000000;0
2693;-743425.660000000149012;-1042065.250000000000000;0
7704;-742256.021000001579523;-1044313.592999998480082;0
6324;-745068.543000001460314;-1042720.445999998599291;0
7043;-743398.899999998509884;-1044106.629999998956919;0
2257;-742956.000000000000000;-1045558.000000000000000;0
3580;-744924.973999999463558;-1042593.699999999254942;0
8285;-742232.780000001192093;-1042821.149999998509884;0
500;-741861.000000000000000;-1043174.000000000000000;0
2386;-742139.000000000000000;-1045460.000000000000000;0
3988;-743309.704999998211861;-1044008.570000000298023;0
5306;-743103.326999999582767;-1043193.129000000655651;0
6727;-742522.868000000715256;-1044395.879999998956919;0
1665;-741012.000000000000000;-1044351.000000000000000;0
462;-741707.000000000000000;-1043294.000000000000000;0
379;-742479.000000000000000;-1043679.000000000000000;0
3393;-743910.969999998807907;-1043143.960000000894070;0
3310;-743829.561999998986721;-1042854.063000001013279;57
7153;-742889.646999999880791;-1044547.438000001013279;0
7655;-742266.583000000566244;-1045284.133999999612570;0
5309;-743033.405000001192093;-1043187.043999999761581;0
1141;-741454.000000000000000;-1044453.000000000000000;0
2300;-742561.000000000000000;-1045413.000000000000000;0
6978;-743090.239999998360872;-1044436.379999998956919;0
6570;-741280.390000000596046;-1044118.620000001043081;0
1116;-741125.980000000447035;-1044610.410000000149012;0
23;-743544.000000000000000;-1042505.000000000000000;0
3820;-743111.699999999254942;-1042659.320000000298023;0
881;-741806.000000000000000;-1042815.000000000000000;0
4059;-743142.649999998509884;-1043612.730000000447035;0
6299;-741803.309999998658895;-1042718.690000001341105;0
2075;-743114.000000000000000;-1044772.000000000000000;0
527;-742186.000000000000000;-1043818.000000000000000;0
7140;-742921.300000000745058;-1044469.335000000894070;0
2231;-743512.000000000000000;-1045263.000000000000000;0
1410;-741643.039999999105930;-1044709.940000001341105;0
3033;-744483.675000000745058;-1042733.627000000327826;0
1942;-743283.000000000000000;-1044370.000000000000000;0
3240;-744173.991999998688698;-1042639.695000000298023;0
7024;-743182.745000001043081;-1044052.815000001341105;0
994;-741946.000000000000000;-1044433.000000000000000;0
2326;-742523.000000000000000;-1045498.000000000000000;0
4957;-742366.010000001639128;-1043006.059999998658895;0
2318;-742763.000000000000000;-1045470.000000000000000;0
2378;-742372.000000000000000;-1045503.000000000000000;0
1295;-742082.000000000000000;-1044456.000000000000000;0
1373;-742143.000000000000000;-1044822.000000000000000;0
6039;-742085.370000001043081;-1043669.620999999344349;0
1914;-743464.000000000000000;-1044458.000000000000000;3
1760;-741162.000000000000000;-1044101.000000000000000;0
1932;-743359.000000000000000;-1044408.000000000000000;0
1562;-743199.000000000000000;-1045122.000000000000000;0
6651;-741697.910000000149012;-1044123.329999998211861;0
3956;-743414.039999999105930;-1043561.081999998539686;0
1610;-742374.000000000000000;-1044447.000000000000000;0
6192;-742317.252000000327826;-1043065.394999999552965;0
4604;-742463.967999998480082;-1042613.381999999284744;0
4828;-743048.579999998211861;-1042941.179999999701977;0
4762;-742854.192000001668930;-1042825.931000001728535;0
1308;-741589.000000000000000;-1044811.000000000000000;0
342;-742573.000000000000000;-1043878.000000000000000;0
2475;-743411.000000000000000;-1044901.000000000000000;0
1126;-741684.000000000000000;-1044450.000000000000000;0
4053;-743260.039999999105930;-1043823.480000000447035;0
4220;-742214.344999998807907;-1043580.359999999403954;0
7681;-742501.629999998956919;-1045152.870000001043081;0
1516;-741928.000000000000000;-1044062.000000000000000;0
4076;-742855.589999999850988;-1043882.670000001788139;0
7959;-741699.170000001788139;-1044292.620000001043081;0
1512;-741829.000000000000000;-1044135.000000000000000;0
4969;-742465.059999998658895;-1043095.034000001847744;0
4332;-742410.359000001102686;-1043282.916000001132488;0
5062;-742798.513999998569489;-1043227.370999999344349;0
2805;-743893.609999999403954;-1043543.980000000447035;0
2561;-741214.000000000000000;-1044393.000000000000000;0
7007;-742923.890000000596046;-1044218.879999998956919;0
4852;-742992.449999999254942;-1042849.890000000596046;0
4327;-742333.449000000953674;-1043399.671000000089407;0
2256;-743156.000000000000000;-1045353.000000000000000;0
339;-742606.000000000000000;-1043916.000000000000000;0
6201;-742317.888999998569489;-1043065.035000000149012;0
590;-741935.000000000000000;-1043331.000000000000000;0
2536;-742003.000000000000000;-1044113.000000000000000;0
4173;-742756.320000000298023;-1043749.629999998956919;0
1872;-743422.000000000000000;-1044246.000000000000000;0
6825;-741380.010000001639128;-1044780.089999999850988;0
1850;-742751.000000000000000;-1044237.000000000000000;0
7652;-742275.046999998390675;-1045497.052000001072884;0
3101;-743922.754999998956919;-1042745.195000000298023;0
6708;-742268.296999998390675;-1044748.438000001013279;0
1921;-743387.000000000000000;-1044335.000000000000000;0
4030;-743133.280000001192093;-1043791.552000001072884;0
5197;-743222.513000000268221;-1043313.989999998360872;0
6092;-742001.309999998658895;-1043482.089999999850988;0
3262;-743572.423999998718500;-1042699.197000000625849;0
4513;-742579.030000001192093;-1042753.609999999403954;0
2167;-743021.000000000000000;-1045154.000000000000000;0
4235;-742390.041999999433756;-1043492.094999998807907;0
2282;-742923.000000000000000;-1045519.000000000000000;0
314;-742585.000000000000000;-1044184.000000000000000;0
1547;-742220.000000000000000;-1044181.000000000000000;0
3212;-743646.699000000953674;-1042469.458999998867512;0
7659;-742336.048000000417233;-1045327.868000000715256;0
6663;-741457.949999999254942;-1044194.329999998211861;0
4062;-742830.460000000894070;-1043654.920000001788139;0
675;-742446.000000000000000;-1043215.000000000000000;0
1706;-741225.800000000745058;-1044698.800000000745058;0
2507;-742427.000000000000000;-1044437.000000000000000;0
1732;-741840.000000000000000;-1045226.000000000000000;0
7729;-742623.480999998748302;-1044601.217000000178814;0
7248;-742757.960000000894070;-1044826.929999999701977;0
7317;-742579.670000001788139;-1045022.239999998360872;0
1596;-742323.000000000000000;-1045037.000000000000000;0
6943;-742902.013999998569489;-1043932.647999998182058;0
4079;-742836.170000001788139;-1043800.960000000894070;0
1594;-742304.000000000000000;-1044977.000000000000000;0
836;-742006.000000000000000;-1042525.000000000000000;0
1750;-742045.000000000000000;-1045215.000000000000000;0
545;-742337.000000000000000;-1043805.000000000000000;0
596;-741867.000000000000000;-1043259.000000000000000;0
5225;-743277.453999999910593;-1043558.087999999523163;0
1160;-741114.859999999403954;-1044508.120000001043081;0
3976;-743088.861000001430511;-1043707.728000000119209;0
641;-742008.000000000000000;-1043304.000000000000000;0
5112;-742942.920000001788139;-1043441.850000001490116;0
1286;-742221.460000000894070;-1044465.969999998807907;0
731;-741925.000000000000000;-1042997.000000000000000;0
4464;-742182.309999998658895;-1042571.379999998956919;0
392;-742418.000000000000000;-1043843.000000000000000;0
2220;-743075.000000000000000;-1045396.000000000000000;0
4847;-742981.100000001490116;-1042831.059999998658895;0
3284;-743642.822000000625849;-1042852.340999998152256;0
7934;-743545.050000000745058;-1044980.559999998658895;0
4134;-742772.309999998658895;-1044078.870000001043081;0
5636;-743427.432000000029802;-1043681.359999999403954;0
3019;-744463.447999998927116;-1042784.646000001579523;0
4084;-742817.504999998956919;-1043681.475000001490116;0
1382;-742096.000000000000000;-1045023.000000000000000;0
2007;-743231.000000000000000;-1044741.000000000000000;0
5324;-743025.329999998211861;-1043045.789999999105930;131
5236;-743352.302000001072884;-1043362.752000000327826;0
4704;-742680.000000000000000;-1042776.750000000000000;0
5128;-743040.467000000178814;-1043389.765999998897314;0
3297;-743706.958999998867512;-1042868.114999998360872;0
556;-742222.000000000000000;-1043702.000000000000000;0
4507;-742472.469999998807907;-1042720.199999999254942;0
5643;-743428.701999999582767;-1043689.872999999672174;0
7281;-742801.859999999403954;-1044705.300000000745058;0
513;-742083.000000000000000;-1043145.000000000000000;0
5111;-742892.337999999523163;-1043424.370999999344349;0
785;-741702.000000000000000;-1042622.000000000000000;0
4677;-742787.309999998658895;-1042797.899999998509884;0
2278;-742791.000000000000000;-1045657.000000000000000;0
408;-742317.000000000000000;-1044182.000000000000000;0
3847;-743122.146999999880791;-1042525.489999998360872;0
1061;-741586.000000000000000;-1045133.000000000000000;0
8150;-743304.219999998807907;-1043217.539999999105930;0
383;-742450.000000000000000;-1043722.000000000000000;0
2243;-743292.000000000000000;-1045310.000000000000000;0
4702;-742669.300000000745058;-1042747.399999998509884;0
5023;-742588.899000000208616;-1042870.296999998390675;0
5048;-742867.500000000000000;-1043381.899999998509884;0
4771;-742890.828000001609325;-1042889.975000001490116;0
8259;-742072.089999999850988;-1042687.219999998807907;0
1819;-743034.000000000000000;-1044350.000000000000000;0
2080;-742685.000000000000000;-1044460.000000000000000;116
4875;-742814.660000000149012;-1042937.800000000745058;0
1753;-742096.000000000000000;-1045195.000000000000000;0
4788;-742970.409000001847744;-1042588.238000001758337;0
2238;-743372.000000000000000;-1045261.000000000000000;0
3350;-743955.140999998897314;-1043006.692000001668930;0
6709;-742264.587999999523163;-1044776.254999998956919;0
5167;-743219.324999999254942;-1043405.249000001698732;0
5235;-743350.096000000834465;-1043388.881000000983477;0
740;-741759.000000000000000;-1043031.000000000000000;0
2741;-744016.675000000745058;-1043336.642999999225140;0
797;-741796.000000000000000;-1042574.000000000000000;0
1983;-743474.000000000000000;-1044709.000000000000000;0
8266;-742220.320000000298023;-1042706.760000001639128;0
1008;-741962.000000000000000;-1044568.000000000000000;0
1085;-741634.000000000000000;-1044530.000000000000000;0
5957;-742962.627000000327826;-1043510.905000001192093;0
4197;-742179.633999999612570;-1043776.899000000208616;0
1300;-741917.410000000149012;-1044719.769999999552965;0
3160;-743959.590999998152256;-1042557.386999998241663;0
3981;-743341.517000000923872;-1043837.353999998420477;0
1808;-743187.000000000000000;-1044539.000000000000000;0
5;-743466.000000000000000;-1042616.000000000000000;27
701;-742023.000000000000000;-1042885.000000000000000;0
1317;-741748.000000000000000;-1044884.000000000000000;0
3569;-744704.920000001788139;-1042585.679999999701977;0
5456;-742761.041000001132488;-1043254.350999999791384;0
4639;-742567.399999998509884;-1042548.592999998480082;0
2142;-742883.000000000000000;-1045078.000000000000000;0
4137;-742705.739999998360872;-1044094.100000001490116;0
1781;-741247.000000000000000;-1043923.000000000000000;0
1147;-741346.000000000000000;-1044466.000000000000000;0
4151;-742573.039999999105930;-1044109.035000000149012;0
1323;-741859.000000000000000;-1044941.000000000000000;0
6105;-742213.883000001311302;-1043111.734000001102686;0
4093;-742889.967999998480082;-1043954.530000001192093;0
6702;-742291.596999999135733;-1044564.116999998688698;0
4890;-742605.287000000476837;-1042838.535000000149012;0
5684;-743397.274000000208616;-1043719.995999999344349;0
3781;-743273.059999998658895;-1042814.050000000745058;0
3372;-743823.475000001490116;-1043010.432999998331070;0
6143;-742309.690999999642372;-1043060.385000001639128;0
1098;-741435.000000000000000;-1044571.000000000000000;0
3291;-743588.212999999523163;-1042790.916999999433756;0
4955;-742383.649999998509884;-1043019.250000000000000;0
695;-742207.000000000000000;-1043019.000000000000000;0
7911;-743564.839999999850988;-1045408.649999998509884;0
4622;-742533.901000000536442;-1042569.660000000149012;0
2748;-743933.984000001102686;-1043445.734000001102686;0
4153;-742555.934999998658895;-1044073.285000000149012;0
1109;-741204.100000001490116;-1044585.460000000894070;0
7258;-742917.370000001043081;-1044865.420000001788139;0
8069;-742226.440000001341105;-1045255.949999999254942;0
1119;-741791.000000000000000;-1044446.000000000000000;0
1718;-741366.219999998807907;-1044870.989999998360872;0
1133;-741604.000000000000000;-1044433.000000000000000;0
2339;-742747.000000000000000;-1045548.000000000000000;0
4851;-742991.500000000000000;-1042818.243000000715256;0
4224;-742139.756000000983477;-1043462.488000001758337;0
4603;-742442.480000000447035;-1042617.250000000000000;0
1307;-741803.000000000000000;-1044663.000000000000000;0
7514;-742304.866000000387430;-1044375.124000001698732;0
4785;-742943.613000001758337;-1042632.072999998927116;0
1813;-743118.000000000000000;-1044528.000000000000000;0
2026;-743351.000000000000000;-1045022.000000000000000;0
4835;-742967.660000000149012;-1042677.690000001341105;0
2888;-744082.749000001698732;-1043174.458999998867512;0
7257;-742901.879999998956919;-1044859.039999999105930;0
5002;-742561.190000001341105;-1042977.401999998837709;0
4124;-742751.265000000596046;-1043878.414999999105930;0
1823;-742973.000000000000000;-1044174.000000000000000;0
4759;-742842.945999998599291;-1042806.664000000804663;0
720;-741671.000000000000000;-1042815.000000000000000;0
7224;-742399.359999999403954;-1044829.829999998211861;0
6777;-741073.500000000000000;-1044491.879999998956919;0
2510;-743015.000000000000000;-1044050.000000000000000;0
3566;-744732.028000000864267;-1042600.848000001162291;0
1857;-742574.000000000000000;-1044318.000000000000000;0
1719;-741406.760000001639128;-1044866.039999999105930;0
283;-743026.000000000000000;-1043788.000000000000000;0
4068;-742917.125000000000000;-1043734.535000000149012;0
4652;-742775.500000000000000;-1042533.997999999672174;0
1862;-743477.000000000000000;-1044188.000000000000000;0
3806;-743010.089999999850988;-1042912.410000000149012;0
164;-743392.000000000000000;-1043230.000000000000000;0
4210;-742178.550000000745058;-1043586.035000000149012;0
7538;-742701.420000001788139;-1045364.109999999403954;0
4711;-742803.300000000745058;-1042601.140000000596046;0
6137;-742314.326999999582767;-1043068.837000001221895;0
309;-742721.000000000000000;-1044157.000000000000000;0
1602;-742507.000000000000000;-1044924.000000000000000;0
2104;-743176.000000000000000;-1044964.000000000000000;0
5161;-743160.846999999135733;-1043333.914999999105930;0
4807;-743122.570000000298023;-1042767.850000001490116;0
5674;-743409.089999999850988;-1043715.618000000715256;0
1922;-743390.000000000000000;-1044308.000000000000000;0
1629;-742450.000000000000000;-1044518.000000000000000;0
110;-744127.000000000000000;-1042724.000000000000000;0
6818;-741163.460000000894070;-1044806.616999998688698;0
1515;-741913.000000000000000;-1044072.000000000000000;0
5149;-743072.195999998599291;-1043377.370999999344349;0
6837;-741677.875999998301268;-1044964.791999999433756;0
1360;-741983.000000000000000;-1044900.000000000000000;0
4517;-742638.449999999254942;-1042779.280000001192093;0
384;-742471.000000000000000;-1043766.000000000000000;0
4500;-742315.239999998360872;-1042719.460000000894070;0
4836;-742984.245999999344349;-1042653.127999998629093;0
5138;-743030.936000000685453;-1043483.587999999523163;0
4250;-742144.109999999403954;-1043367.519999999552965;0
7186;-742587.609999999403954;-1044726.000000000000000;0
1696;-741529.000000000000000;-1044660.000000000000000;0
1047;-741816.000000000000000;-1044867.000000000000000;0
3985;-743312.765000000596046;-1043928.164999999105930;0
1311;-741646.000000000000000;-1044831.000000000000000;0
3922;-743844.574999999254942;-1043491.188999999314547;0
4047;-743210.230000000447035;-1043992.289999999105930;0
5730;-743418.855999998748302;-1043638.949000000953674;0
1964;-743412.000000000000000;-1044708.000000000000000;0
5651;-743429.440999999642372;-1043699.524999998509884;0
3889;-742335.008999999612570;-1042489.949000000953674;0
5242;-743357.030000001192093;-1043419.239999998360872;0
1355;-741899.000000000000000;-1044858.000000000000000;0
7035;-743299.831999998539686;-1044176.241999998688698;0
5723;-743420.903000000864267;-1043631.703999999910593;0
6207;-742313.287000000476837;-1043056.642000000923872;0
1135;-741572.000000000000000;-1044437.000000000000000;0
7085;-743327.129999998956919;-1044533.960000000894070;0
1601;-742452.000000000000000;-1044939.000000000000000;0
7179;-742625.429000001400709;-1044622.710000000894070;0
2085;-742426.000000000000000;-1044797.000000000000000;0
7145;-742812.874000001698732;-1044402.199000000953674;52
708;-741854.000000000000000;-1042881.000000000000000;0
2151;-742827.000000000000000;-1045047.000000000000000;0
6691;-742386.879000000655651;-1045082.589000001549721;0
1660;-741423.000000000000000;-1044818.000000000000000;0
3760;-743233.829999998211861;-1042978.739999998360872;0
5659;-743426.815000001341105;-1043709.059000000357628;0
1952;-743316.000000000000000;-1044495.000000000000000;0
5791;-743256.583000000566244;-1043571.184000000357628;0
5370;-742580.300999999046326;-1042977.140999998897314;0
7028;-743257.254999998956919;-1044104.574999999254942;0
2361;-742323.000000000000000;-1045576.000000000000000;0
3703;-744551.563999999314547;-1042514.760999999940395;0
4939;-742448.866999998688698;-1043072.822999998927116;0
4733;-742767.890000000596046;-1042671.010000001639128;0
1253;-742084.000000000000000;-1044730.000000000000000;0
4145;-742687.109999999403954;-1043837.125000000000000;0
5729;-743420.103000000119209;-1043638.901000000536442;0
1544;-742236.000000000000000;-1044198.000000000000000;0
1049;-741795.000000000000000;-1044923.000000000000000;0
2092;-742917.000000000000000;-1044617.000000000000000;0
1545;-742236.000000000000000;-1044234.000000000000000;0
5258;-743356.739999998360872;-1043230.039999999105930;0
4849;-742966.960000000894070;-1042893.583999998867512;0
5419;-742434.690000001341105;-1042846.280000001192093;0
4621;-742536.945999998599291;-1042552.296000000089407;0
1506;-741642.000000000000000;-1044236.000000000000000;0
1020;-742293.000000000000000;-1044615.000000000000000;0
4597;-742620.600000001490116;-1042680.690000001341105;0
1055;-741747.000000000000000;-1045038.000000000000000;0
5650;-743429.348999999463558;-1043698.318999998271465;0
7960;-741633.300000000745058;-1044301.980000000447035;0
6130;-742312.136999998241663;-1043066.344000000506639;0
6363;-742027.344999998807907;-1042665.324000000953674;0
7138;-742917.554999999701977;-1044421.774999998509884;0
1656;-741395.000000000000000;-1044688.000000000000000;0
1779;-741035.000000000000000;-1044812.000000000000000;0
1608;-742391.000000000000000;-1044383.000000000000000;0
3829;-742992.250000000000000;-1042635.140000000596046;0
2053;-743404.000000000000000;-1044986.000000000000000;0
4765;-742822.897999998182058;-1042850.499000001698732;0
1433;-741895.000000000000000;-1044328.000000000000000;0
2482;-741262.739999998360872;-1044725.530000001192093;0
6367;-741928.510000001639128;-1042645.149999998509884;0
265;-743344.000000000000000;-1043735.000000000000000;0
6841;-741583.443999998271465;-1044946.208000000566244;0
3768;-743006.370000001043081;-1042978.829999998211861;0
7030;-743291.859999999403954;-1044128.440000001341105;0
5644;-743428.793999999761581;-1043691.079999998211861;0
842;-742101.000000000000000;-1042521.000000000000000;0
7970;-741444.739999998360872;-1044384.980000000447035;0
2314;-742884.000000000000000;-1045456.000000000000000;0
4139;-742859.625999998301268;-1044000.574999999254942;0
1197;-741657.000000000000000;-1043865.000000000000000;0
1728;-741473.000000000000000;-1045087.000000000000000;0
1262;-742066.000000000000000;-1044917.000000000000000;0
1181;-741920.000000000000000;-1044230.000000000000000;0
7801;-742459.168999999761581;-1044490.660000000149012;0
2019;-743264.000000000000000;-1044921.000000000000000;0
4573;-742341.550000000745058;-1042629.699999999254942;0
628;-742217.370000001043081;-1043308.559999998658895;0
6230;-742317.590999998152256;-1043059.730999998748302;0
274;-743359.000000000000000;-1043833.000000000000000;0
6506;-741743.019999999552965;-1044571.050000000745058;0
2515;-742517.000000000000000;-1044420.000000000000000;0
3177;-743877.122000001370907;-1042630.761999998241663;0
2488;-742083.000000000000000;-1044303.000000000000000;0
4980;-742521.857999999076128;-1043030.853000000119209;0
4979;-742507.703000001609325;-1043016.118000000715256;0
5637;-743428.151000000536442;-1043682.633999999612570;0
7973;-741347.850000001490116;-1044381.850000001490116;0
1988;-743481.000000000000000;-1044849.000000000000000;0
1013;-742076.000000000000000;-1044595.000000000000000;0
688;-742284.000000000000000;-1043125.000000000000000;0
3233;-744152.962999999523163;-1042686.791999999433756;0
5777;-742926.357000000774860;-1043427.357999999076128;0
5511;-743426.401000000536442;-1043599.129999998956919;0
1178;-741952.000000000000000;-1044311.000000000000000;0
516;-742160.000000000000000;-1043135.000000000000000;0
5461;-742442.704999998211861;-1043234.515000000596046;0
7207;-742570.620000001043081;-1045016.149999998509884;0
4705;-742714.100000001490116;-1042599.829999998211861;0
1172;-741869.000000000000000;-1044348.000000000000000;0
2192;-743499.000000000000000;-1045199.000000000000000;0
1477;-741482.750000000000000;-1044212.480000000447035;0
4619;-742460.010000001639128;-1042480.890000000596046;0
210;-743112.000000000000000;-1043566.000000000000000;0
4167;-742438.315000001341105;-1044021.960000000894070;0
5014;-742563.771999999880791;-1042993.241999998688698;0
7967;-741508.109999999403954;-1044369.239999998360872;0
4966;-742377.289999999105930;-1043071.030000001192093;0
4846;-742981.635999999940395;-1042805.254000000655651;0
7978;-741231.690000001341105;-1044407.519999999552965;0
8267;-742240.420000001788139;-1042709.160000000149012;0
4324;-742269.346000000834465;-1043165.410999998450279;0
1479;-741407.000000000000000;-1044225.000000000000000;0
1448;-741537.000000000000000;-1044716.000000000000000;0
4527;-742728.050000000745058;-1042838.719999998807907;0
2032;-743526.000000000000000;-1044797.000000000000000;0
6370;-741968.780000001192093;-1042685.250000000000000;0
1003;-741913.000000000000000;-1044580.000000000000000;0
819;-741987.000000000000000;-1042599.000000000000000;0
7259;-742935.280000001192093;-1044869.829999998211861;0
2150;-742812.000000000000000;-1045054.000000000000000;0
6284;-742309.677999999374151;-1043054.043999999761581;0
6753;-742485.511999998241663;-1044950.206999998539686;0
1440;-741782.000000000000000;-1044362.000000000000000;0
8051;-742213.199999999254942;-1044935.890000000596046;0
3352;-743954.622000001370907;-1043015.732999999076128;0
6245;-742369.682000000029802;-1043057.377000000327826;0
2083;-742588.000000000000000;-1044663.000000000000000;0
3237;-744143.304999999701977;-1042651.339999999850988;0
1426;-742056.000000000000000;-1044228.000000000000000;0
2044;-743445.000000000000000;-1044960.000000000000000;0
6112;-742237.710000000894070;-1043370.434999998658895;0
1031;-741973.000000000000000;-1044784.000000000000000;0
3424;-743725.243000000715256;-1043089.951999999582767;0
1132;-741596.000000000000000;-1044446.000000000000000;0
4816;-742976.510000001639128;-1042798.309999998658895;0
5250;-743328.995000001043081;-1043178.495000001043081;0
697;-742101.000000000000000;-1042908.000000000000000;0
3145;-744025.730000000447035;-1042639.432999998331070;0
171;-743448.000000000000000;-1043399.000000000000000;0
4502;-742349.309999998658895;-1042718.199999999254942;0
2474;-743439.000000000000000;-1044900.000000000000000;0
885;-741739.000000000000000;-1042777.000000000000000;0
7968;-741473.980000000447035;-1044379.839999999850988;0
1125;-741728.000000000000000;-1044435.000000000000000;0
4819;-742941.910000000149012;-1042776.670000001788139;0
954;-742231.000000000000000;-1043024.000000000000000;0
6135;-742308.289000000804663;-1043059.340999998152256;0
1228;-742220.539999999105930;-1044250.829999998211861;0
2889;-744074.103999998420477;-1043194.559999998658895;0
3800;-743098.550000000745058;-1042863.019999999552965;0
1304;-741810.000000000000000;-1044684.000000000000000;0
1427;-742017.000000000000000;-1044256.000000000000000;0
1044;-741861.000000000000000;-1044743.000000000000000;0
4902;-742480.460000000894070;-1042802.989999998360872;0
6142;-742310.477000001817942;-1043061.813000001013279;0
4873;-742775.690000001341105;-1042931.829999998211861;0
212;-743080.000000000000000;-1043557.000000000000000;0
2493;-742011.000000000000000;-1044181.000000000000000;0
3326;-744036.002000000327826;-1042922.574999999254942;0
6159;-742312.495999999344349;-1043062.521000001579523;0
6874;-741789.789999999105930;-1045272.100000001490116;0
1171;-741882.000000000000000;-1044375.000000000000000;0
3281;-743629.340999998152256;-1042825.692000001668930;0
1388;-742152.000000000000000;-1045026.000000000000000;0
3286;-743679.592999998480082;-1042870.787000000476837;0
5215;-743342.890000000596046;-1043380.368000000715256;0
4559;-742400.530000001192093;-1042503.760000001639128;0
935;-744096.000000000000000;-1043503.000000000000000;0
2886;-744104.953999999910593;-1043172.171999998390675;0
7305;-742795.050000000745058;-1045069.809999998658895;0
575;-742053.000000000000000;-1043541.000000000000000;0
1752;-742070.000000000000000;-1045197.000000000000000;0
4168;-742423.695000000298023;-1043984.135000001639128;0
2556;-741376.000000000000000;-1044379.000000000000000;0
8019;-741972.039999999105930;-1044557.089999999850988;0
4606;-742512.769000001251698;-1042608.333000000566244;0
1093;-741494.000000000000000;-1044548.000000000000000;0
4617;-742561.250999998301268;-1042668.140000000596046;0
6145;-742315.708000000566244;-1043069.881999999284744;0
4662;-742819.471000000834465;-1042530.037000000476837;0
7018;-742577.747000001370907;-1044239.712999999523163;0
1698;-741464.000000000000000;-1044668.000000000000000;0
634;-742117.000000000000000;-1043309.000000000000000;0
4889;-742621.425000000745058;-1042831.109999999403954;0
4460;-742216.600000001490116;-1042598.850000001490116;0
4674;-742806.475999999791384;-1042703.594999998807907;0
4834;-742972.708000000566244;-1042657.809000000357628;0
5360;-742453.188999999314547;-1042938.521999999880791;0
5678;-743404.363000001758337;-1043717.368999999016523;0
3585;-744920.065000001341105;-1042522.129999998956919;0
1289;-742211.000000000000000;-1044521.000000000000000;0
7944;-742086.969999998807907;-1044063.079999998211861;0
623;-742254.000000000000000;-1043325.000000000000000;0
4839;-742984.162000000476837;-1042715.425000000745058;0
6338;-742247.910000000149012;-1042851.670000001788139;0
2293;-742786.000000000000000;-1045387.000000000000000;0
6648;-741750.510000001639128;-1044080.329999998211861;0
4790;-743036.497999999672174;-1042635.973999999463558;0
1364;-742077.000000000000000;-1044936.000000000000000;0
1687;-741142.120000001043081;-1044817.019999999552965;0
4233;-742334.782000001519918;-1043445.793000001460314;0
1412;-741635.760000001639128;-1044654.449999999254942;0
6707;-742271.293999999761581;-1044721.274999998509884;0
7776;-743089.784000001847744;-1045773.409000001847744;0
4922;-742443.129999998956919;-1042886.510000001639128;0
702;-741961.000000000000000;-1042885.000000000000000;0
6860;-741482.129999998956919;-1044991.089999999850988;0
1118;-741807.000000000000000;-1044459.000000000000000;0
6922;-742056.329999998211861;-1045086.679999999701977;0
4910;-742367.789000000804663;-1042795.280999999493361;0
535;-742111.000000000000000;-1043714.000000000000000;0
6249;-742373.554999999701977;-1043049.822000000625849;0
4947;-742399.918000001460314;-1042993.458000000566244;0
524;-742255.000000000000000;-1043913.000000000000000;0
