OID_;X;Y;TEMPERATURE
5786;-743456.410000000149012;-1042105.250000000000000;0
4333;-742428.420000001788139;-1043255.609999999403954;0
2261;-743009.000000000000000;-1045657.000000000000000;0
2520;-741847.000000000000000;-1045324.000000000000000;0
5382;-744377.920000001788139;-1042814.201000001281500;0
7782;-743012.350000001490116;-1045871.938999999314547;0
1268;-742046.000000000000000;-1045021.000000000000000;0
2050;-743460.000000000000000;-1045072.000000000000000;0
1608;-742391.000000000000000;-1044383.000000000000000;0
6853;-741548.899000000208616;-1045052.295000001788139;0
3702;-744567.984999999403954;-1042510.802000001072884;0
23;-743544.000000000000000;-1042505.000000000000000;0
7141;-742895.629999998956919;-1044470.910000000149012;0
3767;-743033.910000000149012;-1042982.390000000596046;0
510;-742048.000000000000000;-1043150.000000000000000;0
3326;-744036.002000000327826;-1042922.574999999254942;0
110;-744127.000000000000000;-1042724.000000000000000;3
1492;-741096.000000000000000;-1044331.000000000000000;0
1524;-741710.000000000000000;-1043844.000000000000000;0
747;-741690.000000000000000;-1043000.000000000000000;0
7154;-742908.467000000178814;-1044547.784000001847744;0
6559;-741296.480000000447035;-1043984.920000001788139;0
5394;-744802.909000001847744;-1042664.260999999940395;0
3110;-743743.295000001788139;-1042640.627000000327826;0
3598;-744894.750000000000000;-1042560.583999998867512;0
6980;-743071.769999999552965;-1044387.548999998718500;0
6362;-742039.230999998748302;-1042680.660000000149012;0
1501;-741475.000000000000000;-1044292.000000000000000;0
4336;-742416.888999998569489;-1043431.418000001460314;0
3919;-743904.947000000625849;-1043493.929999999701977;0
2885;-744122.791999999433756;-1043190.208000000566244;0
6313;-743936.949999999254942;-1042594.780000001192093;0
826;-742191.000000000000000;-1042616.000000000000000;0
885;-741739.000000000000000;-1042777.000000000000000;0
7539;-742682.600000001490116;-1045366.339999999850988;0
2167;-743021.000000000000000;-1045154.000000000000000;0
2560;-741251.000000000000000;-1044390.000000000000000;0
1601;-742452.000000000000000;-1044939.000000000000000;0
583;-741975.000000000000000;-1043434.000000000000000;0
2277;-742826.000000000000000;-1045653.000000000000000;0
2315;-742854.000000000000000;-1045460.000000000000000;0
3842;-743141.300000000745058;-1042637.030000001192093;0
2346;-742654.000000000000000;-1045546.000000000000000;0
3387;-743960.368000000715256;-1043194.717000000178814;0
3302;-743795.043999999761581;-1042863.539000000804663;0
1028;-741981.000000000000000;-1044692.000000000000000;0
2185;-743216.000000000000000;-1045130.000000000000000;0
8019;-741972.039999999105930;-1044557.089999999850988;0
598;-741853.000000000000000;-1043233.000000000000000;0
2159;-742822.000000000000000;-1045141.000000000000000;0
2223;-743053.000000000000000;-1045437.000000000000000;0
6873;-741769.339999999850988;-1045285.489999998360872;0
3752;-743213.949999999254942;-1042902.719999998807907;0
4063;-742855.079999998211861;-1043654.695000000298023;0
1693;-741613.000000000000000;-1044649.000000000000000;76
2024;-743305.000000000000000;-1045000.000000000000000;0
400;-742356.000000000000000;-1043931.000000000000000;0
6401;-741992.449999999254942;-1042503.609999999403954;0
2257;-742956.000000000000000;-1045558.000000000000000;0
697;-742101.000000000000000;-1042908.000000000000000;0
2542;-741813.000000000000000;-1044224.000000000000000;0
3209;-743668.293999999761581;-1042492.478999998420477;0
2272;-742922.000000000000000;-1045759.000000000000000;0
1984;-743476.000000000000000;-1044743.000000000000000;0
4771;-742890.828000001609325;-1042889.975000001490116;0
6820;-741224.105999998748302;-1044799.311999998986721;0
6724;-742590.385000001639128;-1044428.910000000149012;0
1593;-742192.000000000000000;-1044826.000000000000000;0
1486;-741150.000000000000000;-1044219.000000000000000;0
3033;-744483.675000000745058;-1042733.627000000327826;0
1838;-743004.480000000447035;-1044216.030000001192093;0
1125;-741728.000000000000000;-1044435.000000000000000;0
3534;-744667.721000000834465;-1042664.578000001609325;0
6716;-742256.467000000178814;-1044966.368000000715256;0
2479;-741247.800000000745058;-1044609.379999998956919;0
2381;-742313.000000000000000;-1045438.000000000000000;0
1504;-741577.000000000000000;-1044258.000000000000000;0
4680;-742759.370000001043081;-1042864.140000000596046;0
725;-741983.000000000000000;-1042939.000000000000000;0
505;-741917.000000000000000;-1043153.000000000000000;0
2357;-742388.000000000000000;-1045577.000000000000000;0
7104;-743423.739999998360872;-1044624.530000001192093;0
6721;-742321.052999999374151;-1044705.548000000417233;0
4806;-743138.429999999701977;-1042771.350000001490116;0
3781;-743273.059999998658895;-1042814.050000000745058;0
1919;-743381.000000000000000;-1044393.000000000000000;0
1134;-741558.000000000000000;-1044450.000000000000000;0
1879;-743302.000000000000000;-1044264.000000000000000;0
1466;-741838.000000000000000;-1044041.000000000000000;0
4005;-743325.977000001817942;-1044053.392999999225140;0
1903;-743445.000000000000000;-1044281.000000000000000;0
282;-743034.000000000000000;-1043819.000000000000000;0
5116;-742947.859000001102686;-1043386.767000000923872;0
7656;-742290.328000001609325;-1045294.499000001698732;0
467;-741757.000000000000000;-1043352.000000000000000;0
3267;-743587.203000001609325;-1042710.840999998152256;0
2367;-742510.000000000000000;-1045483.000000000000000;0
1945;-743270.000000000000000;-1044454.000000000000000;0
1676;-741033.000000000000000;-1044755.000000000000000;0
6;-743464.000000000000000;-1042594.000000000000000;0
7207;-742570.620000001043081;-1045016.149999998509884;0
8056;-742242.379999998956919;-1045023.460000000894070;0
4240;-742471.613000001758337;-1043552.366000000387430;322
1767;-741261.000000000000000;-1044168.000000000000000;0
2061;-742681.000000000000000;-1044491.000000000000000;0
513;-742083.000000000000000;-1043145.000000000000000;0
5282;-743037.090999998152256;-1043297.587999999523163;0
1795;-742155.000000000000000;-1044231.000000000000000;0
4558;-742373.019999999552965;-1042506.949999999254942;0
4048;-743218.050000000745058;-1043961.320000000298023;0
5067;-742813.465999998152256;-1043267.335999999195337;0
5142;-743039.870000001043081;-1043473.929999999701977;0
5001;-742560.092999998480082;-1042966.206999998539686;0
1759;-741128.000000000000000;-1044097.000000000000000;0
5294;-743056.328999999910593;-1043196.096999999135733;323
1754;-742120.000000000000000;-1045193.000000000000000;0
926;-741894.000000000000000;-1042999.000000000000000;0
6168;-742313.092999998480082;-1043062.208999998867512;0
4743;-742812.449999999254942;-1042729.609999999403954;0
227;-742846.000000000000000;-1043520.000000000000000;0
382;-742481.000000000000000;-1043751.000000000000000;0
5412;-742582.037000000476837;-1042571.986000001430511;0
4936;-742454.684000000357628;-1042685.620999999344349;0
1310;-741623.000000000000000;-1044829.000000000000000;0
2209;-743309.000000000000000;-1045217.000000000000000;0
1015;-742126.000000000000000;-1044599.000000000000000;0
1516;-741928.000000000000000;-1044062.000000000000000;0
4071;-742929.394999999552965;-1043807.585000000894070;0
7286;-742814.550000000745058;-1044746.960000000894070;0
5213;-743326.385999999940395;-1043368.675999999046326;0
5223;-743283.699999999254942;-1043535.940000001341105;0
1622;-742495.000000000000000;-1044321.000000000000000;0
4242;-742214.469999998807907;-1043415.800000000745058;0
6150;-742311.879999998956919;-1043062.857000000774860;0
6209;-742319.320000000298023;-1043066.114999998360872;0
4602;-742441.269000001251698;-1042596.320000000298023;0
2104;-743176.000000000000000;-1044964.000000000000000;0
5408;-743696.881000000983477;-1042878.024999998509884;0
2741;-744016.675000000745058;-1043336.642999999225140;0
568;-742116.000000000000000;-1043604.000000000000000;0
1892;-743525.000000000000000;-1044425.000000000000000;0
1697;-741495.000000000000000;-1044664.000000000000000;0
1427;-742017.000000000000000;-1044256.000000000000000;0
1240;-742145.000000000000000;-1044418.000000000000000;0
8152;-743293.600000001490116;-1043190.510000001639128;0
4430;-742235.070000000298023;-1043092.839999999850988;0
2385;-742167.000000000000000;-1045479.000000000000000;0
4828;-743048.579999998211861;-1042941.179999999701977;0
711;-741828.000000000000000;-1042860.000000000000000;0
6122;-742071.870000001043081;-1043283.660000000149012;0
1611;-742400.000000000000000;-1044442.000000000000000;0
2336;-742837.000000000000000;-1045523.000000000000000;0
1456;-741513.000000000000000;-1044437.000000000000000;0
7147;-742827.925000000745058;-1044451.385000001639128;0
1042;-741883.000000000000000;-1044682.000000000000000;0
4079;-742836.170000001788139;-1043800.960000000894070;0
351;-742509.000000000000000;-1043739.000000000000000;0
4198;-742192.445000000298023;-1043760.521000001579523;0
7243;-742724.339999999850988;-1044835.870000001043081;0
3352;-743954.622000001370907;-1043015.732999999076128;0
7732;-742611.719000000506639;-1044632.203999999910593;0
2805;-743893.609999999403954;-1043543.980000000447035;0
7015;-742554.570000000298023;-1044360.725000001490116;0
7944;-742086.969999998807907;-1044063.079999998211861;0
1993;-743483.000000000000000;-1044984.000000000000000;0
4332;-742410.359000001102686;-1043282.916000001132488;0
2233;-743461.000000000000000;-1045218.000000000000000;0
309;-742721.000000000000000;-1044157.000000000000000;0
7736;-742342.260000001639128;-1045113.918000001460314;0
4938;-742469.324999999254942;-1042658.263000000268221;0
4310;-742031.800000000745058;-1043475.199999999254942;0
4939;-742448.866999998688698;-1043072.822999998927116;0
5322;-743060.379999998956919;-1043029.589999999850988;0
1520;-741777.000000000000000;-1043939.000000000000000;0
5704;-743417.484999999403954;-1043635.530999999493361;0
1170;-741893.000000000000000;-1044403.000000000000000;0
4837;-742979.105999998748302;-1042672.627999998629093;0
3824;-743038.059999998658895;-1042573.800000000745058;0
6651;-741697.910000000149012;-1044123.329999998211861;0
4737;-742718.399999998509884;-1042684.079999998211861;0
3802;-743068.190000001341105;-1042879.710000000894070;0
1223;-742190.000000000000000;-1044277.000000000000000;0
6826;-741405.300000000745058;-1044777.199999999254942;0
6506;-741743.019999999552965;-1044571.050000000745058;0
5646;-743428.978999998420477;-1043693.493000000715256;0
6851;-741595.567000001668930;-1045078.456999998539686;0
4724;-742870.089999999850988;-1042658.210000000894070;0
1586;-742372.000000000000000;-1044785.000000000000000;0
6510;-741721.960000000894070;-1044461.815000001341105;0
4223;-742161.556000001728535;-1043473.138999998569489;0
3825;-743056.390000000596046;-1042570.079999998211861;0
1017;-742167.000000000000000;-1044603.000000000000000;0
6368;-741940.324999999254942;-1042660.324000000953674;0
536;-742085.000000000000000;-1043673.000000000000000;0
6703;-742288.903999999165535;-1044591.625999998301268;0
5581;-743409.978999998420477;-1043638.324000000953674;0
7735;-742196.594999998807907;-1045243.149999998509884;0
4046;-743205.699999999254942;-1044009.719999998807907;0
4455;-741714.589000001549721;-1042663.557000000029802;0
4830;-743043.449999999254942;-1042882.359999999403954;0
3808;-742987.050000000745058;-1042925.350000001490116;0
4974;-742489.458999998867512;-1043047.024999998509884;0
5176;-743321.252999998629093;-1043447.495000001043081;0
1095;-741452.000000000000000;-1044553.000000000000000;0
2149;-742819.000000000000000;-1045024.000000000000000;0
390;-742429.000000000000000;-1043827.000000000000000;0
6186;-742314.337999999523163;-1043061.517000000923872;0
2133;-743040.000000000000000;-1045127.000000000000000;0
6830;-741526.739999998360872;-1044761.309000000357628;0
1041;-741893.000000000000000;-1044653.000000000000000;0
1270;-742242.000000000000000;-1044491.000000000000000;0
1815;-743083.000000000000000;-1044478.000000000000000;0
6397;-742033.839999999850988;-1042501.859999999403954;0
6142;-742310.477000001817942;-1043061.813000001013279;0
617;-742179.000000000000000;-1043272.000000000000000;0
7807;-742647.802999999374151;-1044543.524000000208616;0
4647;-742705.322999998927116;-1042525.425000000745058;0
1336;-741737.000000000000000;-1044860.000000000000000;0
7259;-742935.280000001192093;-1044869.829999998211861;0
4715;-742877.199999999254942;-1042610.059999998658895;0
6281;-742307.629000000655651;-1043042.113000001758337;0
2254;-743235.000000000000000;-1045290.000000000000000;0
1531;-741782.000000000000000;-1043838.000000000000000;0
5178;-743386.421000000089407;-1043452.486000001430511;0
1349;-741824.000000000000000;-1044818.000000000000000;0
7721;-742941.157000001519918;-1044215.368000000715256;0
525;-742233.000000000000000;-1043884.000000000000000;247
1370;-742061.000000000000000;-1044797.000000000000000;0
3333;-743967.447999998927116;-1042967.616000000387430;0
7801;-742459.168999999761581;-1044490.660000000149012;0
338;-742602.000000000000000;-1043933.000000000000000;0
1584;-742368.000000000000000;-1044717.000000000000000;0
6300;-741836.949999999254942;-1042698.329999998211861;0
1376;-742165.000000000000000;-1044873.000000000000000;0
639;-741958.000000000000000;-1043294.000000000000000;0
5370;-742580.300999999046326;-1042977.140999998897314;0
4426;-742197.589999999850988;-1043031.679999999701977;0
7049;-743420.177000001072884;-1044168.629999998956919;32
7234;-742594.870000001043081;-1044815.140000000596046;0
1131;-741643.000000000000000;-1044433.000000000000000;0
3612;-744996.545000001788139;-1042292.646000001579523;0
1474;-741604.000000000000000;-1044172.000000000000000;0
995;-741906.000000000000000;-1044434.000000000000000;0
1272;-742237.000000000000000;-1044545.000000000000000;0
3310;-743829.561999998986721;-1042854.063000001013279;0
8285;-742232.780000001192093;-1042821.149999998509884;0
2388;-742096.000000000000000;-1045422.000000000000000;0
1320;-741870.000000000000000;-1044957.000000000000000;0
4122;-742732.074999999254942;-1043923.995000001043081;0
3416;-743754.546000000089407;-1043086.953000001609325;0
4174;-742738.230000000447035;-1043763.155000001192093;0
6215;-742314.692000001668930;-1043057.682000000029802;0
5584;-743408.885000001639128;-1043643.532000001519918;0
8242;-742568.629999998956919;-1045197.829999998211861;0
1962;-743406.000000000000000;-1044664.000000000000000;0
4944;-742430.605999998748302;-1043013.879000000655651;0
1704;-741289.000000000000000;-1044690.000000000000000;0
6192;-742317.252000000327826;-1043065.394999999552965;0
3951;-743433.379999998956919;-1043586.600000001490116;0
4731;-742802.002999998629093;-1042654.546000000089407;0
1163;-741072.820000000298023;-1044501.940000001341105;0
1791;-742157.000000000000000;-1044163.000000000000000;0
3457;-745069.765000000596046;-1042699.907000001519918;0
6105;-742213.883000001311302;-1043111.734000001102686;0
7928;-743542.539999999105930;-1044784.769999999552965;0
8076;-742050.429999999701977;-1045256.199999999254942;0
4163;-742487.695000000298023;-1044138.535000000149012;0
2286;-742894.000000000000000;-1045440.000000000000000;0
3974;-743140.660000000149012;-1043725.350000001490116;0
2514;-742546.000000000000000;-1044431.000000000000000;0
4829;-743051.579999998211861;-1042916.609999999403954;0
1373;-742143.000000000000000;-1044822.000000000000000;0
4924;-742427.890999998897314;-1042890.581000000238419;0
4983;-742587.776000000536442;-1043013.068999998271465;0
1036;-741961.000000000000000;-1044922.000000000000000;0
302;-742925.000000000000000;-1044109.000000000000000;0
5240;-743364.164000000804663;-1043254.934000000357628;0
1133;-741604.000000000000000;-1044433.000000000000000;0
2326;-742523.000000000000000;-1045498.000000000000000;0
6014;-742844.000000000000000;-1043239.482999999076128;0
6663;-741457.949999999254942;-1044194.329999998211861;0
3269;-743600.679000001400709;-1042731.660000000149012;0
1850;-742751.000000000000000;-1044237.000000000000000;0
4905;-742467.730000000447035;-1042815.620000001043081;0
2205;-743136.000000000000000;-1045304.000000000000000;0
7515;-742273.021999999880791;-1044371.543999999761581;0
4873;-742775.690000001341105;-1042931.829999998211861;0
5164;-743173.335000000894070;-1043404.677000001072884;0
1048;-741805.000000000000000;-1044896.000000000000000;0
5462;-742498.728999998420477;-1042986.947000000625849;0
2364;-742504.000000000000000;-1045563.000000000000000;0
2039;-743308.000000000000000;-1044808.000000000000000;0
8261;-742108.039999999105930;-1042693.769999999552965;0
4202;-742285.475999999791384;-1043627.734999999403954;0
1679;-741116.550000000745058;-1044578.600000001490116;0
5177;-743336.440999999642372;-1043440.883999999612570;0
191;-743424.000000000000000;-1043599.000000000000000;0
4052;-743252.954999998211861;-1043843.585000000894070;0
2090;-742923.000000000000000;-1044566.000000000000000;0
7083;-743309.980000000447035;-1044509.500000000000000;0
4177;-742387.940999999642372;-1044182.254999998956919;0
2548;-741672.000000000000000;-1044304.000000000000000;0
2095;-743178.000000000000000;-1044734.000000000000000;0
952;-742274.000000000000000;-1043018.000000000000000;0
1053;-741768.000000000000000;-1045023.000000000000000;0
1360;-741983.000000000000000;-1044900.000000000000000;0
3344;-743932.276000000536442;-1043064.493999999016523;0
4849;-742966.960000000894070;-1042893.583999998867512;0
3101;-743922.754999998956919;-1042745.195000000298023;0
7033;-743303.864999998360872;-1044132.750000000000000;0
5265;-743188.572999998927116;-1043226.513999998569489;0
1432;-741958.000000000000000;-1044285.000000000000000;0
4135;-742747.719999998807907;-1044085.660000000149012;0
4758;-742854.840999998152256;-1042811.914000000804663;0
1933;-743329.000000000000000;-1044407.000000000000000;0
4945;-742422.162999998778105;-1043009.861000001430511;0
6704;-742282.179999999701977;-1044623.793999999761581;0
3759;-743267.609999999403954;-1042971.300000000745058;0
7280;-742806.989999998360872;-1044667.600000001490116;0
6354;-741928.410000000149012;-1042711.350000001490116;0
3283;-743632.767000000923872;-1042846.004000000655651;0
1031;-741973.000000000000000;-1044784.000000000000000;0
1824;-742963.809999998658895;-1044143.929999999701977;0
5207;-743208.434999998658895;-1043365.236999999731779;0
705;-741929.000000000000000;-1042865.000000000000000;0
3719;-744730.929000001400709;-1042409.002000000327826;0
2389;-742076.000000000000000;-1045396.000000000000000;0
4666;-742808.710000000894070;-1042576.609999999403954;0
4750;-742784.420000001788139;-1042733.429999999701977;0
4663;-742820.800000000745058;-1042560.039999999105930;0
5451;-743276.109000001102686;-1043331.000999998301268;0
702;-741961.000000000000000;-1042885.000000000000000;0
4152;-742564.589999999850988;-1044089.934999998658895;0
677;-742425.000000000000000;-1043200.000000000000000;0
115;-745228.000000000000000;-1042764.000000000000000;0
7705;-742283.471999999135733;-1044316.339999999850988;0
7317;-742579.670000001788139;-1045022.239999998360872;0
4033;-743319.719999998807907;-1043793.300000000745058;0
7829;-743509.649999998509884;-1045166.399999998509884;0
4036;-743246.920000001788139;-1043771.574999999254942;0
5042;-742731.719000000506639;-1042890.517000000923872;0
2046;-743382.000000000000000;-1044968.000000000000000;0
2498;-741906.000000000000000;-1044040.000000000000000;0
1154;-741228.719999998807907;-1044493.440000001341105;0
4630;-742646.271999999880791;-1042652.089999999850988;0
552;-742259.000000000000000;-1043732.000000000000000;0
7949;-741953.559999998658895;-1044123.660000000149012;0
6126;-743428.385999999940395;-1043621.800000000745058;0
628;-742217.370000001043081;-1043308.559999998658895;0
4784;-742945.712999999523163;-1042685.611999999731779;0
7210;-742559.789999999105930;-1045047.809999998658895;0
8258;-742053.760000001639128;-1042683.769999999552965;0
204;-743208.000000000000000;-1043588.000000000000000;0
4499;-742338.899999998509884;-1042707.250000000000000;0
1159;-741137.000000000000000;-1044493.000000000000000;0
1383;-742077.000000000000000;-1045046.000000000000000;0
3959;-743417.421999998390675;-1043577.730000000447035;0
7175;-742651.780000001192093;-1044558.149999998509884;0
4151;-742573.039999999105930;-1044109.035000000149012;0
3273;-743642.442999999970198;-1042796.677999999374151;0
6265;-742353.164999999105930;-1043020.054999999701977;0
5514;-743426.903000000864267;-1043609.252999998629093;0
4128;-742915.039999999105930;-1044041.920000001788139;0
3768;-743006.370000001043081;-1042978.829999998211861;0
1811;-743175.000000000000000;-1044525.000000000000000;0
5958;-742962.513999998569489;-1043517.497999999672174;0
3322;-743927.326000001281500;-1042934.425999999046326;0
1629;-742450.000000000000000;-1044518.000000000000000;0
8267;-742240.420000001788139;-1042709.160000000149012;0
3953;-743407.249000001698732;-1043543.537000000476837;0
8272;-742042.399999998509884;-1042732.559999998658895;0
4557;-742381.019999999552965;-1042528.550000000745058;0
4571;-742345.710000000894070;-1042568.989999998360872;0
880;-741793.000000000000000;-1042834.000000000000000;0
7005;-742998.190000001341105;-1043944.824999999254942;0
572;-742083.000000000000000;-1043561.000000000000000;0
7019;-742585.024999998509884;-1044210.725000001490116;0
1757;-742189.000000000000000;-1045219.000000000000000;0
5196;-743199.263000000268221;-1043326.401000000536442;0
3373;-743814.043000001460314;-1043018.168000001460314;0
4232;-742315.057999998331070;-1043428.918999999761581;0
6857;-741503.982999999076128;-1044930.340999998152256;0
8262;-742129.620000001043081;-1042698.079999998211861;0
7967;-741508.109999999403954;-1044369.239999998360872;0
5086;-742856.307999998331070;-1043239.488000001758337;0
5697;-743416.916000001132488;-1043635.342000000178814;0
6195;-742314.956000000238419;-1043061.181000001728535;0
4922;-742443.129999998956919;-1042886.510000001639128;0
209;-743108.000000000000000;-1043583.000000000000000;0
1453;-741525.000000000000000;-1044529.000000000000000;0
7026;-743217.644999999552965;-1044082.329999998211861;0
344;-742557.000000000000000;-1043847.000000000000000;0
4956;-742383.579999998211861;-1043007.739999998360872;0
620;-742253.000000000000000;-1043281.000000000000000;0
1110;-741220.730000000447035;-1044598.480000000447035;0
1602;-742507.000000000000000;-1044924.000000000000000;0
1293;-742037.000000000000000;-1044462.000000000000000;0
1375;-742151.000000000000000;-1044887.000000000000000;0
4519;-742665.160000000149012;-1042790.820000000298023;0
5216;-743284.217999998480082;-1043325.638999998569489;0
2556;-741376.000000000000000;-1044379.000000000000000;0
5169;-743240.785000000149012;-1043411.081999998539686;0
4691;-742693.760000001639128;-1042596.969999998807907;0
6573;-741294.089999999850988;-1044091.679999999701977;0
1500;-741441.000000000000000;-1044299.000000000000000;0
6169;-742312.320000000298023;-1043060.791999999433756;0
2037;-743373.000000000000000;-1044805.000000000000000;0
4675;-742805.809999998658895;-1042785.070000000298023;0
874;-741755.000000000000000;-1042675.000000000000000;0
5171;-743266.124000001698732;-1043419.293999999761581;0
8257;-742149.809999998658895;-1045048.399999998509884;0
6860;-741482.129999998956919;-1044991.089999999850988;0
2145;-742825.000000000000000;-1045079.000000000000000;0
517;-742207.000000000000000;-1043117.000000000000000;0
6389;-742141.199999999254942;-1042497.030000001192093;0
3263;-743570.528999999165535;-1042712.653999999165535;0
6993;-743172.409000001847744;-1044501.339000001549721;0
2578;-742494.000000000000000;-1045542.000000000000000;0
5419;-742434.690000001341105;-1042846.280000001192093;0
4779;-742917.822999998927116;-1042727.385000001639128;0
546;-742323.640000000596046;-1043781.429999999701977;0
5647;-743429.070999998599291;-1043694.699000000953674;0
4047;-743210.230000000447035;-1043992.289999999105930;0
5686;-743394.912000000476837;-1043720.872000001370907;0
5724;-743422.230999998748302;-1043632.715999998152256;0
2546;-741750.000000000000000;-1044271.000000000000000;0
5233;-743347.210000000894070;-1043435.807000000029802;0
7176;-742630.820000000298023;-1044585.809999998658895;0
6675;-742272.140000000596046;-1044167.469999998807907;0
5688;-743415.267000000923872;-1043631.945000000298023;0
4093;-742889.967999998480082;-1043954.530000001192093;0
5736;-743414.859999999403954;-1043691.462999999523163;0
4791;-743022.245000001043081;-1042633.714000001549721;0
6496;-742290.655999999493361;-1044438.502999998629093;0
4624;-742577.815000001341105;-1042600.907999999821186;0
4775;-742898.375999998301268;-1042802.914000000804663;0
4229;-742146.929000001400709;-1043334.585000000894070;0
729;-741986.000000000000000;-1042998.000000000000000;0
1985;-743478.000000000000000;-1044769.000000000000000;0
5022;-742578.440000001341105;-1042849.350000001490116;0
619;-742229.000000000000000;-1043277.000000000000000;0
6849;-741635.855999998748302;-1045019.947999998927116;0
6134;-742309.011999998241663;-1043060.703000001609325;0
1257;-742070.000000000000000;-1044815.000000000000000;0
4325;-742270.679000001400709;-1043141.787999998778105;0
1261;-742057.000000000000000;-1044894.000000000000000;0
625;-742247.000000000000000;-1043299.000000000000000;0
3993;-743345.100000001490116;-1043930.980000000447035;0
6479;-741969.831000000238419;-1044454.850000001490116;0
554;-742238.000000000000000;-1043717.000000000000000;0
5122;-742902.166999999433756;-1043373.543999999761581;0
1405;-741681.000000000000000;-1044325.000000000000000;0
6248;-742372.506000000983477;-1043051.769999999552965;0
6196;-742314.190000001341105;-1043059.774999998509884;0
1698;-741464.000000000000000;-1044668.000000000000000;0
408;-742317.000000000000000;-1044182.000000000000000;0
3971;-743206.815000001341105;-1043721.065000001341105;0
1906;-743459.000000000000000;-1044325.000000000000000;0
7945;-742063.179999999701977;-1044077.379999998956919;0
6007;-743187.807000000029802;-1043302.019000001251698;0
2085;-742426.000000000000000;-1044797.000000000000000;0
6239;-742363.504999998956919;-1043069.298000000417233;0
2222;-743058.000000000000000;-1045420.000000000000000;0
5504;-743428.977000001817942;-1043686.274000000208616;0
5058;-742837.528999999165535;-1043170.686000000685453;0
323;-742711.000000000000000;-1044140.000000000000000;0
7211;-742570.070000000298023;-1045065.679999999701977;0
6191;-742318.017000000923872;-1043066.800999999046326;0
614;-742111.000000000000000;-1043271.000000000000000;0
6214;-742315.447999998927116;-1043059.026000000536442;0
7410;-743525.730000000447035;-1045377.420000001788139;0
4057;-743132.184999998658895;-1043648.719999998807907;0
1475;-741565.000000000000000;-1044185.000000000000000;0
3797;-743147.989999998360872;-1042854.129999998956919;0
758;-741658.000000000000000;-1042666.000000000000000;0
3979;-743340.934999998658895;-1043779.414999999105930;0
5583;-743410.274999998509884;-1043642.072000000625849;0
387;-742421.000000000000000;-1043763.000000000000000;0
1307;-741803.000000000000000;-1044663.000000000000000;0
3990;-743339.489999998360872;-1043987.234999999403954;0
4709;-742775.800000000745058;-1042600.690000001341105;0
5509;-743425.144999999552965;-1043637.853000000119209;0
5689;-743415.442000001668930;-1043633.646000001579523;0
4898;-742571.280000001192093;-1042840.859999999403954;0
4074;-742943.350000001490116;-1043880.304999999701977;0
1335;-741752.000000000000000;-1044833.000000000000000;0
7739;-742301.399000000208616;-1045040.431000001728535;0
4603;-742442.480000000447035;-1042617.250000000000000;0
4843;-742975.057000000029802;-1042729.682000000029802;0
6170;-742311.548000000417233;-1043059.381000000983477;0
6876;-741825.559999998658895;-1045240.469999998807907;0
297;-742938.000000000000000;-1044069.000000000000000;0
6256;-742380.723000001162291;-1043035.640000000596046;0
3943;-743413.429000001400709;-1043376.822000000625849;0
5664;-743420.907000001519918;-1043711.245999999344349;0
183;-743438.000000000000000;-1043422.000000000000000;0
4117;-742733.614999998360872;-1044043.129999998956919;0
3956;-743414.039999999105930;-1043561.081999998539686;0
1831;-742994.000000000000000;-1044105.000000000000000;0
4527;-742728.050000000745058;-1042838.719999998807907;0
