OID_;X;Y;TEMPERATURE
3614;-744984.548999998718500;-1042283.640999998897314;0
110;-744127.000000000000000;-1042724.000000000000000;0
3019;-744463.447999998927116;-1042784.646000001579523;0
3568;-744718.817999999970198;-1042588.614999998360872;0
3692;-744525.876499999314547;-1042540.534000001847744;0
3580;-744924.973999999463558;-1042593.699999999254942;0
2605;-745393.842999998480082;-1042860.796000000089407;0
5975;-745052.346999999135733;-1042674.673000000417233;0
118;-745135.000000000000000;-1042687.000000000000000;0
3542;-744575.274000000208616;-1042656.160000000149012;0
2696;-743477.489999998360872;-1042038.000000000000000;0
2520;-741847.000000000000000;-1045324.000000000000000;0
696;-742077.000000000000000;-1042913.000000000000000;0
7259;-742935.280000001192093;-1044869.829999998211861;0
1524;-741710.000000000000000;-1043844.000000000000000;0
7;-743479.000000000000000;-1042567.000000000000000;0
2070;-742993.000000000000000;-1044723.000000000000000;0
1521;-741808.000000000000000;-1043917.000000000000000;0
3066;-744075.627000000327826;-1042883.837000001221895;0
3752;-743213.949999999254942;-1042902.719999998807907;0
709;-741861.000000000000000;-1042862.000000000000000;0
725;-741983.000000000000000;-1042939.000000000000000;0
3111;-743727.034000001847744;-1042625.182999998331070;0
2149;-742819.000000000000000;-1045024.000000000000000;0
6;-743464.000000000000000;-1042594.000000000000000;0
3216;-743615.890999998897314;-1042451.129999998956919;0
8077;-742038.989999998360872;-1045265.309999998658895;0
2154;-742805.000000000000000;-1045147.000000000000000;0
465;-741728.000000000000000;-1043309.000000000000000;0
1540;-742005.000000000000000;-1044009.000000000000000;0
4047;-743210.230000000447035;-1043992.289999999105930;0
744;-741666.000000000000000;-1042994.000000000000000;0
7010;-742857.964999999850988;-1044251.155000001192093;4
509;-741991.000000000000000;-1043143.000000000000000;0
7142;-742872.445000000298023;-1044472.239999998360872;0
1780;-741214.000000000000000;-1043934.000000000000000;0
884;-741771.000000000000000;-1042776.000000000000000;0
7147;-742827.925000000745058;-1044451.385000001639128;0
2103;-743182.000000000000000;-1044931.000000000000000;0
7278;-742803.899999998509884;-1044636.800000000745058;0
2091;-742920.000000000000000;-1044593.000000000000000;0
1272;-742237.000000000000000;-1044545.000000000000000;0
2135;-743006.000000000000000;-1045119.000000000000000;0
2212;-743217.000000000000000;-1045279.000000000000000;0
1797;-743098.000000000000000;-1044099.000000000000000;0
283;-743026.000000000000000;-1043788.000000000000000;0
4331;-742391.967999998480082;-1043310.539000000804663;0
1240;-742145.000000000000000;-1044418.000000000000000;0
6962;-743011.489999998360872;-1044196.070000000298023;0
6722;-742357.717000000178814;-1044705.708000000566244;0
1905;-743446.000000000000000;-1044312.000000000000000;0
2502;-742750.000000000000000;-1045457.000000000000000;0
7162;-743075.840999998152256;-1044541.596000000834465;0
7003;-743074.140000000596046;-1044350.280000001192093;0
6977;-743098.949999999254942;-1044459.879999998956919;0
7000;-743096.190000001341105;-1044426.870000001043081;0
1795;-742155.000000000000000;-1044231.000000000000000;0
430;-742185.000000000000000;-1043888.000000000000000;0
7410;-743525.730000000447035;-1045377.420000001788139;0
1822;-742986.199999999254942;-1044211.969999998807907;0
6701;-742295.142000000923872;-1044533.372000001370907;0
651;-742490.000000000000000;-1043564.000000000000000;0
2185;-743216.000000000000000;-1045130.000000000000000;0
8284;-742219.410000000149012;-1042809.500000000000000;0
2193;-743531.000000000000000;-1045204.000000000000000;0
6946;-742974.765000000596046;-1043929.388000000268221;0
4219;-742243.045000001788139;-1043600.660000000149012;0
2325;-742559.000000000000000;-1045494.000000000000000;0
4060;-742896.530000001192093;-1043699.219999998807907;0
6659;-741515.070000000298023;-1044171.070000000298023;0
6556;-741290.410000000149012;-1044041.471000000834465;0
3848;-743094.383999999612570;-1042505.245000001043081;0
3974;-743140.660000000149012;-1043725.350000001490116;0
4130;-742868.460000000894070;-1044055.510000001639128;0
6826;-741405.300000000745058;-1044777.199999999254942;0
4098;-742789.157000001519918;-1043861.918999999761581;0
2486;-741289.250000000000000;-1044848.829999998211861;0
3092;-743909.377999998629093;-1042780.322999998927116;0
309;-742721.000000000000000;-1044157.000000000000000;0
2449;-742825.000000000000000;-1044147.000000000000000;0
1832;-743024.000000000000000;-1044100.000000000000000;0
3995;-743393.225000001490116;-1043973.719999998807907;0
6945;-742955.907000001519918;-1043932.182999998331070;0
2226;-743057.000000000000000;-1045470.000000000000000;0
739;-741789.000000000000000;-1043028.000000000000000;0
2237;-743368.000000000000000;-1045238.000000000000000;0
4071;-742929.394999999552965;-1043807.585000000894070;0
3211;-743651.409000001847744;-1042483.458999998867512;0
2321;-742679.000000000000000;-1045480.000000000000000;0
4208;-742372.416999999433756;-1043503.423000000417233;0
1421;-741587.000000000000000;-1044356.000000000000000;0
1515;-741913.000000000000000;-1044072.000000000000000;0
3314;-743758.675999999046326;-1042905.688999999314547;0
7946;-742007.769999999552965;-1044091.789999999105930;0
7207;-742570.620000001043081;-1045016.149999998509884;0
2491;-742059.000000000000000;-1044251.000000000000000;0
1443;-741727.000000000000000;-1044386.000000000000000;0
7716;-743023.190999999642372;-1045843.241999998688698;0
1468;-741778.000000000000000;-1044082.000000000000000;0
738;-741818.000000000000000;-1043024.000000000000000;0
317;-742464.000000000000000;-1044207.000000000000000;0
6872;-741751.719999998807907;-1045296.679999999701977;0
7397;-743021.859999999403954;-1045682.989999998360872;0
5067;-742813.465999998152256;-1043267.335999999195337;0
2493;-742011.000000000000000;-1044181.000000000000000;0
1433;-741895.000000000000000;-1044328.000000000000000;0
1298;-741964.000000000000000;-1044736.000000000000000;0
2247;-743199.000000000000000;-1045400.000000000000000;0
4249;-742151.910000000149012;-1043354.719999998807907;0
733;-741963.000000000000000;-1043018.000000000000000;0
3292;-743576.905000001192093;-1042781.315000001341105;0
1756;-742165.000000000000000;-1045209.000000000000000;0
2275;-742845.000000000000000;-1045719.000000000000000;0
4080;-742832.480000000447035;-1043782.030000001192093;0
7656;-742290.328000001609325;-1045294.499000001698732;0
1014;-742097.000000000000000;-1044586.000000000000000;0
4326;-742319.855000000447035;-1043419.918999999761581;0
2397;-742181.000000000000000;-1045368.000000000000000;0
7744;-742941.256999999284744;-1045533.171000000089407;0
3273;-743642.442999999970198;-1042796.677999999374151;0
1502;-741506.000000000000000;-1044283.000000000000000;0
7014;-742650.170000001788139;-1044305.010000001639128;0
8262;-742129.620000001043081;-1042698.079999998211861;0
2760;-743863.331000000238419;-1043483.304000001400709;0
2562;-741090.000000000000000;-1044404.000000000000000;0
596;-741867.000000000000000;-1043259.000000000000000;0
1697;-741495.000000000000000;-1044664.000000000000000;0
2516;-742500.000000000000000;-1044414.000000000000000;0
6727;-742522.868000000715256;-1044395.879999998956919;0
7347;-742557.690000001341105;-1045177.440000001341105;0
4340;-742473.662000000476837;-1043349.048999998718500;0
2095;-743178.000000000000000;-1044734.000000000000000;0
4500;-742315.239999998360872;-1042719.460000000894070;0
1481;-741335.000000000000000;-1044231.000000000000000;0
2061;-742681.000000000000000;-1044491.000000000000000;0
4135;-742747.719999998807907;-1044085.660000000149012;0
1112;-741189.050000000745058;-1044602.469999998807907;0
1487;-741117.000000000000000;-1044216.000000000000000;0
5272;-743000.013999998569489;-1043245.364000000059605;0
2755;-744003.879000000655651;-1043471.734000001102686;0
8049;-742198.890000000596046;-1044891.600000001490116;0
2316;-742823.000000000000000;-1045463.000000000000000;0
2334;-742872.000000000000000;-1045519.000000000000000;0
2008;-743242.000000000000000;-1044759.000000000000000;0
6675;-742272.140000000596046;-1044167.469999998807907;0
3366;-743913.831000000238419;-1043002.796999998390675;0
4214;-742229.274999998509884;-1043511.745000001043081;0
1546;-742219.000000000000000;-1044147.000000000000000;0
6096;-742098.760000001639128;-1043615.589999999850988;0
1584;-742368.000000000000000;-1044717.000000000000000;0
2218;-743091.000000000000000;-1045372.000000000000000;0
6448;-744017.179999999701977;-1043123.899999998509884;0
1614;-742388.000000000000000;-1044432.000000000000000;0
2166;-743016.000000000000000;-1045179.000000000000000;0
2404;-742179.000000000000000;-1045467.000000000000000;0
7201;-742571.190000001341105;-1044939.320000000298023;0
647;-742216.000000000000000;-1043375.000000000000000;0
350;-742505.000000000000000;-1043757.000000000000000;0
8058;-742263.219999998807907;-1045051.489999998360872;0
7704;-742256.021000001579523;-1044313.592999998480082;0
754;-741676.000000000000000;-1042727.000000000000000;0
914;-741715.000000000000000;-1042583.000000000000000;0
1341;-741687.000000000000000;-1044742.000000000000000;0
503;-741879.000000000000000;-1043158.000000000000000;32
6806;-741090.381000000983477;-1044706.675999999046326;0
2274;-742870.000000000000000;-1045732.000000000000000;0
6841;-741583.443999998271465;-1044946.208000000566244;0
2130;-743095.000000000000000;-1045126.000000000000000;0
2741;-744016.675000000745058;-1043336.642999999225140;0
79;-744062.000000000000000;-1043257.000000000000000;0
2021;-743281.000000000000000;-1044948.000000000000000;0
6385;-742179.530000001192093;-1042495.359999999403954;0
4257;-742056.467000000178814;-1043503.657999999821186;25
2044;-743445.000000000000000;-1044960.000000000000000;0
1994;-743483.000000000000000;-1045010.000000000000000;0
512;-742063.000000000000000;-1043136.000000000000000;0
2418;-742410.000000000000000;-1045109.000000000000000;0
3365;-743840.598999999463558;-1043023.565000001341105;0
6721;-742321.052999999374151;-1044705.548000000417233;0
2440;-742596.000000000000000;-1044193.000000000000000;0
1317;-741748.000000000000000;-1044884.000000000000000;0
5068;-742837.162999998778105;-1043263.965999998152256;0
4025;-743202.881000000983477;-1043852.008000001311302;0
3919;-743904.947000000625849;-1043493.929999999701977;0
1653;-741384.000000000000000;-1044592.000000000000000;0
1971;-743385.000000000000000;-1044881.000000000000000;0
4033;-743319.719999998807907;-1043793.300000000745058;0
3309;-743830.328000001609325;-1042834.535000000149012;0
522;-742261.000000000000000;-1043122.000000000000000;0
1057;-741686.000000000000000;-1045058.000000000000000;0
2892;-744005.317000001668930;-1043204.537000000476837;0
3148;-744008.699000000953674;-1042624.668999999761581;0
4807;-743122.570000000298023;-1042767.850000001490116;0
6854;-741522.427999999374151;-1045038.967999998480082;0
1355;-741899.000000000000000;-1044858.000000000000000;0
6273;-742321.806000001728535;-1043017.085000000894070;0
2033;-743500.000000000000000;-1044798.000000000000000;0
4481;-741766.089999999850988;-1042627.859999999403954;0
779;-741708.000000000000000;-1042533.000000000000000;0
3373;-743814.043000001460314;-1043018.168000001460314;0
1250;-742103.000000000000000;-1044672.000000000000000;0
7979;-741161.500000000000000;-1044398.210000000894070;0
3786;-743150.480000000447035;-1042925.960000000894070;0
333;-742651.000000000000000;-1043996.000000000000000;0
5258;-743356.739999998360872;-1043230.039999999105930;0
4169;-742414.420000001788139;-1043962.329999998211861;0
1150;-741290.000000000000000;-1044485.000000000000000;0
680;-742402.109999999403954;-1043166.679999999701977;0
4669;-742823.199999999254942;-1042658.309999998658895;0
1686;-741143.910000000149012;-1044795.120000001043081;0
4888;-742649.925999999046326;-1042830.767000000923872;0
7034;-743299.725999999791384;-1044153.140000000596046;0
8046;-742169.109999999403954;-1044835.660000000149012;0
4715;-742877.199999999254942;-1042610.059999998658895;0
516;-742160.000000000000000;-1043135.000000000000000;0
3834;-743079.190000001341105;-1042579.899999998509884;0
5036;-742666.855999998748302;-1042990.710000000894070;0
5667;-743417.361999999731779;-1043712.557000000029802;0
1600;-742418.000000000000000;-1044944.000000000000000;0
591;-741912.000000000000000;-1043346.000000000000000;0
4089;-742812.844999998807907;-1043560.114999998360872;0
1012;-742060.000000000000000;-1044582.000000000000000;0
5729;-743420.103000000119209;-1043638.901000000536442;0
5322;-743060.379999998956919;-1043029.589999999850988;0
5509;-743425.144999999552965;-1043637.853000000119209;0
342;-742573.000000000000000;-1043878.000000000000000;0
1444;-741559.000000000000000;-1044786.000000000000000;0
3978;-743342.695000000298023;-1043756.835000000894070;0
2457;-741016.000000000000000;-1044542.000000000000000;0
3180;-743900.668000001460314;-1042588.706000000238419;0
7032;-743301.464999999850988;-1044106.190000001341105;0
1928;-743474.000000000000000;-1044409.000000000000000;0
6723;-742592.894999999552965;-1044408.905000001192093;0
1046;-741838.000000000000000;-1044805.000000000000000;0
1925;-743331.000000000000000;-1044321.000000000000000;0
3988;-743309.704999998211861;-1044008.570000000298023;0
841;-742056.000000000000000;-1042508.000000000000000;0
4105;-742678.771999999880791;-1043769.206000000238419;0
3836;-743096.070000000298023;-1042561.879999998956919;0
336;-742616.000000000000000;-1043959.000000000000000;0
6504;-741755.193999998271465;-1044619.083000000566244;0
1949;-743248.000000000000000;-1044491.000000000000000;0
613;-742089.000000000000000;-1043271.000000000000000;0
1127;-741700.000000000000000;-1044440.000000000000000;0
4859;-742966.710000000894070;-1042996.302999999374151;0
5107;-742857.611999999731779;-1043458.278000000864267;0
2049;-743499.000000000000000;-1045071.000000000000000;0
1703;-741320.000000000000000;-1044686.000000000000000;0
827;-742218.000000000000000;-1042626.000000000000000;0
2327;-742491.000000000000000;-1045502.000000000000000;0
7118;-743468.750000000000000;-1044677.690000001341105;0
3849;-743061.690000001341105;-1042485.920000001788139;0
4174;-742738.230000000447035;-1043763.155000001192093;0
2298;-742621.000000000000000;-1045406.000000000000000;0
921;-743338.000000000000000;-1043818.000000000000000;0
4743;-742812.449999999254942;-1042729.609999999403954;0
1319;-741788.000000000000000;-1044905.000000000000000;0
1389;-742281.250000000000000;-1044962.859999999403954;0
397;-742355.000000000000000;-1043861.000000000000000;0
6260;-742377.692999999970198;-1043022.434000000357628;0
1924;-743359.000000000000000;-1044320.000000000000000;0
7246;-742736.730000000447035;-1044825.399999998509884;0
2081;-742551.000000000000000;-1044621.000000000000000;0
4760;-742826.947000000625849;-1042799.914000000804663;0
4973;-742480.098000001162291;-1043031.443999998271465;0
5149;-743072.195999998599291;-1043377.370999999344349;0
1027;-741984.000000000000000;-1044660.000000000000000;0
1359;-742000.000000000000000;-1044897.000000000000000;0
563;-742155.000000000000000;-1043660.000000000000000;0
621;-742285.000000000000000;-1043282.000000000000000;0
1956;-743397.000000000000000;-1044501.000000000000000;0
1618;-742405.000000000000000;-1044404.000000000000000;0
7214;-742470.679999999701977;-1044531.269999999552965;0
5144;-743052.642000000923872;-1043488.940000001341105;0
4950;-742354.289999999105930;-1042955.670000001788139;0
1943;-743264.000000000000000;-1044421.000000000000000;0
5048;-742867.500000000000000;-1043381.899999998509884;0
1256;-742084.000000000000000;-1044787.000000000000000;0
1345;-741741.000000000000000;-1044789.000000000000000;0
845;-742126.000000000000000;-1042505.000000000000000;0
1669;-741077.000000000000000;-1044092.000000000000000;0
4951;-742335.579999998211861;-1042934.429999999701977;0
4860;-742964.800999999046326;-1043016.107999999076128;0
1550;-741356.000000000000000;-1044363.000000000000000;0
6312;-743933.359999999403954;-1042580.719999998807907;0
4797;-743049.140999998897314;-1042689.576999999582767;0
8270;-742019.480000000447035;-1042725.870000001043081;0
893;-742956.000000000000000;-1042572.000000000000000;0
5727;-743422.451999999582767;-1043637.473000001162291;0
4928;-742444.890000000596046;-1042854.899999998509884;0
556;-742222.000000000000000;-1043702.000000000000000;0
1766;-741257.000000000000000;-1044204.000000000000000;0
1003;-741913.000000000000000;-1044580.000000000000000;0
383;-742450.000000000000000;-1043722.000000000000000;0
1964;-743412.000000000000000;-1044708.000000000000000;0
1587;-742372.000000000000000;-1044806.000000000000000;0
5648;-743429.164000000804663;-1043695.905999999493361;0
5725;-743422.388000000268221;-1043634.186999998986721;0
3343;-743911.989000000059605;-1043070.489000000059605;0
225;-742885.000000000000000;-1043535.000000000000000;0
6360;-742004.925000000745058;-1042692.804000001400709;0
7706;-742313.239999998360872;-1044319.611999999731779;0
6162;-742310.199999999254942;-1043058.306000001728535;0
4057;-743132.184999998658895;-1043648.719999998807907;0
7652;-742275.046999998390675;-1045497.052000001072884;0
529;-742162.000000000000000;-1043803.000000000000000;0
1097;-741414.000000000000000;-1044558.000000000000000;0
6141;-742311.243999999016523;-1043063.195999998599291;0
6303;-741823.820000000298023;-1042750.410000000149012;0
994;-741946.000000000000000;-1044433.000000000000000;0
6130;-742312.136999998241663;-1043066.344000000506639;0
4651;-742756.375000000000000;-1042524.938000001013279;0
6178;-742312.960000000894070;-1043060.445999998599291;0
1726;-741516.000000000000000;-1045120.000000000000000;0
1105;-741274.000000000000000;-1044576.000000000000000;0
1414;-741627.000000000000000;-1044593.000000000000000;0
390;-742429.000000000000000;-1043827.000000000000000;0
4638;-742553.631999999284744;-1042542.028000000864267;0
697;-742101.000000000000000;-1042908.000000000000000;0
5186;-743270.949999999254942;-1043526.039999999105930;0
1436;-741869.000000000000000;-1044323.000000000000000;0
4526;-742696.690000001341105;-1042823.320000000298023;0
531;-742157.000000000000000;-1043778.000000000000000;0
6568;-741292.100000001490116;-1044161.670000001788139;0
1293;-742037.000000000000000;-1044462.000000000000000;0
1871;-743440.000000000000000;-1044260.000000000000000;0
4707;-742743.519999999552965;-1042600.359999999403954;0
7644;-742295.089000001549721;-1045373.164999999105930;0
1237;-742144.000000000000000;-1044365.000000000000000;0
4690;-742679.162999998778105;-1042583.138999998569489;0
6403;-741971.879999998956919;-1042504.289999999105930;0
5243;-743357.622000001370907;-1043407.258999999612570;0
6213;-742316.227000001817942;-1043060.478999998420477;0
4963;-742396.510000001639128;-1043031.829999998211861;0
5518;-743427.500999998301268;-1043621.975000001490116;0
7739;-742301.399000000208616;-1045040.431000001728535;0
5205;-743251.475000001490116;-1043328.679000001400709;0
7355;-743348.309999998658895;-1045148.329999998211861;0
5411;-742776.079999998211861;-1042905.300000000745058;0
7085;-743327.129999998956919;-1044533.960000000894070;0
1382;-742096.000000000000000;-1045023.000000000000000;0
4815;-742992.210000000894070;-1042788.359999999403954;0
4597;-742620.600000001490116;-1042680.690000001341105;0
5231;-743342.107000000774860;-1043497.627000000327826;0
3871;-742356.649999998509884;-1042420.543999999761581;0
1862;-743477.000000000000000;-1044188.000000000000000;0
7740;-742301.949999999254942;-1045061.239000000059605;0
6193;-742316.486000001430511;-1043063.991000000387430;0
4934;-742433.807000000029802;-1042730.874000001698732;0
3953;-743407.249000001698732;-1043543.537000000476837;0
4849;-742966.960000000894070;-1042893.583999998867512;0
4831;-743041.170000001788139;-1042862.530000001192093;0
6861;-741491.429999999701977;-1045010.300000000745058;0
4768;-742862.888000000268221;-1042936.997999999672174;0
109;-744134.000000000000000;-1042768.000000000000000;0
6099;-741947.280000001192093;-1043424.289999999105930;0
1267;-742040.000000000000000;-1044999.000000000000000;0
5303;-743164.818999998271465;-1043211.078000001609325;0
5698;-743416.785999998450279;-1043633.638000000268221;0
2357;-742388.000000000000000;-1045577.000000000000000;0
1453;-741525.000000000000000;-1044529.000000000000000;0
4721;-742883.219999998807907;-1042605.010000001639128;0
4660;-742801.596999999135733;-1042487.965999998152256;0
5022;-742578.440000001341105;-1042849.350000001490116;0
4602;-742441.269000001251698;-1042596.320000000298023;0
4786;-742953.361000001430511;-1042655.886999998241663;0
3412;-743772.947000000625849;-1043053.557999998331070;0
7121;-743339.839999999850988;-1044620.059999998658895;0
5296;-743058.934999998658895;-1043177.035000000149012;0
5730;-743418.855999998748302;-1043638.949000000953674;0
4696;-742682.817000001668930;-1042658.543999999761581;0
5118;-742835.168000001460314;-1043315.074000000953674;0
6283;-742308.969000000506639;-1043049.539999999105930;0
4724;-742870.089999999850988;-1042658.210000000894070;0
519;-742239.000000000000000;-1043113.000000000000000;0
988;-741820.000000000000000;-1044516.000000000000000;0
6298;-741804.910000000149012;-1042692.300000000745058;0
5655;-743429.699000000953674;-1043704.359999999403954;0
4623;-742533.778999999165535;-1042585.824000000953674;0
4180;-742368.370000001043081;-1044115.471999999135733;0
4762;-742854.192000001668930;-1042825.931000001728535;0
7732;-742611.719000000506639;-1044632.203999999910593;0
839;-742021.000000000000000;-1042510.000000000000000;0
1456;-741513.000000000000000;-1044437.000000000000000;0
520;-742225.000000000000000;-1043127.000000000000000;0
6226;-742320.660999998450279;-1043065.366999998688698;0
4615;-742527.811000000685453;-1042658.600999999791384;0
7723;-741757.929000001400709;-1044043.175000000745058;0
7995;-741545.920000001788139;-1045160.100000001490116;0
4577;-742376.686000000685453;-1042590.309999998658895;0
4806;-743138.429999999701977;-1042771.350000001490116;0
6002;-742018.502000000327826;-1043294.918999999761581;0
1041;-741893.000000000000000;-1044653.000000000000000;0
4699;-742676.469999998807907;-1042731.760000001639128;0
5955;-742960.732999999076128;-1043520.888999998569489;0
1442;-741753.000000000000000;-1044375.000000000000000;0
551;-742269.000000000000000;-1043755.000000000000000;0
3811;-743244.620000001043081;-1042809.420000001788139;0
1656;-741395.000000000000000;-1044688.000000000000000;0
4627;-742601.138999998569489;-1042606.791000001132488;0
2057;-742787.000000000000000;-1044365.000000000000000;0
5446;-743190.850000001490116;-1043337.008999999612570;0
6279;-742306.210000000894070;-1043033.421999998390675;0
4059;-743142.649999998509884;-1043612.730000000447035;0
5647;-743429.070999998599291;-1043694.699000000953674;0
5239;-743361.096000000834465;-1043279.333999998867512;0
6147;-742314.177000001072884;-1043067.070999998599291;0
7649;-742319.399999998509884;-1045429.557000000029802;0
675;-742446.000000000000000;-1043215.000000000000000;0
692;-742292.000000000000000;-1043084.000000000000000;0
4703;-742697.859000001102686;-1042783.011999998241663;0
4305;-742520.295000001788139;-1043993.065000001341105;0
2236;-743391.000000000000000;-1045242.000000000000000;0
5508;-743426.105999998748302;-1043645.960999999195337;0
6144;-742308.925000000745058;-1043059.002000000327826;0
6103;-742213.102000001817942;-1043103.528999999165535;0
6280;-742306.918999999761581;-1043038.083000000566244;0
5081;-742917.046000000089407;-1043356.515999998897314;0
1416;-741628.000000000000000;-1044523.000000000000000;0
634;-742117.000000000000000;-1043309.000000000000000;0
4983;-742587.776000000536442;-1043013.068999998271465;0
5687;-743415.142000000923872;-1043630.285999998450279;0
6269;-742337.300000000745058;-1043018.486000001430511;0
7189;-742588.486999999731779;-1044766.690999999642372;0
6140;-742311.999000001698732;-1043064.638999998569489;0
5582;-743410.127000000327826;-1043640.197999998927116;0
3760;-743233.829999998211861;-1042978.739999998360872;0
4584;-742417.721999999135733;-1042627.620999999344349;0
2329;-742432.000000000000000;-1045508.000000000000000;0
6532;-741593.359999999403954;-1044141.059999998658895;0
1376;-742165.000000000000000;-1044873.000000000000000;0
5718;-743420.888999998569489;-1043629.666999999433756;0
5710;-743421.574999999254942;-1043640.598000001162291;0
6508;-741728.552999999374151;-1044508.050999999046326;0
618;-742203.000000000000000;-1043272.000000000000000;0
6250;-742374.638999998569489;-1043047.576999999582767;0
4598;-742602.175000000745058;-1042688.015999998897314;0
7244;-742713.559999998658895;-1044823.719999998807907;0
6368;-741940.324999999254942;-1042660.324000000953674;0
6040;-742075.469999998807907;-1043676.809999998658895;0
6276;-742310.815999999642372;-1043016.000999998301268;0
4945;-742422.162999998778105;-1043009.861000001430511;0
7041;-743381.004999998956919;-1044158.699999999254942;0
1590;-742377.000000000000000;-1044885.000000000000000;0
1498;-741382.000000000000000;-1044310.000000000000000;0
5580;-743409.831000000238419;-1043636.449000000953674;0
5244;-743361.021000001579523;-1043374.999000001698732;0
1624;-742551.000000000000000;-1044318.000000000000000;0
6234;-742324.105000000447035;-1043076.613000001758337;0
3276;-743673.931000001728535;-1042836.190999999642372;0
4676;-742792.579999998211861;-1042771.519999999552965;0
4241;-742225.929999999701977;-1043394.530000001192093;0
5418;-742434.890000000596046;-1042864.780000001192093;0
6258;-742382.381999999284744;-1043032.370999999344349;0
5598;-743412.839999999850988;-1043680.403000000864267;0
5317;-743063.690000001341105;-1043053.769999999552965;0
4694;-742689.272999998182058;-1042626.495999999344349;0
1510;-741764.000000000000000;-1044180.000000000000000;0
1252;-742096.000000000000000;-1044711.000000000000000;0
1511;-741795.000000000000000;-1044159.000000000000000;0
6219;-742319.168999999761581;-1043064.293999999761581;0
4840;-742988.201999999582767;-1042740.603999998420477;0
6210;-742318.541000001132488;-1043064.662999998778105;0
517;-742207.000000000000000;-1043117.000000000000000;0
2547;-741724.000000000000000;-1044282.000000000000000;0
4628;-742619.598000001162291;-1042609.989999998360872;0
5704;-743417.484999999403954;-1043635.530999999493361;0
1471;-741711.000000000000000;-1044132.000000000000000;0
681;-742383.000000000000000;-1043170.000000000000000;0
8150;-743304.219999998807907;-1043217.539999999105930;0
5224;-743293.449999999254942;-1043542.160000000149012;0
1957;-743402.000000000000000;-1044519.000000000000000;0
7086;-743333.149999998509884;-1044527.250000000000000;0
4784;-742945.712999999523163;-1042685.611999999731779;0
5169;-743240.785000000149012;-1043411.081999998539686;0
6281;-742307.629000000655651;-1043042.113000001758337;0
6160;-742311.730999998748302;-1043061.116000000387430;0
6218;-742319.947000000625849;-1043065.767999999225140;0
4902;-742480.460000000894070;-1042802.989999998360872;0
5217;-743306.870999999344349;-1043323.228000000119209;0
3793;-743101.820000000298023;-1042826.379999998956919;0
3795;-743173.190000001341105;-1042842.170000001788139;0
1571;-742239.000000000000000;-1044186.000000000000000;0
5699;-743416.657000001519918;-1043631.932999998331070;0
4734;-742762.920000001788139;-1042698.820000000298023;0
4689;-742688.114999998360872;-1042568.859999999403954;0
5677;-743405.545000001788139;-1043716.931000001728535;0
5694;-743417.339999999850988;-1043640.361000001430511;0
1313;-741681.000000000000000;-1044849.000000000000000;0
380;-742501.000000000000000;-1043722.000000000000000;0
6186;-742314.337999999523163;-1043061.517000000923872;0
191;-743424.000000000000000;-1043599.000000000000000;0
6253;-742378.725000001490116;-1043039.690000001341105;0
4729;-742855.690000001341105;-1042695.640000000596046;0
5229;-743327.379999998956919;-1043528.620000001043081;0
4921;-742444.739999998360872;-1042908.420000001788139;0
1981;-743406.000000000000000;-1044627.000000000000000;0
6271;-742329.282000001519918;-1043017.853999998420477;0
4824;-742918.673000000417233;-1042871.875000000000000;0
1507;-741673.000000000000000;-1044223.000000000000000;0
