OID_;X;Y;TEMPERATURE
3209;-743668.293999999761581;-1042492.478999998420477;0
8;-743496.000000000000000;-1042539.000000000000000;178
3613;-744986.447999998927116;-1042275.537999998778105;0
502;-741901.000000000000000;-1043169.000000000000000;0
2255;-743181.000000000000000;-1045372.000000000000000;0
3289;-743584.761999998241663;-1042769.188000001013279;0
283;-743026.000000000000000;-1043788.000000000000000;0
1531;-741782.000000000000000;-1043838.000000000000000;0
80;-744067.000000000000000;-1043330.000000000000000;0
531;-742157.000000000000000;-1043778.000000000000000;0
224;-742904.000000000000000;-1043522.000000000000000;0
6946;-742974.765000000596046;-1043929.388000000268221;0
383;-742450.000000000000000;-1043722.000000000000000;0
5113;-742946.795000001788139;-1043444.427999999374151;0
510;-742048.000000000000000;-1043150.000000000000000;0
2516;-742500.000000000000000;-1044414.000000000000000;0
6722;-742357.717000000178814;-1044705.708000000566244;0
1587;-742372.000000000000000;-1044806.000000000000000;0
6316;-743949.877999998629093;-1042656.561999998986721;0
3752;-743213.949999999254942;-1042902.719999998807907;0
87;-743857.000000000000000;-1043557.000000000000000;0
5240;-743364.164000000804663;-1043254.934000000357628;0
8079;-742021.839999999850988;-1045292.179999999701977;0
2286;-742894.000000000000000;-1045440.000000000000000;0
1248;-742109.000000000000000;-1044631.000000000000000;0
2034;-743468.000000000000000;-1044800.000000000000000;0
6872;-741751.719999998807907;-1045296.679999999701977;0
1629;-742450.000000000000000;-1044518.000000000000000;0
3837;-743093.699999999254942;-1042577.890000000596046;0
2749;-743924.129999998956919;-1043464.359999999403954;0
398;-742372.000000000000000;-1043909.000000000000000;0
6448;-744017.179999999701977;-1043123.899999998509884;0
7650;-742315.337000001221895;-1045462.039999999105930;0
4093;-742889.967999998480082;-1043954.530000001192093;0
7012;-742805.839999999850988;-1044263.870000001043081;0
466;-741743.000000000000000;-1043331.000000000000000;0
1498;-741382.000000000000000;-1044310.000000000000000;0
7281;-742801.859999999403954;-1044705.300000000745058;0
1666;-741017.000000000000000;-1044315.000000000000000;0
2503;-742753.000000000000000;-1045484.000000000000000;0
3068;-744158.921000000089407;-1042812.230999998748302;0
4161;-742506.254999998956919;-1044181.925000000745058;0
7015;-742554.570000000298023;-1044360.725000001490116;0
1056;-741707.000000000000000;-1045042.000000000000000;0
1179;-741934.000000000000000;-1044251.000000000000000;0
7519;-742850.620000001043081;-1045673.670000001788139;0
1030;-741975.000000000000000;-1044753.000000000000000;0
2270;-742954.000000000000000;-1045592.000000000000000;0
2050;-743460.000000000000000;-1045072.000000000000000;0
3335;-743976.318999998271465;-1042991.258999999612570;0
4218;-742263.436999998986721;-1043615.100999999791384;0
5409;-743745.201000001281500;-1042902.750000000000000;0
884;-741771.000000000000000;-1042776.000000000000000;0
4237;-742425.385000001639128;-1043517.421000000089407;0
1396;-741798.000000000000000;-1044263.000000000000000;0
7263;-743009.559999998658895;-1044894.379999998956919;0
4070;-742925.285000000149012;-1043783.565000001341105;48
1698;-741464.000000000000000;-1044668.000000000000000;0
7933;-743544.570000000298023;-1044950.370000001043081;0
4224;-742139.756000000983477;-1043462.488000001758337;0
7397;-743021.859999999403954;-1045682.989999998360872;0
4148;-742631.269999999552965;-1043885.870000001043081;0
1608;-742391.000000000000000;-1044383.000000000000000;0
2321;-742679.000000000000000;-1045480.000000000000000;0
334;-742631.000000000000000;-1043987.000000000000000;0
1164;-741055.000000000000000;-1044515.000000000000000;0
1928;-743474.000000000000000;-1044409.000000000000000;0
2222;-743058.000000000000000;-1045420.000000000000000;0
7247;-742774.480000000447035;-1044839.850000001490116;0
2142;-742883.000000000000000;-1045078.000000000000000;0
7775;-743098.660999998450279;-1045755.228999998420477;0
6794;-741124.372999999672174;-1044792.221000000834465;0
513;-742083.000000000000000;-1043145.000000000000000;0
31;-743485.000000000000000;-1042645.000000000000000;0
1150;-741290.000000000000000;-1044485.000000000000000;0
1220;-742147.000000000000000;-1044283.000000000000000;0
3111;-743727.034000001847744;-1042625.182999998331070;0
2369;-742503.000000000000000;-1045427.000000000000000;0
4010;-743200.372999999672174;-1044041.177999999374151;0
7050;-743438.070999998599291;-1044185.932000000029802;0
2070;-742993.000000000000000;-1044723.000000000000000;0
2692;-743430.750000000000000;-1042085.649999998509884;0
6656;-741590.160000000149012;-1044150.480000000447035;0
596;-741867.000000000000000;-1043259.000000000000000;0
2133;-743040.000000000000000;-1045127.000000000000000;0
3768;-743006.370000001043081;-1042978.829999998211861;0
3810;-743261.510000001639128;-1042802.960000000894070;0
2095;-743178.000000000000000;-1044734.000000000000000;0
3677;-744603.943999998271465;-1042491.761999998241663;0
2091;-742920.000000000000000;-1044593.000000000000000;0
3756;-743319.230000000447035;-1042949.019999999552965;0
2157;-742789.000000000000000;-1045161.000000000000000;0
7136;-742914.329999998211861;-1044374.469999998807907;0
1905;-743446.000000000000000;-1044312.000000000000000;0
7171;-742671.969999998807907;-1044508.219999998807907;0
7182;-742597.789999999105930;-1044678.260000001639128;0
1517;-741964.000000000000000;-1044034.000000000000000;0
6997;-743109.160000000149012;-1044453.600000001490116;0
881;-741806.000000000000000;-1042815.000000000000000;0
2242;-743321.000000000000000;-1045313.000000000000000;0
7077;-743564.359000001102686;-1045385.210000000894070;0
7143;-742850.414999999105930;-1044473.449999999254942;0
2497;-741932.000000000000000;-1044075.000000000000000;0
6007;-743187.807000000029802;-1043302.019000001251698;0
6648;-741750.510000001639128;-1044080.329999998211861;0
1750;-742045.000000000000000;-1045215.000000000000000;0
7994;-741529.219999998807907;-1045148.010000001639128;0
1020;-742293.000000000000000;-1044615.000000000000000;0
1187;-741805.000000000000000;-1044071.000000000000000;0
1350;-741814.000000000000000;-1044844.000000000000000;0
4164;-742476.478000000119209;-1044110.528000000864267;0
7173;-742660.850000001490116;-1044535.730000000447035;0
2093;-742915.000000000000000;-1044642.000000000000000;0
1039;-741914.000000000000000;-1044595.000000000000000;0
1607;-742414.000000000000000;-1044379.000000000000000;0
408;-742317.000000000000000;-1044182.000000000000000;0
4326;-742319.855000000447035;-1043419.918999999761581;0
4143;-742750.925000000745058;-1044017.960000000894070;0
3415;-743772.855999998748302;-1043081.368000000715256;0
675;-742446.000000000000000;-1043215.000000000000000;0
7735;-742196.594999998807907;-1045243.149999998509884;0
700;-742008.000000000000000;-1042895.000000000000000;0
6154;-742316.324000000953674;-1043069.546000000089407;0
6692;-742222.114999998360872;-1044818.673000000417233;0
1414;-741627.000000000000000;-1044593.000000000000000;0
1325;-741894.000000000000000;-1044959.000000000000000;0
3996;-743394.274999998509884;-1044004.254999998956919;0
2185;-743216.000000000000000;-1045130.000000000000000;0
1429;-741982.000000000000000;-1044280.000000000000000;0
2535;-742042.000000000000000;-1044071.000000000000000;0
3291;-743588.212999999523163;-1042790.916999999433756;0
640;-741983.000000000000000;-1043299.000000000000000;0
6483;-741773.829999998211861;-1044640.969000000506639;0
4598;-742602.175000000745058;-1042688.015999998897314;0
672;-742484.000000000000000;-1043226.000000000000000;0
6176;-742314.491000000387430;-1043063.256000000983477;0
1133;-741604.000000000000000;-1044433.000000000000000;0
1196;-741677.000000000000000;-1043894.000000000000000;0
1820;-743006.000000000000000;-1044272.000000000000000;0
1329;-742062.000000000000000;-1045046.000000000000000;0
2512;-743070.000000000000000;-1044052.000000000000000;0
6977;-743098.949999999254942;-1044459.879999998956919;0
8284;-742219.410000000149012;-1042809.500000000000000;0
5317;-743063.690000001341105;-1043053.769999999552965;0
5294;-743056.328999999910593;-1043196.096999999135733;0
1402;-741699.000000000000000;-1044419.000000000000000;0
7291;-742809.960000000894070;-1044827.300000000745058;0
1544;-742236.000000000000000;-1044198.000000000000000;0
6325;-745069.041000001132488;-1042716.723000001162291;0
3389;-743919.920000001788139;-1043153.510000001639128;0
2054;-743413.000000000000000;-1045010.000000000000000;0
7027;-743237.269999999552965;-1044095.524999998509884;0
2887;-744098.480000000447035;-1043192.508000001311302;0
6192;-742317.252000000327826;-1043065.394999999552965;0
2357;-742388.000000000000000;-1045577.000000000000000;0
6274;-742318.392999999225140;-1043016.747000001370907;0
8018;-741974.039999999105930;-1044442.870000001043081;0
3155;-743969.353000000119209;-1042568.828000001609325;0
3580;-744924.973999999463558;-1042593.699999999254942;0
2386;-742139.000000000000000;-1045460.000000000000000;0
5000;-742542.798000000417233;-1042978.486999999731779;0
1850;-742751.000000000000000;-1044237.000000000000000;0
6861;-741491.429999999701977;-1045010.300000000745058;0
6580;-741299.379000000655651;-1044005.879000000655651;0
2756;-743984.276999998837709;-1043475.763000000268221;0
4339;-742459.269000001251698;-1043367.923000000417233;0
3539;-744607.903000000864267;-1042668.236999999731779;0
1272;-742237.000000000000000;-1044545.000000000000000;0
1129;-741672.000000000000000;-1044438.000000000000000;0
6224;-742315.320000000298023;-1043057.335000000894070;0
1268;-742046.000000000000000;-1045021.000000000000000;0
2057;-742787.000000000000000;-1044365.000000000000000;0
4596;-742597.181000001728535;-1042670.653000000864267;0
6039;-742085.370000001043081;-1043669.620999999344349;25
4821;-742966.550000000745058;-1042877.969999998807907;0
1942;-743283.000000000000000;-1044370.000000000000000;0
527;-742186.000000000000000;-1043818.000000000000000;0
6389;-742141.199999999254942;-1042497.030000001192093;0
5755;-743415.670000001788139;-1043702.254000000655651;0
3829;-742992.250000000000000;-1042635.140000000596046;0
6573;-741294.089999999850988;-1044091.679999999701977;0
5302;-743090.423999998718500;-1043070.048999998718500;0
551;-742269.000000000000000;-1043755.000000000000000;0
701;-742023.000000000000000;-1042885.000000000000000;0
4978;-742491.822999998927116;-1043028.688000001013279;0
4950;-742354.289999999105930;-1042955.670000001788139;0
301;-742613.000000000000000;-1043903.000000000000000;0
4213;-742218.094999998807907;-1043529.954999998211861;0
1218;-742120.000000000000000;-1044309.000000000000000;0
5372;-742084.010000001639128;-1043008.550000000745058;0
1502;-741506.000000000000000;-1044283.000000000000000;0
7197;-742570.949000000953674;-1044895.548999998718500;0
1401;-741723.000000000000000;-1044408.000000000000000;0
6105;-742213.883000001311302;-1043111.734000001102686;0
5600;-743410.407000001519918;-1043680.594000000506639;0
1557;-741193.000000000000000;-1044306.000000000000000;0
7961;-741602.260000001639128;-1044314.350000001490116;0
4793;-743035.089999999850988;-1042650.028000000864267;0
1257;-742070.000000000000000;-1044815.000000000000000;0
6373;-741992.809999998658895;-1042677.000000000000000;0
5589;-743423.785999998450279;-1043679.548000000417233;0
817;-741937.000000000000000;-1042586.000000000000000;0
4018;-743153.285000000149012;-1043925.850000001490116;0
2402;-742236.000000000000000;-1045408.000000000000000;0
3730;-744714.653000000864267;-1042576.567999999970198;0
892;-742946.000000000000000;-1042607.000000000000000;0
6239;-742363.504999998956919;-1043069.298000000417233;0
575;-742053.000000000000000;-1043541.000000000000000;0
4818;-742949.140000000596046;-1042791.660000000149012;0
351;-742509.000000000000000;-1043739.000000000000000;0
1293;-742037.000000000000000;-1044462.000000000000000;0
1333;-741781.000000000000000;-1044777.000000000000000;0
682;-742380.000000000000000;-1043151.000000000000000;0
636;-742160.000000000000000;-1043325.000000000000000;0
1454;-741521.000000000000000;-1044499.000000000000000;0
7706;-742313.239999998360872;-1044319.611999999731779;50
4081;-742828.035000000149012;-1043754.850000001490116;0
1352;-741840.000000000000000;-1044854.000000000000000;0
2440;-742596.000000000000000;-1044193.000000000000000;0
3095;-743923.068999998271465;-1042787.789000000804663;87
5025;-742609.543000001460314;-1042894.629000000655651;0
5238;-743360.410000000149012;-1043296.723999999463558;0
1114;-741151.059999998658895;-1044607.410000000149012;0
7118;-743468.750000000000000;-1044677.690000001341105;0
5293;-743043.969999998807907;-1043208.554000001400709;0
4063;-742855.079999998211861;-1043654.695000000298023;0
1519;-741754.000000000000000;-1043956.000000000000000;0
4054;-743269.304999999701977;-1043797.405000001192093;0
1095;-741452.000000000000000;-1044553.000000000000000;0
3980;-743339.260000001639128;-1043798.940000001341105;0
7084;-743318.609999999403954;-1044521.789999999105930;0
6282;-742308.337999999523163;-1043045.984000001102686;0
5144;-743052.642000000923872;-1043488.940000001341105;0
4772;-742879.881999999284744;-1042872.157000001519918;0
6822;-741283.870000001043081;-1044793.059999998658895;0
1416;-741628.000000000000000;-1044523.000000000000000;0
4599;-742625.879999998956919;-1042698.820000000298023;0
2477;-741238.370000001043081;-1044535.289999999105930;0
5509;-743425.144999999552965;-1043637.853000000119209;0
3018;-744443.368000000715256;-1042805.962000001221895;0
4622;-742533.901000000536442;-1042569.660000000149012;0
4977;-742489.451000001281500;-1042992.394000001251698;0
4703;-742697.859000001102686;-1042783.011999998241663;0
6106;-742210.445999998599291;-1043112.203000001609325;0
1758;-741097.000000000000000;-1044094.000000000000000;0
3425;-743730.254000000655651;-1043071.712000001221895;0
3242;-744191.513000000268221;-1042647.011999998241663;0
1407;-741650.000000000000000;-1044242.000000000000000;0
6265;-742353.164999999105930;-1043020.054999999701977;0
4509;-742502.519999999552965;-1042732.079999998211861;0
1311;-741646.000000000000000;-1044831.000000000000000;0
2488;-742083.000000000000000;-1044303.000000000000000;0
1330;-741817.000000000000000;-1044709.000000000000000;0
5165;-743191.168000001460314;-1043398.304000001400709;0
7049;-743420.177000001072884;-1044168.629999998956919;0
2273;-742895.000000000000000;-1045745.000000000000000;0
1051;-741775.000000000000000;-1044980.000000000000000;0
6665;-741433.260000001639128;-1044189.760000001639128;0
6197;-742313.425000000745058;-1043058.370999999344349;0
40;-743597.000000000000000;-1042361.000000000000000;0
305;-742837.000000000000000;-1044130.000000000000000;0
520;-742225.000000000000000;-1043127.000000000000000;0
164;-743392.000000000000000;-1043230.000000000000000;0
4105;-742678.771999999880791;-1043769.206000000238419;0
4583;-742401.482999999076128;-1042625.886999998241663;0
2037;-743373.000000000000000;-1044805.000000000000000;0
3815;-743161.949999999254942;-1042769.750000000000000;0
3839;-743112.140000000596046;-1042558.280000001192093;0
1701;-741378.000000000000000;-1044678.000000000000000;0
7809;-741981.809999998658895;-1044560.280000001192093;0
1247;-742104.000000000000000;-1044609.000000000000000;0
4666;-742808.710000000894070;-1042576.609999999403954;0
1932;-743359.000000000000000;-1044408.000000000000000;0
4504;-742387.329999998211861;-1042714.820000000298023;0
4579;-742378.747999999672174;-1042626.699999999254942;0
7211;-742570.070000000298023;-1045065.679999999701977;0
8275;-742087.910000000149012;-1042738.609999999403954;0
6000;-741980.750000000000000;-1043285.629999998956919;0
544;-742343.910000000149012;-1043796.500000000000000;0
1240;-742145.000000000000000;-1044418.000000000000000;0
3801;-743091.350000001490116;-1042882.719999998807907;0
4024;-743223.734999999403954;-1043859.954999998211861;0
5591;-743421.353999998420477;-1043679.738000001758337;0
1118;-741807.000000000000000;-1044459.000000000000000;0
2577;-742491.000000000000000;-1045513.000000000000000;0
3942;-743420.800000000745058;-1043492.339999999850988;0
584;-741980.000000000000000;-1043396.000000000000000;0
624;-742241.000000000000000;-1043343.000000000000000;0
918;-743437.000000000000000;-1043904.000000000000000;0
4962;-742387.429999999701977;-1043028.129999998956919;0
2453;-742941.000000000000000;-1044121.000000000000000;0
4723;-742883.429999999701977;-1042644.829999998211861;0
8276;-742095.079999998211861;-1042752.519999999552965;0
2294;-742754.000000000000000;-1045391.000000000000000;0
1766;-741257.000000000000000;-1044204.000000000000000;0
1661;-741426.000000000000000;-1044846.000000000000000;0
1839;-742994.469999998807907;-1044185.679999999701977;0
4238;-742440.263000000268221;-1043528.236000001430511;0
4749;-742884.420000001788139;-1042760.329999998211861;0
7985;-741091.269999999552965;-1044419.039999999105930;0
3889;-742335.008999999612570;-1042489.949000000953674;0
1818;-743046.000000000000000;-1044380.000000000000000;0
2417;-742421.000000000000000;-1045135.000000000000000;0
4710;-742796.730000000447035;-1042611.769999999552965;0
4760;-742826.947000000625849;-1042799.914000000804663;0
4064;-742879.655000001192093;-1043647.420000001788139;0
4521;-742681.440000001341105;-1042792.960000000894070;0
6276;-742310.815999999642372;-1043016.000999998301268;0
4741;-742787.859999999403954;-1042715.800000000745058;0
3949;-743420.780000001192093;-1043527.820000000298023;0
5667;-743417.361999999731779;-1043712.557000000029802;0
4097;-742806.000000000000000;-1043874.793999999761581;0
5413;-742651.872000001370907;-1042662.627999998629093;0
6219;-742319.168999999761581;-1043064.293999999761581;0
3763;-743140.420000001788139;-1042987.649999998509884;0
1829;-742968.539999999105930;-1044100.210000000894070;0
4458;-742245.679999999701977;-1042633.960000000894070;0
6855;-741501.394999999552965;-1045027.784000001847744;0
5230;-743335.399999998509884;-1043517.670000001788139;0
2150;-742812.000000000000000;-1045054.000000000000000;0
4733;-742767.890000000596046;-1042671.010000001639128;0
7037;-743316.085000000894070;-1044222.170000001788139;0
3311;-743816.037999998778105;-1042845.728999998420477;0
7279;-742799.399999998509884;-1044679.829999998211861;0
847;-742155.000000000000000;-1042504.000000000000000;0
6277;-742304.633999999612570;-1043024.256000000983477;0
2123;-743299.000000000000000;-1045010.000000000000000;0
381;-742465.000000000000000;-1043700.000000000000000;0
6360;-742004.925000000745058;-1042692.804000001400709;0
1593;-742192.000000000000000;-1044826.000000000000000;0
503;-741879.000000000000000;-1043158.000000000000000;0
4875;-742814.660000000149012;-1042937.800000000745058;0
6834;-741594.763000000268221;-1044922.236000001430511;0
745;-741649.000000000000000;-1042968.000000000000000;0
4797;-743049.140999998897314;-1042689.576999999582767;0
4680;-742759.370000001043081;-1042864.140000000596046;0
6830;-741526.739999998360872;-1044761.309000000357628;0
4692;-742681.477000001817942;-1042600.622000001370907;0
4922;-742443.129999998956919;-1042886.510000001639128;0
905;-742312.000000000000000;-1042489.000000000000000;0
7739;-742301.399000000208616;-1045040.431000001728535;0
4512;-742515.339999999850988;-1042750.230000000447035;0
737;-741849.000000000000000;-1043021.000000000000000;37
5141;-743039.598000001162291;-1043495.265000000596046;0
4058;-743138.765000000596046;-1043625.405000001192093;0
3948;-743409.451999999582767;-1043515.662000000476837;0
632;-742130.000000000000000;-1043287.000000000000000;0
4748;-742895.730000000447035;-1042781.289999999105930;0
4589;-742408.243000000715256;-1042542.631999999284744;0
2165;-742994.000000000000000;-1045179.000000000000000;0
2103;-743182.000000000000000;-1044931.000000000000000;0
1287;-742217.000000000000000;-1044486.000000000000000;0
1781;-741247.000000000000000;-1043923.000000000000000;0
1437;-741840.000000000000000;-1044336.000000000000000;0
4625;-742594.258000001311302;-1042576.114000000059605;0
4777;-742910.034000001847744;-1042759.350999999791384;0
1380;-742156.000000000000000;-1044947.000000000000000;0
1305;-741826.000000000000000;-1044678.000000000000000;0
4608;-742555.160999998450279;-1042637.633999999612570;0
4792;-743051.280000001192093;-1042654.962999999523163;0
6221;-742317.633000001311302;-1043061.541000001132488;0
5127;-743019.265000000596046;-1043389.644999999552965;0
573;-742067.000000000000000;-1043561.000000000000000;0
628;-742217.370000001043081;-1043308.559999998658895;0
4776;-742909.276000000536442;-1042820.587000001221895;0
205;-743173.000000000000000;-1043599.000000000000000;0
4582;-742390.164999999105930;-1042606.546000000089407;0
3986;-743313.355000000447035;-1043956.986999999731779;0
733;-741963.000000000000000;-1043018.000000000000000;175
3321;-743903.500999998301268;-1042936.324999999254942;0
3796;-743161.100000001490116;-1042834.149999998509884;0
7538;-742701.420000001788139;-1045364.109999999403954;0
4517;-742638.449999999254942;-1042779.280000001192093;0
1936;-743293.000000000000000;-1044272.000000000000000;0
1435;-741903.000000000000000;-1044306.000000000000000;0
4677;-742787.309999998658895;-1042797.899999998509884;0
5579;-743409.682999998331070;-1043634.574999999254942;0
5210;-743253.673999998718500;-1043370.440999999642372;0
4656;-742827.763000000268221;-1042494.379999998956919;0
3528;-744791.905999999493361;-1042674.936000000685453;0
5697;-743416.916000001132488;-1043635.342000000178814;0
4974;-742489.458999998867512;-1043047.024999998509884;0
6281;-742307.629000000655651;-1043042.113000001758337;0
7199;-742570.910000000149012;-1044916.410000000149012;0
2232;-743488.000000000000000;-1045234.000000000000000;0
5588;-743425.002000000327826;-1043679.451999999582767;0
1125;-741728.000000000000000;-1044435.000000000000000;0
1034;-741964.000000000000000;-1044876.000000000000000;0
2238;-743372.000000000000000;-1045261.000000000000000;0
1708;-741170.820000000298023;-1044705.589999999850988;0
1515;-741913.000000000000000;-1044072.000000000000000;0
1223;-742190.000000000000000;-1044277.000000000000000;0
5681;-743400.820000000298023;-1043718.682000000029802;0
4933;-742437.605000000447035;-1042750.853000000119209;0
5719;-743419.508999999612570;-1043629.817999999970198;0
4801;-742998.943999998271465;-1042721.118000000715256;0
1213;-742068.000000000000000;-1044387.000000000000000;0
4662;-742819.471000000834465;-1042530.037000000476837;0
6125;-743428.124000001698732;-1043615.223999999463558;0
6308;-741823.129999998956919;-1042770.370000001043081;0
6589;-741303.679999999701977;-1043901.390000000596046;0
6356;-741962.699999999254942;-1042712.320000000298023;0
525;-742233.000000000000000;-1043884.000000000000000;0
7269;-743143.410000000149012;-1044948.879999998956919;0
4538;-742291.464000001549721;-1042734.344000000506639;0
5717;-743422.208999998867512;-1043629.984000001102686;0
5701;-743417.076999999582767;-1043630.140000000596046;0
2396;-742212.000000000000000;-1045365.000000000000000;0
1972;-743389.000000000000000;-1044907.000000000000000;0
6399;-742013.379999998956919;-1042502.739999998360872;0
4722;-742878.030000001192093;-1042626.550000000745058;0
1696;-741529.000000000000000;-1044660.000000000000000;0
4177;-742387.940999999642372;-1044182.254999998956919;0
586;-741966.000000000000000;-1043374.000000000000000;0
6391;-742109.269999999552965;-1042498.320000000298023;0
4032;-743136.934999998658895;-1043750.375000000000000;0
2889;-744074.103999998420477;-1043194.559999998658895;0
7539;-742682.600000001490116;-1045366.339999999850988;0
4836;-742984.245999999344349;-1042653.127999998629093;0
1423;-742167.000000000000000;-1044150.000000000000000;0
1986;-743480.000000000000000;-1044794.000000000000000;0
3983;-743317.089999999850988;-1043883.160000000149012;0
6130;-742312.136999998241663;-1043066.344000000506639;0
836;-742006.000000000000000;-1042525.000000000000000;0
1592;-742378.000000000000000;-1044936.000000000000000;0
5069;-742829.063999999314547;-1043280.938000001013279;0
5158;-743148.138999998569489;-1043320.254999998956919;0
6233;-742319.057000000029802;-1043072.162999998778105;0
5663;-743422.087999999523163;-1043710.807999998331070;0
7216;-742500.129999998956919;-1044564.390000000596046;0
754;-741676.000000000000000;-1042727.000000000000000;0
5418;-742434.890000000596046;-1042864.780000001192093;0
5003;-742589.811999998986721;-1042974.888999998569489;0
699;-742067.000000000000000;-1042896.000000000000000;0
6255;-742379.991999998688698;-1043037.068999998271465;0
515;-742176.000000000000000;-1043121.000000000000000;0
7036;-743316.204999998211861;-1044198.315000001341105;0
1156;-741191.980000000447035;-1044497.850000001490116;0
7680;-742500.160000000149012;-1045137.399999998509884;0
4783;-742933.866999998688698;-1042668.403000000864267;0
318;-742434.000000000000000;-1044213.000000000000000;0
7246;-742736.730000000447035;-1044825.399999998509884;0
5512;-743426.556000001728535;-1043602.920000001788139;0
7137;-742916.074999999254942;-1044400.230000000447035;0
504;-741937.000000000000000;-1043164.000000000000000;0
5108;-742876.219999998807907;-1043431.129999998956919;0
649;-742233.000000000000000;-1043382.000000000000000;0
2561;-741214.000000000000000;-1044393.000000000000000;0
4465;-742180.250000000000000;-1042584.370000001043081;0
4525;-742716.719999998807907;-1042823.219999998807907;0
7025;-743199.914999999105930;-1044070.515000000596046;0
608;-741955.000000000000000;-1043274.000000000000000;0
4706;-742728.070000000298023;-1042610.910000000149012;0
5014;-742563.771999999880791;-1042993.241999998688698;0
2341;-742711.000000000000000;-1045552.000000000000000;0
7727;-743363.892999999225140;-1044617.146000001579523;0
1359;-742000.000000000000000;-1044897.000000000000000;0
6175;-742315.256999999284744;-1043064.660999998450279;0
5227;-743318.199999999254942;-1043537.510000001639128;0
793;-741697.000000000000000;-1042588.000000000000000;0
5086;-742856.307999998331070;-1043239.488000001758337;0
1105;-741274.000000000000000;-1044576.000000000000000;0
6837;-741677.875999998301268;-1044964.791999999433756;0
5068;-742837.162999998778105;-1043263.965999998152256;0
207;-743142.000000000000000;-1043590.000000000000000;0
4820;-742927.769999999552965;-1042786.710000000894070;0
7962;-741640.190000001341105;-1044316.800000000745058;0
2379;-742291.000000000000000;-1045388.000000000000000;0
3525;-744827.657000001519918;-1042673.842999998480082;0
710;-741829.000000000000000;-1042878.000000000000000;0
5121;-742889.114000000059605;-1043362.250000000000000;0
1109;-741204.100000001490116;-1044585.460000000894070;0
326;-742682.000000000000000;-1044102.000000000000000;0
399;-742339.000000000000000;-1043884.000000000000000;0
1028;-741981.000000000000000;-1044692.000000000000000;0
3203;-743724.272999998182058;-1042522.517000000923872;0
6123;-743427.453000001609325;-1043603.083000000566244;0
1450;-741527.000000000000000;-1044632.000000000000000;0
4837;-742979.105999998748302;-1042672.627999998629093;0
618;-742203.000000000000000;-1043272.000000000000000;0
1144;-741402.000000000000000;-1044470.000000000000000;0
331;-742664.000000000000000;-1044024.000000000000000;0
759;-741659.000000000000000;-1042650.000000000000000;0
6718;-742339.493000000715256;-1044956.921999998390675;0
614;-742111.000000000000000;-1043271.000000000000000;0
5142;-743039.870000001043081;-1043473.929999999701977;0
6829;-741498.170000001788139;-1044764.809999998658895;0
5082;-742925.114000000059605;-1043348.883999999612570;0
4782;-742938.315999999642372;-1042714.212000001221895;0
3183;-743909.289999999105930;-1042546.210000000894070;0
5666;-743418.543999999761581;-1043712.120000001043081;0
4184;-742311.379999998956919;-1044164.660000000149012;0
619;-742229.000000000000000;-1043277.000000000000000;0
2403;-742211.000000000000000;-1045436.000000000000000;0
1949;-743248.000000000000000;-1044491.000000000000000;0
3804;-743040.109999999403954;-1042895.410000000149012;0
204;-743208.000000000000000;-1043588.000000000000000;0
5647;-743429.070999998599291;-1043694.699000000953674;0
5648;-743429.164000000804663;-1043695.905999999493361;0
753;-741692.000000000000000;-1042713.000000000000000;0
