OID_;X;Y;TEMPERATURE
3614;-744984.548999998718500;-1042283.640999998897314;0
3019;-744463.447999998927116;-1042784.646000001579523;0
3568;-744718.817999999970198;-1042588.614999998360872;0
3692;-744525.876499999314547;-1042540.534000001847744;0
3580;-744924.973999999463558;-1042593.699999999254942;0
2605;-745393.842999998480082;-1042860.796000000089407;0
5975;-745052.346999999135733;-1042674.673000000417233;0
118;-745135.000000000000000;-1042687.000000000000000;0
3542;-744575.274000000208616;-1042656.160000000149012;0
2696;-743477.489999998360872;-1042038.000000000000000;0
2520;-741847.000000000000000;-1045324.000000000000000;0
3066;-744075.627000000327826;-1042883.837000001221895;0
6;-743464.000000000000000;-1042594.000000000000000;0
3216;-743615.890999998897314;-1042451.129999998956919;0
2226;-743057.000000000000000;-1045470.000000000000000;0
3211;-743651.409000001847744;-1042483.458999998867512;0
6872;-741751.719999998807907;-1045296.679999999701977;0
2760;-743863.331000000238419;-1043483.304000001400709;0
2755;-744003.879000000655651;-1043471.734000001102686;0
1584;-742368.000000000000000;-1044717.000000000000000;0
2404;-742179.000000000000000;-1045467.000000000000000;0
3919;-743904.947000000625849;-1043493.929999999701977;0
3107;-743778.888000000268221;-1042682.131999999284744;0
2255;-743181.000000000000000;-1045372.000000000000000;0
2740;-744042.611999999731779;-1043335.940000001341105;0
2641;-743432.578999999910593;-1042583.418999999761581;0
3268;-743594.046999998390675;-1042721.412999998778105;0
5408;-743696.881000000983477;-1042878.024999998509884;0
6705;-742279.050999999046326;-1044655.923000000417233;0
1629;-742450.000000000000000;-1044518.000000000000000;0
1760;-741162.000000000000000;-1044101.000000000000000;0
2085;-742426.000000000000000;-1044797.000000000000000;0
3233;-744152.962999999523163;-1042686.791999999433756;0
7185;-742600.515000000596046;-1044717.333999998867512;0
7829;-743509.649999998509884;-1045166.399999998509884;0
1267;-742040.000000000000000;-1044999.000000000000000;0
6833;-741571.423000000417233;-1044909.473999999463558;0
5405;-744043.826000001281500;-1042674.686000000685453;0
1486;-741150.000000000000000;-1044219.000000000000000;0
1445;-741553.000000000000000;-1044757.000000000000000;0
7174;-742639.019999999552965;-1044564.949999999254942;0
598;-741853.000000000000000;-1043233.000000000000000;0
1332;-741793.000000000000000;-1044755.000000000000000;0
6712;-742273.328000001609325;-1044860.912000000476837;0
1524;-741710.000000000000000;-1043844.000000000000000;0
1727;-741495.000000000000000;-1045103.000000000000000;0
1723;-741611.000000000000000;-1045092.000000000000000;0
3289;-743584.761999998241663;-1042769.188000001013279;0
1053;-741768.000000000000000;-1045023.000000000000000;0
2017;-743247.000000000000000;-1044884.000000000000000;0
1411;-741639.480000000447035;-1044683.019999999552965;0
7183;-742606.379999998956919;-1044692.969999998807907;0
6828;-741465.309999998658895;-1044768.940000001341105;0
2409;-742363.000000000000000;-1045093.000000000000000;0
7411;-743529.510000001639128;-1045393.140000000596046;0
727;-742001.000000000000000;-1042962.000000000000000;0
8054;-742230.239999998360872;-1044988.530000001192093;0
6719;-742371.686999998986721;-1044952.227000001817942;0
7020;-743104.175000000745058;-1044078.344999998807907;0
3413;-743776.791000001132488;-1043071.675000000745058;0
7212;-742559.410000000149012;-1045073.070000000298023;0
1602;-742507.000000000000000;-1044924.000000000000000;0
1971;-743385.000000000000000;-1044881.000000000000000;0
2079;-742688.000000000000000;-1044428.000000000000000;0
1355;-741899.000000000000000;-1044858.000000000000000;0
8244;-742617.899999998509884;-1045206.480000000447035;0
6845;-741527.188000001013279;-1044989.557000000029802;0
8257;-742149.809999998658895;-1045048.399999998509884;0
5434;-744042.467999998480082;-1043135.986999999731779;0
1315;-741715.000000000000000;-1044867.000000000000000;0
385;-742436.000000000000000;-1043742.000000000000000;0
7143;-742850.414999999105930;-1044473.449999999254942;0
345;-742559.000000000000000;-1043826.000000000000000;0
8079;-742021.839999999850988;-1045292.179999999701977;0
2070;-742993.000000000000000;-1044723.000000000000000;0
2097;-743143.000000000000000;-1044742.000000000000000;0
4156;-742513.734999999403954;-1043978.035000000149012;0
3988;-743309.704999998211861;-1044008.570000000298023;0
1092;-741549.000000000000000;-1044556.000000000000000;0
2417;-742421.000000000000000;-1045135.000000000000000;0
7263;-743009.559999998658895;-1044894.379999998956919;0
383;-742450.000000000000000;-1043722.000000000000000;0
4238;-742440.263000000268221;-1043528.236000001430511;0
465;-741728.000000000000000;-1043309.000000000000000;0
7654;-742242.081000000238419;-1045273.263999998569489;0
2893;-743977.276000000536442;-1043208.923999998718500;0
502;-741901.000000000000000;-1043169.000000000000000;0
7008;-742899.559999998658895;-1044224.074999999254942;0
1521;-741808.000000000000000;-1043917.000000000000000;0
2394;-742273.000000000000000;-1045360.000000000000000;0
2329;-742432.000000000000000;-1045508.000000000000000;0
2160;-742849.000000000000000;-1045147.000000000000000;0
2161;-742876.000000000000000;-1045153.000000000000000;0
4003;-743371.839999999850988;-1044053.258999999612570;0
8073;-742120.640000000596046;-1045259.500000000000000;0
512;-742063.000000000000000;-1043136.000000000000000;0
3782;-743285.429999999701977;-1042842.460000000894070;0
7652;-742275.046999998390675;-1045497.052000001072884;0
1015;-742126.000000000000000;-1044599.000000000000000;0
2378;-742372.000000000000000;-1045503.000000000000000;0
4055;-743119.070000000298023;-1043694.109999999403954;0
4826;-743043.850000001490116;-1042979.600000001490116;0
709;-741861.000000000000000;-1042862.000000000000000;0
7141;-742895.629999998956919;-1044470.910000000149012;0
8263;-742151.089999999850988;-1042702.239999998360872;0
1027;-741984.000000000000000;-1044660.000000000000000;0
3812;-743231.179999999701977;-1042815.199999999254942;0
2211;-743248.000000000000000;-1045258.000000000000000;0
4081;-742828.035000000149012;-1043754.850000001490116;0
3761;-743202.559999998658895;-1042981.710000000894070;0
510;-742048.000000000000000;-1043150.000000000000000;0
4341;-742488.855000000447035;-1043325.412999998778105;0
2237;-743368.000000000000000;-1045238.000000000000000;0
4122;-742732.074999999254942;-1043923.995000001043081;0
4075;-742947.934999998658895;-1043903.649999998509884;0
3799;-743117.550000000745058;-1042868.160000000149012;0
6657;-741565.760000001639128;-1044156.980000000447035;0
4079;-742836.170000001788139;-1043800.960000000894070;0
4047;-743210.230000000447035;-1043992.289999999105930;0
1491;-741057.000000000000000;-1044333.000000000000000;0
3915;-744021.765999998897314;-1043098.603999998420477;0
7243;-742724.339999999850988;-1044835.870000001043081;0
7027;-743237.269999999552965;-1044095.524999998509884;0
8152;-743293.600000001490116;-1043190.510000001639128;0
2497;-741932.000000000000000;-1044075.000000000000000;0
4074;-742943.350000001490116;-1043880.304999999701977;0
8271;-742030.649999998509884;-1042720.129999998956919;0
671;-742489.000000000000000;-1043245.000000000000000;0
3369;-743878.633000001311302;-1043011.739000000059605;0
5292;-743055.866000000387430;-1043215.710999999195337;0
282;-743034.000000000000000;-1043819.000000000000000;0
4067;-742913.594999998807907;-1043714.640000000596046;0
7282;-742809.410000000149012;-1044693.629999998956919;0
621;-742285.000000000000000;-1043282.000000000000000;0
7151;-742842.649000000208616;-1044545.307000000029802;0
1814;-743095.000000000000000;-1044510.000000000000000;0
3985;-743312.765000000596046;-1043928.164999999105930;0
1171;-741882.000000000000000;-1044375.000000000000000;0
1854;-742675.000000000000000;-1044271.000000000000000;0
5775;-743915.925000000745058;-1042818.550999999046326;0
3325;-743911.068999998271465;-1042947.052000001072884;0
5409;-743745.201000001281500;-1042902.750000000000000;0
1985;-743478.000000000000000;-1044769.000000000000000;0
578;-742023.000000000000000;-1043464.000000000000000;0
1553;-741350.000000000000000;-1044268.000000000000000;0
209;-743108.000000000000000;-1043583.000000000000000;0
6365;-741979.230000000447035;-1042656.230000000447035;0
1819;-743034.000000000000000;-1044350.000000000000000;0
4029;-743130.695999998599291;-1043815.427999999374151;0
5203;-743386.346000000834465;-1043274.958000000566244;0
4334;-742384.170000001788139;-1043468.820000000298023;0
1878;-743324.000000000000000;-1044249.000000000000000;0
7965;-741515.510000001639128;-1044348.350000001490116;0
1698;-741464.000000000000000;-1044668.000000000000000;0
2123;-743299.000000000000000;-1045010.000000000000000;0
1517;-741964.000000000000000;-1044034.000000000000000;0
7968;-741473.980000000447035;-1044379.839999999850988;0
7814;-741769.006999999284744;-1044058.535999998450279;0
4555;-742337.140000000596046;-1042512.379999998956919;0
7706;-742313.239999998360872;-1044319.611999999731779;0
561;-742172.000000000000000;-1043675.000000000000000;0
7947;-742030.969999998807907;-1044096.679999999701977;0
7828;-743537.940000001341105;-1045170.530000001192093;0
524;-742255.000000000000000;-1043913.000000000000000;96
226;-742879.000000000000000;-1043516.000000000000000;0
4859;-742966.710000000894070;-1042996.302999999374151;0
4088;-742812.114999998360872;-1043580.475000001490116;0
1362;-742017.000000000000000;-1044913.000000000000000;0
1873;-743410.000000000000000;-1044260.000000000000000;0
7218;-742534.100000001490116;-1044603.559999998658895;0
1701;-741378.000000000000000;-1044678.000000000000000;0
4221;-742209.576000001281500;-1043499.238000001758337;0
4204;-742312.750999998301268;-1043589.962999999523163;0
2296;-742678.000000000000000;-1045399.000000000000000;0
728;-741997.000000000000000;-1042918.000000000000000;0
1508;-741705.000000000000000;-1044210.000000000000000;0
1249;-742097.000000000000000;-1044649.000000000000000;0
5306;-743103.326999999582767;-1043193.129000000655651;0
2523;-742181.000000000000000;-1044140.000000000000000;0
2146;-742845.000000000000000;-1044968.000000000000000;0
6824;-741347.350000001490116;-1044784.280000001192093;0
4128;-742915.039999999105930;-1044041.920000001788139;0
540;-742144.000000000000000;-1043804.000000000000000;0
2326;-742523.000000000000000;-1045498.000000000000000;0
2323;-742622.000000000000000;-1045487.000000000000000;0
5323;-743049.401000000536442;-1043038.131000000983477;0
1993;-743483.000000000000000;-1044984.000000000000000;0
735;-741910.000000000000000;-1043014.000000000000000;0
1780;-741214.000000000000000;-1043934.000000000000000;0
4023;-743246.635000001639128;-1043864.364999998360872;0
6848;-741619.096999999135733;-1045007.451999999582767;0
6821;-741256.649999998509884;-1044796.100000001490116;0
738;-741818.000000000000000;-1043024.000000000000000;0
340;-742588.000000000000000;-1043906.000000000000000;0
5283;-743032.892000000923872;-1043284.399000000208616;0
7798;-743468.929999999701977;-1045091.809999998658895;0
4824;-742918.673000000417233;-1042871.875000000000000;0
4105;-742678.771999999880791;-1043769.206000000238419;0
1128;-741655.000000000000000;-1044448.000000000000000;0
1090;-741581.000000000000000;-1044552.000000000000000;0
1318;-741838.000000000000000;-1044940.000000000000000;0
4499;-742338.899999998509884;-1042707.250000000000000;0
1426;-742056.000000000000000;-1044228.000000000000000;0
6449;-743140.379999998956919;-1043395.559999998658895;0
6660;-741490.809999998658895;-1044176.750000000000000;0
1112;-741189.050000000745058;-1044602.469999998807907;0
274;-743359.000000000000000;-1043833.000000000000000;0
4921;-742444.739999998360872;-1042908.420000001788139;0
302;-742925.000000000000000;-1044109.000000000000000;0
576;-742054.000000000000000;-1043517.000000000000000;0
3377;-743832.151999998837709;-1042925.721000000834465;0
819;-741987.000000000000000;-1042599.000000000000000;0
2288;-742936.000000000000000;-1045436.000000000000000;0
1996;-743484.000000000000000;-1045063.000000000000000;0
1303;-741865.000000000000000;-1044692.000000000000000;0
3098;-743918.111000001430511;-1042753.629000000655651;0
2276;-742865.000000000000000;-1045649.000000000000000;0
1837;-743015.000000000000000;-1044249.000000000000000;0
6505;-741746.570000000298023;-1044600.429999999701977;0
5194;-743205.761999998241663;-1043310.581999998539686;0
4464;-742182.309999998658895;-1042571.379999998956919;0
5020;-742572.699999999254942;-1042891.372999999672174;0
204;-743208.000000000000000;-1043588.000000000000000;0
1942;-743283.000000000000000;-1044370.000000000000000;0
1875;-743367.000000000000000;-1044261.000000000000000;0
5142;-743039.870000001043081;-1043473.929999999701977;0
6487;-741745.798000000417233;-1044519.414999999105930;0
6792;-741101.151999998837709;-1044754.271000001579523;0
7007;-742923.890000000596046;-1044218.879999998956919;0
1512;-741829.000000000000000;-1044135.000000000000000;0
221;-742951.000000000000000;-1043544.000000000000000;0
2337;-742783.000000000000000;-1045544.000000000000000;0
884;-741771.000000000000000;-1042776.000000000000000;0
4232;-742315.057999998331070;-1043428.918999999761581;0
2168;-743025.000000000000000;-1045134.000000000000000;0
2130;-743095.000000000000000;-1045126.000000000000000;0
798;-741797.000000000000000;-1042590.000000000000000;0
6701;-742295.142000000923872;-1044533.372000001370907;0
8281;-742164.160000000149012;-1042778.140000000596046;0
584;-741980.000000000000000;-1043396.000000000000000;0
674;-742463.000000000000000;-1043211.000000000000000;0
4809;-743081.589999999850988;-1042799.800000000745058;0
2316;-742823.000000000000000;-1045463.000000000000000;0
7399;-742999.699999999254942;-1045733.309999998658895;0
7045;-743400.745000001043081;-1044160.004999998956919;0
6337;-742257.140000000596046;-1042864.820000000298023;0
1925;-743331.000000000000000;-1044321.000000000000000;0
647;-742216.000000000000000;-1043375.000000000000000;0
6299;-741803.309999998658895;-1042718.690000001341105;0
2447;-742772.000000000000000;-1044159.000000000000000;0
4775;-742898.375999998301268;-1042802.914000000804663;0
4249;-742151.910000000149012;-1043354.719999998807907;0
4651;-742756.375000000000000;-1042524.938000001013279;0
1910;-743460.000000000000000;-1044391.000000000000000;0
4905;-742467.730000000447035;-1042815.620000001043081;0
7715;-743042.480000000447035;-1045860.798999998718500;0
6751;-742426.350000001490116;-1044371.070000000298023;0
3154;-743984.818999998271465;-1042573.844999998807907;0
1289;-742211.000000000000000;-1044521.000000000000000;0
4817;-742967.460000000894070;-1042782.559999998658895;0
533;-742137.000000000000000;-1043750.000000000000000;0
756;-741681.000000000000000;-1042695.000000000000000;0
6314;-743939.670000001788139;-1042606.239999998360872;0
627;-742223.000000000000000;-1043335.000000000000000;0
1269;-742246.000000000000000;-1044462.000000000000000;0
1178;-741952.000000000000000;-1044311.000000000000000;0
4504;-742387.329999998211861;-1042714.820000000298023;0
7975;-741349.339999999850988;-1044397.800000000745058;0
3758;-743284.129999998956919;-1042964.100000001490116;0
6157;-742314.026999998837709;-1043065.331000000238419;0
5116;-742947.859000001102686;-1043386.767000000923872;0
1394;-741822.000000000000000;-1044310.000000000000000;0
5710;-743421.574999999254942;-1043640.598000001162291;0
5213;-743326.385999999940395;-1043368.675999999046326;0
4791;-743022.245000001043081;-1042633.714000001549721;0
6234;-742324.105000000447035;-1043076.613000001758337;0
632;-742130.000000000000000;-1043287.000000000000000;0
1152;-741257.000000000000000;-1044489.000000000000000;0
1983;-743474.000000000000000;-1044709.000000000000000;0
5062;-742798.513999998569489;-1043227.370999999344349;0
6197;-742313.425000000745058;-1043058.370999999344349;0
2060;-742659.000000000000000;-1044472.000000000000000;0
4136;-742726.225000001490116;-1044089.829999998211861;0
4579;-742378.747999999672174;-1042626.699999999254942;0
4430;-742235.070000000298023;-1043092.839999999850988;0
3816;-743149.379999998956919;-1042748.489999998360872;0
4715;-742877.199999999254942;-1042610.059999998658895;0
3834;-743079.190000001341105;-1042579.899999998509884;0
6727;-742522.868000000715256;-1044395.879999998956919;0
1163;-741072.820000000298023;-1044501.940000001341105;0
5082;-742925.114000000059605;-1043348.883999999612570;0
4161;-742506.254999998956919;-1044181.925000000745058;0
2487;-742101.000000000000000;-1044308.000000000000000;0
2475;-743411.000000000000000;-1044901.000000000000000;0
269;-743248.000000000000000;-1043725.000000000000000;0
3783;-743211.559999998658895;-1042920.120000001043081;0
5968;-742288.989000000059605;-1044168.456999998539686;0
5664;-743420.907000001519918;-1043711.245999999344349;0
4593;-742510.820000000298023;-1042652.203999999910593;0
1611;-742400.000000000000000;-1044442.000000000000000;0
4560;-742427.079999998211861;-1042500.829999998211861;0
4805;-743001.147999998182058;-1042707.644999999552965;0
6148;-742313.410999998450279;-1043065.666999999433756;0
6194;-742315.721000000834465;-1043062.585999999195337;0
6374;-741977.035000000149012;-1042674.153999999165535;0
5048;-742867.500000000000000;-1043381.899999998509884;0
613;-742089.000000000000000;-1043271.000000000000000;0
5447;-743129.958999998867512;-1043365.166000001132488;0
1109;-741204.100000001490116;-1044585.460000000894070;0
1555;-741196.000000000000000;-1044374.000000000000000;0
6104;-742208.646999999880791;-1043103.999000001698732;0
7155;-742920.776999998837709;-1044546.934000000357628;0
4455;-741714.589000001549721;-1042663.557000000029802;0
4772;-742879.881999999284744;-1042872.157000001519918;0
1300;-741917.410000000149012;-1044719.769999999552965;0
7705;-742283.471999999135733;-1044316.339999999850988;0
1519;-741754.000000000000000;-1043956.000000000000000;0
6272;-742325.379000000655651;-1043017.383000001311302;0
3788;-743134.440000001341105;-1042956.210000000894070;0
4991;-742675.414999999105930;-1043031.236000001430511;0
5593;-743418.921000000089407;-1043679.927999999374151;0
325;-742700.000000000000000;-1044114.000000000000000;0
2108;-743147.000000000000000;-1045086.000000000000000;0
1244;-742127.000000000000000;-1044527.000000000000000;0
1651;-741374.000000000000000;-1044519.000000000000000;0
6144;-742308.925000000745058;-1043059.002000000327826;0
1950;-743271.000000000000000;-1044490.000000000000000;0
6479;-741969.831000000238419;-1044454.850000001490116;0
1770;-741270.000000000000000;-1044086.000000000000000;0
5175;-743313.734999999403954;-1043433.749000001698732;0
2261;-743009.000000000000000;-1045657.000000000000000;0
6223;-742316.076000001281500;-1043058.679000001400709;0
4944;-742430.605999998748302;-1043013.879000000655651;0
2105;-743158.000000000000000;-1044971.000000000000000;0
7162;-743075.840999998152256;-1044541.596000000834465;0
6176;-742314.491000000387430;-1043063.256000000983477;0
6673;-742244.289999999105930;-1044153.350000001490116;0
5516;-743427.133000001311302;-1043615.250999998301268;0
1931;-743388.000000000000000;-1044409.000000000000000;0
610;-742011.000000000000000;-1043270.000000000000000;0
845;-742126.000000000000000;-1042505.000000000000000;0
6270;-742333.412999998778105;-1043018.204999998211861;0
3948;-743409.451999999582767;-1043515.662000000476837;0
3836;-743096.070000000298023;-1042561.879999998956919;0
6253;-742378.725000001490116;-1043039.690000001341105;0
548;-742297.000000000000000;-1043762.000000000000000;0
6805;-741109.710000000894070;-1044689.170000001788139;0
1485;-741184.000000000000000;-1044223.000000000000000;0
4722;-742878.030000001192093;-1042626.550000000745058;0
973;-741908.000000000000000;-1044547.000000000000000;0
612;-742064.000000000000000;-1043270.000000000000000;0
543;-742361.000000000000000;-1043823.000000000000000;0
4633;-742625.931000001728535;-1042639.918999999761581;0
1165;-741037.420000001788139;-1044506.500000000000000;0
1843;-743041.600000001490116;-1044324.489999998360872;0
6140;-742311.999000001698732;-1043064.638999998569489;0
1259;-742064.000000000000000;-1044854.000000000000000;0
4976;-742494.337000001221895;-1043009.743000000715256;0
817;-741937.000000000000000;-1042586.000000000000000;0
6257;-742381.556000001728535;-1043033.991000000387430;0
6135;-742308.289000000804663;-1043059.340999998152256;0
4920;-742444.449999999254942;-1042928.980000000447035;0
5411;-742776.079999998211861;-1042905.300000000745058;0
6133;-742309.820000000298023;-1043062.171999998390675;0
2565;-741043.000000000000000;-1044424.000000000000000;0
1623;-742524.000000000000000;-1044319.000000000000000;0
792;-741718.000000000000000;-1042599.000000000000000;0
3830;-743013.879999998956919;-1042612.359999999403954;0
2185;-743216.000000000000000;-1045130.000000000000000;0
4164;-742476.478000000119209;-1044110.528000000864267;0
6297;-742506.859999999403954;-1042634.250000000000000;0
6693;-742248.197000000625849;-1044816.127000000327826;0
6202;-742317.124000001698732;-1043063.651999998837709;0
5119;-742850.592999998480082;-1043328.484999999403954;0
7704;-742256.021000001579523;-1044313.592999998480082;0
4889;-742621.425000000745058;-1042831.109999999403954;0
301;-742613.000000000000000;-1043903.000000000000000;0
6258;-742382.381999999284744;-1043032.370999999344349;0
4676;-742792.579999998211861;-1042771.519999999552965;0
5747;-743413.175999999046326;-1043698.811000000685453;0
701;-742023.000000000000000;-1042885.000000000000000;0
4690;-742679.162999998778105;-1042583.138999998569489;0
6570;-741280.390000000596046;-1044118.620000001043081;0
5578;-743409.534000001847744;-1043632.701000001281500;0
3145;-744025.730000000447035;-1042639.432999998331070;0
5058;-742837.528999999165535;-1043170.686000000685453;0
5677;-743405.545000001788139;-1043716.931000001728535;0
6207;-742313.287000000476837;-1043056.642000000923872;0
6186;-742314.337999999523163;-1043061.517000000923872;0
5504;-743428.977000001817942;-1043686.274000000208616;0
3820;-743111.699999999254942;-1042659.320000000298023;0
6232;-742316.034000001847744;-1043057.000000000000000;0
6127;-742314.456000000238419;-1043070.548999998718500;0
4466;-742177.620000001043081;-1042567.899999998509884;0
4031;-743135.774000000208616;-1043769.622000001370907;0
1493;-741134.000000000000000;-1044328.000000000000000;0
4803;-743043.410999998450279;-1042699.506000000983477;0
6266;-742349.021000001579523;-1043019.662999998778105;0
2061;-742681.000000000000000;-1044491.000000000000000;0
5969;-742284.809999998658895;-1044169.578000001609325;0
4661;-742816.708000000566244;-1042503.918999999761581;0
6200;-742318.653999999165535;-1043066.462000001221895;0
5514;-743426.903000000864267;-1043609.252999998629093;0
6215;-742314.692000001668930;-1043057.682000000029802;0
4950;-742354.289999999105930;-1042955.670000001788139;0
4997;-742492.638000000268221;-1042962.833999998867512;0
4638;-742553.631999999284744;-1042542.028000000864267;0
4739;-742751.690000001341105;-1042699.230000000447035;0
5700;-743416.574000000953674;-1043630.223999999463558;0
4609;-742557.414000000804663;-1042621.583999998867512;0
4190;-742301.250000000000000;-1044166.100000001490116;0
5589;-743423.785999998450279;-1043679.548000000417233;0
3241;-744178.436999998986721;-1042649.513999998569489;0
6261;-742373.956999998539686;-1043022.041999999433756;0
4641;-742591.151999998837709;-1042559.721000000834465;0
4118;-742725.980000000447035;-1044022.765000000596046;0
5231;-743342.107000000774860;-1043497.627000000327826;0
3960;-743418.563000001013279;-1043583.526000000536442;0
5233;-743347.210000000894070;-1043435.807000000029802;0
4426;-742197.589999999850988;-1043031.679999999701977;0
6195;-742314.956000000238419;-1043061.181000001728535;0
3966;-743363.859999999403954;-1043530.829999998211861;0
910;-742219.000000000000000;-1042529.000000000000000;0
7959;-741699.170000001788139;-1044292.620000001043081;0
6492;-742174.054000001400709;-1044455.534000001847744;0
7003;-743074.140000000596046;-1044350.280000001192093;0
6198;-742312.659000001847744;-1043056.964999999850988;0
4973;-742480.098000001162291;-1043031.443999998271465;0
4617;-742561.250999998301268;-1042668.140000000596046;0
4647;-742705.322999998927116;-1042525.425000000745058;0
748;-741671.000000000000000;-1042971.000000000000000;0
6275;-742314.603999998420477;-1043016.407999999821186;0
6137;-742314.326999999582767;-1043068.837000001221895;0
7716;-743023.190999999642372;-1045843.241999998688698;0
4958;-742349.620000001043081;-1043004.539999999105930;0
1464;-741899.000000000000000;-1043994.000000000000000;0
1147;-741346.000000000000000;-1044466.000000000000000;0
1255;-742077.000000000000000;-1044770.000000000000000;0
2223;-743053.000000000000000;-1045437.000000000000000;0
4619;-742460.010000001639128;-1042480.890000000596046;0
3979;-743340.934999998658895;-1043779.414999999105930;0
318;-742434.000000000000000;-1044213.000000000000000;0
2256;-743156.000000000000000;-1045353.000000000000000;0
4649;-742732.228999998420477;-1042525.100000001490116;0
1111;-741167.030000001192093;-1044590.170000001788139;0
6243;-742367.739999998360872;-1043061.098000001162291;0
2258;-742974.000000000000000;-1045574.000000000000000;0
1237;-742144.000000000000000;-1044365.000000000000000;0
6170;-742311.548000000417233;-1043059.381000000983477;0
352;-742386.000000000000000;-1043914.000000000000000;0
7094;-743370.620000001043081;-1044578.289999999105930;0
1476;-741531.000000000000000;-1044196.000000000000000;0
5515;-743426.960000000894070;-1043612.083999998867512;0
5733;-743410.142999999225140;-1043688.210999999195337;0
4518;-742623.960000000894070;-1042786.719999998807907;0
1402;-741699.000000000000000;-1044419.000000000000000;0
4427;-742190.519999999552965;-1043099.440000001341105;0
1373;-742143.000000000000000;-1044822.000000000000000;0
6217;-742320.725999999791384;-1043067.133999999612570;0
3868;-742432.381000000983477;-1042412.094000000506639;0
5638;-743428.245000001043081;-1043683.840999998152256;0
1376;-742165.000000000000000;-1044873.000000000000000;0
7970;-741444.739999998360872;-1044384.980000000447035;0
5709;-743420.221999999135733;-1043640.467999998480082;0
5703;-743417.385000001639128;-1043633.592000000178814;0
5792;-743363.984999999403954;-1043442.513999998569489;0
5178;-743386.421000000089407;-1043452.486000001430511;0
3978;-743342.695000000298023;-1043756.835000000894070;0
5653;-743429.589999999850988;-1043701.940999999642372;0
6150;-742311.879999998956919;-1043062.857000000774860;0
1026;-741986.000000000000000;-1044631.000000000000000;0
6952;-743044.730999998748302;-1044106.129999998956919;0
5997;-742040.579999998211861;-1043282.651999998837709;0
5669;-743414.997999999672174;-1043713.431000001728535;0
4680;-742759.370000001043081;-1042864.140000000596046;0
5650;-743429.348999999463558;-1043698.318999998271465;0
4874;-742795.429999999701977;-1042925.910000000149012;0
2225;-743041.000000000000000;-1045477.000000000000000;0
754;-741676.000000000000000;-1042727.000000000000000;0
1708;-741170.820000000298023;-1044705.589999999850988;0
6210;-742318.541000001132488;-1043064.662999998778105;0
4700;-742659.859999999403954;-1042723.210000000894070;0
5224;-743293.449999999254942;-1043542.160000000149012;0
6106;-742210.445999998599291;-1043112.203000001609325;0
6151;-742311.114999998360872;-1043061.451000001281500;0
982;-741992.000000000000000;-1044416.000000000000000;0
5943;-742064.651000000536442;-1043693.136999998241663;0
943;-742292.000000000000000;-1043017.000000000000000;0
4928;-742444.890000000596046;-1042854.899999998509884;0
4678;-742775.910000000149012;-1042839.929999999701977;0
4167;-742438.315000001341105;-1044021.960000000894070;0
7090;-743353.289999999105930;-1044571.760000001639128;0
1960;-743386.000000000000000;-1044623.000000000000000;0
4956;-742383.579999998211861;-1043007.739999998360872;0
740;-741759.000000000000000;-1043031.000000000000000;0
273;-743381.000000000000000;-1043820.000000000000000;0
6510;-741721.960000000894070;-1044461.815000001341105;0
182;-743429.000000000000000;-1043385.000000000000000;0
4961;-742309.460000000894070;-1043010.730000000447035;0
4753;-742764.600000001490116;-1042761.899999998509884;0
