{[1:U=5],[1:U=6],[1:U=7],[1:U=8],[1:U=9],[1:U=10],[1:U=11],[1:U=12],[1:U=13],[1:U=14],[1:U=15],[1:U=16],[1:U=17],[1:U=18],[1:U=19],[1:U=20],[1:U=21],[1:U=22],[1:U=23],[1:U=24],[1:U=25],[1:U=26],[1:U=27],[1:U=28],[1:U=29],[1:U=30],[1:U=31],[1:U=32],[1:U=33],[1:U=34],[1:U=35],[1:U=36],[1:U=37],[1:U=38],[1:U=39],[1:U=40],[1:U=41],[1:U=42],[1:U=43],[1:U=44],[1:U=45],[1:U=46],[1:U=47],[1:U=48],[1:U=49],[1:U=50],[1:U=51],[1:U=52],[1:U=53],[1:U=54],[1:U=55],[1:U=56],[1:U=57],[1:U=58],[1:U=59],[1:U=60],[1:U=61],[1:U=62],[1:U=63],[1:U=64],[1:U=65],[1:U=66],[1:U=67],[1:U=68],[1:U=69],[1:U=70],[1:U=71],[1:U=72],[1:U=73],[1:U=74],[1:U=75],[1:U=76],[1:U=77],[1:U=78],[1:U=79],[1:U=80],[1:U=81],[1:U=82],[1:U=83],[1:U=84],[1:U=85],[1:U=86],[1:U=87],[1:U=88],[1:U=89],[1:U=90],[1:U=91],[1:U=92],[1:U=93],[1:U=94],[1:U=95],[1:U=96],[1:U=97],[1:U=98],[1:U=99],[1:U=100],[1:U=101],[1:U=102],[1:U=103],[1:U=104]}
0 1
1 2
2 3
3 4
4 5
5 6
6 7
7 8
8 9
9 10
10 11
11 12
12 13
13 14
14 15
15 16
16 17
17 18
18 19
19 20
20 21
21 22
22 23
23 24
24 25
25 26
26 27
27 28
28 29
29 30
30 31
31 32
32 33
33 34
34 35
35 36
36 37
37 38
38 39
39 40
40 41
41 42
42 43
43 44
44 45
45 46
46 47
47 48
48 49
49 50
50 51
51 52
52 53
53 54
54 55
55 56
56 57
57 58
58 59
59 60
60 61
61 62
62 63
63 64
64 65
65 66
66 67
67 68
68 69
69 70
70 71
71 72
72 73
73 74
74 75
75 76
76 77
77 78
78 79
79 80
80 81
81 82
82 83
83 84
84 85
85 86
86 87
87 88
88 89
89 90
90 91
91 92
92 93
93 94
94 95
95 96
96 97
97 98
98 99
99 100
0 50
1 51
2 52
3 53
4 54
5 55
6 56
7 57
8 58
9 59
10 60
11 61
12 62
13 63
14 64
15 65
16 66
17 67
18 68
19 69
20 70
21 71
22 72
23 73
24 74
25 75
26 76
27 77
28 78
29 79
30 80
31 81
32 82
33 83
34 84
35 85
36 86
37 87
38 88
39 89
40 90
41 91
42 92
43 93
44 94
45 95
46 96
47 97
48 98
49 99
50 100
