(footprint "TouchButton-10x10mm" (version 20211014) (generator pcbnew) (layer "F.Cu")
  (tedit 0)
  (fp_text reference "REF**" (at 0 -6) (layer "F.SilkS")
    (effects (font (size 1 1) (thickness 0.15)))
    (tstamp 6a7b350f-cbda-4d29-9f0e-b0365a5666e5)
  )
  (fp_text value "TouchButton-10x10mm" (at 0 6) (layer "F.Fab")
    (effects (font (size 1 1) (thickness 0.15)))
    (tstamp 059de0b4-c1a8-4837-a96f-3d99ab6b6f6c)
  )
  (fp_line (start 5 5) (end -5 5) (layer "F.SilkS") (width 0.15) (tstamp 304545bb-924a-4fea-8158-87d4212265d7))
  (fp_line (start -5 5) (end -5 -5) (layer "F.SilkS") (width 0.15) (tstamp 8d09b5ce-1c03-4929-a6b1-4d91df51f283))
  (fp_line (start -5 -5) (end 5 -5) (layer "F.SilkS") (width 0.15) (tstamp d592d742-2fe7-462a-a9c8-7fbfd6612499))
  (fp_line (start 5 -5) (end 5 5) (layer "F.SilkS") (width 0.15) (tstamp db0c9f09-c44c-4038-9b50-0db6f35adaa7))
  (pad "1" smd rect (at -4.5 0) (size 1 8) (layers "F.Cu") (tstamp 0d306a20-98a9-4aa8-b118-bde33b30e3c8))
  (pad "1" smd rect (at 0 4.5) (size 10 1) (layers "F.Cu") (tstamp 1b49db8f-ac50-4678-ba6e-77654ac33d54))
  (pad "1" smd rect (at 4.5 0) (size 1 8) (layers "F.Cu") (tstamp 1fd8baf1-8003-445c-a922-faf60b7e51e9))
  (pad "1" smd rect (at 0.85 -0.600001) (size 0.5 6.8) (layers "F.Cu") (tstamp 6da5ca7a-9646-49d0-9008-5465741bcc28))
  (pad "1" smd rect (at 0 -4.5) (size 10 1) (layers "F.Cu") (tstamp 981c77d6-bb7c-41d9-9449-763981a9fa39))
  (pad "1" smd rect (at 2.55 -0.600001) (size 0.5 6.8) (layers "F.Cu") (tstamp a7b8fc34-702a-4c05-87b5-4a710adced65))
  (pad "1" smd rect (at -0.85 -0.600001) (size 0.5 6.8) (layers "F.Cu") (tstamp b4951b7a-a513-4661-9382-27e4b733ae4e))
  (pad "1" smd rect (at -2.55 -0.600001) (size 0.5 6.8) (layers "F.Cu") (tstamp f3af9e82-80ca-4fc6-95c4-3965a0d286c8))
  (pad "2" smd rect (at 1.7 0) (size 0.2 7) (layers "F.Cu") (tstamp 1893ef3d-faac-4e20-8b54-833aaafbc400))
  (pad "2" smd rect (at -3.4 0) (size 0.2 7) (layers "F.Cu") (tstamp 26e8a759-70a1-4cf0-960d-9e7c38e74fee))
  (pad "2" smd rect (at 3.4 0) (size 0.2 7) (layers "F.Cu") (tstamp 45a3f302-92ae-4908-b34b-52492b3412fd))
  (pad "2" smd rect (at 0 0) (size 0.2 7) (layers "F.Cu") (tstamp 55cbe6d6-fdc7-4100-9796-1de492ff36e1))
  (pad "2" smd rect (at 0 3.4) (size 7 0.2) (layers "F.Cu") (tstamp 79ccfd2d-d4e2-4877-99fb-e5d7b83d0a5c))
  (pad "2" smd rect (at -1.7 0) (size 0.2 7) (layers "F.Cu") (tstamp e03abae4-75c1-4897-9003-79e020a93e3d))
)
