(kicad_symbol_lib (version 20211014) (generator kicad_symbol_editor)
  (symbol "ssd1306:ER-OLED013-1" (in_bom yes) (on_board yes)
    (property "Reference" "U" (id 0) (at 0 6.35 0)
      (effects (font (size 1.27 1.27)))
    )
    (property "Value" "ER-OLED013-1" (id 1) (at 0 8.89 0)
      (effects (font (size 1.27 1.27)))
    )
    (property "Footprint" "" (id 2) (at 0 0 0)
      (effects (font (size 1.27 1.27)) hide)
    )
    (property "Datasheet" "https://components101.com/sites/default/files/component_datasheet/SSD1306-OLED-Display-Datasheet.pdf" (id 3) (at 0 15.24 0)
      (effects (font (size 1.27 1.27)) hide)
    )
    (symbol "ER-OLED013-1_0_0"
      (pin no_connect line (at 48.26 -15.24 180) (length 2.54) hide
        (name "NC" (effects (font (size 1.27 1.27))))
        (number "1" (effects (font (size 1.27 1.27))))
      )
      (pin no_connect line (at 48.26 -35.56 180) (length 2.54) hide
        (name "NC" (effects (font (size 1.27 1.27))))
        (number "10" (effects (font (size 1.27 1.27))))
      )
      (pin power_in line (at 34.29 -5.08 270) (length 2.54)
        (name "V_{DD}" (effects (font (size 1.27 1.27))))
        (number "11" (effects (font (size 1.27 1.27))))
      )
      (pin input line (at 22.86 -17.78 0) (length 2.54)
        (name "BS1" (effects (font (size 1.27 1.27))))
        (number "12" (effects (font (size 1.27 1.27))))
      )
      (pin input line (at 22.86 -15.24 0) (length 2.54)
        (name "BS2" (effects (font (size 1.27 1.27))))
        (number "13" (effects (font (size 1.27 1.27))))
      )
      (pin power_in line (at 36.83 -76.2 90) (length 2.54)
        (name "V_{SS1}" (effects (font (size 1.27 1.27))))
        (number "14" (effects (font (size 1.27 1.27))))
      )
      (pin input line (at 22.86 -46.99 0) (length 2.54)
        (name "~{CS}" (effects (font (size 1.27 1.27))))
        (number "15" (effects (font (size 1.27 1.27))))
      )
      (pin input line (at 22.86 -49.53 0) (length 2.54)
        (name "~{RES}" (effects (font (size 1.27 1.27))))
        (number "16" (effects (font (size 1.27 1.27))))
      )
      (pin input line (at 22.86 -52.07 0) (length 2.54)
        (name "~{D/C}" (effects (font (size 1.27 1.27))))
        (number "17" (effects (font (size 1.27 1.27))))
      )
      (pin input line (at 22.86 -54.61 0) (length 2.54)
        (name "~{R/W}" (effects (font (size 1.27 1.27))))
        (number "18" (effects (font (size 1.27 1.27))))
      )
      (pin input line (at 22.86 -57.15 0) (length 2.54)
        (name "~{E/RD}" (effects (font (size 1.27 1.27))))
        (number "19" (effects (font (size 1.27 1.27))))
      )
      (pin power_in line (at 34.29 -76.2 90) (length 2.54)
        (name "V_{SS}" (effects (font (size 1.27 1.27))))
        (number "2" (effects (font (size 1.27 1.27))))
      )
      (pin bidirectional line (at 22.86 -22.86 0) (length 2.54)
        (name "D0" (effects (font (size 1.27 1.27))))
        (number "20" (effects (font (size 1.27 1.27))))
      )
      (pin bidirectional line (at 22.86 -25.4 0) (length 2.54)
        (name "D1" (effects (font (size 1.27 1.27))))
        (number "21" (effects (font (size 1.27 1.27))))
      )
      (pin bidirectional line (at 22.86 -27.94 0) (length 2.54)
        (name "D2" (effects (font (size 1.27 1.27))))
        (number "22" (effects (font (size 1.27 1.27))))
      )
      (pin bidirectional line (at 22.86 -30.48 0) (length 2.54)
        (name "D3" (effects (font (size 1.27 1.27))))
        (number "23" (effects (font (size 1.27 1.27))))
      )
      (pin bidirectional line (at 22.86 -33.02 0) (length 2.54)
        (name "D4" (effects (font (size 1.27 1.27))))
        (number "24" (effects (font (size 1.27 1.27))))
      )
      (pin bidirectional line (at 22.86 -35.56 0) (length 2.54)
        (name "D5" (effects (font (size 1.27 1.27))))
        (number "25" (effects (font (size 1.27 1.27))))
      )
      (pin bidirectional line (at 22.86 -38.1 0) (length 2.54)
        (name "D6" (effects (font (size 1.27 1.27))))
        (number "26" (effects (font (size 1.27 1.27))))
      )
      (pin bidirectional line (at 22.86 -40.64 0) (length 2.54)
        (name "D7" (effects (font (size 1.27 1.27))))
        (number "27" (effects (font (size 1.27 1.27))))
      )
      (pin input line (at 22.86 -63.5 0) (length 2.54)
        (name "I_{REF}" (effects (font (size 1.27 1.27))))
        (number "28" (effects (font (size 1.27 1.27))))
      )
      (pin output line (at 22.86 -66.04 0) (length 2.54)
        (name "V_{COMH}" (effects (font (size 1.27 1.27))))
        (number "29" (effects (font (size 1.27 1.27))))
      )
      (pin no_connect line (at 48.26 -17.78 180) (length 2.54) hide
        (name "NC" (effects (font (size 1.27 1.27))))
        (number "3" (effects (font (size 1.27 1.27))))
      )
      (pin power_in line (at 36.83 -5.08 270) (length 2.54)
        (name "V_{CC}" (effects (font (size 1.27 1.27))))
        (number "30" (effects (font (size 1.27 1.27))))
      )
      (pin no_connect line (at 48.26 -38.1 180) (length 2.54) hide
        (name "NC" (effects (font (size 1.27 1.27))))
        (number "31" (effects (font (size 1.27 1.27))))
      )
      (pin no_connect line (at 48.26 -20.32 180) (length 2.54) hide
        (name "NC" (effects (font (size 1.27 1.27))))
        (number "4" (effects (font (size 1.27 1.27))))
      )
      (pin no_connect line (at 48.26 -22.86 180) (length 2.54) hide
        (name "NC" (effects (font (size 1.27 1.27))))
        (number "5" (effects (font (size 1.27 1.27))))
      )
      (pin no_connect line (at 48.26 -25.4 180) (length 2.54) hide
        (name "NC" (effects (font (size 1.27 1.27))))
        (number "6" (effects (font (size 1.27 1.27))))
      )
      (pin no_connect line (at 48.26 -30.48 180) (length 2.54) hide
        (name "NC" (effects (font (size 1.27 1.27))))
        (number "7" (effects (font (size 1.27 1.27))))
      )
      (pin no_connect line (at 48.26 -27.94 180) (length 2.54) hide
        (name "NC" (effects (font (size 1.27 1.27))))
        (number "8" (effects (font (size 1.27 1.27))))
      )
      (pin no_connect line (at 48.26 -33.02 180) (length 2.54) hide
        (name "NC" (effects (font (size 1.27 1.27))))
        (number "9" (effects (font (size 1.27 1.27))))
      )
    )
    (symbol "ER-OLED013-1_0_1"
      (rectangle (start 25.4 -7.62) (end 45.72 -73.66)
        (stroke (width 0.1524) (type default) (color 0 0 0 0))
        (fill (type background))
      )
    )
    (symbol "ER-OLED013-1_1_1"
      (pin passive line (at 40.64 -76.2 90) (length 2.54)
        (name "MountPin" (effects (font (size 1.27 1.27))))
        (number "MP" (effects (font (size 1.27 1.27))))
      )
    )
  )
)
