(footprint "TouchButton-15x15mm" (version 20211014) (generator pcbnew) (layer "F.Cu")
  (tedit 0)
  (fp_text reference "REF**" (at 0 -8.5) (layer "F.SilkS")
    (effects (font (size 1 1) (thickness 0.15)))
    (tstamp 4e283522-6c74-4570-aa98-ddab1c4c7ef0)
  )
  (fp_text value "TouchButton-15x15mm" (at 0 8.5) (layer "F.Fab")
    (effects (font (size 1 1) (thickness 0.15)))
    (tstamp bd94e62a-cef2-4703-8a6c-d7a0ff2ab928)
  )
  (fp_line (start -7.5 7.5) (end -7.5 -7.5) (layer "F.SilkS") (width 0.15) (tstamp 11f82283-7e81-416a-8905-3a68326009b9))
  (fp_line (start -7.5 -7.5) (end 7.5 -7.5) (layer "F.SilkS") (width 0.15) (tstamp b3c5af04-e501-45fe-8a66-9679d63eee75))
  (fp_line (start 7.5 -7.5) (end 7.5 7.5) (layer "F.SilkS") (width 0.15) (tstamp c534d055-d6dd-42d6-a24e-d847f47f393e))
  (fp_line (start 7.5 7.5) (end -7.5 7.5) (layer "F.SilkS") (width 0.15) (tstamp fa07b08f-28ad-431a-87d5-4742a64d2f67))
  (pad "1" smd rect (at -4.8 -0.550001) (size 0.5 11.9) (layers "F.Cu") (tstamp 0db8b3c6-1385-476c-9a63-24392dd75664))
  (pad "1" smd rect (at 6.825 0) (size 1.35 13) (layers "F.Cu") (tstamp 335a84b9-23e5-4009-8543-c0abbe07184f))
  (pad "1" smd rect (at 3.2 -0.550001) (size 0.5 11.9) (layers "F.Cu") (tstamp 3d6a74fb-95cb-423a-bdbd-2878487a87f7))
  (pad "1" smd rect (at 4.8 -0.550001) (size 0.5 11.9) (layers "F.Cu") (tstamp 505aba60-9e7d-47c0-af7a-60491f1ab880))
  (pad "1" smd rect (at 0 -0.550001) (size 0.5 11.9) (layers "F.Cu") (tstamp 8674f70b-a23f-4632-ace1-4862c19905ac))
  (pad "1" smd rect (at -1.6 -0.550001) (size 0.5 11.9) (layers "F.Cu") (tstamp 92deb2a9-1cfb-48a2-8a4c-a46c5e4d3a97))
  (pad "1" smd rect (at 0 -7) (size 15 1) (layers "F.Cu") (tstamp b8962273-5901-4ef7-931d-573ecd4ad2d0))
  (pad "1" smd rect (at -6.825 0) (size 1.35 13) (layers "F.Cu") (tstamp bb05651d-05df-40c5-817d-eaa74d7eebfb))
  (pad "1" smd rect (at -3.2 -0.550001) (size 0.5 11.9) (layers "F.Cu") (tstamp c0c937e8-7fdb-43b4-b43c-919d3344b76e))
  (pad "1" smd rect (at 0 7) (size 15 1) (layers "F.Cu") (tstamp eea54aea-4abe-4de6-bc02-462f9aa0745e))
  (pad "1" smd rect (at 1.6 -0.550001) (size 0.5 11.9) (layers "F.Cu") (tstamp f4412583-6191-4fad-816b-d20e9dcd6841))
  (pad "2" smd rect (at 5.6 0) (size 0.1 12) (layers "F.Cu") (tstamp 145f3b17-7212-488e-9726-d97175a4f608))
  (pad "2" smd rect (at 4 0) (size 0.1 12) (layers "F.Cu") (tstamp 3a07d772-73a8-4fb1-ade5-260365db3219))
  (pad "2" smd rect (at 0.8 0) (size 0.1 12) (layers "F.Cu") (tstamp 42de085f-7e52-4b61-b9fd-9967559e4fb8))
  (pad "2" smd rect (at -2.4 0) (size 0.1 12) (layers "F.Cu") (tstamp 58487fd0-f90f-49ab-86bd-67e890cdf060))
  (pad "2" smd rect (at 2.4 0) (size 0.1 12) (layers "F.Cu") (tstamp 620aefc5-7337-493d-9610-7d370b5d9dad))
  (pad "2" smd rect (at -4 0) (size 0.1 12) (layers "F.Cu") (tstamp a8106b9f-b199-4481-955f-2df701c4fbd1))
  (pad "2" smd rect (at -0.8 0) (size 0.1 12) (layers "F.Cu") (tstamp b9da018b-f649-41fc-b19b-c82b8d91103e))
  (pad "2" smd rect (at -5.6 0) (size 0.1 12) (layers "F.Cu") (tstamp ddc3081d-0c0b-41f5-8ea4-078af3ec3f70))
  (pad "2" smd rect (at 0 5.95) (size 11.3 0.1) (layers "F.Cu") (tstamp ddd7196f-b810-4707-8c88-307203f0db44))
)
