<svg width="133" height="50" viewBox="0 0 133 50" fill="none" xmlns="http://www.w3.org/2000/svg">
<g clip-path="url(#clip0)">
<path fill-rule="evenodd" clip-rule="evenodd" d="M22.0522 1.71094C22.0087 1.71094 21.9652 1.71094 21.9217 1.71094C16.0801 1.71094 10.4595 3.26921 5.01292 6.41282C2.80238 12.4501 1.55578 18.5873 1.49055 24.8496C1.40358 31.0618 2.51791 37.424 4.98936 43.9133C10.677 46.7549 16.3646 48.2132 22.0522 48.2902C27.7398 48.2132 33.4274 46.7549 39.1131 43.9133C41.5864 37.424 42.7007 31.0618 42.6138 24.8496C42.5485 18.5873 41.3019 12.4501 39.0914 6.41282C33.6448 3.26921 28.0242 1.71094 22.1826 1.71094C22.1391 1.71094 22.0956 1.71094 22.0522 1.71094Z" fill="#FEFEFE"/>
<path d="M4.09423 5.03104C9.82531 1.66035 15.7738 0 21.9216 0C21.9651 0 22.0086 0 22.0521 0C22.0956 0 22.1391 0 22.1826 0C28.3304 0 34.2789 1.66035 40.01 5.03104L40.3615 5.45811C42.7007 11.7953 44.0361 18.2597 44.1013 24.824C44.1013 24.949 44.1013 25.049 44.1013 25.176V25.6281C44.0795 31.9403 42.8982 38.3797 40.3615 44.919L39.9665 45.346C33.9962 48.3897 28.0242 49.9229 22.0521 50C16.08 49.9229 10.108 48.3897 4.13772 45.346L3.74272 44.919C1.20604 38.3797 0.0246726 31.9403 0.00292969 25.6281V25.176C0.00292969 25.049 0.00292969 24.949 0.00292969 24.824C0.0681586 18.2597 1.40354 11.7953 3.74272 5.45811L4.09423 5.03104ZM22.0521 1.71035C22.0086 1.71035 21.9651 1.71035 21.9216 1.71035C16.08 1.71035 10.4595 3.26861 5.01287 6.41223C2.80234 12.4495 1.55574 18.5867 1.49051 24.849C1.40354 31.0612 2.51787 37.4234 4.98932 43.9128C10.6769 46.7543 16.3645 48.2126 22.0521 48.2897C27.7397 48.2126 33.4273 46.7543 39.1131 43.9128C41.5863 37.4234 42.7007 31.0612 42.6137 24.849C42.5485 18.5867 41.3019 12.4495 39.0913 6.41223C33.6447 3.26861 28.0242 1.71035 22.1826 1.71035C22.1391 1.71035 22.0956 1.71035 22.0521 1.71035Z" fill="#003399"/>
<path fill-rule="evenodd" clip-rule="evenodd" d="M22.445 38.9584C22.1388 34.1544 22.3363 29.1484 21.0897 24.5715C19.9301 20.2966 15.5326 17.8572 15.4456 13.1532C15.3586 9.48042 17.7866 5.2306 22.3363 5.2306C26.6016 5.2056 29.2488 8.77628 29.555 12.7511C29.9264 17.353 25.0705 20.4466 23.8022 24.8235C22.4885 29.3004 22.8618 34.2544 22.445 38.9584Z" fill="#003399"/>
<path fill-rule="evenodd" clip-rule="evenodd" d="M24.1303 37.7998C23.9545 33.625 23.9545 29.6273 24.962 26.0795C26.0763 22.0567 28.3955 18.661 31.9396 17.5548C34.3676 16.8007 37.9316 20.0693 37.3645 23.415C36.8825 26.1066 34.5415 29.2752 30.78 29.6273C29.0297 29.8022 28.2868 31.4126 27.1924 32.3438C32.0918 31.7897 35.2645 29.5773 37.4732 27.2628C37.8012 29.2231 38.0204 32.5188 36.685 33.65C34.0614 35.7874 31.6334 34.0521 28.5477 35.0583C26.821 35.6374 25.7483 36.8957 24.1303 37.7998Z" fill="#003399"/>
<path fill-rule="evenodd" clip-rule="evenodd" d="M20.7836 37.7998C20.9793 33.625 20.9576 29.6273 19.9737 26.0795C18.8575 22.0567 16.5401 18.661 12.996 17.5548C10.568 16.8007 6.98046 20.0693 7.57114 23.415C8.05311 26.1066 10.3923 29.2752 14.1556 29.6273C15.8842 29.8022 16.6488 31.4126 17.7432 32.3438C12.8203 31.7897 9.67115 29.5773 7.46243 27.2628C7.13447 29.2231 6.91523 32.5188 8.2488 33.65C10.8743 35.7874 13.3022 34.0521 16.3861 35.0583C18.1147 35.6374 19.1638 36.8957 20.7836 37.7998Z" fill="#003399"/>
<path fill-rule="evenodd" clip-rule="evenodd" d="M32.4415 44.0118V43.3327L32.88 43.2077L32.4415 42.4536V41.1953L34.411 44.3389L33.7116 44.541L33.2297 43.7598L32.4415 44.0118ZM32.4415 41.1953V42.4536L32.1353 41.9494L32.0048 43.4598L32.4415 43.3327V44.0118L31.9396 44.1389L31.8508 45.068L31.1514 45.2701L31.6116 41.1703L32.311 40.9682L32.4415 41.1953ZM25.924 46.2013V45.5472H26.0762C26.3172 45.5222 26.4712 45.4972 26.5365 45.4701C26.6234 45.4451 26.7104 45.3701 26.7557 45.2951C26.8209 45.1951 26.8427 45.093 26.8427 44.968C26.8209 44.8431 26.7992 44.741 26.7321 44.666C26.6887 44.591 26.6017 44.541 26.5147 44.516C26.4277 44.491 26.2302 44.491 25.924 44.516V43.8618C26.098 43.8618 26.2085 43.8368 26.252 43.8368C26.3607 43.8118 26.4495 43.7348 26.5147 43.6598C26.5799 43.5848 26.6017 43.4848 26.5799 43.3577C26.5799 43.2327 26.5365 43.1327 26.4712 43.0806C26.4277 43.0056 26.339 42.9556 26.2085 42.9556C26.165 42.9556 26.0762 42.9556 25.924 42.9806V42.3265C26.165 42.3015 26.339 42.3015 26.4495 42.3265C26.5799 42.3265 26.7104 42.3786 26.8209 42.4536C26.9296 42.5036 27.0166 42.6036 27.1054 42.7286C27.1706 42.8556 27.2141 43.0056 27.2358 43.1827C27.2576 43.3577 27.2141 43.5348 27.1489 43.6848C27.0836 43.8368 26.9731 43.9618 26.8209 44.0618C27.0383 44.1139 27.2141 44.2139 27.3228 44.3639C27.4551 44.516 27.5203 44.691 27.5421 44.918C27.5421 45.093 27.5203 45.2701 27.4768 45.4451C27.4116 45.6222 27.3228 45.7472 27.2141 45.8743C27.0836 45.9743 26.9514 46.0493 26.7774 46.0992C26.6669 46.1242 26.3824 46.1492 25.9675 46.2013H25.924ZM30.057 44.0868L30.7365 44.1889C30.693 44.616 30.5825 44.968 30.3868 45.2201C30.1893 45.4451 29.9048 45.6222 29.5551 45.6972C29.1166 45.7722 28.7234 45.6722 28.3955 45.3951C28.0458 45.093 27.8483 44.666 27.7396 44.0618C27.6508 43.4348 27.7178 42.9056 27.957 42.5036C28.1762 42.1015 28.5259 41.8494 28.9862 41.7494C29.4011 41.6723 29.729 41.7494 30.0353 41.9744C30.211 42.1015 30.3632 42.3015 30.4737 42.6036L29.8396 42.9056C29.7743 42.7286 29.6638 42.5786 29.5334 42.5036C29.3793 42.4036 29.2271 42.3786 29.0514 42.4036C28.8104 42.4536 28.6365 42.6036 28.5042 42.8306C28.3737 43.0806 28.352 43.4098 28.4172 43.8618C28.5042 44.3389 28.6365 44.666 28.8104 44.843C28.9862 45.018 29.2054 45.093 29.4446 45.043C29.6203 44.993 29.7526 44.893 29.8613 44.741C29.97 44.591 30.0353 44.3639 30.057 44.0868ZM25.924 42.3265V42.9806C25.8371 42.9806 25.7483 43.0056 25.6396 43.0056L25.2464 43.0577L25.3116 43.9368L25.77 43.8868C25.8135 43.8868 25.8805 43.8868 25.924 43.8618V44.516C25.924 44.516 25.924 44.516 25.9023 44.516L25.3768 44.566L25.4421 45.5972L25.924 45.5472V46.2013L24.8296 46.3263L24.5234 42.4786L25.8588 42.3536C25.8805 42.3265 25.9023 42.3265 25.924 42.3265ZM21.7023 44.8681V44.2139C21.8545 44.2139 21.9432 44.1889 22.0085 44.1639C22.0954 44.1389 22.1607 44.0618 22.2277 43.9868C22.2712 43.8868 22.2929 43.7868 22.2929 43.6848C22.3147 43.5348 22.2712 43.4348 22.2042 43.3327C22.1389 43.2327 22.052 43.1827 21.9432 43.1577C21.8762 43.1577 21.811 43.1327 21.7023 43.1327V42.4786C22.0302 42.4786 22.2277 42.5036 22.3364 42.5536C22.5339 42.6036 22.6861 42.7286 22.8184 42.9306C22.9489 43.1327 23.0141 43.3827 22.9923 43.6848C22.9923 43.9118 22.9489 44.1139 22.8836 44.2889C22.7948 44.4389 22.7079 44.566 22.5992 44.666C22.4669 44.741 22.3582 44.791 22.2277 44.843C22.0955 44.868 21.9215 44.8681 21.7023 44.8681ZM21.7023 42.4786V43.1327C21.637 43.1327 21.5483 43.1327 21.4395 43.1327L21.1116 43.1077V44.2139H21.4613C21.5483 44.2139 21.637 44.2139 21.7023 44.2139V44.8681C21.6588 44.8681 21.5917 44.8681 21.5265 44.8681H21.0898L21.0681 46.3263L20.3886 46.3013L20.4557 42.4536L21.5265 42.4786C21.5917 42.4786 21.6588 42.4786 21.7023 42.4786ZM15.3805 44.491V43.3077C15.578 43.3577 15.7085 43.3577 15.7737 43.3577C15.8625 43.3327 15.9277 43.3077 15.9929 43.2327C16.0364 43.1577 16.0799 43.0806 16.1016 42.9556C16.1234 42.8306 16.1016 42.7286 16.0582 42.6286C16.0147 42.5286 15.9277 42.4786 15.8172 42.4286C15.7737 42.4036 15.6215 42.3786 15.3805 42.3265V41.6723L15.665 41.7244C16.0147 41.7994 16.2557 41.8744 16.4079 41.9744C16.5619 42.0765 16.6706 42.2265 16.7358 42.4286C16.8029 42.6036 16.8246 42.8306 16.7811 43.0577C16.7358 43.3327 16.6271 43.5598 16.4532 43.7098C16.2991 43.8618 16.0582 43.9368 15.7519 43.9368C15.8842 44.0618 15.9929 44.1889 16.0582 44.3139C16.1451 44.466 16.2339 44.691 16.3426 45.018L16.6271 45.8493L15.8389 45.6722L15.4892 44.741C15.4457 44.666 15.424 44.566 15.3805 44.491ZM17.3048 42.1015L17.9607 42.1765L17.8085 44.2639C17.7867 44.591 17.7867 44.8181 17.7867 44.893C17.8085 45.068 17.8737 45.1951 17.9607 45.2951C18.0712 45.4201 18.2016 45.4701 18.3991 45.4972C18.5966 45.5222 18.7488 45.4701 18.8358 45.3951C18.9463 45.3201 19.0116 45.2201 19.0551 45.093C19.0768 44.968 19.0985 44.741 19.1203 44.4389L19.2743 42.3015L19.952 42.3786L19.7998 44.3889C19.778 44.8681 19.7327 45.1951 19.6675 45.3701C19.624 45.5472 19.537 45.7222 19.4482 45.8222C19.3395 45.9493 19.1873 46.0493 19.0116 46.0992C18.8576 46.1763 18.6401 46.1763 18.3774 46.1492C18.0494 46.1242 17.8085 46.0493 17.6544 45.9493C17.5022 45.8493 17.37 45.7222 17.283 45.5972C17.196 45.4451 17.1525 45.2951 17.1308 45.1451C17.1091 44.918 17.1091 44.591 17.1308 44.1639L17.3048 42.1015ZM11.9904 43.2327L12.1209 42.6036L13.5432 43.0306L13.1935 44.516C13.0178 44.641 12.7985 44.716 12.4923 44.741C12.2078 44.766 11.9469 44.741 11.6842 44.666C11.3327 44.566 11.05 44.3889 10.8525 44.1639C10.6333 43.9118 10.5028 43.6098 10.4376 43.2827C10.3923 42.9306 10.3923 42.5786 10.4811 42.2265C10.5681 41.8494 10.7203 41.5224 10.9395 41.2453C11.137 40.9953 11.3997 40.8432 11.7059 40.7682C11.9469 40.6932 12.2296 40.7182 12.5376 40.8182C12.9308 40.9432 13.237 41.1203 13.4109 41.3974C13.5867 41.6473 13.6737 41.9744 13.6519 42.3265L12.9743 42.2765C12.9743 42.0765 12.9308 41.8994 12.8203 41.7494C12.7115 41.6223 12.5811 41.4974 12.3836 41.4474C12.0991 41.3724 11.8581 41.3974 11.6389 41.5474C11.4215 41.6994 11.2675 41.9994 11.1587 42.4036C11.05 42.8556 11.0718 43.2077 11.1805 43.4848C11.3109 43.7598 11.5084 43.9368 11.7712 44.0118C11.9234 44.0618 12.0556 44.0618 12.2078 44.0618C12.3619 44.0368 12.4923 43.9868 12.6246 43.9368L12.7333 43.4598L11.9904 43.2327ZM15.3805 41.6723L14.2426 41.4474L13.6737 45.2451L14.3296 45.3701L14.5706 43.7868L14.7246 43.8118C14.8768 43.8368 14.9873 43.8868 15.0525 43.9118C15.1178 43.9618 15.1613 44.0368 15.2265 44.1139C15.2482 44.1889 15.3153 44.3139 15.3805 44.491V43.3077C15.3153 43.3077 15.2482 43.2827 15.1613 43.2827L14.6811 43.1827L14.8116 42.2265L15.337 42.3265C15.3588 42.3265 15.3805 42.3265 15.3805 42.3265V41.6723Z" fill="#003399"/>
<path fill-rule="evenodd" clip-rule="evenodd" d="M119.633 36.9715V29.8781H122.345V17.4036L119.633 23.6408V8.07273H130.285L132.997 43.9379H122.345V36.9715H119.633ZM119.633 8.07273V23.6408L116.92 29.8781H119.633V36.9715H114.514L112.414 43.5608H105.808V35.3612L113.179 17.0765H111.669L115.869 8.07273H119.633ZM105.808 20.0201L109.111 11.0164L105.808 8.90394V20.0201ZM79.5369 16.5745C79.6909 15.5432 79.6909 14.537 79.5369 13.5808V16.5745ZM105.808 8.90394V20.0201L105.371 21.2263C98.8519 15.8703 89.227 20.7493 88.6798 26.4074C88.1344 32.3175 92.05 37.0965 102.046 33.5258L98.6109 44.0879C85.422 45.7732 80.3033 39.7631 79.5369 32.7467V28.7719C79.7344 26.9365 80.1493 25.1512 80.7182 23.4908C87.2158 4.92911 97.7575 9.10394 101.762 8.75187L102.352 6.68945L105.808 8.90394ZM105.808 35.3612L102.505 43.5608H105.808V35.3612ZM67.6815 43.3338C74.7462 41.7255 81.6804 31.9655 74.7244 24.195C77.4369 22.5346 79.122 19.5431 79.5369 16.5745V13.5808C79.0567 10.4872 76.9785 7.97273 73.0629 7.89774L67.6815 7.77066V14.662H69.912C72.2965 14.662 71.9903 21.7555 69.0151 21.7555H67.6815V27.1886C70.8977 27.8927 69.7598 33.0217 67.6815 34.607V43.3338ZM79.5369 28.7719V32.7467C79.4064 31.4384 79.4064 30.1051 79.5369 28.7719ZM58.3629 7.54567L54.0106 17.2536L55.9566 17.0765L50.7075 43.5608H65.7355C66.3914 43.5608 67.0256 43.4858 67.6815 43.3338V34.607C67.3101 34.9091 66.8933 35.0841 66.4784 35.0841H61.0753L62.8691 27.1115H66.9151C67.1996 27.1115 67.4623 27.1365 67.6815 27.1886V21.7555H63.9182L65.4275 14.662H67.6815V7.77066L58.3629 7.54567Z" fill="#003399"/>
</g>
<defs>
<clipPath id="clip0">
<rect width="133" height="50" fill="white"/>
</clipPath>
</defs>
</svg>
