<svg width="100" height="100" viewBox="0 0 100 100" fill="none" xmlns="http://www.w3.org/2000/svg">
<circle cx="50" cy="50" r="50" fill="#00BA88" fill-opacity="0.2"/>
<circle cx="49.5" cy="49.5" r="37.5" fill="#00BA88" fill-opacity="0.2"/>
<path d="M34 50.627L45.3137 61.9407L67.9411 39.3132" stroke="#00BA88" stroke-width="2" stroke-linecap="round"/>
</svg>
