<svg width="14" height="14" viewBox="0 0 14 14" fill="none" xmlns="http://www.w3.org/2000/svg">
<path d="M9.43327 1.57922L12.4541 4.60006L4.59993 12.4542H1.5791V9.43339L9.43327 1.57922Z" stroke="white" stroke-width="2" stroke-linecap="round" stroke-linejoin="round"/>
</svg>
