<svg width="24" height="23" viewBox="0 0 24 23" fill="none" xmlns="http://www.w3.org/2000/svg">
<path d="M19 3.8335H5C3.89543 3.8335 3 4.69162 3 5.75016V19.1668C3 20.2254 3.89543 21.0835 5 21.0835H19C20.1046 21.0835 21 20.2254 21 19.1668V5.75016C21 4.69162 20.1046 3.8335 19 3.8335Z" stroke="#3A3735" stroke-width="2" stroke-linecap="round" stroke-linejoin="round"/>
<path d="M16 1.9165V5.74984" stroke="#3A3735" stroke-width="2" stroke-linecap="round" stroke-linejoin="round"/>
<path d="M8 1.9165V5.74984" stroke="#3A3735" stroke-width="2" stroke-linecap="round" stroke-linejoin="round"/>
<path d="M3 9.5835H21" stroke="#3A3735" stroke-width="2" stroke-linecap="round" stroke-linejoin="round"/>
</svg>
